##TITLE=31Pdec_DE-135_oil6
, 24 sc
 27.3.2026
##JCAMPDX= 6.0         $$ Bruker NMR JCAMP-DX V2.0
##DATA TYPE= NMR SPECTRUM
##DATA CLASS= NTUPLES
##ORIGIN= UXNMR, Bruker Analytische Messtechnik GmbH
##OWNER= root
$$ XWIN-NMR		Version 3.5
$$ Fri Mar 27 13:58:26 2026 Russian Standard Time (UT+4h)  she@DPX200
##.OBSERVE FREQUENCY= 81.013821
##.OBSERVE NUCLEUS= ^31P
##.ACQUISITION MODE= SIMULTANEOUS
##.ACQUISITION SCHEME= undefined
##.AVERAGES= 24
##.DIGITISER RES= 17
##SPECTROMETER/DATA SYSTEM= spect
##.PULSE SEQUENCE= zgpg30
##.SOLVENT NAME= DMSO
##.SHIFT REFERENCE= (INTERNAL, DMSO, 0, 197.392)
##AUDIT TRAIL= $$ (NUMBER, WHEN, WHO, WHERE, WHAT)
$$ ##TITLE= Audit trail, XWIN-NMR		Version 3.5
$$ ##JCAMPDX= 5.01
$$ ##ORIGIN= Bruker BioSpin GmbH
$$ ##OWNER= she
$$ F:/spectra/data/she/nmr/P31/2/pdata/1/auditp.txt
$$ ##AUDIT TRAIL=  $$ (NUMBER, WHEN, WHO, WHERE, WHAT)
(   1,<2026-03-27 13:56:26.95 +0400>,<she>,<DPX200>,
      <created by zg, POWCHK disabled, PULCHK disabled
       configuration hash MD5:
       00 E9 B6 7A A2 85 ED C7 34 08 36 98 17 FE 4E 26
       data hash MD5: 32K
       75 6F D3 F8 66 9C 6B 66 37 1E 19 F3 14 A0 47 D1>)
(   2,<2026-03-27 13:57:43.59 +0400>,<she>,<DPX200>,
      <Start of raw data processing
       efp BC_mod = 2 LB = 1.5 FT_mod = 6 PKNL = 1 PHC0 = 1465.262 PHC1 = -72.69934 SI = 64K 
       data hash MD5: 64K
       BA 1F 54 91 D8 83 F6 94 D9 2C 44 D8 76 D3 5F BC>)
$$ ##END=
$$ 
$$ hash MD5
$$ 8D 39 E8 E4 93 70 AD 20 83 25 0A 49 AC 54 F3 44
##$RELAX= 
##$RELAX= 
##$RELAX= 
##$RELAX= 
##$RELAX= 
##$RELAX= 
##$RELAX= 
##$RELAX= 
$$ Bruker specific parameters
$$ --------------------------
##$DU= <F:/spectra>
##$EXPNO= 2
##$NAME= <P31>
##$PROCNO= 1
##$TYPE= <nmr>
##$USER= <she>
##$AMP= (0..31)
100 100 100 100 100 100 100 100 100 100 100 100 100 100 100 100 100 100 
100 100 100 100 100 100 100 100 100 100 100 100 100 100 
##$AQSEQ= 0
##$AQ_mod= 1
##$AUNM= <au_zg>
##$AUTOPOS= <>
##$BF1= 81.014009
##$BF2= 200.13
##$BF3= 200.13
##$BF4= 200.13
##$BF5= 200.13
##$BF6= 200.13
##$BF7= 200.13
##$BF8= 200.13
##$BYTORDA= 1
##$CFDGTYP= 0
##$CFRGTYP= 5
##$CHEMSTR= <none>
##$CNST= (0..31)
1 1 145 1 1 1 1 1 1 1 1 1 1 1 1 1 1 1 1 1 1 1 1 1 1 1 1 1 1 1 1 1 
##$CPDPRG= <waltz16>
##$CPDPRG1= <>
##$CPDPRG2= <waltz16>
##$CPDPRG3= <>
##$CPDPRG4= <mlev>
##$CPDPRG5= <mlev>
##$CPDPRG6= <mlev>
##$CPDPRG7= <mlev>
##$CPDPRG8= <mlev>
##$CPDPRGB= <>
##$CPDPRGT= <>
##$D= (0..31)
0 1 0 0 0 0 0 0 0 0.06 0 0.03 2e-05 3e-06 0 0 0.0002 0 0 0 0 0 0 0 0 0 
0 0 0 0 0 0 
##$DATE= 1774605386
##$DBL= (0..7)
120 120 120 11 120 120 24 19 
##$DBP= (0..7)
150 150 150 150 150 150 150 150 
##$DBP07= 0
##$DBPNAM0= <>
##$DBPNAM1= <>
##$DBPNAM2= <>
##$DBPNAM3= <>
##$DBPNAM4= <>
##$DBPNAM5= <>
##$DBPNAM6= <>
##$DBPNAM7= <>
##$DBPOAL= (0..7)
0.5 0.5 0.5 0.5 0.5 0.5 0.5 0.5 
##$DBPOFFS= (0..7)
0 0 0 0 0 0 0 0 
##$DE= 6
##$DECBNUC= <off>
##$DECIM= 4
##$DECNUC= <off>
##$DECSTAT= 4
##$DIGMOD= 1
##$DIGTYP= 9
##$DL= (0..7)
0 0 52 120 120 21 21 25 
##$DP= (0..7)
$$ [...]
##$SUBNAM3= <"">
##$SUBNAM4= <"">
##$SUBNAM5= <"">
##$SUBNAM6= <"">
##$SUBNAM7= <"">
##$SUBNAM8= <"">
##$SUBNAM9= <"">
##$SW= 400.765351723535
##$SWIBOX= (0..15)
0 1 3 0 0 0 0 0 0 0 0 0 0 0 0 0 
##$SW_h= 32467.5324675325
##$TD= 32768
##$TD0= 1
##$TE= 0
##$TE2= 300
##$TE3= 300
##$TEG= 300
##$TL= (0..7)
0 120 53 12 22 120 120 120 
##$TP= (0..7)
150 150 150 150 150 150 150 150 
##$TP07= 0
##$TPNAME0= <>
##$TPNAME1= <>
##$TPNAME2= <>
##$TPNAME3= <>
##$TPNAME4= <>
##$TPNAME5= <>
##$TPNAME6= <>
##$TPNAME7= <>
##$TPOAL= (0..7)
0.5 0.5 0.5 0.5 0.5 0.5 0.5 0.5 
##$TPOFFS= (0..7)
0 0 0 0 0 0 0 0 
##$TUNHIN= 0
##$TUNHOUT= 0
##$TUNXOUT= 0
##$USERA1= <user>
##$USERA2= <user>
##$USERA3= <user>
##$USERA4= <user>
##$USERA5= <user>
##$V9= 5
##$VALIST= <valist>
##$VCLIST= <CCCCCCCCCCCCCCC>
##$VD= 0
##$VDLIST= <DDDDDDDDDDDDDDD>
##$VPLIST= <PPPPPPPPPPPPPPP>
##$VTLIST= <TTTTTTTTTTTTTTT>
##$WBST= 1024
##$WBSW= 4
##$XGAIN= (0..3)
0 0 0 0 
##$XL= 0
##$YL= 0
##$YMAX_a= 10066
##$YMIN_a= -11591
##$ZGOPTNS= <>
##$ZL1= 120
##$ZL2= 120
##$ZL3= 120
##$ZL4= 120
##$ABSF1= 0
##$ABSF2= 0
##$ABSG= 0
##$ABSL= 0
##$ALPHA= 0
##$AQORDER= 0
##$ASSFAC= 0
##$ASSFACI= 0
##$ASSFACX= 0
##$ASSWID= 0
##$AUNMP= <proc_1d>
##$AZFE= 0.1
##$AZFW= 0.5
##$BCFW= 0
##$BC_mod= 2
##$BYTORDP= 0
##$COROFFS= 0
##$CY= -3
##$DATMOD= 1
##$DC= 0
##$DFILT= <>
##$DTYPP= 0
##$F1P= 0
##$F2P= 0
##$FCOR= 1
##$FTSIZE= 65536
##$FT_mod= 6
##$GAMMA= 0
##$GB= 0
##$INTBC= 1
##$INTSCL= 9.790993e-09
##$ISEN= 30
##$LB= 1.5
##$LEV0= 0
##$LPBIN= 0
##$MAXI= 10000
##$MC2= 0
##$MEAN= 0
##$ME_mod= 0
##$MI= 50
##$NCOEF= 0
##$NC_proc= -8
##$NLEV= 6
##$NOISF1= 182.463
##$NOISF2= 159.3651
##$NSP= 0
##$NTH_PI= 0
##$NZP= 0
##$OFFSET= 197.3918
##$PC= 4
##$PHC0= 1465.262
##$PHC1= -72.69934
##$PH_mod= 1
##$PKNL= yes
##$PPARMOD= 0
##$PSCAL= 0
##$PSIGN= 0
##$REVERSE= no
##$SF= 81.014063255964
##$SI= 65536
##$SIGF1= 159.3651
##$SIGF2= -187.1042
##$SINO= 113.3802
##$SIOLD= 16384
##$SREGLST= <1H.CDCl3>
##$SSB= 0
##$STSI= 65536
##$STSR= 0
##$SW_p= 32467.5324675325
##$SYMM= 0
##$S_DEV= 0
##$TDeff= 32768
##$TDoff= 0
##$TI= <>
##$TILT= no
##$TM1= 0
##$TM2= 0
##$TOPLEV= 0
##$USERP1= <user>
##$USERP2= <user>
##$USERP3= <user>
##$USERP4= <user>
##$USERP5= <user>
##$WDW= 1
##$XDIM= 65536
##$YMAX_p= 346989224
##$YMIN_p= -72339277
$$ End of Bruker specific parameters
$$ ---------------------------------
##NTUPLES= NMR SPECTRUM
##VAR_NAME=  FREQUENCY,     SPECTRUM/REAL,   SPECTRUM/IMAG
##SYMBOL=    X,             R,               I
##VAR_TYPE=  INDEPENDENT,   DEPENDENT,       DEPENDENT
##VAR_FORM=  AFFN,          ASDF,            ASDF
##VAR_DIM=   65536,         65536,           65536
##UNITS=     HZ,            ARBITRARY UNITS, ARBITRARY UNITS
##FACTOR=    0.49542278885378, 1,            1
##FIRST=     15991.5117654749, 0,            0
##LAST=      -16476.0207020576, 0,           0
##MIN=       -16476.0207020576, -72339277,   0
##MAX=       15991.5117654749, 346989224,    0
$$ Real data points
##PAGE= N=1
##DATA TABLE= (X++(R..R)), XYDATA
$$ [...]
43586A671558k779827k709694p75136P47843O29281n37190j124862j64955J305713
$$ 1671558 -1108269 -3817963 -4593099 -3845256 -3215975 -3753165 -4878027 -5042982 -3737269
43577c737269J229786o20889j906332q27900J274907J955879J138153N46259N62406
$$ -3737269 -2507483 -3128372 -5034704 -5862604 -4587697 -2631818 -1493665 -947406 -385000
43568c85000J75965l09453N73739K223129J863091j107484l346109k042095R91143
$$ -385000 -209035 -518488 55251 2278380 4141471 3033987 -312122 -2354217 -1363074
43559a363074K009974N06126r36683q92684l35378L0956Q06591J861104J834533
$$ -1363074 646900 1153026 216343 -676341 -1011719 -980763 -174172 1686932 3521465
43550C521465N73094j52058M61737O88716q06386k348214j732042K7391J20076
$$ 3521465 4094559 3942501 4404238 5092954 4286568 1938354 206312 233703 353779
43541C53779j479125j852054P6217J584300M25465j472865r35410J501055K457186
$$ 353779 -1125346 -2977400 -2901183 -1316883 -891418 -2364283 -3299693 -1798638 658548
43532F58548R06324n48532J2469J076725N88875o86784o71020O43497J478132
$$ 658548 1564872 1016340 1028809 2105534 2694409 2007625 1336605 1980102 3458234
43523C458234J112073L17924o00616k016014l218057k644689m04494J368983J465128
$$ 3458234 4570307 4888231 4287615 2271601 -946456 -3591145 -3995639 -2626656 -1161528
43514a161528J088805J423651J597148O08328m19264m9791N84626p30975l402515
$$ -1161528 -72723 1350928 2948076 3556404 3137140 3087349 3671975 2941000 -461515
43505d61515m317497k321313J24338O55684J13375M78922J556738J683783O31425
$$ -461515 -4779012 -7100325 -6975987 -6320303 -6206928 -5728006 -4171268 -2487485 -1856060
43496a856060k47017k86698j06327p4691J86507O63353P43096L98697L44779P24563
$$ -1856060 -2103077 -2389775 -2496102 -2570793 -2384286 -1720933 -977837 -579140 -234361 490202
43486D90202P89980K21579l38092m59636n57608q82770r37453m55880K0694J26399
$$ 490202 1280182 1501761 1163669 704033 146425 -736345 -1673798 -2129678 -2108984 -1982585
43476a982585K25813L97786K6998p96490p53724O56012J755103R37199o94081
$$ -1982585 -1756772 -1358986 -1331988 -2128478 -2882202 -2226190 -471087 466112 -227969
43467b27969q33352M88100J046397L9975p01808K71779J791568J927817O20148
$$ -227969 -1061321 -573221 473176 513151 -188657 83122 1874690 3802507 4422655
43458D422655p76631j478168j530162r00548L13619J167967O42726q54960j696936
$$ 4422655 3646024 2167856 637694 -262854 50765 1218732 1861458 1006498 -690438
43449f90438q71297J009364K528044K654412J109293j641920m263927m913379
$$ -690438 -1561735 -552371 1975673 4630085 5739378 4097458 -166469 -5079848
43441e079848k611233J400186M162241L622370Q57601r83951k81370J243763R44644
$$ -5079848 -7691081 -6290895 -2128654 1493716 2351317 1367366 1085996 2329759 3274403
43432C274403j242985k815877j901065P54374K965634L167716J244067j489472
$$ 3274403 2031418 -784459 -2685524 -1931150 1034484 4202200 5446267 3956795
43424C956795k850464j507679J361756L027958K180849O6850j485675j917308
$$ 3956795 1106331 -401348 960408 3988366 6169215 6236065 4750390 2833082
43416B833082j465351l54016P07314N42551q96002j987466j502809j80688P54739
$$ 2833082 1367731 1013715 1721029 2263580 1367578 -619888 -2122697 -2303385 -1548646
43407a548646J442465K399545K795393J462883r64593k587943k588928j604362
$$ -1548646 -106181 2293364 5088757 6551640 5587047 2999104 410176 -1194186
43399a194186j68646J583233K811063K279503J32520j880469k355504j589093
$$ -1194186 -1362832 220401 3031464 5310967 5443487 3563018 1207514 -381579
43391c81579q39845r51842j711614k008812r06300R53763J719433Q29726O7234
$$ -381579 -1221424 -2173266 -3884880 -5893692 -6799992 -5846229 -4126796 -3297070 -3229836
43382c229836Q87094J919563J048584r75764j474875k2959R87882K12627q34045
$$ -3229836 -2342742 -423179 625405 -350359 -1825234 -1848193 -860311 -647684 -1481729
43373a481729o04516K21710M71601M43555P43628P98353L383q85886q63836k13914
$$ -1481729 -2086245 -1864535 -1392934 -949379 -205751 592602 595985 -289901 -1153737 -1367651
43363a367651J45402m5361n73792j203054j243734K3261J737322J817266o8596
$$ -1367651 -1222249 -1267610 -1841402 -3044456 -4288190 -4264929 -2527607 -710341 -778937
43354g78937j562876r41355L77466L42868m20331o1561J062188J031224k75859
$$ -778937 -2341813 -3283168 -2905702 -2562834 -2983165 -3044726 -1982538 -951314 -1227173
43345a227173j126097j006733j170871j922482j828637l00128J177380J332313
$$ -1227173 -2353270 -3360003 -4530874 -6453356 -8281993 -8582121 -7404741 -6072428
43337f072428Q94862J091062J801187K254307K322533K060835J026951p85637
$$ -6072428 -5177566 -4086504 -2285317 -31010 2291523 4352358 5379309 4593672
43329D593672k148285j900719n40483M97591P04559O18197M13926m31054j922404
$$ 4593672 2445387 544668 4185 501776 1206335 1824532 2238458 1807404 -115000
43320a15000k986192k637034j189500J83073P94005Q50450O96683L46017j1848
$$ -115000 -3101192 -5738226 -6927726 -6744653 -5950648 -5100198 -4403515 -4057498 -4069346
43311d069346K72753J390836K255252J553165l75097j679930j280422l9643P34608
$$ -4069346 -3796593 -2405757 -150505 1402660 1027563 -652367 -1932789 -1972432 -1237824
43302a237824Q67537O70186j38143j615362k522118j611533L33911J268887O58305
$$ -1237824 -370287 299899 161756 -1453606 -3975724 -5587257 -5253346 -3984459 -3326154
43293c326154J3483M26161J021790N30900p37849j429549j032494l80523m36908
$$ -3326154 -3312671 -2886510 -1864720 -1333820 -2071669 -3501218 -4533712 -4914235 -5351143
43284e351143j094854j246328r532K030962L088246K082345k183j232818q80165
$$ -5351143 -6445997 -7692325 -7701857 -5670895 -2582649 -500304 -502487 -1735305 -2615470
43275b615470K74471J369704K081309J975408O08533j425176k705832k654349
$$ -2615470 -2340999 -971295 1110014 3085422 3693955 2268779 -437053 -3091402
43267c091402j961771j064387M80149K454498L243542J869110k12233p78349K22004
$$ -3091402 -5053173 -6117560 -5637411 -3182913 60629 1929739 1717506 939157 1161161
43258A161161Q32458O308j076175r31325J34609N98328j67940j140140j031107
$$ 1161161 1993619 1999927 923752 -7573 127036 725364 557424 -582716 -1613823
43249a613823N4148P49016J70065r50373j243822m42771N04929Q34773O29722
$$ -1613823 -1559675 -810659 -640594 -1590967 -2834789 -3277560 -2772631 -1937858 -1308136
43240a308136J44588m76017o01844N47613K372478K857957J039454j413616k221776
$$ -1308136 -1163548 -1639565 -2241409 -1693796 678682 3536639 4576093 3162477 940701
43231I40701j386140p60099j226969j768913j271626Q0274J395049J980554J481498
$$ 940701 -445439 -1205538 -2432507 -4201420 -5473046 -5392772 -3997723 -2017169 -535671
43222e35671J14293j033994q87509K39160J038915J036963Q78113O92974k82782
$$ -535671 -421378 -1455372 -2342881 -2103721 -1064806 -27843 850270 1543244 1260462
43213A260462j860903k275800n95271J520121J968755J154943J018594J737537
$$ 1260462 -600441 -2876241 -3471512 -1951391 17364 1172307 2190901 3928438
43205C928438J501587l46858k001133j767837l36158N84396O46156O17089O26508
$$ 3928438 5430025 5083167 3082034 1314197 978039 1562435 2208591 2825680 3452188
43196C452188R5992r06979j512758j259171n17980K89634J022123J308898O43038
$$ 3452188 3548180 2641201 1128443 -130728 -648708 -359074 663049 1971947 2614985
43187B614985o90132j491997r14864N36595J555670J308096N8791j122755j226244
$$ 2614985 1924853 432856 -482008 54587 1610257 2918353 2977144 1854389 628145
43178F28145k62156N97834K24626j177987k419941k730334k121449o60232J432154
$$ 628145 365989 963823 1188449 10462 -2409479 -5139813 -7261262 -7921494 -6489340
43169f489340K927248K346350J89459j012976Q2439J616643J141516p94732j553935
$$ -6489340 -3562092 -1215742 -1026283 -2039259 -1956820 -340177 801339 6607 -1547328
43160a547328l86569O28238j46821j642089j916363p98582L91827Q04118O43774
$$ -1547328 -1933897 -1305659 -1452480 -3094569 -5010932 -5809514 -5417687 -4613569 -3969795
43151c969795L75213L08228O91528J462375K040080J859518R43044l27527j596716
$$ -3969795 -3594582 -3286354 -2594826 -1132451 907629 2767147 3710191 3382664 1785948
43142A785948k366089k038609p55645K75663P5981p18201n55253R66421K470868
$$ 1785948 -580141 -2618750 -3374395 -3098732 -3022751 -3740952 -4296205 -3329784 -858916
43133h58916K430611Q68959q35611j469233j011497l76683m37918j259219k052201
$$ -858916 1571695 2440654 1605043 135810 -875687 -1252370 -1690288 -2949507 -5001708
43124e001708j808474j55025K148934L550840K901301O12931j583889k367752
$$ -5001708 -6810182 -6965207 -4816273 -1265433 1635868 2248799 664910 -1702842
43116a702842k078653j836783j787175j078952M62682J698123J624979O30659
$$ -1702842 -3781495 -5618278 -7405453 -8484405 -8021723 -6323600 -4698621 -4067962
43108d067962k65455o93539p85507m23740M63298J275241J341466R50315R48664
$$ -4067962 -4333417 -5026956 -5812463 -6236203 -5772905 -4497664 -3156198 -2205883 -1257219
43099a257219J456195J776478J473964P25504k97233j474500k167282j639449
$$ -1257219 198976 1975454 3449418 4174922 3877689 2403189 235907 -1403542
43091a403542l15232L45033l27007j300828j263521k59737N89511M28723o80092
$$ -1403542 -1718774 -1373741 -1700748 -3001576 -4265097 -4524834 -3935323 -3506600 -4186692
43082d186692j833196j712598J84547K299398K133003n34055k712732j791279
$$ -4186692 -6019888 -7732486 -7547939 -5248541 -3115538 -3649593 -6362325 -8153604
43074h153604R85487K354259J560719P86504J234171J392453L66j564528j366763
$$ -8153604 -7168117 -4813858 -3253139 -2466635 -1232464 159989 160355 -1404173 -2770936
43065b770936K38587J471478J667246J351766P51990p8035l72146L71390J027557
$$ -2770936 -2532349 -1060871 606375 1958141 2710131 2632096 2259950 2631340 3658897
43056C658897J90574j453313j874613o96550L34280j6879j023723j416490p50552
$$ 3658897 3849471 2396158 521545 -175005 159275 142396 -881327 -2297817 -3048369
43047c048369P98869K486184K764240P37375j974705k695370j262288n6509j40702
$$ -3048369 -2249500 236684 3000924 3738299 1763594 -931776 -2194064 -2250573 -2391275
43038b391275O5667J417564K180668J112866k51331m76759q75487k659890l751862
$$ -2391275 -2325608 -908044 1272624 2385490 2134159 1657400 781913 -1877977 -5629839
43029e629839j782134J359978J734764p02423k136714p13206J365899J988518
$$ -5629839 -7411973 -6051995 -4317231 -5019654 -7156368 -7869574 -6503675 -4515157
43021d515157J848329J956778J545455p265j554342j985882j724885j216991J14001
$$ -4515157 -2666828 -710050 835405 828140 -726202 -2712084 -4436969 -5653960 -5539959
43012e539959K132440L092015J902829k33438j664311k232586k295692j541997
$$ -5539959 -3407519 -315504 1587325 1353887 -310424 -2543010 -4838702 -6380699
43004f380699j38158N64852l1215n34140L12248J629257J941008J323734N60137
$$ -6380699 -6518857 -5954005 -5985220 -6519360 -6207112 -4577855 -2636847 -1313113 -752976
42995g52976m06301j529524j588820L2079J636843J258500m65660j315652n86951
$$ -752976 -1159277 -2688801 -4277621 -4245542 -2608699 -1350199 -1815859 -3131511 -3718462
42986c718462O35124J514240J914728J488987J86762q43948n95221J23557N170
$$ -3718462 -3083338 -1569098 345630 1834617 2021379 1177431 582210 705767 710937
42977G10937n17969k34733M16973O0106j016451j250518n12419j33453l69597
$$ 710937 192968 -41765 375208 435314 -581137 -1831655 -2344074 -2477527 -2847124
42968b847124j47794O26589Q27253L68659M27339J089299J062616J71698j94334
$$ -2847124 -2994918 -2368329 -1541076 -1172417 -745078 344221 1406837 1578535 1384201
42959A384201K76091J16648j136159j868993j244570p85891j611641k235800r55455
$$ 1384201 1660292 1776940 640781 -1228212 -2472782 -3258673 -4870314 -7106114 -8061569
42950h061569J340362K668930K743750K306497J100995j200622l079053k655329
$$ -8061569 -6721207 -4052277 -1308527 997970 2098965 898343 -2180710 -4836039
42942d836039o67366L25773l85211r28903J0436J361957J597059Q18811P2335
$$ -4836039 -5503405 -5177632 -5562843 -6491746 -6481310 -5119353 -3522294 -2703483 -2631148
42933b631148j72528K0040O11344J217284R54661m33210j851883k114597j458625
$$ -2631148 -2803676 -2783636 -2172292 -955008 -347 -433557 -2285440 -4400037 -5858662
42924e858662q87112m27351O94646K176948K439180R55855n29425l43743N65087
$$ -5858662 -6745774 -7173125 -6478479 -4301531 -1862351 -906496 -1435921 -1779664 -1214577
42915a214577J41058j282801j259699P45657K065713P92745j164843j041043M33869
$$ -1214577 -1073519 -2356320 -3616019 -2870362 -804649 -11904 -1176747 -2217790 -1783921
42906a783921L50022j543118k356922o08876J592829J904949R55472O91025J232503
$$ -1783921 -1433899 -2977017 -5333939 -5942815 -4349986 -2445037 -1489565 -798540 433963
42897D33963J154460o0764j457352k050572j626238m16847R91925J617981Q53145
$$ 433963 1588423 1527659 70307 -1980265 -3606503 -4023350 -3031425 -1413444 -560299
42888e60299o41291j339204k91006J910775L468183K810195J87901k190500k261404
$$ -560299 -1201590 -2540794 -2831800 -921025 2547158 5357353 5545254 3354754 1093350
42879A093350m28694Q65130j916k082846l136393k028628K91622J731293J019104
$$ 1093350 664656 1529786 1527870 -554976 -3691369 -5719997 -5428375 -3697082 -2677978
42870b677978q15972j342681K42221J779711J057572q60631j181264L26429J170702
$$ -2677978 -3493950 -4836631 -4594410 -2814699 -1757127 -2617758 -3799022 -3472593 -2301891
42861b301891L60727j16748J003083J881549O58609j324982j570399j04880J068170
$$ -2301891 -1941164 -2057912 -1054829 826720 1485329 160347 -1410052 -1514932 -446762
42852d46762J061885N53625O417n35816n06817M03612R84425j40739k174655k906882
$$ -446762 615123 1168748 1175165 639349 132532 536144 1520569 1379830 -794825 -3701707
42842c701707j702810j44808L19525o6363k99629O8479P17417Q58432j05469j521078
$$ -3701707 -5404517 -5549325 -5229800 -5296163 -5595792 -5527313 -4809896 -3951464 -4056933 -5578011
42832e578011j603512M28908K894991L459613J926748O4833q51182r99332q74029
$$ -5578011 -7181523 -6752615 -3857624 -398011 1528737 1593570 742388 -256944 -1130973
42823a130973n83886k29231R1147N40326J031063R29667R0163n96756o72619j039906
$$ -1130973 -1714859 -1944090 -1852943 -1312617 -281554 648113 738276 141520 -531099 -1571005
42813a571005k072966k123572O0041K519431K261187l30987k015154j452770n34204
$$ -1571005 -3643971 -5767543 -5707502 -3188071 -926884 -1257871 -3273025 -4725795 -5259999
42804e259999o68477q22832k04166L9619o45429n47029J430660L272027K556628
$$ -5259999 -5928476 -6751308 -6955474 -6915855 -7561284 -8108313 -6677653 -3405626 -848998
42795h48998J89381r60901j74533P56667P59277O65680J062920J091384P4285
$$ -848998 -659617 -1620518 -1795051 -1038384 -279107 386573 1449493 2540877 2615162
42786B615162j203591j708459j590401j540379j458196p21814N02234J100145
$$ 2615162 1411571 -296888 -1887289 -3427668 -4885864 -5607678 -5105444 -4005299
42778d005299L47349j087579j768468r16315R84875K770904L468411K797770J355378
$$ -4005299 -3657950 -4745529 -6513997 -7430312 -6445437 -3674533 -206122 2591648 3947026
42769C947026L06843L15214O45524k1062j665202k622878j696667J75156J057431
$$ 3947026 4253869 4569083 5214607 5193545 3528343 905465 -791202 -616046 441385
42760D41385K45693j326925k341262k052399n95961R15677J188306L26562j14972
$$ 441385 687078 -639847 -2981109 -5033508 -5629469 -4713792 -3525486 -3198924 -3313896
42751c313896O63042J530302J415236J101698J519085J580690j37294k501617
$$ -3313896 -2650854 -1120552 294684 1396382 2915467 4496157 4358863 1857246
42743A857246l050025j612313k25798K41436O81802J033085K1282j835286k023888
$$ 1857246 -1192779 -2805092 -3030890 -2789454 -2107652 -1074567 -1053285 -2888571 -4912459
42734d912459K1481J599684Q85113k41857N45473K252641K425093J014372j22317
$$ -4912459 -4890978 -3291294 -2406181 -2648038 -2102565 150076 2575169 3589541 3467224
42725C467224l82151o66673j249192j568149j625557j700213j193935M07387J911736
$$ 3467224 3085073 2418400 1169208 -398941 -2024498 -3724711 -4918646 -4511259 -2599523
42716b599523J614639k05453j704329k034512j735224r52610O50187K214199K072512
$$ -2599523 -984884 -1190337 -2894666 -4929178 -6664402 -7617012 -6966825 -4752626 -2680114
42707b680114L08596r52935n12713L65908L02276L1298Q67689K121582J841169
$$ -2680114 -2371518 -3324453 -3837166 -3471258 -3168982 -3137684 -2269995 -148413 1692756
42698A692756k44450k168309k313245j238293l74486N042N23972J102802R76842
$$ 1692756 1448306 -720003 -3033248 -4271541 -4646027 -4640985 -4117013 -3014211 -2037369
42689b037369K54109L7924M98706J96927j597293l065626j984936Q71210K373312
$$ -2037369 -1783260 -1745336 -1246630 -1049703 -2646996 -5712622 -7697558 -6826348 -4453036
42680d453036J121460q94530j170990L53519J936488K304629J430187M9383p90445
$$ -4453036 -3331576 -4226106 -5397096 -5043577 -3107089 -802460 627727 677110 -113335
42671a13335m73151L43874L89417m55380j095668j120118j297092j705813j093477
$$ -113335 -586486 -242612 146805 -308575 -1404243 -2524361 -3821453 -5527266 -6620743
42662f620743R17396K558514K182196N52529m95288o00569o55528r69128j167632
$$ -6620743 -5703347 -3144833 -962637 -410108 -905396 -1505965 -2161493 -3130621 -4298253
42653d298253j287358j554977j505090n29145R84706J957304J746493M67925j126320
$$ -4298253 -5585611 -7140588 -8645678 -9174823 -8190117 -6232813 -4486320 -4018395 -5144715
42644e144715j719511n20381J199473J128400p66406j711266r2075J964855J712043
$$ -5144715 -6864226 -7384607 -6185134 -5056734 -5823140 -7534406 -7626481 -5661626 -3949583
42635c949583k52975j315295p94256j80397k81297m30978r3767O29027J625110
$$ -3949583 -4202558 -5517853 -6312109 -6492506 -6773803 -7204781 -7298548 -6669521 -5044411
42626e044411K396023J921915L78056l38975M59519N59283j571068l446908k052154
$$ -5044411 -2648388 -726473 -348417 -687392 -227873 331410 -1239658 -4686566 -6738720
42617f738720R64140J536895l51221q99006R88616K086186N85921j005246m03563
$$ -6738720 -5774580 -4237685 -4588906 -5487912 -4499296 -2413110 -1827189 -2832435 -3235998
42608c235998Q55098N30866p31717j187307q05188k14611Q77941K272073K441840
$$ -3235998 -2380900 -1850034 -2581751 -3769058 -4574246 -4788857 -3910916 -1638843 802997
42599H02997R88913j80414R0928K45065r39980j716140k45879J930642K061695
$$ 802997 1791910 1611496 1702424 1947489 1007509 -708631 -954510 976132 3037827
42590C037827K88701j085326j184737q32039l08290N50121Q27561l67349j841921
$$ 3037827 3326528 2241202 1056465 224426 -83864 466257 1293818 926469 -915452
42581i15452j706216l29596L25369j55949m49142r1527N3851j63964R0202P69646
$$ -915452 -2621668 -2951264 -2625895 -2781844 -3230986 -3322513 -3268662 -3432626 -3342424 -2572778
42571b572778Q54939L32401L45937J078957J267441K21982j218783k075389k120032
$$ -2572778 -1717839 -1385438 -1039501 39456 1306897 1528879 310096 -1765293 -3885325
42562c885325j203007P14293K509107K466043M89687j527392k042884j389890
$$ -3885325 -5088332 -4374039 -1864932 601111 1090798 -436594 -2479478 -3869368
42554c869368o03913p7702L5775o04456j674132j897733n80207J192302J723126
$$ -3869368 -4473281 -4550983 -4515208 -5119664 -6793796 -8691529 -9271736 -8079434 -6356308
42545f356308P30784m33112m21213O79463J542762J105129j90864r37597o12906
$$ -6356308 -5625524 -6058636 -6479849 -5800386 -4257624 -3152495 -3343359 -4280956 -4893862
42536d893862j98657m78567o16617M79869K039281K185825O82831o19678l43620
$$ -4893862 -5092519 -5571086 -6187703 -5707834 -3668553 -1482728 -799897 -1419575 -1763195
42527a763195P97616J445561J406490J223520R13765J41456q30629j254437q66721
$$ -1763195 -965579 479982 1886472 3109992 4023757 4165213 3334584 2080147 1213426
42518A213426k11879r367m50446j039534j013521p0650J229658J916462J475551
$$ 1213426 1001547 992180 541734 -497800 -1511321 -1581971 -352313 1564149 3039700
42509C039700K30318r50120j216886l87842O93381Q56745L4558n09671R4120R51588
$$ 3039700 3270018 2319898 1103012 715170 1408551 2265296 2299854 1790183 1884303 2835891
42499B835891N85189r36637k054163j732451m46383Q03363J458507J259511J21204
$$ 2835891 3421080 2484443 430280 -1302171 -1748554 -945191 513316 1772827 1894031
42490A894031j428434k358217k112537j108648q9847O01855J000019J202723J240342
$$ 1894031 465597 -1892620 -4005157 -5113805 -5203652 -4601797 -3601778 -2399055 -1158713
42481a158713R80336K14112q51564j426973j007288k42223k64534j137261j611995
$$ -1158713 -178377 35735 -815829 -2242802 -3250090 -3492313 -3756847 -4894108 -6506103
42472f506103o14265J465486L122127L137192J659643J08407j43092Q13259J548900
$$ -6506103 -7120368 -5654882 -2532755 604437 2264080 2372487 2229395 3042654 4591554
42463D591554R68488o06817k153822k966706k620546r56519J121054J827796N71402
$$ 4591554 5560042 4953225 2799403 -167303 -2787849 -3744368 -2623314 -795518 -224116
42454b24116r74808j039011j17912K58743K19686J019818K304299K219607M43795
$$ -224116 -1198924 -2237935 -2355847 -2097104 -1877418 -857600 1446699 3666306 4110101
42445D110101j067479r92464l95732o82847j445201j444330m94757O82499J502664
$$ 4110101 3042622 2050158 1654426 971579 -473622 -1917952 -2412709 -1730210 -227546
42436b27546J589127Q16740L0788N69621K184731K653565O27461k214538l219838
$$ -227546 1361581 2178321 2209109 2778730 4963461 7617026 8244487 6029949 2810111
42427B810111k085024o08495J65366P12260J145329N68217j070296k044317r46790
$$ 2810111 725087 116592 281958 994218 2139547 2707764 1637468 -406849 -1353639
42418a353639J126457J756955L06492j378926j578462q12021n23450o44741l6575
$$ -1353639 -227182 1529773 1836265 457339 -1121123 -1933144 -2456594 -3101335 -3137910
42409c137910R94915O82498j122571j964018l63675J443744O66917j439323j144042
$$ -3137910 -2142995 -1460497 -2583068 -4547086 -4910761 -3467017 -2800100 -4239423 -5383465
42400e383465J942861L930115K252719q14596j807487p31510M4863k85622o23410
$$ -5383465 -3440604 489511 2742230 1927634 120147 -611363 -566500 -852122 -1475532
42391a475532n64870r65326k052109k758619k138954m04570J423455K248944J697705
$$ -1475532 -2040402 -3005728 -5057837 -7816456 -9955410 -10359980 -8936525 -6687581 -4989876
42382d989876P45134Q26636J755809J652525k07928j888661j509358j14074L8445
$$ -4989876 -4244742 -3418106 -1662297 -9772 -217700 -2106361 -3615719 -3729793 -3691348
42373c691348j005002j260300o6566J280179J892477K088321J863772P61642n45640
$$ -3691348 -4696350 -5956650 -6023216 -4743037 -2850560 -762239 1101533 1863175 1317535
42364A317535o73087J55286L27687k42428J86089J848211K427739O93012j287908
$$ 1317535 644448 799734 1127421 884993 1071082 2919293 5347032 6040044 4752136
42355D752136j461745j073993k148280l523309k550473K62291J717708R03463
$$ 4752136 3290391 2216398 68118 -3455191 -6005664 -5743373 -4025665 -3122202
42347c122202L01344J280683J822611L47536j124497j95261J613521R58744j907637
$$ -3122202 -2820858 -1540175 282436 629972 -494525 -689786 923735 1882479 -25158
42338b5158l179395j101280J586281J898003O53473M02098J255850J289635J51735
$$ -25158 -3204553 -4305833 -2719552 -821549 -168076 234022 1489872 2779507 2931242
42329B931242l76434M98276J217382M29949q57827r22350O5473N12330n1513l25638
$$ 2931242 2554808 3053084 4270466 4700415 3842588 2920238 2985711 3498041 3446528 3120890
42319C120890P27066K231165K339166M35814k083632l272224k591403j147029
$$ 3120890 3847956 6079121 8418287 8854101 6770469 3498245 906842 -240187
42311b40187r3880N69108J249735J526894O95097o94259j106801j44617P60090
$$ -240187 -334067 235041 1484776 3011670 3706767 3012508 1905707 1761090 2521180
42302B521180M00747m55243k96910Q79591J656779J177633k2213j062819j602461
$$ 2521180 2921927 2466684 2169774 3049365 4706144 5883777 5861564 4798745 3196284
42293C196284j535009p07228O03544J478296J188026J11605n68813j91923N70609
$$ 3196284 1661275 954047 1557591 3035887 4223913 4335518 3766705 3574782 4145391
42284D145391M93822o12192j523782j151820m3358L60144k70183q30429n12509
$$ 4145391 4639213 4027021 2503239 1351419 1308061 1668205 1398022 567593 55084
42275E5084K19720P26995J154961J610054J386484M4525j430526j691510q88322
$$ 55084 274804 1001799 2156760 3766814 5153298 5197823 3767297 2075787 1187465
42266A187465l94624q42875j414443j115661R146J014180R03342m97630k039969
$$ 1187465 792841 -50034 -1464477 -2580138 -2570992 -1556812 -653470 -1151100 -3191069
42257c191069k017446j21003J819537J950883Q08407L88753J058876R90032r36913
$$ -3191069 -5208515 -5329518 -3509981 -1559098 -750691 -361938 696938 1686970 750057
42248G50057l165131l394836j533566M33209J065460Q55777J003059J696896K018537
$$ 750057 -2415074 -5809910 -7343476 -6910267 -5844807 -4989030 -3985971 -2289075 -270538
42239b70538J180806m81155j755919j739358p49025P2006J12659k5371M90896
$$ -270538 910268 429113 -1326806 -3066164 -3815189 -3743183 -3630524 -3655895 -3164999
42230c164999J307286J131810l82142j753533j458593j28760K59797o03186p04397
$$ -3164999 -1857713 -725903 -1108045 -2861578 -4320171 -4448931 -4189134 -4792320 -5496717
42221e496717J223060L475521L627404J860572K59808l55116p23324q45344o2772
$$ -5496717 -4273657 -798136 2829268 4689840 4949648 4594532 3871208 3025864 2963092
42212B963092N85214q68757l470784l471398J29169L255310K359484m28235q95375
$$ 2963092 3548306 2679549 -791235 -4262633 -4133464 -878154 1481330 1053095 157720
42203A57720Q18854J316170j4053n52513K67058j39792k428223l393282j020458
$$ 157720 976574 2292744 2278691 1726178 1993236 1853444 -574779 -3968061 -4988519
42194d988519K021012K389477Q25559J35277N49160K08845r74875j117776K93042
$$ -4988519 -2967507 -578030 247529 382806 931966 1140811 165936 -951840 -658798
42185f58798J555225J479993P77297K99233j60751o32491k53930J137705J997958
$$ -658798 896427 2376420 3153717 3452950 3292199 2659708 2405778 3543483 5541441
42176E541441J011805p38222j028021L39579J193210J81403j222236j009546K27591
$$ 5541441 6553246 5815024 4787003 5126582 6319792 6501195 5278959 4269413 4497004
42167D497004K38043j274949k126550j083851L35498N37022K91393Q39181J333887
$$ 4497004 4735047 3460098 1333548 249697 585195 1122217 1413610 2252791 3586678
42158C586678M50336p60600l24196J090210R92004o94216j281926K71037J576747
$$ 3586678 4037014 3276414 2952218 4042428 5034432 4340216 3058290 3329327 4906074
42149D906074O20915j211892j541252m17774L95152O9718r62437k119028k657016
$$ 4906074 5526989 4315097 2773845 2356071 2751223 2820941 1858504 -260524 -2917540
42140b917540j624170Q50109L106232L811839L266070K102588K08172j973338
$$ -2917540 -4541710 -3691601 -585369 3226470 6492540 8595128 8803300 6829962
42132F829962k759723j487175p2145n23203j996466k165864o16533J014068J605964
$$ 6829962 4070239 2583064 2510919 1987716 -8750 -2174614 -2791147 -1777079 -171115
42123a71115J415494Q12398j01530q29253q89577p09738r71987j479309j704399
$$ -171115 1244379 2056777 1955247 1125994 236417 -473321 -1445308 -2924617 -4629016
42114d629016j771865j743315q21970J293813L112092L021144J570437M89955
$$ -4629016 -6400881 -8144196 -8966166 -7672353 -4560261 -1539117 31320 521275
42106E21275J77340j18541l64156M4955O65678N65862R2033J87971M47824j10604
$$ 521275 698615 580074 215918 260873 926551 1492413 1584446 1772417 2220241 2109637
42096B109637q41835l36177Q75593R65975o872k11945O02794P29653j11647k8195
$$ 2109637 1267802 931625 1807218 2773193 2766321 2554376 3157170 3886823 3775176 3746981
42086C746981J434923J883683j53959k575977k727366j024177M21031J048064
$$ 3746981 5181904 7065587 6911628 4335651 1608285 584108 1005139 2053203
42078B053203J585736J880578J223167J02225k92556R9324L78094K24325o7548
$$ 2053203 3638939 5519517 6742684 6844909 6552353 6651677 7029771 7254096 7186548
42069G186548n96520j555598k300672j980327q70941j0440L01716O77665J444150
$$ 7186548 6590028 5034430 2733758 753431 -117510 -127950 173766 851431 2295581
42060B295581K087171J888599O76354q83832j570737p38257O03395O28230r94048
$$ 2295581 4382752 6271351 6947705 6063873 4493136 3754879 4358274 4986504 3992456
42051C992456k495011k216476n25965J047183J656042J442703Q96732O29535R95597
$$ 3992456 1497445 -719031 -1244996 -197813 1458229 2900932 3797664 4427199 5422796
42042E422796J362818O58932q86383j724068j277880q17270j211622j413298m05011
$$ 5422796 6785614 7444546 6558163 4834095 3556215 2738945 1527323 114025 -290986
42033b90986Q71786J065491N51794L81195L58458n3423j82958M80414O22143q00751
$$ -290986 580800 1646291 2198085 2579280 2937738 2884315 2701357 3181771 3803914 3003163
42023C003163j920026l31652K536868K772674j58998k286059q88771J655885J585966
$$ 3003163 1083137 751485 3288353 6061027 5902029 3615970 2727199 4383084 5969050
42014E969050r92008k791430j984666o2013N22713q89487k758280l059252j492558
$$ 5969050 4977042 2185612 200946 138933 661646 -227841 -2986121 -6045373 -7537931
42005g537931Q6998L9727p16557j06375J705404K417704J323360M48239R91745
$$ -7537931 -7450933 -7411206 -8127763 -8234138 -6528734 -4111030 -2787670 -2339431 -1347686
41996a347686J175444n76356k533270k162279j10370J047827R48310J330239K283413
$$ -1347686 -172242 -748598 -3281868 -5444147 -5554517 -4506690 -3558380 -2228141 55272
41987E5272J831521l04199j510691j00547K016195K129308M99762n05631K6026
$$ 55272 1886793 1582594 71903 -28644 1987551 4116859 4616621 4110990 4137016
41978D137016P46174M01097o35590j318156j256434p19714q132P48211J391296
$$ 4137016 4883190 5284287 4648697 3330541 2074107 1354393 1346261 2094472 3485768
41969C485768J624763J257561O33606N55580J388677K465454K959701L070456
$$ 3485768 5110531 6368092 7001698 7557278 8945955 11411409 14371110 17441566
41961A7441566L423793L527335K235382k6584j162078l24700O64875O5624j152645
$$ 17441566 20865359 24392694 26628076 26601492 25439414 25114714 25779589 25845213 24692568
41952B4692568j184302n66633j124020k522047k616620j138548j76322m68335
$$ 24692568 23508266 22941633 21817613 19295566 16678946 15540398 15364076 14895741
41944A4895741j17109J762536K862586J168389j548863k170955o05961Q43610
$$ 14895741 14778632 16541168 19403754 20572143 19023280 16852325 16246364 17089974
41936A7089974J296317J638674J729993L48983j903466k507676o74669J186964
$$ 17089974 18386291 20024965 21754958 22103941 20200475 17692799 17018130 18205094
41928A8205094P40055j297304k498952j690194L20237J791038J209105j370891
$$ 18205094 18945149 17647845 15148893 13458699 13778936 15569974 16779079 15408188
41920A5408188l667281l230321o06080J114017L51571j224789j689588j405039
$$ 15408188 11740907 8510586 7904506 9018523 9370094 8145305 6455717 5050678
41912E050678j395508j329493p61384m93665q86283n92687J025626K005756O37269
$$ 5050678 3655170 2325677 1564293 1070628 184345 -408342 617284 2623040 3260309
41903C260309j430554j579108k54374L35631K33467J020032K061584J369384j82351
$$ 3260309 1829755 250647 -3727 331904 565371 1585403 3646987 5016371 4834020
41894D834020K59585K139550J523073k253564m493771k028871J824679K347574
$$ 4834020 5093605 7233155 8756228 6502664 2008893 -19978 1804701 4152275
41886D152275J33671j026993m36426l94492j272683j019102P33654J887242J512625
$$ 4152275 4285946 3258953 2822527 2428035 1155352 136250 869904 2757146 4269771
41877D269771J011627J088887N24356j136574k256034j635443l03497L39176L49602
$$ 4269771 5281398 6370285 6894641 5758067 3502033 1866590 1563093 1902269 2251871
41868B251871J61883n66253j789418k282543j378719k95153l90957j092997q76933
$$ 2251871 2413754 1847501 58083 -2224460 -3603179 -3898332 -4289289 -5382286 -6259219
41859f259219M63305J800177K362850K296075J938958J518298J218741Q15995
$$ -6259219 -5795914 -3995737 -1632887 663188 2602146 4120444 5339185 6155180
41851F155180k40631j656430j974300m79659J290793J316503o4533o40157M17369
$$ 6155180 5914549 4258119 2283819 1804160 3094953 4411456 4346923 3706766 4124135
41842D124135J437522Q36816p00459j560164j576926j788393k401739k423103
$$ 4124135 5561657 6398473 5698014 4137850 2560924 772531 -1629208 -4052311
41834d052311j367849j25085L87866N20884J031642J555252J093979q3341l69265
$$ -4052311 -5420160 -5545245 -5157379 -4636495 -3604853 -2049601 -955622 -1038963 -1408228
41825a408228Q41157J951669J351746j47121n52682K21866M32381l68709n05873
$$ -1408228 -567071 1384598 2736344 2589223 2036541 2258407 2690788 2322079 1816206
41816A816206P51394J477431M6866j928810j784928J89410J351746P44412o0884
$$ 1816206 2567600 4045031 4091897 2163087 378159 567569 1919315 2663727 2602843
41807B602843j21380l85968j160128r94993N36540J326338q1523j743327j158570
$$ 2602843 2481463 2095495 935367 -59626 476914 1803252 1721729 -21598 -1180168
41798a180168O14372N95565j108004j246725J243780L075045J352302j954721
$$ -1180168 -565796 29769 -1078235 -2324960 -1081180 1993865 3346167 1391446
41790A391446k667180j96972J933544J208506o17453k81028K498364M748506M012322
$$ 1391446 -1275734 -1472706 460838 1669344 1051891 770863 3269227 8017733 12030055
41781A2030055J069217j424100k090819j777511j668383j605892q25879M27765
$$ 12030055 13099272 11675172 9584353 7806842 6138459 4532567 3706688 4134453
41773D134453J049216O51147R001k49520n02207j201364j782241j238683M77186
$$ 4134453 5183669 5834816 5843817 5594297 5092090 3890726 2108485 869802 1346988
41764A346988K248335K937187K317316R26580n46252j581946j860223j309941
$$ 1346988 3595323 6532510 8849826 9776406 9230154 7648208 5787985 4478044
41756D478044k11227Q57367J325450R82292N9788r54862j536108j381262p93599
$$ 4478044 4266817 5124184 6449634 7431926 7491714 6536852 5000744 3619482 2825883
41747B825883o37374j350697k065173j497237J82823J413133J524243J615235
$$ 2825883 2188509 837812 -1227361 -2724598 -2541775 -1128642 395601 2010836
41739B010836K300954K145945L5381k155487j692791P36061J589184m38178k569857
$$ 2010836 4311790 6457735 6493116 4337629 2644838 3380899 4970083 4531905 1962048
41730A962048k101746M1522J331089J175500O84216M43571L50065N48491R24163
$$ 1962048 -139698 -98176 1232913 2408413 3092629 3536200 3886265 4434756 5358919
41721E358919O42837m06483q62439l4051N40576n95695k294031k604346j822608
$$ 5358919 6001756 5595273 4732834 4698783 5239359 4643664 2349633 -254713 -2077321
41712b077321j393263r41678P93130K824383K806546Q66275m72537l00415k26861
$$ -2077321 -3470584 -4412262 -3619132 -794749 2011797 2878072 2405535 2105120 1878259
41703A878259r03989q34046M49444J089545J63382n79531J02872O35678m99797
$$ 1878259 974270 140224 589668 1679213 1842595 1263064 1365936 2001614 1501817
41694A501817j875027j389994L78066J419355J406111J288622J049255J82790
$$ 1501817 -373210 -1763204 -1385138 34217 1440328 2728950 3778205 3960995
41686C960995n54895j48512O21371K06446j193335k029396j733025q75345K64771
$$ 3960995 3406100 3257588 3878959 4085405 2892070 862674 -870351 -1745696 -1480925
41677a480925J436257J556872K12489p76787L56647K128805J549767j273728l167318
$$ -1480925 -44668 1512204 1724693 947906 1304553 3433358 4983125 3709397 542079
41668E42079k602259j367786r59061l83343J126470K006221R47286n07797j84809
$$ 542079 -2060180 -3427966 -4387027 -4770370 -3643900 -1637679 -690393 -1198190 -1382999
41659a382999J316216J645744K94651r30542p34724J36560L51381k76341q37520
$$ -1382999 -66783 1578961 1873612 943070 208346 344906 696287 419946 -417574
41650d17574m29230R69728K410088K842447K191673J208276K74650q47279j915260
$$ -417574 -846804 122924 2533012 5375459 7567132 8775408 9050058 8202779 6287519
41641F287519j961823p75571L62477K99727m21696n78322j47380l2472l67578
$$ 6287519 4325696 3550125 3912602 4212329 3790633 3212311 3064931 3032459 2664881
41632B664881l65004K14460O10378L42525L300K49079O04856M449j544421k499584
$$ 2664881 2299877 2514337 3124715 3467240 3470540 3719619 4324475 4328924 2784503 284919
41622B84919j504958O46180J582568K20313j781850k220973j190182l86168j84371
$$ 284919 -1220039 -573859 1008709 1229022 -552828 -2773801 -3963983 -4350151 -4534522
41613d534522O05517J992302K110329K39259j535825j245443O7543L18772j49848
$$ -4534522 -3929005 -1936703 173626 412885 -1122940 -2368383 -2300840 -1982068 -2131916
41604b131916M61661J814052J676265j91902j266780k53154O90387o59480k902556
$$ -2131916 -1670255 143797 1820062 1628160 361380 108226 798613 139133 -2763423
41595b763423k859628p0099K720827L272655K102481Q01147j90281j279548k273716
$$ -2763423 -5623051 -5693150 -2972323 300332 2402813 3203960 3013679 1734131 -539585
41586e39585k320614j056372Q23851K126430K080300R12280k79935m63152K86693
$$ -539585 -2860199 -3916571 -3092720 -966290 1114010 2026290 1746355 1283203 1569896
41577A569896Q76472N26215k78316m80358J46941P39042M03128q58411k257697
$$ 1569896 2446368 2972583 2694267 2213909 2360850 3099892 3503020 2644609 386912
41568C86912k853946k093555k32083J595941K150058J221009k25151j150603j348014
$$ 386912 -2467034 -4560589 -4792672 -3196731 -1046673 174336 -50815 -1201418 -2549432
41559b549432j132418o71820j6118N89936Q69481P85067M08595j27693l66349
$$ -2549432 -3681850 -4353670 -4369788 -3779852 -2910371 -2125304 -1716709 -1844402 -2210751
41550b210751J57430R50537P33562o91691j598159n17376J399207J749146L23456
$$ -2210751 -2053321 -1102784 -369222 -1060913 -2659072 -3176448 -1777241 -28095 295361
41541B95361o17300K37917J377907Q71126q63114j956029j778722j344739j463937
$$ 295361 -321939 -84022 1293885 2165011 1301897 -654132 -2432854 -3777593 -5241530
41532e241530j687374j070037O91308K770620L536974J908105j118015k957559
$$ -5241530 -6928904 -7998941 -7307633 -4537013 -1000039 908066 -209949 -3167508
41524c167508k174960p4836J219237J441877J705821K033852J191732q95970k289441
$$ -3167508 -5342468 -5417304 -4198067 -2756190 -1050369 983483 2175215 1279245 -1010196
41515a010196j407639Q69734K397393K287575J264976N5177j338077k684631l000820
$$ -1010196 -2417835 -1548101 849292 3136867 4401843 4457020 3118943 434312 -2566508
41506b566508j700690K44473J162341O90039J67982P33493J739628J737226N22490
$$ -2566508 -4267198 -4022725 -2860384 -2170345 -2002363 -1268870 470758 2207984 2730474
41497B730474p33597j193944j129078r11565m02714K12074Q7114r48511j544410
$$ 2730474 1996877 802933 -326145 -1237710 -1640424 -1428350 -1341236 -2289747 -3834157
41488c834157l78111J857632L032179K080040J59820p70653l3400J223741J326607
$$ -3834157 -4212268 -2354636 677543 2757583 2917403 2146750 2113350 3337091 4663698
41479D663698j07958j703980j893044o97713O45911J508032K156209K327233J173395
$$ 4663698 4555740 2851760 958716 261003 906914 2414946 4571155 6898388 8071783
41470H071783q39634j714688o41922O58113O05860J11032M98184P70955n51474
$$ 8071783 7232149 5517461 4875539 5533652 6139512 6250544 6748728 7519683 6968209
41461F968209k110960j330171J110418J755696l02512j881684o60390J315805
$$ 6968209 4857249 3527078 4637496 6393192 6090680 4208996 3548606 4864411
41453D864411J022460r85860j851597q04966K39128q5255r42643r83412j44586
$$ 4864411 5886871 4901011 3049414 2244448 2483576 2398321 1455678 472266 327680
41444C27680O32912O71813K51743K47414R49355J377724N05869r16074j027006
$$ 327680 960592 1632405 1884148 2131562 3080917 4458641 4964510 4048436 3021430
41435C021430L89587J360313O21049n73032o48410j26989k83034p53867m01826
$$ 3021430 3411017 4771330 5392379 4819347 4170937 4043948 3760914 3007047 2605221
41426B605221M18166N05293R6870M14160J252226J128790j49645j058879p48263
$$ 2605221 3023387 3528680 3625550 4039710 5291936 6420726 6271081 5212202 4463939
41417D463939n3575K19499K67573J00092q19399k021374j847455J36708K016228
$$ 4463939 4410364 4629863 4897436 4997528 4178129 2156755 309300 446008 2462236
41408B462236K031811R67067O52196J101395Q06925o07447j730943j504754o85675
$$ 2462236 4494047 5461114 6113310 7214705 8021630 7414183 5683240 4178486 3492811
41399C492811o53161j573712k360871k101597j022441p6371J15966k45472n72893
$$ 3492811 2839650 1265938 -1094933 -3196530 -4218971 -4295342 -4179376 -4424848 -4997741
41390d997741m99976K4224Q57082J538018J377474J89529j246224j944347j732746
$$ -4997741 -5497717 -5473493 -4616411 -3078393 -1700919 -1511390 -2757614 -4701961 -6434707
41381f434707j049209j59478O47388N64417q00044k134270j492285J071721L275123
$$ -6434707 -7483916 -7643394 -6996006 -6431589 -7231633 -9365903 -10858188 -9786467 -6511344
41372f511344L504267K649546K346655K631886K356368R91647r99060k829088
$$ -6511344 -3007077 -357531 1989124 4621010 6977378 7969025 6969965 4140877
41364D140877l536700k352869K8298J423286O47077p48924o12251O81608R67656
$$ 4140877 604177 -1748692 -1720394 -297108 349969 -398955 -1011206 -329598 638058
41355F38058k72291j210889n80356N79247P34789k433m07474J00421R27518J001639
$$ 638058 365767 -845122 -1425478 -846231 -111442 -113875 -521349 -420928 506590 1508229
41345A508229k27665j905196k095625k2679K291921K151617j13652j505834p41666
$$ 1508229 1280564 -624632 -2720257 -2742936 -451015 1700602 1586950 81116 -660550
41336f60550N2204r35773k206160j619859n4856K40608l75701L31456K254273
$$ -660550 -608346 -1544119 -3750279 -5370138 -5424994 -5184386 -5560087 -5228631 -2974358
41327b974358K637131M68376j641233j122948J200038K789705K648680J409181
$$ -2974358 -337227 131149 -1510084 -2633032 -1432994 1356711 4005391 5414572
41319E414572l51062k135794k828329j715304J80986J159770R63620P30529J139640
$$ 5414572 5063510 2927716 99387 -1615917 -1434931 -275161 688459 1418988 2558628
41310B558628J708414J756193J118038P2909o61606k54070J049658J620402N03684
$$ 2558628 4267042 6023235 7141273 7214182 6552576 6298506 7348164 8968566 9472250
41301I472250p65683r596K148145K618191P2016l012497l572471j766079j40394
$$ 9472250 8706567 8696971 10845116 13463307 13535323 10522826 6950355 5184276 5043882
41292E043882J0539k41846L20031J346321J787141J372892O41537J03739r7531
$$ 5043882 5054421 4812575 5132606 6478927 8266068 9638960 10280497 10384236 10286705
41283A0286705n0473m1150m54934j308657j945278j579297k63720R76108J216858
$$ 10286705 10236232 10195082 9740148 8431491 6486213 4906916 4643196 5619304 6836162
41274F836162O50045J69656Q6789j46187p83412j088834m05949N75988N25316
$$ 6836162 7486207 7655863 7742652 7596465 6813053 5724219 5318270 5894258 6419574
41265F419574o67331j615408j206446J12867J147144J391106J181805Q99673O15775
$$ 6419574 5752243 4136835 2930389 3043256 4190400 5581506 6763311 7662984 8278759
41256H278759L73492L57297P03738J254393J494736Q98897l51621j131912m25884
$$ 8278759 8652251 9009548 9713286 10967679 12462415 13361312 13009691 11877779 11451895
41247A1451895J292971K323310J650320R9307p75292n46267k39268j010943k802580
$$ 11451895 12744866 15068176 16718496 16817803 16042511 15496244 15256976 14246033 11443453
41238A1443453m230369l798581j465811J079016K110654J702508J265069J420958
$$ 11443453 7213084 3414503 1948692 3027708 5138362 6840870 8105939 9526897
41230I526897J322609K47834j196175j943477j626458l73633J519160L044434
$$ 9526897 10849506 11097340 9901165 7957688 6331230 5957597 7476757 10521191
41222A0521191K753242O37901j208355j092196q6827l99213j972247k544005j026302
$$ 10521191 13274433 13912334 12703979 11611783 11524956 11125743 9153496 6609491 5583189
41213E583189R96541J576079O75690n27369j310374j483760q12298N57770J614268
$$ 5583189 6579730 8155809 8831499 8304130 6993756 5509996 4697698 5255468 6869736
41204F869736J364928K6773j273717j787687j627921j182920o23883l1133L93656
$$ 6869736 8234664 8261437 6987720 5200033 3572112 2389192 1765309 1734176 2127832
41195B127832M58904K61961K01418N66083J103178J229119P69099J86230o0123
$$ 2127832 2586736 2848697 3050115 3616198 4719376 5948495 6717594 6903824 6843701
41186F843701M9118M77190J255370J780286Q81513j473054l287600k659180l72814
$$ 6843701 6892819 7370009 8625379 10405665 11287178 9814124 6526524 3867344 3494530
41177C494530J023528N03049o14729j063155j092186j190956j103387q14188r06847
$$ 3494530 4518058 5021107 4406378 3343223 2251037 1060081 -43306 -857494 -1764341
41168a764341j089459p958K316703L503651J896756o95410j297456J43055J131044
$$ -1764341 -2853800 -2861758 -545055 2958596 4855352 4159942 2862486 3005541 4136585
41159D136585N35578k69013k19729j12326n87120o49244N02928J679298J265866
$$ 4136585 4672163 4403150 4183421 4071095 3483975 2834731 3337659 5016957 6282823
41150F282823l16170j203051o41312M21783J058379J307439J289249O50825n54744
$$ 6282823 5966653 4763602 4122290 4544073 5602452 6909891 8199140 8849965 8295221
41141H295221j367609j069325k81179j39341p14276j087602q58573o10114o80805
$$ 8295221 6927612 5858287 5577108 5437767 4723491 3635889 2777316 2167202 1486397
41132A486397m47178N79469J727811K097490J954283K132395K366332J512910
$$ 1486397 1039219 1618688 3346499 5443989 7398272 9530667 11896999 13409909
41124A3409909m55160j974504j928246j068751o76802p48037m91812P5375K42588
$$ 13409909 12954749 10980245 9051999 7983248 7306446 6558409 6066597 6141972 6384560
41115F384560L8214M02747J815585L593575M775057N114480N036005N057593N334464
$$ 6384560 6422774 6825521 8641106 12234681 17009738 22124218 27160223 32217816 37552280
41106C7552280N347257M072372J047756k592812m737256m356398k677015j926208
$$ 37552280 42899537 46971909 48019665 45426853 40689597 36333199 33656184 31729976
41098C1729976k984000m583184m900180l641400k163446j571097j385820o44013
$$ 31729976 28745976 24162792 19262612 15621212 13457766 11886669 10500849 9856836
41090I856836K72969K7623j514362k778558k551298j370574j67664J226104L021152
$$ 9856836 10129805 10157428 8643066 5864508 3313210 1942636 1774972 3001076 6022228
41081F022228L972732K686452L1493j511928j004621O9767L98364O08716J563125
$$ 6022228 9994960 12681412 12712905 11200977 10196356 10266123 10664487 11273203 12836328
41072A2836328K374040J620929k40065j312916r60284n48245j129850j748345
$$ 12836328 15210368 16831297 16591232 15278316 14318032 13769787 12639937 10891592
41064A0891592j023151M85889R41829L7501m88454L04036P58023r11153l381651
$$ 10891592 9868441 10354330 11296159 11333660 10845206 11149242 11907265 10996112 7614461
41055G614461l512016p07483K114814K449191J103765J64516m7572l44160m89494
$$ 7614461 4102445 3394962 5509776 7958967 9062732 9227248 9179676 8835516 8346022
41046H346022K51417J245975J312743R96937J972948M280262O094919O318372
$$ 8346022 8597439 9843414 11156157 12153094 14126042 18406304 24501223 30819595
41038C0819595N499143M015295J407039j867350l903865l579264j972979q06030
$$ 30819595 36318738 40334033 41741072 39873722 35969857 32390593 30417614 29611584
41030B9611584o73707j355865k488503l341577l314114l048412l359387k814122
$$ 29611584 28937877 27582012 25093509 21751932 18437818 15389406 12030019 9215897
41022I215897J004971O749371Q852165M253476k794124n736418l833133j725640
$$ 9215897 10220868 16970239 25822404 30075880 27281756 21545338 17712205 15986565
41014A5986565j981813k310753n51338J631204J764838L46045n19536k60675L50141
$$ 15986565 14004752 11693999 11142661 12773865 14538703 14884748 14365212 14104537 14454678
41005A4454678R89342J472437Q96967r50807k257598j251621R53353J564516n1119
$$ 14454678 15444020 16916457 17813424 16862617 14605019 13353398 14306751 15871267 15820148
40996A5820148j663762j464628k12067M80866M15320L93085O47071P88705P12005
$$ 15820148 14156386 12691758 12479691 12960557 13375877 13768962 14416033 15204738 15916743
40987A5916743O18523N08438L73458N47376J191898J799609J932350K081092K906291
$$ 15916743 16535266 17043704 17417162 17964538 19156436 20956045 22888395 24969487 27875778
40978B7875778L910353L973555L189111K960050M003966N487267O674246Q158807
$$ 27875778 31786131 35759686 38948797 41908847 45912813 51400080 58074326 66233133
40970F6233133J0525292J2966839J4609380J6352765J9744886K4499449K8882326
$$ 66233133 76758425 89725264 104334644 120687409 140432295 164931744 193814070
40963A93814070L2276793L5176259L6191030L1364316J8166756o94419j8591016
$$ 193814070 226090863 261267122 297458152 328822468 346989224 346294805 327703789
40956C27703789k9665575l2060719k8067689k2240921j8243031j6129755j3174775
$$ 327703789 298038214 265977495 237909806 215668885 197425854 181296099 168121324
40949A68121324p953162k365331J354124L931050P450178J1824945J5433094J8539911
$$ 168121324 160168162 157802831 159156955 163088005 170538183 182363128 197796222 216336133
40941B16336133K3029057K8348555L0446654K5857576J4991965O83657j4260681
$$ 216336133 239365190 267713745 298160399 324017975 339009940 339693597 325432916
40934C25432916k6859603l3767872l3804501k9720488k5452992k2181510j8658725
$$ 325432916 298573313 264805441 231000940 201280452 175827460 153645950 134987225
40927A34987225j4546100j1209460r365684q115888o847945o350168p120264p862716
$$ 134987225 120441125 109231665 99865981 91750093 84902148 78551980 71431716 63569000
40919F3569000o891419m442230k524139k561386l896398m740255m150153k781194
$$ 63569000 56677581 52235351 49711212 47149826 43253428 38513173 34363020 31581826
40911C1581826j817307j544628j314701p50485l24796m64416p36382n64354k69443
$$ 31581826 29764519 28219891 26905190 26154705 25829909 25365493 24629111 24064757 23795314
40902B3795314n08175r16687m17807R36079J513949J62861k017623k838893j653880
$$ 23795314 23287139 22370452 21952645 22888724 24402673 24565534 22547911 19709018 18055138
40893A8055138L3951N98993J30658j37028L00059N84983k24716j724274k380578
$$ 18055138 18089089 18688082 18818740 18681712 18981771 19566754 19342038 17617764 15237186
40884A5237186j194451J033231K257372J132096j535587l379108k739033l55139
$$ 15237186 14042735 15075966 17333338 18465434 16929847 13550739 10811706 10456567
40876A0456567J465786J424512N15047M23205J222538J537393P87447P0787L96653
$$ 10456567 11922353 13346865 13861912 14285117 15507655 17045048 17832495 17903282 18299935
40867A8299935J134475J145706O80961Q53049J511697J129787q33618k753341
$$ 18299935 19434410 20580116 21261077 22114126 23625823 24755610 23921992 21168651
40859B1168651k883129j707930j146392j848761k519181j968542o68697K47997
$$ 21168651 18285522 16577592 15431200 13582439 11063258 9094716 8426019 8674016
40851H674016O20615J028593J463271J320287P10616P15189J802246K713436J770191
$$ 8674016 9294631 10323224 11786495 13106782 13817398 14532587 16334833 19048269 20818460
40842B0818460r18358l314150l607572j942695J56915J465936J745679J250416
$$ 20818460 19900102 16585952 12978380 11035685 11192600 12658536 14404215 15654631
40834A5654631K90238o93345j189712j061872p03879n27964l99278K27493J590849
$$ 15654631 15944869 15251524 14061812 12999940 12296061 11768097 11368819 11596312 13187161
40825A3187161L113238L676317K553359K33841j754418k133629j088752K8471
$$ 13187161 16300399 19976716 22530075 22763916 21009498 18875869 17787117 17815588
40817A7815588L15697L27746J170282K840393L980141L324883J020334j547935
$$ 17815588 18131285 18459031 19629313 22469706 26449847 29774730 30795064 29247129
40809B9247129k851389k141794P3163K113155K240348L49784j643918j651268
$$ 29247129 26395740 24253946 24327109 26440264 28680612 29030396 27386478 25735210
40801B5735210M33162K785868L646262K810221J463277J201672K971177O094960
$$ 25735210 26168372 28954240 32600502 35410723 36874000 38075672 41046849 47141809
40793D7141809Q375782Q074164N912007M216270L939483L640822J812789j015712
$$ 47141809 55517591 63591755 69503762 73720032 77659515 81300337 83113126 82097414
40785H2097414l297715m494227m975497m754132l690326k538015k420480l280851
$$ 82097414 78799699 74305472 69329975 64575843 60885517 58347502 55927022 52646171
40777E2646171l910674l547857k586581j784701j636359k388669l698767m347810
$$ 52646171 48735497 45187640 42601059 40816358 39179999 36791330 33092563 28744753
40769B8744753l351609j415819k72178m87110r89376q95764o00869o86884r17728
$$ 28744753 25393144 23977325 23705147 23218037 22228661 21332897 20732028 20045144 19127416
40760A9127416r13090q52630q66556n57213K48594J043821J541075K232872L370353
$$ 19127416 18214326 17361696 16495140 15937927 16186521 17230342 18771417 21004289 24374642
40751B4374642M171923L911084L193129L243526M307283N541733O175699O039458
$$ 24374642 28546565 32457649 35650778 38894304 43201587 48743320 54919019 60958477
40743F0958477N207698L817097K100930J16515k298593m839195o401782o092233
$$ 60958477 66166175 69983272 72084202 72200717 69902124 65062929 58661147 52568914
40735E2568914m368097k659628k027534k530798l509081m004326l342402j923237
$$ 52568914 48200817 45541189 43513655 40982857 37473776 33469450 30127048 28203811
40727B8203811j104586j696220k892913l309881k683051j768536q96912L29865
$$ 28203811 27099225 25403005 22510092 19200211 16517160 14748624 13851712 14181577
40719A4181577J842427K587256J701443k93176j951162k403807k079143j907133
$$ 14181577 16024004 18611260 20312703 20019527 18068365 15664558 13585415 11678282
40711A1678282k059783j816689p38407N35377J123960J064784Q39786J97383j256208
$$ 11678282 9618499 7801810 7063403 7598780 8722740 9787524 10627310 10824693 9568485
40702I568485k430058j459474J412898L381208K569621M79483m32659k03303n03265
$$ 9568485 7138427 5678953 7091851 10473059 13042680 13522163 13089504 12886201 12382936
40693A2382936j399048j343313r3325P19640K82983j85423L41723R83486N13481
$$ 12382936 10983888 9640575 9547250 10266890 10549873 10364450 10706173 11689659 12203140
40684A2203140n97984q63497K24793J822778K873936K885082J970028P83915J64842
$$ 12203140 11605156 10741659 10966452 12789230 15663166 18548248 20518276 21302191 21467033
40675B1467033L31238N98675K19721p10272j472459j630117j385171j108178q28929
$$ 21467033 21798271 22396946 22616667 21906395 20433936 18803819 17418648 16310470 15481541
40666A5481541l83826L4655q8177o66227n86872R13382K628778K422386J88002
$$ 15481541 15097715 15132370 15044193 14377966 13791094 14704476 17333254 19755640 19943642
40657A9943642j650760j369071k28992l16232j433915j879836j333332r29728
$$ 19943642 18292882 16923811 16694819 16378587 14944672 13064836 11731504 10801776
40649A0801776r77743o97176j02759j44819q33024j070289o10957m11273o82551
$$ 10801776 9824033 9126857 9024098 8879279 8046255 6975966 6365009 5953736 5271185
40640E271185l61308R21933J930424J544182J43122j153160j455708k49439J996543
$$ 5271185 4909877 5831810 7762234 9306416 9449538 8296378 6840670 6591231 8587774
40631H587774L442147K870343J910990K980753N003365M184465j59995l751739
$$ 8587774 12029921 14900264 16811254 19792007 24795372 28979837 28819842 25068103
40623B5068103l000063L56405K430076K437575K107067J978700J439999J104438
$$ 25068103 22068040 22424445 24854521 27292096 29399163 31377863 32817862 33922300
40615C3922300K072701L592555M185569M424527N922990Q203357R435047R920656
$$ 33922300 35995001 39587556 43773125 48197652 54120642 62323999 71759046 81679702
40607H1679702J1774314J4911421J6253011J3630263Q096702J716918m564434
$$ 81679702 93454016 108365437 124618448 138248711 146345413 148062331 143497897
40600A43497897r956827j3010401j3163934j1616455r651400p439608n169124
$$ 143497897 133541070 120530669 107366735 95750280 86098880 78659272 73490148
40593G3490148l654920k842008j336207J349738L533011L769459L348844M754695
$$ 73490148 69835228 66993220 65657013 67006751 70539762 74309221 77658065 82412760
40585H2412760Q269881J1544714J2211221R765752N127787m61475n866742j0091619
$$ 82412760 90682641 102227355 114438576 124204328 129332115 128870640 123003898 112912279
40577A12912279j2324820j2123761r881079p066596n354495n217678n808615o261978
$$ 112912279 100587459 88463698 78582619 71516023 66161528 60943850 55135235 48873257
40569D8873257o405340o075833m747169k453483l99716Q1646j065980k637902
$$ 48873257 42467917 36392084 31644915 29191432 28791716 28873362 27807382 25169480
40561B5169480l325397k692924j389378n31361n33751o30090n1639O02321J05593
$$ 25169480 21844083 19151159 17761781 17230420 16696669 16066579 16014940 16617261 16722854
40552A6722854j363879k093526j006862J079988K701022L172313K406707N60317
$$ 16722854 15358975 13265449 12258587 13338575 16039597 19211910 21618617 22178934
40544B2178934j398272j932284p94723K33287m27046j898403k073594o18301O67541
$$ 22178934 20780662 18848378 18053655 18286942 17859896 15961493 13887899 13269598 13937139
40535A3937139M87417k70860j27J351683K237840J487491k98322j511106j397241
$$ 13937139 14424556 14153696 14153569 15505252 17743092 19230583 18932261 17421155 16023914
40526A6023914p33580n57235p06766j60053J376730K883239L131171J890387n0823
$$ 16023914 15290334 14733099 14026333 13866280 15243010 18126249 21257420 23147807 23096984
40517B3096984j583775j884735q33510Q55598K079133K038929O06170j534082
$$ 23096984 21513209 19628474 18794964 19650562 21729695 23768624 24374794 22840712
40509B2840712k918787k292855k48154Q88521j78293j767579j392631P10234J980057
$$ 22840712 19921925 17629070 17380916 18269437 18091144 16323565 14930934 15641168 17621225
40500A7621225J263732J99712N57280J982605K987713K676583R82303j291680
$$ 17621225 18884957 19084669 19641949 21624554 24612267 27288850 28271153 26979473
40492B6979473k243143m61257K578490L721823K590354K546862N781497R738739
$$ 26979473 24736330 24275073 26853563 30575386 33165740 35712602 41494099 51232838
40484E1232838J0614408Q529896O528830N679799M185840R69855k663548n185325
$$ 51232838 61847246 70377142 76905972 82585771 86771611 87741466 85077918 79892593
40476G9892593o370164o301708m921298l131558k512670l188371l475981k359993
$$ 79892593 73522429 67220721 62299423 59167865 56655195 53466824 49990843 47630850
40468D7630850q70641j46263N27642K509134N458640P518688P634266O686450
$$ 47630850 46760209 46613946 47141588 49650722 55109362 62628050 70262316 76948766
40460G6948766O115608O029086N137996K478060j261967m448018o216017o893253
$$ 76948766 83064374 89093460 94231456 96709516 95447549 90999531 84783514 77890261
40452G7890261o963982o585388o141477o054912n736560m106393j740359q88067
$$ 77890261 70926279 64340891 58199414 52144502 46407942 42301549 40561190 39673123
40444C9673123k312407l783486l265277j995188k263039l440623k959947o43061
$$ 39673123 37360716 33577230 30311953 28316765 26053726 22613103 19653156 19010095
40436A9010095Q85866K89205p18461m24056M69366O39562M00265P04090J219931
$$ 19010095 19895961 20185166 19466705 19042649 19512015 20151577 20551842 21255932 22475863
40427B2475863Q38664o04668k121473k648912j853436m16931K53942o58883k231426
$$ 22475863 23314527 22709859 20588386 17939474 16086038 15669107 15923049 15264166 13032740
40418A3032740k773854j927568p87117q9325L79137O16898K47335k70165J00036
$$ 13032740 10258886 8331318 7544201 7454876 7834013 8450911 8698246 8428081 8528117
40409H528117J141536J448526P02556J15392J30532k56311j065014m94706K000471
$$ 8528117 9669653 11118179 11820735 11936127 12066659 11810348 10745334 10250628 12251099
40400A2251099L823463K447601q83124k752678j924819r0354J080507J599693
$$ 12251099 16074562 18522163 17639039 14886361 12961542 12871188 13951695 15551388
40392A5551388K017879K336167K309989J807148Q35358j18284j90800O40378J029099
$$ 15551388 17569267 19905434 22215423 24022571 24857929 24739645 24548845 25189223 26218322
40383B6218322j16874k030864l040628k552386j160094M96425J831178J940944
$$ 26218322 26101448 24070584 21029956 18477570 17317476 17813901 19645079 21586023
40375B1586023N20125j178606j536202n27595N23201Q24413O98294N93072O14980
$$ 21586023 22106148 20927542 19391340 18863745 19386946 20211359 20909653 21502725 22117705
40366B2117705Q84641J398631J646734J106163r8512j527825k831251l300460
$$ 22117705 23002346 24400977 26047711 27153874 27055362 25527537 22696286 19395826
40358A9395826k056656L62895J707144O39674j273103j698416p63138l78456j073933
$$ 19395826 17339170 17702065 19409209 20048883 18775780 17077364 16314226 15935770 14861837
40349A4861837j562969j168928o60818o02492n99609l20068J92477J123539K328732
$$ 14861837 13298868 12129940 11469122 10866630 10267021 9946953 10139430 11262969 13591701
40340A3591701K495764O39360j825971k486827j273011k87164l83066l77371P7545
$$ 13591701 16087465 16726825 14900854 12414027 11141016 10853852 10470786 10093415 10170960
40331A0170960m20097k157738l064720j694449O05136J846896J851228J247493
$$ 10170960 9750863 7593125 4528405 2833956 3439092 5285988 7137216 8384709
40323H384709J2835j406855j370360O67207K582302K157969K6442j632845k029230
$$ 8384709 8397544 6990689 5620329 6287536 8869838 11027807 11054249 9421404 7392174
40314G392174j621878m44861J272893J955451N44900j237055r10666R88669J681800
$$ 7392174 5770296 5325435 6598328 8553779 9098679 7861624 6950958 7939627 9621427
40305I621427N01758k01100J065521K665019K497134R99308J18901N28842J189513
$$ 9621427 10123185 9922085 10987606 13652625 16149759 17149067 17267968 17796810 18986323
40296A8986323J058008K30951l93889p0042J077688K194364K710927K915699L132911
$$ 18986323 20044331 20275282 19881393 19811351 20889039 23083403 25794330 28710029 31842940
40287C1842940K934391J974009R99435Q51837Q63418l40948k546353l893590l316019
$$ 31842940 34777331 36751340 37750775 38602612 39466030 39125082 36578729 32685139 29369120
40278B9369120j763401p05501n54437r04354j306271j425648j218838j111900
$$ 29369120 27605719 26900218 26345781 25441427 24135156 22709508 21490670 20378770
40270B0378770j297009j080574N8443J153042R26607k1707k8100P47754M95834
$$ 20378770 19081761 18001187 18059630 19212672 20139279 20117572 20089472 20837226 21333060
40261B1333060q17819p61110J665429L838942L089325N83787o14346n2412M0915
$$ 21333060 20515241 19754131 21419560 25258502 28347827 28931614 28317268 28264856 28305771
40252B8305771j420241k935126k947975j893255j171661j341860j834281j740260
$$ 28305771 26885530 23950404 21002429 19109174 17937513 16595653 14761372 13021112
40244A3021112o88166O24854R72123O4771j055063j531933j699874j894963j509991
$$ 13021112 12332946 12957800 13929923 13994694 12939631 11407698 9707824 7812861 6302870
40235F302870l74504K62410k49703k79310J585253L481165K524797m61420j727880
$$ 6302870 5928366 6190776 5941073 5661763 7247016 10728181 13252978 12791558 11063678
40226A1063678k84331O35237j134519l257536k781701p14296m022q41300r91034
$$ 11063678 10779347 11414584 10280065 7022529 4240828 3526532 3522510 2681210 1690176
40217A690176J51534P96745n2239j136724j093112k09698N10275O70052L96277
$$ 1690176 1841710 2638455 2586216 1449492 356380 146682 656957 1327009 1723286
40208A723286m182J9086P73986J603512J488628M47902m82429o35047k08018M88626
$$ 1723286 1719104 1738190 2512176 4115688 5604316 6052218 5569789 4934742 4726724 5215350
40198E215350J192914J132874l80866k472966l053280j312027J065957J906135
$$ 5215350 6408264 7541138 7160272 4687306 1634026 321999 1387956 3294091
40190C294091J018974j19567n51791o61616r48999j041715m64910J99206j21501
$$ 3294091 4313065 4193498 3641707 2980091 2031092 989377 524467 723673 602172
40181F02172j145170r99809J260994L659235L401161Q20239q20971k1152P93717
$$ 602172 -542998 -1542807 -281813 3377422 6778583 7598822 6777851 6756699 7550416
40172G550416p04799k828741k569421n74620o7471j485585j909631j29860J439942
$$ 7550416 6845617 4016876 1447455 872835 805364 -680221 -2589852 -2719712 -1279770
40163a279770J092292N59879J435577J984192K80395j917950j693783K49024P45805
$$ -1279770 -187478 372401 1807978 3792170 4072565 2154615 460832 709856 1455661
40154A455661p62072j718120q12583L68144M45050J07317Q1745j87942p31528
$$ 1455661 693589 -1024531 -1837114 -1468970 -1023920 -916603 -834858 -1022800 -1754328
40145a754328j82012J867007L439375K671543M13488j094809j052015k32666P05809
$$ -1754328 -1936340 -69333 3370042 6041585 6455073 5360264 4308249 4075583 4781392
40136D781392J521866J644056O65515o26039r54680k52467L01771j33711j272376
$$ 4781392 6303258 7947314 8612829 7986790 7032110 6779643 7081414 6947703 5675327
40127E675327k368080k812496k118686k39904J876690K816893K169315R83893
$$ 5675327 3307247 494751 -1623935 -1863839 12851 2829744 4999059 5982952
40119E982952M29985M33992J12716p31019j221940o74583L23412O22252N5253
$$ 5982952 6412937 6846929 6959645 6228626 5006686 4332103 4655515 5277767 5333020
40110E333020m20187j77002K48505J31987l46174n71659m46583j52956M45253
$$ 5333020 4912833 4735831 4984336 5116323 4770149 4198490 3751907 3598951 4044204
40101D044204J275843J498205N92048m53433l82539K39065j63592j337260j147850
$$ 4044204 5320047 6818252 7410300 6956867 6574328 6813393 6649801 5312541 4164691
40092D164691J115382L308967L321733J716667K09758r31859k250571l044333
$$ 4164691 5280073 8589040 11910773 13627440 13837198 12905339 10654768 7610435
40084G610435k056498K16921J809175J873689J450683J545763J849167J668748
$$ 7610435 5553937 5770858 7580033 9453722 10904405 12450168 14299335 15968083
40076A5968083R85869J70896n63313j150818j639005k115103k217830j236165
$$ 15968083 16953952 17124848 16561535 15410717 13771712 11656609 9438779 8202614
40068H202614N34585J307854q484j802115j680529J6925P84504j9311k85127J041870
$$ 8202614 8737199 10045053 10036569 8234454 6553925 6570850 7355354 7336043 7050916 8092786
40058H092786J993081R53129m35925k3673J101587M26711j655276k460260j446706
$$ 8092786 10085867 11038996 10603071 10579398 11680985 12107696 10452420 7992160 6545454
40049F545454p42260j028861l11728K038658L192134R66400k364809l038980j009787
$$ 6545454 5803194 4774333 4462605 6501263 9693397 10659797 8294988 5256008 4246221
40040D246221O29372M62744k992L17360M76079k01653p50564n18254l92480r12366
$$ 4246221 4875593 5338337 5335345 5652705 6128784 5927131 5176567 4658313 4265833 3353467
40030C353467r92409J46180J386256J480808R52451P59397N53983k4231J39981
$$ 3353467 2361058 2507238 3893494 5374302 6326753 7086150 7640133 7615902 7755883
40021G755883J646024K456537M92876k535672k994557p11423Q22177m2310r11827
$$ 7755883 9401907 11858444 12351320 9815648 6821091 6109668 6931845 6889535 5977708
40012E977708J52789J314608K77593j737247j950601j21725J848148K947436L185531
$$ 5977708 6130497 7445105 7722698 5985451 4034850 3913125 5761273 8708709 11894240
40003A1894240J999831p01583k783927k035966L32027J057148n45504k093289
$$ 11894240 13894071 13192488 10408561 8372595 8704622 9761770 9216266 7122977
39995G122977k221898k104976k401745j821131O4679J403540J145076J068603
$$ 7122977 4901079 2796103 394358 -1426773 -1362094 41446 1186522 2255125
39987B255125K673315M170832L088983L36670j073502m73730L5702p17575j552875
$$ 2255125 4928440 9099272 12188255 12524925 11451423 10977693 11013395 10295820 8742945
39978H742945j477744j198789j312881j082146j63571J67609r68387k054501r65009
$$ 8742945 7265201 6066412 4753531 3671385 3507814 3675423 2707036 652535 -312474
39969c12474J800452L387698K124224o26954k451833k460498j281513L32155J740235
$$ -312474 1487978 4875676 6999900 6372946 3921113 1460615 179102 511257 2251492
39960B251492J959259M58021j569624k066198o98692N53981J19081r39658n84766
$$ 2251492 4210751 4668772 3099148 1032950 334258 888239 1007320 67662 -517104
39951e17104J054817J786828N05510j293947j603031l02652J219432J952009J887183
$$ -517104 537713 2324541 2830051 1536104 -66927 -369579 849853 2801862 4689045
39942D689045J279433J82636j258497k506226k767755j573504M79528J794602
$$ 4689045 5968478 6151114 4892617 2386391 -381364 -1954868 -1475340 319262
39934C19262J334607J25181K26417J867495K691368P09296k774586m355459k431517
$$ 319262 1653869 1779050 2005467 3872962 6564330 7273626 4499040 143581 -2287936
39925b287936J057768K859501J649258j091897k831054k281807k40722J506548
$$ -2287936 -1230168 1629333 3278591 2186694 -644360 -2926167 -3166889 -1660341
39917a660341J943871J439952Q39433M39023M5720l74497n35086k40587K87182
$$ -1660341 283530 1723482 2562915 3001938 3047658 2673161 2138075 1897488 2184670
39908B184670N66858L90291J72771M40883Q42220L34553j078286j640783r4186
$$ 2184670 2751528 3141819 3314590 3755473 4597693 4932246 3853960 2213177 2118991
39899B118991J964788J732840q49493k789270k174678n41460j6245q3164R91853
$$ 2118991 4083779 5816619 4967126 2177856 3178 -538282 -554527 -637691 354162
39890C54162K936653L817540K894577J190675l75908j648813k315142k068859
$$ 354162 3290815 7108355 10002932 11193607 10817699 9168886 6853744 4784885
39882D784885j577951j694755j838431q04585R35670J583607P75255Q3147L47786
$$ 4784885 3206934 1512179 -326252 -1130837 -195167 1388440 2163695 2246842 2594628
39873B594628M18785o53835j884804j912091r85075k43331N4341N30807J522534
$$ 2594628 3013413 2359578 474774 -1437317 -2422392 -2665723 -2611382 -2080575 -558041
39864e58041K632331K990928J764799p84005k736612k308452l58869N01642l54143
$$ -558041 2074290 5065218 6830017 6046012 3309400 1000948 642079 1143721 789578
39855G89578p57357N41517J684500Q27794p19691p61736J08027j45540j167435
$$ 789578 32221 573738 2258238 3086032 2366341 1604605 1712632 1567092 399657
39846C99657q71224N57047O13111j252066k444208j288717N19794J003530R54286
$$ 399657 -471567 85480 698591 -553475 -2997683 -4286400 -3766606 -2763076 -1808790
39837a808790J871656K790566J684884r86252k590672j899330k93083O35551Q30993
$$ -1808790 62866 2853432 4538316 3552064 961392 -937938 -1231021 -595470 235523
39828B35523P55888K71963o40123j157032n70955N74779J068943M96154m26463
$$ 235523 991411 1263374 623251 -533781 -1104736 -529957 538986 1035140 608677
39819F08677q43215o41474k70908N6677O95995J898200K958230K608812O03001
$$ 608677 -234538 -876012 -1146920 -1090243 -394248 1503952 4462182 7070994 7673995
39810G673995j596943k340221j680099r84072q78208o42524J73991O98142L4025
$$ 7673995 6077052 3736831 2056732 1072660 194452 -448072 -274081 424061 458086
39801D58086j171561j441589l97725Q98348J364636Q59216j69900j133498j363306
$$ 458086 -713475 -2155064 -2552789 -1654441 -289805 569411 399511 -733987 -2097293
39792b097293o21771K52640J20813p12024n81085J041981K248453J133730j226884
$$ -2097293 -2719064 -2466424 -2345611 -3057635 -3638720 -2596739 -348286 785444 -441440
39783d41440j923917j61649J767775J896459J139287J257887J741260O26393k124620
$$ -441440 -2365357 -2527006 -759231 1137228 2276515 3534402 5275662 5902055 3777435
39774C777435m056344l341040r66200Q23634J143027P57613O16907R97731J632740
$$ 3777435 -278909 -3619949 -4586149 -3762515 -2619488 -1861875 -1244968 -247237 1385503
39765A385503J909838J242087j34765j055595p57010j595j32080j205734j886061
$$ 1385503 3295341 4537428 4402663 3347068 2590058 2588463 2456383 1250649 -635412
39756f35412j187626M18340J734136K002664J235200N3812n93396j83825O82412
$$ -635412 -1823038 -1404698 329438 2332102 3567302 3621114 3027718 2843893 3526305
39747C526305R00167L06124k08559k06712l74436j203872j975696j835629j058518
$$ 3526305 4426472 4732596 4524037 4317325 3942889 2739017 763321 -1072308 -2130826
39738b130826l27892M22916J286368J296878k94003k070632j710569O60827K295861
$$ -2130826 -2458718 -2035802 -749434 547444 253441 -1817191 -3527760 -2866933 -571072
39729e71072J588399J10312j77956Q8715p40190k103070j902466J2993J342453
$$ -571072 1017327 1127639 949683 1038398 298208 -1804862 -3707328 -3694335 -2351882
39720b351882O74678n91739n40892N25840Q92466R4672n86280j14048R37018J318523
$$ -2351882 -1677204 -2268943 -2809835 -2283995 -1391529 -1296857 -1883137 -1997185 -1060167 258356
39710B58356P51006R9079O8780K60733j50963j059177j384162n70562N11906O79925
$$ 258356 1009362 1108441 1177221 1437954 1286991 227814 -1156348 -1726910 -1215004 -535079
39700e35079j6486n35862l40939R6052J61234k38717q44059j237214r48629j1141
$$ -535079 -551565 -1087427 -1428366 -1332314 -1171080 -1409797 -2253856 -3491070 -4439699 -4450840
39690d450840P34614O13307J73956L57294Q43077M91960n64681q06095K70366
$$ -4450840 -3716226 -3102919 -2928963 -2571669 -1728592 -1236632 -1801313 -2607408 -2337042
39681b337042J163094O36120m12987n20270P9604J78452k89322m36258j88179
$$ -2337042 -1173948 -537828 -950815 -1471085 -1391481 -1213029 -1502351 -1938609 -2126788
39672b126788k54144n90993m66856R709q628l74114M6088J238569J609438M87418
$$ -2126788 -2380932 -2971925 -3438781 -3429072 -3437700 -3811814 -3765726 -2527157 -917719 -430301
39662d30301n06665J58636J447823J301408j59439q93441j94546L44063l66196
$$ -430301 -936966 -778330 669493 1970901 1811462 918021 723475 1067538 701342
39653G01342j023962j38618J241832Q68437j157832k183946o89918J581525K115327
$$ 701342 -322620 -461238 780594 1649031 491199 -1692747 -2382665 -801140 1314187
39644A314187Q70929l00139n25484n41807q46568r21392m37447J99686P98024
$$ 1314187 2185116 1884977 1359493 817686 -28882 -950274 -1387721 -1188035 -390011
39635c90011J563809K032279J243860m73037j353346o29508K84426L2495o75820
$$ -390011 1173798 3206077 4449937 3976900 2623554 1994046 2278472 2310967 1635147
39626A635147n99135j63046m36335r50807m66239P52881J363503J200753J152696
$$ 1635147 1036012 872966 436631 -514176 -980415 -227534 1135969 2336722 3489418
39617C489418J112795K05254r89937p33125R44560J796533O16303j022167j249043
$$ 3489418 4602213 4807467 3817530 3084405 4028965 5825498 6441801 5419634 4170591
39608D170591l65808K74774K63516k16529j305143k655252k874881j187637J191606
$$ 4170591 3804783 4079557 4343073 4126544 2821401 166149 -2708732 -3896369 -2704763
39599b704763K500246K416730J634706N28355n75145q49550q3617M89492j98556
$$ -2704763 -204517 2212213 3846919 4375274 3800129 2950579 2866962 3356454 3157898
39590C157898j383891j670279j055988m53037q9758J65191j75010j222311j615604
$$ 3157898 1774007 103728 -952260 -1405297 -1495055 -1329864 -1504874 -2727185 -4342789
39581d342789k41518J687806K190672J437596J024298J024542K69524q00250l56562
$$ -4342789 -4584307 -2896501 -705829 731767 1756065 2780607 3050131 2249881 1893319
39572A893319J556163K694296K087760J239868J099191M92054j191607k215492
$$ 1893319 3449482 6143778 8231538 9471406 10570597 11062651 9871044 7655552
39564G655552j102014Q85021J565475O41886p86509k018974k645868k128002r10830
$$ 7655552 6553538 7438559 9004034 9645920 8859411 6840437 4194569 2066567 1155737
39555A155737n10063j153753j023428O60278J749162L62212j900230k377660j357718
$$ 1155737 645674 -508079 -1531507 -871229 877933 1240145 -660085 -3037745 -4395463
39546d395463q81416r16565O1891J533641J453870J11733L0258J641024K320473
$$ -4395463 -5276879 -6193444 -6131553 -4597912 -3144042 -3032309 -3002051 -1361027 959446
39537I59446O21174j462051j685810n35641L29340M94875L34870l8189j86757
$$ 959446 1580620 118569 -1567241 -2102882 -1773542 -1278667 -943797 -981986 -1168743
39528a168743O19836J849272J936236Q15441J45738K64638m47516j989822j658883
$$ -1168743 -548907 1300365 3236601 4052042 4197780 4462418 4014902 2025080 366197
39519C66197J322980L165320O61289l435268m009883r87373J041197r2208j711594
$$ 366197 1689177 4854497 5515786 2080518 -1929365 -2916738 -1875541 -1967749 -3679343
39510c679343j277575K37389J121748J631599K238717J960898L50441j055926
$$ -3679343 -4956918 -4719529 -3597781 -1966182 272535 2233433 2583874 1527948
39502A527948j132595j056709j895626k200086l84130J936403J786766n83142
$$ 1527948 395353 -661356 -2556982 -4757068 -5141198 -3204795 -1418029 -2001171
39494b001171j740678P4553K578376K822391J037059l26882k20355O9190o34032
$$ -2001171 -3741849 -3667296 -1088920 1733471 2770530 2443648 2223293 2292483 1658451
39485A658451j605175j522823n50208K6596j00848J20238J071273J452185L46601
$$ 1658451 53276 -1469547 -2019755 -1993159 -2094007 -1973769 -902496 549689 896290
39476H96290q61498l13120J239844J282614n30936j620007m30273J090041N52998
$$ 896290 34792 -278328 961516 2244130 1713194 93187 -337086 752955 1305953
39467A305953j090426j033072J079969K686448K010549J21224j104498j302025
$$ 1305953 215527 -817545 262424 2948872 4959421 5080645 3976147 2674122
39459B674122j125540q06601k81721L3175l42102j035687j096144j66957J059664
$$ 2674122 1548582 741981 460260 493435 151333 -884354 -1980498 -2147455 -1087791
39450a087791J589678J099812J81737k55714J53337R37996J378650J280457J000607
$$ -1087791 501887 1601699 1783436 1527722 1681059 2619055 3997705 5278162 6278769
39441F278769P96139M19365n14886j832484k612857j942389n2758J530608J448957
$$ 6278769 7074908 7494273 6979387 5146903 2534046 591657 538899 2069507 3518464
39432C518464L8741j165674j390670j244654j251522r01184J80632J157317J135594
$$ 3518464 3557205 2391531 1000861 -243793 -1495315 -2396499 -2215867 -1058550 77044
39423G7044O37369O83401R64639L73861r04888j444013q42137l49183p16181r36301
$$ 77044 714413 1397814 2362453 2736314 1831426 387413 -454724 -803907 -1520088 -2456389
39413b456389m9077J077382J058639K46902J98977J220226J879368J130369k86733
$$ -2456389 -2505466 -1428084 -369445 -122543 76434 1296660 3176028 4306397 4019664
39404D019664j051733r73668q02740q97505q99777n90489l22698l95149m85662
$$ 4019664 2967931 1994263 1191523 294018 -605759 -1196248 -1518946 -1914095 -2399757
39395b399757o0570Q82149J786746K137299J841309J143982M11711j26868o61573
$$ -2399757 -2460327 -1578178 208568 2345867 4187176 5331158 5742869 5616001 4954428
39386D954428j582298k646855k792268j496217J0432J2321j204385j510159o5125
$$ 4954428 3372130 725275 -2066993 -3563210 -3552778 -3540457 -4744842 -6255001 -6320126
39377f320126J176190K40768j739359j844026O69695L382389L763463J850744
$$ -6320126 -5143936 -4903168 -6642527 -8486553 -7816858 -4434469 -671006 1179738
39369A179738m03215j356081q32629J43797L89893k28187o39494q1655O69726
$$ 1179738 776523 -579558 -1412187 -1268390 -878497 -1106684 -1746178 -1827833 -1158107
39360a158107M80144k30796j32600O82451O89429n37296j521765j225077n32942
$$ -1158107 -677963 -908759 -1041359 -358908 330521 -206775 -1728540 -2953617 -3486559
39351c486559m68769m42488M16971J384599J138273q7700q36242n70989k07153
$$ -3486559 -3955328 -4397816 -3980845 -2596246 -1457973 -1545673 -2381915 -2952904 -3160057
39342c160057n90929j406696j600280l76289J903127L434814K367549q25108l230929
$$ -3160057 -3750986 -5157682 -6757962 -7134251 -5231124 -1796310 571239 -253869 -3484798
39333c484798k707485l59385J293999J651483J951227K611043K677879J823062
$$ -3484798 -6192283 -6551668 -5257669 -3606186 -1654959 956084 3633963 5457025
39325E457025R27210L57312n82830j939747k499153j727259q94577j165916j684803
$$ 5457025 6384235 6741547 6158717 4218970 1719817 -7442 -902019 -2067935 -3752738
39316c752738q52285J160169K481748J954400M61172k81143L60614J433042J576263
$$ -3752738 -4605023 -3444854 -963106 991294 1452466 1171323 1531937 2964979 4541242
39307D541242N64223m90908o29866l31733o34391j289910r93934L51593R52346
$$ 4541242 5105465 4614557 3984691 3652958 3018567 1728657 734723 1086316 2038662
39298B038662m80030k658931l183876j508690O43949J509174Q67645m16795j332963
$$ 2038662 1558632 -1100299 -4284175 -5792865 -5148916 -3639742 -2772097 -3188892 -4521855
39289d521855j072665N19618K384907K842909J312547r10953k001228j459590
$$ -4521855 -5594520 -5074902 -2689995 152914 1465461 554508 -1446720 -2906310
39281b906310l06337L08932K36494J08717L85289Q22380Q22248J91598n42373
$$ -2906310 -3212647 -2903715 -2667221 -2558504 -2173215 -1350835 -528587 -336989 -879362
39272h79362o55248l1760P17325R99551Q83346P91533P52006L72921m31892j197606
$$ -879362 -1534610 -1566370 -849045 150506 1033852 1825385 2577391 2950312 2518420 1320814
39262A320814j607239j892941k072431j367333O87636K838633L075454J255293
$$ 1320814 -286425 -2179366 -4251797 -5619130 -4931494 -2092861 982593 2237886
39254B237886m59821m11626M76672M28489m46370o50180O3949L13065o43355j842983
$$ 2237886 1778065 1366439 1843111 2271600 1825230 1175050 1238999 1552064 908709 -934274
39244i34274k165158j556626l06908J468250K928964K506704n3176k629761k962957
$$ -934274 -3099432 -4656058 -4962966 -3494716 -565752 1940952 1887776 -741985 -3704942
39235c704942j348030L3391j7639o91471p51202o980Q36078J022935M45656n687
$$ -3704942 -5052972 -5019581 -5037220 -5728691 -6479893 -6486873 -5650795 -4627860 -4182204 -4187891
39225d187891Q33443K686775L488464J828913q04753j710236o43162l0206j270149
$$ -4187891 -3354448 -667673 2820791 4649704 3844951 2134715 1491553 1461347 191198
39216A91198k751914k503930j121403m81501o66860r9945J608556K816833K206495
$$ 191198 -2560716 -5064646 -6186049 -6667550 -7334410 -7434355 -5825799 -3008966 -802471
39207h02471N67889m25410k62000L09859N71775M49572J46787j71455l44774k43279
$$ -802471 -234582 -659992 -921992 -612133 -40358 409214 556001 384546 39772 -203507
39197b03507J30252O46597J019444P95472j98569j249247j154511L15520J784643
$$ -203507 -73255 573342 1592786 2388258 2189689 940442 -214069 101451 1886094
39188A886094J735352L91198n55660p7799J018573J267020L24877p88409r44268
$$ 1886094 3621446 4012644 3456984 3379185 4397758 5664778 5989655 5201246 4256978
39179D256978q6222P31301L85794j082393k315054k001886l74816J039972J152644
$$ 4256978 4170756 4902057 5287851 4205458 1890404 -111482 -486298 553674 1706318
39170A706318L13174m61961o63976m42802j04783J86045M94439R98287J419365
$$ 1706318 2019492 1557531 893555 450753 345970 532015 1026454 2024741 3444106
39161C444106Q11024j139106k676044j396977K256678M543022K799411j022189
$$ 3444106 4255130 3116024 439980 -956997 1299681 5842703 8642114 7619925
39153G619925k940553j999773n07413J05759Q00147J973166J913718l10900k609547
$$ 7619925 4679372 2679599 2172186 2277945 3078092 5051258 6964976 6654076 4044529
39144D044529k503438o48863K67158o92544j975342k134841j298295q7646J208239
$$ 4044529 1541091 892228 1159386 466842 -1508500 -3643341 -4941636 -5029282 -3821043
39135c821043K058203J721993M45789m27978j65271L57939J5405q28984p47493
$$ -3821043 -1762840 -40847 404942 -23036 -188307 169632 185037 -643947 -1391440
39126a391440P67974K442164K569907R27487j017770j793559j375088o42705O7087
$$ -1391440 -623466 1818698 4388605 5316092 4298322 2504763 1129675 486970 554057
39117E54057R65637J593291R44736p72676j847093j424776r40156j853140k993730
$$ 554057 1519694 3112985 4057721 3285045 1437952 13176 -926980 -2780120 -5773850
39108e773850k039892Q14279K777835K283247Q92423N79854Q72290J47522j322607
$$ -5773850 -7813742 -6999463 -4221628 -1938381 -1045958 -466104 406186 553708 -768899
39099g68899j440698O91310L208766L473177R87728k153228l473656k371205j85155
$$ -768899 -2209597 -1518287 1690479 5163656 6151384 3998156 524500 -1846705 -2031860
39090b031860J506587K143954J884598R18620m01795j363222j573089j490604
$$ -2031860 -525273 1618681 3503279 4421899 4020104 2656882 1083793 -406811
39082d06811j595508j462258n19082P00771J158268Q73316O87979O96195L25576
$$ -406811 -2002319 -3464577 -3983659 -3282888 -2124620 -1251304 -563325 132870 458446
39073D58446j13576L47592J356743J335710J16628m61502M37390J017456k61721
$$ 458446 344870 692462 2049205 3384915 3501543 3040041 3477431 4494887 4233166
39064D233166j953153j792957k46069M30550k25953p08629n11310p17174j540333
$$ 4233166 2280013 487056 240987 671537 445584 -263045 -774355 -1491529 -3031862
39055c031862j721561q71863k15476l06650j05904P84889J073760K05059j71158
$$ -3031862 -4753423 -5625286 -5840762 -6147412 -6253316 -5468427 -4394667 -4189608 -4360766
39046d360766J164652K608102K033430K25710k94784Q39876J509866N25261q43974
$$ -4360766 -3196114 -588012 1445418 1671128 1376344 2216220 3726086 4251347 3407373
39037C407373j139922o74439n30953r74105j544898j753845j206051P5271J152630
$$ 3407373 2267451 1593012 1062059 87954 -1456944 -3210789 -4416840 -4341569 -3188939
39028c188939R58791j56619o71283O7802J133724J603095J593786J335928O10374
$$ -3188939 -2230148 -2386767 -3058050 -2990248 -1856524 -253429 1340357 2676285 3286659
39019C286659k44784j87286P87929J118684n2273j383208j347861m80442j76764
$$ 3286659 3041875 2854589 3642518 4761202 4708929 3325721 1977860 1497418 1320654
39010A320654m58762n70921o49555r14768l30545J635852K866282R90072k518803
$$ 1320654 861892 290971 -358584 -1273352 -1603897 31955 2898237 3888309 1369506
39001A369506l683972j556027P29404R51174N31434J040272J285630n797j373008
$$ 1369506 -2314466 -3870493 -3141089 -2189915 -1658481 -618209 667421 661624 -711384
38992g11384j056290q4655k53828q62802l30792M98106j69866j443438r78279
$$ -711384 -1767674 -1852329 -2106157 -2968959 -3299751 -2801645 -2971511 -4414949 -5393228
38983e393228P75927J051278n76810j456795k79411J027392P68927j03089l06469
$$ -5393228 -4617301 -3566023 -4142833 -5599628 -5879039 -4851647 -4082720 -4185809 -4492278
38974d492278l17788o72088n01936O16000J348208O98651l79734q49428j123775
$$ -4492278 -4810066 -5482154 -5984090 -5368090 -4019882 -3321231 -3700965 -4550393 -5674168
38965e674168j299476q0327K601821M055883K363275l80454j056592j44651k51075
$$ -5674168 -6973644 -7053971 -4452150 -396267 1967008 1586554 529962 385311 134236
38956A34236j301665q83568J054006J695707R6462j091119J19750K025764K147436
$$ 134236 -1167429 -2050997 -996991 698716 795178 -295941 -176191 1849573 3997009
38947C997009P58935l82498r04376j381520j489636p03697J02903k52980j143152
$$ 3997009 4755944 4373446 3469070 2087550 597914 -105783 -2880 -255860 -1399012
38938a399012r13446N20652J553690J294435N27976J03625k24505q90440j559555
$$ -1399012 -2312458 -1791806 -238116 1056319 1584295 1687920 1463415 572975 -986580
38929i86580j676557j218021l84862Q44222K326082L358194L184828J712645m89185
$$ -986580 -2663137 -3881158 -4266020 -3421798 -1095716 2262478 5447306 7159951 6670766
38920F670766k536090l380788k293868J18701J826485J310035m38831r31045M79346
$$ 6670766 4134676 753888 -1539980 -1421279 405206 1715241 1276410 345365 824711
38911H24711J486310K7393k446968k600224J83149K780697K477724L44300p51210
$$ 824711 2311021 2338414 -108554 -2708778 -2525629 255068 2732792 3077092 2325882
38902B325882j02840O08262K80240l91655o20248o54644p32185l46616O72750
$$ 2325882 2223042 2831304 3111544 2719889 2099641 1444997 712812 366196 1038946
38893A038946J393492R51005j66796p47992l29539N39472J096574Q57094l36894
$$ 1038946 2432438 3383443 3216647 2468655 2139116 2678588 3775162 4632256 4295362
38884D295362k065014l167990k452574N8528K678649L272824J362447j042064
$$ 4295362 2230348 -937642 -3390216 -3331688 -653039 2619785 3982232 2940168
38876B940168j338281P15265K669441K423893O19137q72090j720324k777001l660267
$$ 2940168 1601887 2317152 4986593 7410486 8029623 7157533 5437209 2660208 -1000059
38867a000059k898381n77910J273021J544399J356600J662236J482639q9597j765164
$$ -1000059 -3898440 -4476350 -3203329 -1658930 -302330 1359906 2842545 2752948 987784
38858I87784j690420j23874J201524J552204J384501P90737m49775j644150j705130
$$ 987784 -702636 -826510 375014 1927218 3311719 4102456 3652681 2008531 303401
38849C03401p77741M3349L57270M20775p4693j407885k269031r11780J898405
$$ 303401 -474340 -430991 -73721 347054 272361 -1135524 -3404555 -4316335 -2417930
38840b417930L221131J910575K16088L16653J164674M99080j374816j982287m07210
$$ -2417930 803201 2713776 2929864 3246517 4411191 4910271 3535455 1553168 1145958
38831A145958J373621J206874o01207k008172j741396l53142Q70202J353588J403889
$$ 1145958 2519579 3726453 3125246 1117074 -624322 -977464 -107262 1246326 2650215
38822B650215J313519Q47887j87201j332228j921074j861024j429029o27279M93648
$$ 2650215 3963734 4811621 4624420 3292192 1371118 -489906 -1918935 -2546214 -2052566
38813b052566J175003O81824l60286n30119L67395J112225J157994J403588K236640
$$ -2052566 -877563 -195739 -556025 -1086144 -718749 393476 1551470 2955058 5191698
38804E191698K400216R92151p38954j103905m77463m24381j045345j031760l1426
$$ 5191698 7591914 8584065 7845111 6741206 6263743 5839362 4794017 3762257 3730831
38795C730831Q81850J110100J194497J383405J165822N84111M22933N81057j34881
$$ 3730831 4612681 5722781 6917278 8300683 9466505 10050616 10473549 11054606 10919725
38786A0919725j816845k632884j365787N04000O49042j065042k772735l147369
$$ 10919725 9102880 6469996 5104209 5608209 6257251 5192209 2419474 -727895
38778g27895k316989p59883J121363K406472K105651M84065j094380j782037j747089
$$ -727895 -3044884 -3804767 -2683404 -276932 1828719 2312784 1218404 -563633 -2310722
38769b310722j126164K06192J593236J769860P41647J83576J013356J756341O59063
$$ -2310722 -3436886 -3230694 -1637458 132402 874049 1057625 2070981 3827322 4486385
38760D486385j473404k244491j084999J03062j36754j035094j389039j464705
$$ 4486385 3012981 768490 -316509 -213447 -350201 -1385295 -2774334 -4239039
38752d239039j830507j556981N68634L470637M337481K110662j054250k479023
$$ -4239039 -6069546 -7626527 -7057893 -3587256 750225 2860887 1806637 -672386
38744f72386j908751q75205j84424N69802J450040J659796Q36495k62082q49755
$$ -672386 -2581137 -3456342 -3640766 -3070964 -1620924 38872 875367 613285 -236470
38735b36470j063583j264015j103914j16813J144905J481786O09428m01323n42562
$$ -236470 -1300053 -2564068 -3667982 -3784795 -2639890 -1158104 -548676 -949999 -1492561
38726a492561j38484j57483o09319m50779P20878J653695Q93941j043139j978758
$$ -1492561 -1631045 -1788528 -2397847 -2848626 -2127748 -474053 419888 -623251 -2602009
38717b602009q36149Q26221Q06103q40238j935681j026619R85221K209704J826368
$$ -2602009 -3438158 -2611937 -1805834 -2646072 -4581753 -5608372 -4623151 -2413447 -587079
38708e87079M33001q58353j209500n62914K16453K36107j60836J89070J304479
$$ -587079 -154078 -1012431 -2221931 -2784845 -2568392 -2332285 -2493121 -2304051 -999572
38699i99572J636249L36532j202493j256057k41515K43358J14822N87304J506347
$$ -999572 636677 973209 -229284 -1485341 -1726856 -1483498 -1368676 -781372 724975
38690G24975J118229r63547k575801j923546j49082M24691m63174j090107m76762
$$ 724975 1843204 879657 -1696144 -3619690 -3768772 -3344081 -3807255 -4897362 -5374124
38681e374124N33490Q73552O62750P02394J326132K089589K285160J658606O85976
$$ -5374124 -4840634 -3967082 -3304332 -2601938 -1275806 813783 3098943 4757549 5443525
38672E443525m7573o62255j574475k328727j964072q62598p21611j749027j564870
$$ 5443525 5395952 4733697 3159222 830495 -1133577 -1996175 -2717786 -4466813 -6031683
38663f031683J308923M257513L497727l81783k795709j401826J051550J292461
$$ -6031683 -4722760 -465247 3032480 2650697 -145012 -1546838 -495288 797173
38655G97173O0050j08159O07765p782k065332l163554k093445l41156N87249J061273
$$ 797173 857223 749064 1356829 1349047 -716285 -3879839 -5973284 -6314440 -5727191 -4665918
38645d665918J657449J574295J03600j638697j927538o51573Q52957J609691J589789
$$ -4665918 -3008469 -1434174 -1330574 -2969271 -4896809 -5548382 -4695425 -3085734 -1495945
38636a495945J039852L46548J94354P38543Q85967m31333k402537l039818j856301
$$ -1495945 -456093 -109545 84809 823352 1709319 1277986 -1124551 -4164369 -6020670
38627f020670n35555n11030j144710j060715j63693P38455J444194K143621K209237
$$ -6020670 -6556225 -7067255 -8211965 -9272680 -9436373 -8697918 -7253724 -5110103 -2900866
38618b900866P56987j539496k634006j596235J92072R59494P28503P62918J557603
$$ -2900866 -2143879 -3683375 -6317381 -7913616 -7721544 -6762050 -6033547 -5270629 -3713026
38609c713026K406415K665483K473822K178920J776321J112464K02963p83287
$$ -3713026 -1306611 1358872 3832694 6011614 7787935 8900399 9103362 8320075
38601H320075j585597j910880j685755j160925n51442J71586Q24471P61965l11602
$$ 8320075 6734478 4823598 3137843 1976918 1425476 1597062 2421533 3183498 2871896
38592B871896j581691j940730j428777j025273j048899p82394O5898O14022J88649
$$ 2871896 1290205 -650525 -2079302 -3104575 -4153474 -4935868 -4869970 -4255948 -4067299
38583d067299l98101R1132J430686K077315J113882p24017j977054j763481j54273
$$ -4067299 -4465400 -4374268 -2943582 -866267 247615 -476402 -2453456 -4216937 -4371210
38574d371210J960843L099472K042005q12733l245722l163166q81386J135491
$$ -4371210 -2410367 689105 2731110 1918377 -1327345 -4490511 -5371897 -4236406
38566d236406J125310J1127j25477R35842J294873j37983j849636j847769n24211
$$ -4236406 -3111096 -3099969 -3225446 -2289604 -994731 -1132714 -2982350 -4830119 -5354330
38557e354330J37989l01598k76466R46805J883850J200676q9305j75859Q46602
$$ -5354330 -5216341 -5517939 -5794405 -4847600 -2963750 -1763074 -1852379 -2028238 -1181636
38548a181636J374376P82915n4828m97206q44081j208157j060164k90987L85396
$$ -1181636 192740 975655 920827 423621 -420460 -1628617 -2688781 -2979768 -2594372
38539b594372N55821P05569J211891J571852J190032K93888m24173n49142k1623
$$ -2594372 -2038551 -1332982 -121091 1450761 2640793 2934681 2510508 1961366 1939743
38530A939743Q75693J337266O67626n27600p62071J55542N09339q17324k372281
$$ 1939743 2815436 4152702 4820328 4292728 3530657 3686199 4195538 3378214 1005933
38521A005933k096718l60223P68667P36963Q29846J309918P06694j202388k035181
$$ 1005933 -1090785 -1451008 -682341 54622 884468 2194386 2901080 1698692 -336489
38512c36489j15171K570511K825929O09458j249005j087315J29826J199160K053402
$$ -336489 -451660 2118851 4944780 5554238 4305233 3217918 3347744 4546904 6600306
38503F600306K319167R43483j607975k833414j434400N30370M72744j076904j671531
$$ 6600306 8919473 9862956 8254981 5421567 3987167 4517537 4990281 3913377 2241846
38494B241846q05835k16103p02395j072647n42041k7234l17787p23339m62466
$$ 2241846 1436011 1219908 517513 -555134 -1097175 -1124409 -1442196 -2165535 -2628001
38485b628001K8909J16073N7335J59493L2400l22387J06325J615171K540056J319989
$$ -2628001 -2599092 -2483019 -2425684 -2266191 -2233791 -2556178 -2449853 -834682 1705374 3025363
38475C025363r31969j694826n91761J42480r95143k600093k349617j00406K035923
$$ 3025363 2093394 398568 -193193 -50713 -1045856 -3645949 -5995566 -6095972 -4060049
38466d060049K288294J009486j69308l32944N396K1137k11210o4538M74396P74665
$$ -4060049 -1771755 -762269 -931577 -1264521 -1259125 -1237988 -1449198 -1513736 -1039340 -264675
38456b64675O44337N63543O76081M94914m7055k57337R0996K47258j13943r9569
$$ -264675 379662 943205 1619286 2114200 2067145 1809808 1900804 2148062 2034119 1934550
38446A934550Q46355J706175J417079O01872L38496J90364p56048j682286j009311
$$ 1934550 2780905 4487080 5904159 6506031 6844527 7034891 6278843 4596557 3587246
38437C587246P75602J515596O68678k2253M97227J175906J141919J254967K219672
$$ 3587246 4362848 5878444 6547122 6524869 7022096 8198002 9339921 10594888 12814560
38428A2814560L007162K576273J639958J192713O06229j059966k827809k813524
$$ 12814560 15821722 18397995 20037953 21230666 21836895 20776929 17949120 15135596
38420A5135596j093097J70573m58753k041315k657524j562889K88036J343608
$$ 15135596 14042499 14213072 13754319 11713004 9055480 7492591 7780627 9124235
38412I124235R62505J3022j98716M35879Q91072P25506O67596J119947J341762
$$ 9124235 10086740 10099762 9901046 10336925 11227997 11953503 12621099 13741046 15082808
38403A5082808Q65583M46277N33092O8691j715096l378585k997703j148837j75371
$$ 15082808 15948391 16394668 16927760 16996451 15281355 11902770 8905067 7756230 7580859
38394G580859p06302r50275K76938J713070J594221M3251j388129j662231r73531
$$ 7580859 6874557 5924282 6201220 7914290 9508511 9551762 8163633 6501402 5527871
38385E527871j28760K00557l8087k78271j27734l8384n74601j223721r07901K72884
$$ 5527871 5399111 5599668 5561581 5283310 5155576 5117192 4542591 3318870 2410969 2683853
38375B683853Q84496J16370j010129r55056M06996J691788J549848K7957j452700
$$ 2683853 3568349 3684719 2674590 1719534 2126530 3818318 5368166 5396123 3943423
38366C943423j530695n14819j29884j137295j880402l32774K788607M450511L007552
$$ 3943423 2412728 1897909 1768025 630730 -1249672 -1582446 1206161 5656672 8664224
38357H664224J02691j604395j410423n73686k65261l71791k114J247537K429426
$$ 8664224 8766915 7162520 5752097 5178411 4913150 4541359 4539245 5786782 8216208
38348H216208J938540l46192k198228j566001M55199R13475p93413k117531j275101
$$ 8216208 10154748 9808556 7610328 6044327 6499526 7413001 6619588 4502057 3226956
$$ [...]
##END NTUPLES=NMR SPECTRUM
##END=
