##TITLE=31Pdec_DE-135_oil5
, 24 sc
 26.3.2026
##JCAMPDX= 6.0         $$ Bruker NMR JCAMP-DX V2.0
##DATA TYPE= NMR SPECTRUM
##DATA CLASS= NTUPLES
##ORIGIN= UXNMR, Bruker Analytische Messtechnik GmbH
##OWNER= root
$$ XWIN-NMR		Version 3.5
$$ Thu Mar 26 15:23:25 2026 Russian Standard Time (UT+4h)  she@DPX200
##.OBSERVE FREQUENCY= 81.013821
##.OBSERVE NUCLEUS= ^31P
##.ACQUISITION MODE= SIMULTANEOUS
##.ACQUISITION SCHEME= undefined
##.AVERAGES= 40
##.DIGITISER RES= 17
##SPECTROMETER/DATA SYSTEM= spect
##.PULSE SEQUENCE= zgpg30
##.SOLVENT NAME= CDCl3
##.SHIFT REFERENCE= (INTERNAL, CDCl3, 0, 197.392)
##AUDIT TRAIL= $$ (NUMBER, WHEN, WHO, WHERE, WHAT)
$$ ##TITLE= Audit trail, XWIN-NMR		Version 3.5
$$ ##JCAMPDX= 5.01
$$ ##ORIGIN= Bruker BioSpin GmbH
$$ ##OWNER= she
$$ F:/spectra/data/she/nmr/P31/2/pdata/1/auditp.txt
$$ ##AUDIT TRAIL=  $$ (NUMBER, WHEN, WHO, WHERE, WHAT)
(   1,<2026-03-26 15:21:45.37 +0400>,<she>,<DPX200>,
      <created by zg, POWCHK disabled, PULCHK disabled
       configuration hash MD5:
       00 E9 B6 7A A2 85 ED C7 34 08 36 98 17 FE 4E 26
       data hash MD5: 32K
       7E 5A 58 5A 5B 8B 17 18 08 3B E3 98 81 5D 8B E2>)
(   2,<2026-03-26 15:21:48.15 +0400>,<she>,<DPX200>,
      <Start of raw data processing
       efp BC_mod = 2 LB = 1.5 FT_mod = 6 PKNL = 1 PHC0 = 1385.737 PHC1 = 93.90066 SI = 64K 
       data hash MD5: 64K
       DE 0B 4B 28 A9 5C 63 15 D3 BE 9F EF 87 BE AF F0>)
(   3,<2026-03-26 15:22:07.50 +0400>,<she>,<DPX200>,
      <pk PHC0 = 13.66371 PHC1 = 0 
       data hash MD5: 64K
       65 E2 4C DE E5 C9 64 36 68 F7 10 42 29 AF 6B 56>)
(   4,<2026-03-26 15:22:44.51 +0400>,<she>,<DPX200>,
      <pk PHC0 = 42.43282 PHC1 = -110.6 
       data hash MD5: 64K
       18 9E 68 A6 32 AC 3A 0D FF 7B 85 05 C4 2E AC A1>)
(   5,<2026-03-26 15:22:51.51 +0400>,<she>,<DPX200>,
      <abs ABSG = 5 
       data hash MD5: 64K
       83 BD 63 29 90 0D C2 6A 52 B4 41 55 A7 80 60 6F>)
$$ ##END=
$$ 
$$ hash MD5
$$ D2 1C 30 70 27 E3 A9 4A 1E 4A 82 BF 7B 22 CB 12
##$RELAX= 
##$RELAX= 
##$RELAX= 
##$RELAX= 
##$RELAX= 
##$RELAX= 
##$RELAX= 
##$RELAX= 
$$ Bruker specific parameters
$$ --------------------------
##$DU= <F:/spectra>
##$EXPNO= 2
##$NAME= <P31>
##$PROCNO= 1
##$TYPE= <nmr>
##$USER= <she>
##$AMP= (0..31)
100 100 100 100 100 100 100 100 100 100 100 100 100 100 100 100 100 100 
100 100 100 100 100 100 100 100 100 100 100 100 100 100 
##$AQSEQ= 0
##$AQ_mod= 1
##$AUNM= <au_zg>
##$AUTOPOS= <>
##$BF1= 81.014009
##$BF2= 200.13
##$BF3= 200.13
##$BF4= 200.13
##$BF5= 200.13
##$BF6= 200.13
##$BF7= 200.13
##$BF8= 200.13
##$BYTORDA= 1
##$CFDGTYP= 0
##$CFRGTYP= 5
##$CHEMSTR= <none>
##$CNST= (0..31)
1 1 145 1 1 1 1 1 1 1 1 1 1 1 1 1 1 1 1 1 1 1 1 1 1 1 1 1 1 1 1 1 
##$CPDPRG= <waltz16>
##$CPDPRG1= <>
##$CPDPRG2= <waltz16>
##$CPDPRG3= <>
##$CPDPRG4= <mlev>
##$CPDPRG5= <mlev>
##$CPDPRG6= <mlev>
##$CPDPRG7= <mlev>
##$CPDPRG8= <mlev>
##$CPDPRGB= <>
##$CPDPRGT= <>
##$D= (0..31)
0 1 0 0 0 0 0 0 0 0.06 0 0.03 2e-05 3e-06 0 0 0.0002 0 0 0 0 0 0 0 0 0 
$$ [...]
##$SUBNAM3= <"">
##$SUBNAM4= <"">
##$SUBNAM5= <"">
##$SUBNAM6= <"">
##$SUBNAM7= <"">
##$SUBNAM8= <"">
##$SUBNAM9= <"">
##$SW= 400.765351723535
##$SWIBOX= (0..15)
0 1 3 0 0 0 0 0 0 0 0 0 0 0 0 0 
##$SW_h= 32467.5324675325
##$TD= 32768
##$TD0= 1
##$TE= 0
##$TE2= 300
##$TE3= 300
##$TEG= 300
##$TL= (0..7)
0 120 53 12 22 120 120 120 
##$TP= (0..7)
150 150 150 150 150 150 150 150 
##$TP07= 0
##$TPNAME0= <>
##$TPNAME1= <>
##$TPNAME2= <>
##$TPNAME3= <>
##$TPNAME4= <>
##$TPNAME5= <>
##$TPNAME6= <>
##$TPNAME7= <>
##$TPOAL= (0..7)
0.5 0.5 0.5 0.5 0.5 0.5 0.5 0.5 
##$TPOFFS= (0..7)
0 0 0 0 0 0 0 0 
##$TUNHIN= 0
##$TUNHOUT= 0
##$TUNXOUT= 0
##$USERA1= <user>
##$USERA2= <user>
##$USERA3= <user>
##$USERA4= <user>
##$USERA5= <user>
##$V9= 5
##$VALIST= <valist>
##$VCLIST= <CCCCCCCCCCCCCCC>
##$VD= 0
##$VDLIST= <DDDDDDDDDDDDDDD>
##$VPLIST= <PPPPPPPPPPPPPPP>
##$VTLIST= <TTTTTTTTTTTTTTT>
##$WBST= 1024
##$WBSW= 4
##$XGAIN= (0..3)
0 0 0 0 
##$XL= 0
##$YL= 0
##$YMAX_a= 12923
##$YMIN_a= -15599
##$ZGOPTNS= <>
##$ZL1= 120
##$ZL2= 120
##$ZL3= 120
##$ZL4= 120
##$ABSF1= 197.3918
##$ABSF2= -203.3724
##$ABSG= 5
##$ABSL= 3
##$ALPHA= 0
##$AQORDER= 0
##$ASSFAC= 0
##$ASSFACI= 0
##$ASSFACX= 0
##$ASSWID= 0
##$AUNMP= <proc_1d>
##$AZFE= 0.1
##$AZFW= 0.5
##$BCFW= 0
##$BC_mod= 2
##$BYTORDP= 0
##$COROFFS= 0
##$CY= -3
##$DATMOD= 1
##$DC= 0
##$DFILT= <>
##$DTYPP= 0
##$F1P= 0
##$F2P= 0
##$FCOR= 1
##$FTSIZE= 65536
##$FT_mod= 6
##$GAMMA= 0
##$GB= 0
##$INTBC= 1
##$INTSCL= 9.790993e-09
##$ISEN= 30
##$LB= 1.5
##$LEV0= 0
##$LPBIN= 0
##$MAXI= 10000
##$MC2= 0
##$MEAN= 0
##$ME_mod= 0
##$MI= 50
##$NCOEF= 0
##$NC_proc= -7
##$NLEV= 6
##$NOISF1= 182.463
##$NOISF2= 159.3651
##$NSP= 0
##$NTH_PI= 0
##$NZP= 0
##$OFFSET= 197.3918
##$PC= 4
##$PHC0= 1441.834
##$PHC1= -16.69934
##$PH_mod= 1
##$PKNL= yes
##$PPARMOD= 0
##$PSCAL= 0
##$PSIGN= 0
##$REVERSE= no
##$SF= 81.014063255964
##$SI= 65536
##$SIGF1= 159.3651
##$SIGF2= -187.1042
##$SINO= 113.3802
##$SIOLD= 16384
##$SREGLST= <1H.CDCl3>
##$SSB= 0
##$STSI= 65536
##$STSR= 0
##$SW_p= 32467.5324675325
##$SYMM= 0
##$S_DEV= 0
##$TDeff= 32768
##$TDoff= 0
##$TI= <>
##$TILT= no
##$TM1= 0
##$TM2= 0
##$TOPLEV= 0
##$USERP1= <user>
##$USERP2= <user>
##$USERP3= <user>
##$USERP4= <user>
##$USERP5= <user>
##$WDW= 1
##$XDIM= 65536
##$YMAX_p= 270505484
##$YMIN_p= -118282929
$$ End of Bruker specific parameters
$$ ---------------------------------
##NTUPLES= NMR SPECTRUM
##VAR_NAME=  FREQUENCY,     SPECTRUM/REAL,   SPECTRUM/IMAG
##SYMBOL=    X,             R,               I
##VAR_TYPE=  INDEPENDENT,   DEPENDENT,       DEPENDENT
##VAR_FORM=  AFFN,          ASDF,            ASDF
##VAR_DIM=   65536,         65536,           65536
##UNITS=     HZ,            ARBITRARY UNITS, ARBITRARY UNITS
##FACTOR=    0.49542278885378, 1,            1
##FIRST=     15991.5117654749, 0,            0
##LAST=      -16476.0207020576, 0,           0
##MIN=       -16476.0207020576, -118282929,  0
##MAX=       15991.5117654749, 270505484,    0
$$ Real data points
##PAGE= N=1
##DATA TABLE= (X++(R..R)), XYDATA
$$ [...]
45841 1872045 501730 -427460 -42813 1390008 3049260 4162901 4059236 2567759 536605
45832 536605 -926484 -1881584 -3295606 -5225685 -6449197 -6329139 -5804117 -5744110 -5438615
45823 -5438615 -3796322 -1191336 1121475 2831744 4473894 5842009 5968524 4794882
45815 4794882 3556994 3094320 2849235 2120069 1391522 1608254 2706378 3730290 4134045
45806 4134045 4151278 3917682 3030417 1311154 -502135 -1344143 -1010447 -375718 -328297
45797 -328297 -747481 -778847 -809 1067771 1769972 2251873 3146320 4422044 5123451
45788 5123451 4504877 3007244 1705637 1058299 711540 411197 431884 873480 1100624
45779 1100624 414116 -934274 -1890215 -1738852 -726410 451202 1359098 1867881 1850946
45770 1850946 1213277 209674 -501248 -325702 623857 1431846 1230331 278344 -183074
45761 -183074 503081 1392434 1131514 -102378 -785395 -221746 536937 402788 -150180
45752 -150180 -71685 480539 552774 206409 554304 1851003 2764921 2109436 449254 -711332
45742 -711332 -813851 -608584 -872187 -1418756 -1488375 -777768 112826 282078 -422847 -1121297
45732 -1121297 -903655 2645 469696 -140109 -1294946 -2125221 -2437655 -2612226 -2884960
45723 -2884960 -3116927 -3055789 -2518809 -1497326 -342321 345548 308954 6354 140571
45714 140571 878712 1719376 2075848 1875422 1634099 1929503 2646640 2858196 1863894 359652
45704 359652 -32967 1264105 2800761 2633789 567550 -1699361 -2529025 -1889031 -936483
45695 -936483 -585329 -725416 -625782 100903 978835 1208583 721606 350569 700419 1216623
45685 1216623 867172 -466403 -1876923 -2645608 -2899645 -2908862 -2393020 -980206 1041447
45676 1041447 2929783 4266552 5100938 5430314 5041088 4007670 2977773 2642618 3023292
45667 3023292 3512981 3565967 3073829 2062057 460195 -1469986 -2786351 -2592319 -1184856
45658 -1184856 121801 596523 938395 2017782 3295920 3384326 2067408 810609 923294
45649 923294 1954940 2471342 1902498 897226 95404 -601474 -1364766 -1764328 -1306932
45640 -1306932 -327048 271327 174491 47848 567405 1500191 2134848 2310789 2458732 2734016
45630 2734016 2767979 2400431 1995066 1693999 986752 -425944 -1851294 -2407301 -2236376
45621 -2236376 -2060384 -1765213 -533905 1460948 2634207 1875467 62345 -1047858 -869737
45612 -869737 -166356 350350 637396 703544 362918 -180734 -255342 394009 1124102 1159935
45602 1159935 507507 -219864 -618319 -788307 -962594 -1191118 -1423787 -1667291 -1905770
45593 -1905770 -1914991 -1343150 -167992 981959 1302477 773843 317662 696536 1585220
45584 1585220 2183121 2410635 2774828 3210088 3014461 2158174 1700886 2327931 3226388
45575 3226388 3194408 2318323 1632823 1452225 1085543 198398 -564886 -631481 -353565 -328358
45565 -328358 -460176 -268209 228283 489608 203347 -327532 -503537 55929 1176829
45556 1176829 2128880 2128873 1055951 -420341 -1486742 -1768694 -1285356 -287293 614251 600906
45546 600906 -581508 -2176470 -3135487 -3182466 -2859012 -2671351 -2578324 -2274214 -1629389 -800369
45536 -800369 -92132 302127 524952 888862 1396759 1671384 1493695 1076916 625886 83551
45526 83551 -383121 -224144 625913 1281704 1065856 654770 1106786 2101329 2348579 1690683
45516 1690683 1476574 2519005 3861420 4130162 3124689 1480352 -257227 -1471959
45508 -1471959 -1361111 -28666 975682 322440 -1322895 -2267273 -2201684 -2447095 -3817583
45499 -3817583 -5394723 -5762344 -4636750 -2891530 -1564896 -1200732 -1717856 -2536196 -2989665
45490 -2989665 -2796309 -2122971 -1362310 -993608 -1320806 -2015263 -2302966 -2049690 -2175952
45481 -2175952 -3323457 -4605190 -4665442 -3699057 -3244301 -3927379 -4572014 -3879489 -2027237
45472 -2027237 -184435 753556 581222 -259485 -740557 -46759 1278091 1753439 902808
45463 902808 -124415 -339706 -287155 -885284 -1880441 -2443469 -2513534 -2480414 -2243584 -1791729
45453 -1791729 -2082476 -3878638 -6042015 -6570087 -5366995 -4449266 -5066789 -6092412 -5953836
45444 -5953836 -4877234 -4150070 -4006129 -3492550 -2183630 -947857 -779695 -1485144 -1906327
45435 -1906327 -1287986 -140250 402069 -30265 -676051 -819999 -786225 -1200550 -1715967
45426 -1715967 -1369070 -50756 1366645 2432051 3588268 4924201 5507251 4612654 2847574
45417 2847574 1371526 617657 409169 673559 1262392 1614531 1435310 1253390 1445717
45408 1445717 1176205 -617903 -3401077 -5304746 -5238424 -3769330 -1877147 63437 1772093
45399 1772093 2620194 2361156 1638393 1191211 1061707 1028843 1217499 1663174 1770767 957860
45389 957860 -392853 -1278920 -1272242 -834068 -542133 -542868 -732792 -942318 -876814 -378987
45379 -378987 92756 -297714 -1755102 -3366996 -3946426 -3256838 -2192593 -1820245 -2409218
45370 -2409218 -3347399 -3823691 -3544837 -2858741 -2227273 -1635136 -656686 809241 2041404
45361 2041404 2054035 761725 -672800 -951758 -27723 932068 967488 322237 -146036
45352 -146036 -129999 -21181 -144574 -404183 -678313 -1019853 -1282656 -1007583 -13599 1166452
45342 1166452 1774086 1633408 1242865 1148856 1394025 1511703 980673 -184035 -1242533
45333 -1242533 -1354687 -496350 487871 845304 604345 159765 -352619 -847964 -846012 103218
45323 103218 1587445 2496867 2189058 1155191 402938 439033 971481 1394074 1394587 1123151
45313 1123151 835779 516067 75126 -182564 159685 713072 335435 -1357066 -3132389
45304 -3132389 -3603674 -3087962 -2970546 -3481649 -3393144 -2069470 -534979 1095 -412383
45295 -412383 -1117416 -1875223 -2413365 -1932368 -202771 1514544 1830588 1049239 468852
45286 468852 328767 -123029 -727220 -273496 1352543 2397845 1449879 -668656 -2127499
45277 -2127499 -2367921 -2141588 -1888533 -1268938 -196082 668996 691626 -42178 -983949
45268 -983949 -1690369 -2032899 -2160287 -2367439 -2833436 -3470789 -4108907 -4655359 -4907773 -4480300
45258 -4480300 -3313168 -2146211 -2018267 -3119674 -4368003 -4349549 -2734081 -709415 140565
45249 140565 -477067 -1180202 -528109 1167712 2233573 1803620 785901 378486 534465
45240 534465 612215 774601 1633640 2864712 3369183 2826812 1993774 1262600 25950
45231 25950 -2015934 -3848332 -4222201 -3172974 -1717187 -445974 781418 1933193 2427551
45222 2427551 1872193 716044 -100792 -24059 618045 911765 263143 -875714 -1377887
45213 -1377887 -713475 388182 788239 169608 -931786 -2011536 -2896399 -3241078 -2489101
45204 -2489101 -725933 882131 1066692 -164082 -1503003 -1771739 -1083086 -435942 -457004
45195 -457004 -937177 -1481017 -1987725 -2239854 -1660256 -158987 1165204 1086409 -54068
45186 -54068 -681386 -124494 699829 1119547 1890255 3570055 4888446 4276143 2353352
45177 2353352 1158915 1162507 926813 -95145 -476724 625144 1657984 855749 -1054856
45168 -1054856 -1977228 -1431357 -678559 -328467 328176 1528293 2263766 1800694 685522
45159 685522 -335605 -1297003 -2243599 -2442341 -1232735 892723 2756635 3648111 3566392
45150 3566392 2898932 2392563 2821676 3982288 4523563 3532730 1846513 973604 1126715
45141 1126715 1321171 1193559 1552378 2940231 4636124 5485389 5024235 3480894 1397005
45132 1397005 -327282 -708879 349971 1741408 2294647 1908184 1156502 285672 -739241
45123 -739241 -1564594 -1681878 -1276118 -1061008 -1158523 -887403 36021 767281 349815 -962246
45113 -962246 -2010091 -2153092 -1774913 -1404681 -962508 -113060 1077169 2174872 2828056
45104 2828056 2922428 2535837 2014944 1829145 1968011 1728254 615649 -699463 -980745
45095 -980745 8058 1238009 1844902 1990881 1935878 1221442 -359530 -1724829 -1659768
45086 -1659768 -709924 -632155 -1915324 -3119127 -3012558 -2124028 -1500806 -1057886 -194755
45077 -194755 757539 969366 610918 652434 1179379 1076788 -261942 -1814890 -2078551
45068 -2078551 -818530 820382 1653989 1500672 1034105 932128 1243383 1544649 1638547
45059 1638547 1837976 2393186 2946601 2938001 2336362 1537630 762633 111433 -3674 734842
45049 734842 1704611 1744479 634565 -574188 -1016124 -1024707 -1226245 -1379491 -845529 293557
45039 293557 1347076 1927747 2072930 1769554 1124534 815659 1543709 2997739 4037723
45030 4037723 3962710 3009887 1648880 171996 -885786 -813089 287944 1206257 928732
45021 928732 -123816 -711812 -355080 269260 393753 98266 95841 887287 2204848 3164073
45011 3164073 3046156 2074723 1254858 1265009 1791822 2297662 3069891 4751678 6847919
45002 6847919 7623219 6058752 3358344 1747083 1978963 2817683 3013260 2886450 3412280
44993 3412280 4371806 4354584 2607629 155219 -1232873 -794055 752609 2117530 2492950
44984 2492950 1973416 1353317 1422549 2125085 2465651 1567193 -216269 -1597098 -1800428
44975 -1800428 -1337142 -1184797 -1572404 -1919468 -1765700 -1298812 -887655 -464286 324506
44966 324506 1460711 2380663 2587342 2237201 1887633 1749751 1491873 833719 16271
44957 16271 -536054 -798483 -1097479 -1593936 -2127134 -2551026 -2914256 -3229246 -3329642 -3121021
44947 -3121021 -2797430 -2592807 -2361492 -1616689 -110216 1700227 2951368 3210884 2820114
44938 2820114 2235092 1318000 -226384 -1843870 -2329265 -1325588 27145 411714 -279208
44929 -279208 -1436322 -2899440 -4613530 -5577411 -4511240 -1724834 847899 1851440
44921 1851440 1738334 1388443 639074 -959903 -2773545 -3543504 -2868033 -1419035 -26813
44912 -26813 700025 239877 -1388034 -3101819 -3496289 -2206357 -81428 1793177 2687416
44903 2687416 2206972 601147 -969521 -1350266 -685070 -89375 -46107 30410 576696
44894 576696 1223709 1668846 2244587 3075484 3485891 2961434 2099684 1812930 1942824 1443056
44884 1443056 -163432 -2121030 -3263784 -3105306 -2104366 -1164701 -938133 -1449139 -2270555
44875 -2270555 -2913459 -2964744 -2196145 -996571 -417507 -1060378 -2024063 -1848450 -564369
44866 -564369 251681 -235760 -965350 -755381 -58640 94572 -85457 250306 835207 687810
44856 687810 4529 80357 1207179 2062333 1593241 346088 -559994 -754328 -374970
44847 -374970 524491 1607405 2010651 1219739 -244091 -1537312 -2444865 -3168062 -3682769
44838 -3682769 -3843804 -3711963 -3317734 -2549365 -1712846 -1631799 -2570845 -3547858 -3430177 -2360878
44828 -2360878 -1423755 -1261753 -1766122 -2740185 -3901258 -4412152 -3497291 -1653935 -289262
44819 -289262 97474 443842 1449312 2332602 2021056 906090 442782 1232878 2372119
44810 2372119 2741934 2251171 1603963 1371558 1584740 1896148 1860377 1281518 524198 281985
44800 281985 777783 1352179 1150295 132104 -940578 -1518467 -1854713 -2382062 -2847791
44791 -2847791 -2492547 -1036141 873057 2290527 2827683 2760212 2490439 2124245 1551816
44782 1551816 766306 -15590 -552123 -830864 -1055804 -1387590 -1776355 -2059843 -2117740 -1900303
44772 -1900303 -1444792 -924218 -526902 -227982 110236 342677 95735 -553342 -848492
44763 -848492 -268808 612468 806040 354070 400883 1640500 3286124 3955744 3238252
44754 3238252 2040558 1563798 2152451 3018532 3000809 1745842 118711 -800342 -1007065
44745 -1007065 -1386108 -2252763 -2753589 -2028101 -418368 957596 1505319 1546841 1579581
44736 1579581 1579988 1119636 38088 -1064689 -1199419 -99459 1255506 1708670 1358684
44727 1358684 1269436 1850868 2404571 2356801 1900850 1093146 -526350 -2723150 -4052406
44718 -4052406 -3562234 -2222080 -1582988 -1663943 -1323079 -210989 909348 1483057 1542294
44709 1542294 915569 -674521 -2648482 -3825739 -3837005 -3406052 -3195243 -3277623 -3700118
44700 -3700118 -4503891 -5122228 -4828377 -3891713 -3227220 -2854445 -1976010 -766986 -618140
44691 -618140 -2047914 -3719209 -4278154 -3954077 -3479134 -2612906 -899140 986927 1896513
44682 1896513 1741799 1395517 1470089 2000304 2837821 3524654 3261689 1877105 425995
44673 425995 17313 452096 793095 757506 604151 125119 -1077115 -2466866 -2831902
44664 -2831902 -1781504 -208187 806392 918880 417572 -176545 -430219 -418193 -690794
44655 -690794 -1425848 -1998117 -1925027 -1722925 -2074043 -2638839 -2605998 -2007903 -1497371 -1188297
44645 -1188297 -808151 -665195 -1197206 -1730121 -1050177 742366 2268267 2870610 3204614
44636 3204614 3606188 3409008 2466291 1883360 2308492 2688197 1804335 127998 -978159
44627 -978159 -1186251 -1182522 -1257848 -1136722 -976738 -1369394 -2240972 -2667150 -2075981 -1061747
44617 -1061747 -734403 -1586369 -3127772 -4363689 -4515116 -3474011 -1753792 -104580 805560
44608 805560 588978 -608010 -2079438 -3105815 -3484021 -3263733 -2295767 -667754 694079
44599 694079 823970 154404 158994 1335853 2547635 2713137 2089852 1357737 566638 -189488
44589 -189488 -113320 1143574 2397156 2164618 525029 -1205108 -2087235 -1861119 -390814
44580 -390814 1772551 2798940 1255493 -1674706 -3243646 -2550031 -1330400 -1081209 -1193133
44571 -1193133 -762283 -574670 -1856872 -4101187 -5643890 -5843026 -5320111 -4424643 -2905804
44562 -2905804 -1113156 -170987 -543065 -1384924 -1770155 -1771099 -1844677 -1902437 -1695591 -1585307
44552 -1585307 -2057714 -2683915 -2477100 -1446837 -995392 -2227713 -4300063 -5110720 -3616236
44543 -3616236 -994676 622043 278660 -1074430 -1755943 -1069248 92281 274391 -905835
44534 -905835 -2283753 -2468315 -1456410 -526975 -583300 -1177401 -1385409 -1048352 -637431
44525 -637431 -334879 19137 228916 -189166 -1051533 -1312745 -300912 1236833 1839651
44516 1839651 943606 -636324 -1766601 -2093721 -2020921 -2052929 -2454911 -3228737 -3983283
44507 -3983283 -3976018 -2790956 -1010046 273466 717952 954726 1323218 1123638 -212253
44498 -212253 -1795013 -2152534 -1278540 -758569 -1680069 -3358423 -4502746 -4783745 -4675179
44489 -4675179 -4433587 -3960323 -3292335 -2628655 -2114146 -1957494 -2322768 -2681509 -1864645
44480 -1864645 518239 3108870 4062990 3136560 1833883 1587612 2429128 3383422 3517279
44471 3517279 2524155 805942 -852847 -1924744 -2418880 -2445116 -1955676 -1269168 -1238561
44462 -1238561 -2180195 -3108362 -2913321 -1925531 -1270364 -948842 103093 1921465 2872932
44453 2872932 1746799 -533453 -2093893 -2320132 -2089921 -2264210 -2770726 -3070946 -2909124
44444 -2909124 -2466965 -2033951 -1656205 -1206902 -883438 -1312349 -2705681 -4172568 -4590029
44435 -4590029 -4085792 -3817867 -4194271 -4268717 -3250611 -1662376 -364092 784294 2438880
44426 2438880 4414977 5657795 5441203 4054266 2432908 1490278 1574916 2208653 2543155
44417 2543155 2269833 1727994 1033458 -144417 -1548938 -1987231 -860899 640248 936063
44408 936063 177449 -260918 -176380 -949975 -3226645 -5520873 -5992993 -4765221 -3477416
44399 -3477416 -3018667 -2792062 -2193136 -1733489 -2138507 -2974339 -3029372 -2014789 -1134882
44390 -1134882 -1593887 -2991572 -3743364 -2933264 -1249180 -112086 -341139 -1691251 -3189002
44381 -3189002 -3756434 -2946800 -1334496 46464 701774 818606 546500 -192727 -1061225
44372 -1061225 -1246329 -484573 426592 614417 157479 -320023 -594483 -856607 -1188767
44363 -1188767 -1571164 -2078011 -2585559 -2639235 -2088452 -1468907 -1258831 -1176668 -754358 -151637
44353 -151637 199987 282164 161725 -454099 -1488671 -1877741 -783659 899695 1424804
44344 1424804 446803 -709629 -952453 -419605 405145 1251260 1523967 580256 -934732
44335 -934732 -1265436 210917 1964787 2344809 1673821 1356728 1711513 1879643 1453552
44326 1453552 982979 888805 837154 397831 -300634 -799275 -869877 -771688 -1091421 -2156453
44316 -2156453 -3433516 -3852920 -3047671 -1896878 -1403776 -1403675 -973539 131719 1151556
44307 1151556 1402760 1067409 763882 801142 1058925 1290403 1320750 1073074 538432 -226204
44297 -226204 -960079 -1093314 -139453 1578427 2915038 2993512 2118545 1245205 762380
44288 762380 315659 -245886 -376202 442895 1840796 2785971 2641573 1809273 1239362
44279 1239362 1317192 1378966 552832 -955976 -1823254 -1105848 518652 1444453 995583
44270 995583 175112 430412 1933090 3325093 3160797 1434083 -490362 -1410136 -1393557
44261 -1393557 -1169487 -925783 -415960 2392 -494281 -1745905 -2309009 -1274545 372974
44252 372974 1017858 431848 -375060 -814697 -1134190 -1437607 -1476019 -1438340 -1869383 -2638562
44242 -2638562 -2978292 -2718977 -2440682 -2173041 -1185129 408554 1141557 260591 -781551
44233 -781551 -171755 1644084 2576639 1746601 340071 -258526 182802 1360266 3010517
44224 3010517 4410511 4510164 3295035 2135148 2047122 2375576 2003814 1173936 1052424
44215 1052424 1842168 2408196 1803300 307666 -1216127 -2321746 -3079001 -3679653 -4245074
44206 -4245074 -4764634 -5062662 -5000614 -4723563 -4501119 -4378570 -4199553 -3822972 -3047754 -1603333
44196 -1603333 304463 1687912 1700038 797223 263057 526823 721416 91878 -962370
44187 -962370 -1626313 -1731571 -1588277 -1355594 -1106838 -1002728 -881611 -198047 1074026
44178 1074026 2023314 1947485 1390750 1248286 1308245 650552 -786187 -2068868 -2625712
44169 -2625712 -2763936 -2809647 -2704474 -2615418 -2996119 -3719451 -3974085 -3415140 -2712901 -2569198
44159 -2569198 -2838822 -3019919 -2986217 -2803457 -2416970 -1992658 -2017788 -2561637 -2931696 -2563838
44149 -2563838 -1768282 -1075333 -378809 581763 1324168 1071185 -27368 -890862 -836951
44140 -836951 -380720 -533437 -1596754 -2753640 -2754746 -1126342 1176343 2527525 2195060
44131 2195060 910577 -176179 -621423 -561722 -122864 502886 871866 806032 748269 1029716
44121 1029716 1182668 655510 -185819 -585042 -586341 -717469 -683164 433639 2484071 3894201
44111 3894201 3514535 2006394 830619 550061 760280 1099235 1488067 1607648 925429
44102 925429 -610668 -2301792 -3253994 -3076739 -2107328 -1122222 -769690 -1138452 -1858887
44093 -1858887 -2541410 -2940797 -2827450 -2136705 -1315470 -1047869 -1398091 -1619626 -1102500
44084 -1102500 -133555 638110 1104700 1543231 1817439 1421281 382317 -444396 -246461
44075 -246461 901046 2264420 3244928 3696867 3666563 3154379 2170060 891566 -234411
44066 -234411 -566185 287553 1842726 2783456 2136501 487728 -429179 381042 2050563
44057 2050563 2922228 2400193 1291903 628531 774491 1529873 2348473 2417175 1306782
44048 1306782 -249909 -977333 -706482 -561395 -1124409 -1458349 -726169 241282 218315
44039 218315 -334043 -20287 1007737 1093978 -205903 -1183728 -461805 1030422 1573958
44030 1573958 1008837 362923 525 -474054 -964746 -985008 -897240 -1665034 -3126576 -3746004
44020 -3746004 -2659111 -1037904 -648565 -1601946 -2312275 -1470571 572834 2356361 2759532
44011 2759532 1835863 521877 -304183 -499179 -405838 -68166 919566 2599143 4086523
44002 4086523 4329023 3335318 2195911 1853416 2273013 2904007 3471451 4049215 4758921
43993 4758921 5753031 7162563 8668131 9480090 9295277 8964883 9454012 10276765 9901530
43984 9901530 7869622 5534798 4228897 3609343 2613418 1311585 711652 1054725 1460281
43975 1460281 1337310 1184031 1704266 2852806 4057663 4808692 4786184 4001528 3100063
43966 3100063 2928216 3404568 3355434 1966899 -27814 -1171259 -989788 -269686 225177
43957 225177 648226 1545768 2956412 4399229 5554932 6583793 7707273 8758782 9429306
43948 9429306 9859215 10565434 11614552 12276925 11903527 10863878 10071042 9705542 9047059
43939 9047059 7654723 6094931 5195446 5016926 4935944 4502069 3889280 3580227 3760218
43930 3760218 3993362 3572737 2370040 1161858 729242 784204 366737 -702457 -1460928
43921 -1460928 -1111580 -50412 774868 1000033 914076 844518 953054 1321845 1795371 1978507
43911 1978507 1762956 1603022 1928270 2580924 3213004 3901721 4850120 5703934 5775108 4956295
43901 4956295 3931601 3349276 3102461 2602643 1624299 705670 595620 1265908 1710637
43892 1710637 1064224 -226617 -870064 -358840 527116 1014679 1342180 1961824 2444342
43883 2444342 2039758 1017144 559260 1282859 2555846 3479518 4014477 4769958 5923025
43874 5923025 6747847 6352664 4740015 2851874 1459056 356361 -972268 -2234486
43866 -2234486 -2572062 -1831321 -820263 -228167 -83980 -395063 -1310313 -2266942 -2064108
43857 -2064108 -534261 761412 411084 -1020468 -2017300 -2248135 -2451734 -2683992 -2137761
43848 -2137761 -713336 533907 852698 731486 964458 1523514 1842384 1791099 1948300
43839 1948300 2984891 4851371 6591398 7251805 7061543 7122100 7636448 7297433 5154682
43830 5154682 2247316 280108 -649234 -1612953 -2605918 -2456710 -1042256 145695 227799
43821 227799 270114 1484447 3183070 3623860 2311251 476326 -526945 -587823 -574111
43812 -574111 -1062895 -1484549 -716823 1287337 2907910 2567930 754098 -574432 -478657
43803 -478657 132511 262207 191679 570987 1160569 1245884 695004 -26621 -454043 -303879
43793 -303879 461520 1367774 1709358 1448201 1362920 1993283 2895480 3207419 2523860 1089210
43783 1089210 -349219 -835105 -35039 1134726 1430796 845285 381112 314370 -117769
43774 -117769 -1095630 -1631915 -1134096 -322229 35818 109225 64297 -545827 -1567177 -1734631
43764 -1734631 -519342 678211 455926 -520637 -754934 -239930 21699 -12870 314046
43755 314046 683150 193218 -799659 -939422 74737 1226601 1947955 2614402 3244653
43746 3244653 3303216 3030043 3395800 4291925 4232871 2507079 374594 -615695 -496415
43737 -496415 -389917 -1027926 -2397537 -4060016 -5180870 -4912928 -3324430 -1402643 209417
43728 209417 1759397 3319023 4101276 3538399 2327589 1596012 1462961 1140409 153999
43719 153999 -1176408 -2318814 -3102934 -3747943 -4540643 -5408603 -5843441 -5533178 -4921583
43710 -4921583 -4584541 -4170068 -2776146 -461611 1548709 2450576 2711350 2916609 2790061
43701 2790061 2077171 1469774 1640020 1993309 1469507 194652 -737160 -899104 -847133
43692 -847133 -820153 -251025 1074572 2243536 2151457 727578 -1180789 -2720589 -3418025
43683 -3418025 -3063126 -1852497 -613473 -342603 -1252763 -2480816 -2935922 -2324452 -1195829
43674 -1195829 -173929 505314 741802 357318 -581429 -1543010 -2008911 -2025943 -2008309 -2197537
43664 -2197537 -2629934 -3337334 -4056310 -3945515 -2297427 379819 2567334 3213902 2620836
43655 2620836 1810353 1513277 1871605 2549722 2854058 2210586 864117 -216475 -391340
43646 -391340 -28684 60522 -425841 -1064721 -1160932 -291588 1308983 2825719 3615697 3849559
43636 3849559 4007346 3907530 2975004 1489055 618813 856101 1301580 1094220 744327
43627 744327 1223563 2326852 2908332 2455503 1523724 725484 135884 -257369 -265041 153002
43617 153002 780493 1511358 2349416 2984700 2941707 2347376 2007092 2353205 2721830 2149973
43607 2149973 699140 -501215 -543532 346960 1358399 2161716 2995610 3831562 4067774
43598 4067774 3327300 2124270 1284463 952967 668390 260650 103343 479172 1224198
43589 1224198 2044462 2663908 2624916 1596212 93381 -739811 -444503 146158 -10631
43580 -10631 -908448 -1691708 -1698098 -892724 324295 1225617 983238 -593129 -2570695 -3574759
43570 -3574759 -3038079 -1635646 -585847 -636968 -1532438 -2299042 -2228754 -1660813 -1557935
43561 -1557935 -2284516 -3178427 -3415502 -2877389 -2063231 -1628776 -2136140 -3661528 -5383253
43552 -5383253 -6106057 -5480563 -4200420 -2853882 -1358352 157259 852223 228595 -1029432
43543 -1029432 -1944754 -2301693 -2159723 -1157257 730787 2417921 2798534 2165770 1527135
43534 1527135 1031422 257478 -409167 -131518 815686 1272078 998588 846549 1010533
43525 1010533 666981 -222575 -318579 1053677 2593535 2834802 2215440 2092614 2462383
43516 2462383 2108243 740761 -400123 -264267 757339 1675904 2149293 2298086 1857842
43507 1857842 358731 -1835891 -3331534 -2987066 -1205981 469603 1051826 977321 1162432
43498 1162432 1699522 1933911 1500723 698723 -49569 -547331 -648228 -286292 221450
43489 221450 393708 265345 425168 1186638 2088701 2430634 1995899 1038580 -162345
43480 -162345 -1443319 -2564796 -3127900 -2797392 -1679775 -466890 34884 -297952 -767268
43471 -767268 -705743 -212165 243625 636325 1327711 2337237 3131680 3121556 2083495 261643
43461 261643 -1612099 -2625811 -2444820 -1615248 -807249 -79458 726538 1343347 1436409
43452 1436409 1167569 709062 -304758 -1929396 -2985877 -2209072 -171143 1181701 972692
43443 972692 191507 -83642 4015 -76373 -312055 -671541 -1599635 -3288879 -5104275 -6241924
43433 -6241924 -6430690 -5751476 -4455561 -3138324 -2306974 -1674879 -777523 -195075 -843232
43424 -843232 -2041958 -2062098 -989049 -976550 -2715549 -3853266 -2571086 -718148 -1055687
43415 -1055687 -2906788 -3369742 -2011585 -1261794 -2181207 -2898679 -2006400 -802314 -807249
43406 -807249 -1248234 -749143 93352 -237735 -1546832 -2232192 -1751913 -1119925 -1103334 -1402569
43396 -1402569 -1700542 -2199854 -2782785 -2719534 -1708001 -417305 458733 1000142 1449150
43387 1449150 1506029 914903 205706 2270 -93878 -978902 -2481721 -3351684 -3037781 -2465194
43377 -2465194 -2518509 -2717901 -2261301 -1573169 -1611107 -2093624 -1806821 -627301 126460 -368387
43367 -368387 -1396657 -2046743 -2392979 -2668575 -2388860 -1271593 -185565 -97509 -625881
43358 -625881 -662177 -10827 592810 791099 912130 1097005 1058594 746535 504000 518517
43348 518517 718135 1157928 1904592 2612874 2835914 2709871 2740936 2958197 2866219 2243829
43338 2243829 1469390 1033248 1141055 1744034 2581907 3292447 3770502 4189515 4435979
43329 4435979 4024218 2983423 2199781 2242452 2485198 2192859 1816216 2159355 2827585
43320 2827585 2772810 2028898 1556269 1554528 1349181 917630 1007358 1511141 1223140 -297691
43310 -297691 -1948804 -2751263 -3078735 -3579282 -4053186 -4189595 -4343702 -4682449 -4507602
43301 -4507602 -3419498 -2341683 -2308342 -2861801 -2777226 -1947467 -1419872 -1771384 -2502585
43292 -2502585 -3012098 -3194783 -2915294 -1768264 189127 1994936 2601123 2011141 1262753
43283 1262753 1242446 1753524 1952174 1547191 1119390 1139041 1219198 761662 -153246 -1111738
43273 -1111738 -2085756 -2960949 -2819721 -938377 1572411 2433105 818128 -1739835 -3361304
43264 -3361304 -3656555 -3197882 -2365039 -1412652 -731398 -298086 390476 1265525 1413375
43255 1413375 471393 -586399 -784311 -443801 -401021 -742549 -1124522 -1558656 -2020004
43246 -2020004 -2023764 -1472260 -1170766 -1588270 -1897207 -1256796 -245727 119981 -15526 -61919
43236 -61919 -532385 -2244488 -4400439 -5190603 -4284899 -3208267 -3147536 -3779935 -4395995
43227 -4395995 -4729383 -4325947 -2485914 473341 2864936 3220251 1687271 -416876 -1816145
43218 -1816145 -1921819 -1059522 -289021 -366521 -818341 -700905 -127100 -61419 -634164 -838237
43208 -838237 -151286 669328 840172 610552 585037 862553 1319957 1928058 2339217 1999412
43198 1999412 1131895 721904 977105 739169 -815947 -2712721 -3335127 -2480784 -1332360
43189 -1332360 -752109 -502749 -21776 790227 1613002 2098203 2215912 2400359 3098643
43180 3098643 3962299 3912359 2413735 345023 -848094 -614458 495610 1812898 3179645
43171 3179645 4583831 5602179 5534020 4179369 2364174 1321282 1340753 1439548 758662
43162 758662 -251276 -768092 -1166199 -2415880 -4082035 -4376329 -2544957 95290 2045714
43153 2045714 3305418 4402633 4940353 4255552 2778691 1598345 1065043 687935 41361
43144 41361 -938533 -2109971 -2914645 -2556684 -1096853 224825 510017 387462 841037
43135 841037 1615284 1884281 1810401 2063915 2239645 1285273 -563339 -1703357 -1209021
43126 -1209021 207788 1426548 1987159 1785294 876907 -108370 -418969 -342784 -856177
43117 -856177 -1830238 -1830482 -261092 1519775 2075394 1817839 1986061 2541567 2406009 1385461
43107 1385461 514125 447921 651678 485728 177303 185748 261467 -167068 -988787 -1526525
43097 -1526525 -1649587 -2045600 -3036964 -3714288 -2924157 -842289 1214309 2447381 3121312
43088 3121312 3344000 2501162 562477 -1106817 -1289693 -537694 -124503 -44900 568721
43079 568721 1524987 1761976 1410063 1922588 3744818 5399651 5526242 4476746 3186939
43070 3186939 1794604 289203 -687224 -818548 -956784 -1889064 -3078613 -3683493 -3964986
43061 -3964986 -4485794 -4737491 -4000050 -2964967 -2973050 -3995620 -4855298 -5151815 -5369664
43052 -5369664 -5257989 -3968742 -2072572 -1592101 -3280756 -5367935 -5911634 -5137467 -4462661
43043 -4462661 -4331633 -4180444 -3675533 -2776280 -1232133 751563 1864279 1035873 -813053
43034 -813053 -1669099 -1046149 -424622 -872016 -1528186 -1105101 110131 690530 7452
43025 7452 -1138211 -1669586 -1339215 -664862 -264950 -371210 -692197 -674216 -84916 689110
43015 689110 1139333 1323708 1679229 2152595 2052815 1078901 65618 153491 1365108 2554966
43005 2554966 2757822 2013283 782221 -704348 -2090384 -2592596 -1878180 -909825 -989054
42996 -989054 -1972316 -2342624 -1289470 142391 488351 -249682 -888213 -803129 -507301
42987 -507301 -543214 -635131 -296168 233163 188975 -655550 -1555387 -1640299 -1037185 -804041
42977 -804041 -1617745 -2845995 -3301875 -2745351 -2091452 -2085533 -2366719 -2138615 -1305180 -543130
42967 -543130 -539536 -1468541 -2910526 -3983625 -3918371 -2875265 -1847202 -1397654 -968952
42958 -968952 65921 1234838 1640582 1373081 1247638 1319604 761712 -655978 -1982718
42949 -1982718 -2319925 -1813010 -1063106 -326879 279178 493474 328967 212496 297333 223610
42939 223610 -64795 24802 750538 1409223 1320597 796016 457183 275673 128154 639412
42929 639412 2338908 4321025 4889635 3488075 1102906 -1086274 -2499014 -2783373 -1862101
42920 -1862101 -531834 15371 -440751 -1088249 -1493138 -2032778 -2685059 -2586668 -1411444
42911 -1411444 -164367 188394 42562 232054 491745 -103317 -1531433 -2641187 -2484509
42902 -2484509 -1134654 677769 2105303 2541776 2114075 1708530 1899805 2020392 1007018
42893 1007018 -931329 -2332521 -2294720 -1459427 -841394 -417858 455367 1631069 2016517
42884 2016517 993173 -568223 -1183031 -502583 304261 79167 -887902 -1433691 -1216420
42875 -1216420 -1048185 -1492958 -2000510 -1864435 -1325384 -1059679 -1064198 -803647 -188637 330086
42865 330086 518791 548762 476366 137879 -421469 -908712 -1153557 -1092569 -541697 460720
42855 460720 1214648 905402 -426086 -2016572 -3356507 -4350443 -4665540 -3891170 -2493931
42846 -2493931 -1665295 -1862134 -2309228 -2315978 -2214694 -2457085 -2640870 -2223195 -1559276 -1367964
42836 -1367964 -1621723 -1832089 -2081256 -2830784 -3871476 -4405691 -4226344 -3992098 -4164325
42827 -4164325 -4385297 -4160106 -3548470 -2875577 -2249404 -1674868 -1219514 -734611 205219
42818 205219 1671984 2948823 3175860 2369234 1436106 1136920 1310985 1251929 644462
42809 644462 -131126 -629661 -989244 -1683006 -2756064 -3727980 -4321450 -4790949 -5223806
42800 -5223806 -5016177 -3648544 -1678829 -207740 541531 1243840 1961422 1643569 -242196
42791 -242196 -2371903 -2834138 -1441696 125582 447883 -167385 -463698 251176 1665767
42782 1665767 2968898 3423059 2844528 1871550 1468559 1904205 2517208 2676221 2518666
42773 2518666 2429682 2304733 1857978 1276421 961963 894387 844418 933006 1285643 1408682
42763 1408682 788454 -46109 -112266 327683 -135187 -1859494 -3259936 -2905720 -1535509
42754 -1535509 -941011 -1537705 -2211764 -2173944 -1749498 -1417491 -1184595 -1065530 -1267420 -1644779
42744 -1644779 -1681179 -1212102 -546378 232860 1389580 2788070 3715685 3702062 2932509
42735 2932509 1695882 123088 -1308129 -1834916 -1456160 -1228311 -1915198 -2870991 -2907367
42726 -2907367 -1873071 -689438 -37577 325005 946818 1899419 2758453 3105990 2905278
42717 2905278 2411750 1796193 1072410 526611 811419 2081634 3330924 3385582 2469740
42708 2469740 1865483 1976946 1853563 952678 120762 82521 98187 -775490 -1940839 -2050688
42698 -2050688 -1010547 83455 665488 1053373 1227670 630629 -590993 -1312106 -844720
42689 -844720 208033 892771 996078 857177 727241 674430 651545 413660 -222629 -957273
42679 -957273 -1321309 -1387403 -1538726 -1576940 -928642 94089 194291 -1267444 -3279637
42670 -3279637 -4384536 -4277425 -3648240 -2977911 -2176563 -1121135 50338 1086574 1738527
42661 1738527 1905085 1861737 2023491 2289033 2075364 1290481 750544 1187105 2286614
42652 2286614 3199729 3557761 3394154 2491241 656143 -1450051 -2588009 -2293721 -1445659
42643 -1445659 -1206053 -1720496 -2143474 -1777880 -878581 -231509 -108798 31192 677585
42634 677585 1487255 1816163 1729163 1746970 1689925 761896 -939991 -2035329 -1652742 -759874
42624 -759874 -803186 -1685641 -2172502 -1842581 -1392442 -1181025 -802259 -276983 -395361 -1346256
42614 -1346256 -2025667 -1403810 161440 1631021 2613426 3226594 3233784 2301626 873366
42605 873366 -148300 -600011 -1170880 -2218277 -3157103 -3236567 -2365448 -952918 532791
42596 532791 1588766 1833650 1584749 1829652 3050741 4337619 4270661 2621858 668447
42587 668447 -181360 375263 1642767 2710432 2974879 2376396 1420119 704577 288818
42578 288818 -176910 -657190 -586091 260803 1257557 1636335 1283465 527336 -340755 -938664
42568 -938664 -817306 -219690 -190038 -1104649 -1687743 -620310 1253729 1721102 216072
42559 216072 -1383130 -1370379 -281344 418642 597234 1270181 2723442 3937517 3866938
42550 3866938 2632778 1347953 998064 1445362 1575471 718731 -322967 -373867 230872
42541 230872 52404 -1081407 -1650162 -978577 -546046 -1545624 -2595720 -1664906 668975
42532 668975 1899690 1135643 3388 28930 962448 1979542 2815731 3147948 2362901
42523 2362901 689279 -656449 -1152817 -1669872 -2784492 -3571418 -3018970 -1692982 -940347
42514 -940347 -1126913 -1643132 -2059547 -2262697 -1888115 -657798 903948 1949197 2399978
42505 2399978 2866941 3588529 4099020 3912800 3029524 1817868 786849 318334 263264
42496 263264 19113 -654278 -1206521 -1049830 -347585 385326 999891 1457051 1358998 548368
42486 548368 -163825 190988 1288974 1754392 896451 -597215 -1792098 -2487417 -2818551
42477 -2818551 -2723767 -2337188 -2305730 -3047033 -3986286 -4152509 -3464463 -2882563 -3142193 -3750012
42467 -3750012 -3604069 -2461962 -1310840 -1086499 -1457951 -1384059 -611970 110593 281558
42458 281558 197681 -6403 -874627 -2512941 -3837346 -3939472 -3566295 -4047210 -5162981
42449 -5162981 -5468093 -4617576 -3821948 -3646066 -2891760 -571566 2155672 3229067 2263257
42440 2263257 764535 78566 155471 282850 72894 -509061 -1361168 -2090564 -2099656 -1281153
42430 -1281153 -446794 -631276 -1851329 -2823926 -2266137 -486748 764583 362580 -723876
42421 -723876 -727752 415623 961472 -7783 -1041288 -304236 1745659 2923535 2221731
42412 2221731 835702 198652 254942 227463 99821 456996 1370428 2284191 2798469 2884134
42402 2884134 2474365 1570782 778537 990322 2225796 3337724 3314375 2503039 2039089
42393 2039089 2305021 2566579 2111560 1101464 56769 -913913 -1847172 -2250756 -1424612
42384 -1424612 474577 2240495 2741562 1933581 608821 -478945 -976045 -806177 -192121
42375 -192121 295065 142570 -580593 -1341489 -1734106 -1668809 -1077762 74978 1366140
42366 1366140 1990658 1637053 1004859 1055128 1896611 2780937 3079103 2831377 2351899 1771503
42356 1771503 1138901 597192 214765 -116736 -442199 -659391 -814602 -1110994 -1387409
42347 -1387409 -1053805 -1091 854822 645204 -51334 280912 2099347 4085802 4714180
42338 4714180 3930703 2928573 2754837 3521012 4597968 5216505 5114775 4753497 4601504
42329 4601504 4325554 3391069 2394956 2605449 3783071 3849186 1709620 -832327 -1400165
42320 -1400165 -280821 433074 210039 390186 1302787 1505043 477846 -165925 687923
42311 687923 1697656 1230220 -20069 -304657 394200 725730 452497 688012 1862983
42302 1862983 3113908 3750852 3947475 3869444 3362819 2651124 2225832 1941060 1288660
42293 1288660 591877 723182 1539880 1914345 1586162 1623633 2569293 3475962 3500466 3208708
42283 3208708 3370180 3538138 2933008 1890977 1252719 948350 418145 -12204 490287
42274 490287 1630815 2012652 1053072 -138394 -245454 618725 1321676 1336722 1316283 1995647
42264 1995647 2976464 3088009 2041100 1166603 1874591 3654233 4535177 3597329 1950720
42255 1950720 837210 -53561 -1499856 -2997697 -3404784 -2813880 -2436788 -2740862 -2872163
42246 -2872163 -2007897 -325663 1454053 2648202 2733367 1790582 894286 1172189 2370750
42237 2370750 3194659 3105445 2814946 2901469 3049311 2960972 2910907 2904507 2310658 937684
42227 937684 -422809 -1133956 -1524595 -1947115 -1964125 -1246799 -390361 48916 473037 1213405
42217 1213405 1470284 539538 -633973 -625858 192025 146195 -1128157 -2217573 -2211691 -1819374
42207 -1819374 -1743126 -1504599 -743135 -366946 -1209334 -2373991 -2196243 -532258 933279
42198 933279 597728 -1520537 -4006238 -5191782 -4232521 -1711312 745627 1841584 1613913
42189 1613913 922958 338966 21557 309298 1558059 3325588 4468611 4384304 3667818
42180 3667818 3195259 2952492 2224092 738761 -866213 -1791109 -1960958 -1977854 -2303583
42171 -2303583 -2657445 -2268026 -704365 1546675 3364042 3943679 3517220 3056161 3214213
42162 3214213 3701920 3859473 3660671 3744004 4416096 5092779 5013488 4179296 3243352 2757631
42152 2757631 2921311 3755884 4907369 5404834 4363820 2145767 278060 -83319 723706
42143 723706 1472029 1424131 890165 695242 1292371 2230269 2499738 1709149 819730 1164700
42133 1164700 2716275 4013007 3983815 3066445 2158937 1337576 318088 -555882 -773006
42124 -773006 -674594 -992676 -1573462 -1570302 -870294 -325524 -431436 -745731 -909051 -1276530
42114 -1276530 -1987259 -2231770 -1251644 407381 1444874 1385037 882113 523156 56505
42105 56505 -969281 -2324988 -3253814 -3291707 -2595343 -1514488 -202656 1139138 1865069
42096 1865069 1220591 -711738 -2734727 -3629631 -3436041 -3220628 -3566134 -3802759 -3012124
42087 -3012124 -1405581 -225341 -335766 -1293351 -1930880 -1635135 -841662 -324000 -240391
42078 -240391 -78690 542726 1350077 1856192 2068427 2414487 3031361 3477607 3258666 2443929
42068 2443929 1671886 1638689 2554663 3939429 4953027 5084237 4524105 3788487 3122684
42059 3122684 2490458 1983390 1848083 2081110 2334157 2332462 2151363 1986660 1851433 1591530
42049 1591530 1066693 282388 -553347 -1145902 -1393008 -1426702 -1258703 -640004 475648
42040 475648 1625004 2362305 2784223 3060816 2833118 1822384 770015 795080 1793772
42031 1793772 2448276 2019857 1193029 870168 1142097 1864398 3114509 4346069 4210558
42022 4210558 2350068 527221 628681 2078300 2686878 1806336 1019915 1499929 2277204
42013 2277204 1897329 579086 -354480 -455029 -383873 -444893 -7768 1398666 3233534
42004 3233534 4634335 5473393 6198512 6879493 7048672 6546105 5922141 5704779 5808941
41995 5808941 6143106 7198347 9149062 10788378 10670840 9404352 9401256 11784601 14831529
41986 14831529 16363136 16463499 16601412 17126742 17293202 17121431 17411322 18094011 18306556
41977 18306556 18103432 18327209 18605771 17430110 14825249 12986908 13160253 13627809 12325720
41968 12325720 10060773 9240807 10280724 11310535 11177544 10780612 11127804 11693503 11431449
41959 11431449 10385309 9532273 9539992 10150485 10487085 9794226 8194490 6714944 6184481
41950 6184481 6256310 6069102 5665300 5923161 7069060 8173016 8412940 8052812 7756229
41941 7756229 7624182 7447868 7357948 7582740 7895821 7910142 7740712 7821047 8108336 7962942
41931 7962942 6943685 5438851 4367740 4356422 5218485 6125663 6260222 5417142 4123873
41922 4123873 3276448 3580068 5048362 6856076 7887019 7716515 6960017 6432017 6170429
41913 6170429 5650656 4731658 3808310 3086085 2377143 1758778 1763907 2558187 3444375 3609384
41903 3609384 2988714 2032960 1048288 233420 -21061 531818 1567069 2608405 3660009
41894 3660009 4879316 5880376 6104592 5809656 5881325 6523695 6895187 6309052 5054550
41885 5054550 3637452 1996093 169865 -891163 -186243 1871633 3777663 4734253
41877 4734253 5283886 6034279 6670925 6654616 6124365 5494734 4742928 3800849 3201912 3498105
41867 3498105 4248183 4422673 3776593 3032808 2672339 2401279 2021077 1925942 2267045 2424109
41857 2424109 1983251 1582747 1930887 2452088 1944393 435850 -671926 -483660 309496
41848 309496 628494 470782 535015 950695 1189388 1033924 871386 948299 962668 664092
41838 664092 398425 640460 1221294 1487285 1215632 931338 1120135 1467769 1237191 236771
41828 236771 -961974 -1674259 -1533119 -336533 1869258 4282782 5551639 5071204 3758313
41819 3758313 3002484 3157402 3678010 4394802 5685362 7368465 8454133 8403506 7831923
41810 7831923 7430717 6928120 5860905 4764055 4547891 4902075 4425519 2581814 626264
41801 626264 84469 936232 1923401 2252148 2286034 2689772 3572921 4599928 5410455 5709057
41791 5709057 5379437 4801105 4666802 5106629 5321860 4563192 3199853 2210111 1798520
41782 1798520 1330010 693079 780133 2133646 3875833 4691225 4368346 3650298 3009518
41773 3009518 2452141 2256308 2872652 4023577 4789687 4812307 4694660 5010308 5608916
41764 5608916 6124278 6464413 6534646 6207942 5902101 6403874 7645662 8433928 8033228
41755 8033228 7306688 7471071 8300099 8532772 7723075 6684812 6203189 6207033 6239741 5932882
41745 5932882 4922695 3093405 1137124 189401 573711 1397758 1663310 1329617 1024058
41736 1024058 1150006 1634312 2241972 2772621 3090052 3209795 3283587 3378748 3377731 3164106
41726 3164106 2790046 2415813 2172823 2065165 1933708 1641092 1388418 1583658 2155328
41717 2155328 2315517 1446180 23464 -819592 -521542 575004 1923004 3180625 3990487
41708 3990487 4024198 3361777 2335183 1026418 -491013 -1509248 -1144003 379554 1690491
41699 1690491 1825313 1139313 441060 40908 27700 597228 1488859 1854178 1389536 936655
41689 936655 1220010 1645719 1222899 83121 -934221 -1740666 -2881941 -4208007 -4864468
41680 -4864468 -4625720 -4144742 -3766259 -3156975 -2326670 -1916350 -2028428 -1759546 -513419
41671 -513419 1042727 2038725 2726358 3902527 5464961 6449731 6383360 5853469 5681818
41662 5681818 6063380 6598619 6749839 6146216 4757614 2968495 1424850 754801 1315625
41653 1315625 2893682 4530885 5039155 4088652 2623233 1835354 1847058 1788472 1095326
41644 1095326 209649 -186722 -210709 -621494 -1707455 -2721027 -2637777 -1349180 139857
41635 139857 747351 388927 -50153 346471 1711371 3299723 4016282 3269901 1643480
41626 1643480 577449 992417 2263704 2922172 2304088 1068130 137819 -261269 -378253
41617 -378253 -376509 -337382 -362037 -321250 97768 766753 974427 324408 -625332 -1106273
41607 -1106273 -1166803 -1379621 -1774341 -1720004 -852924 396406 1272494 1371390 876469 365895
41597 365895 246041 155621 -748069 -2554097 -4063541 -4074787 -2868652 -1690569 -1017320
41588 -1017320 -260216 846874 1611381 1490015 988997 881088 1055606 743179 -357005
41579 -357005 -1632210 -2205326 -1853393 -1288821 -1421889 -2220717 -2672357 -2276975 -2021258
41570 -2021258 -2954261 -4214640 -3883371 -1876963 -405615 -913586 -2043069 -1739381 -168161
41561 -168161 899938 779471 347046 262396 310809 427759 880326 1287132 853044 -105269
41551 -105269 -190629 1015019 2135951 1926195 920127 308332 114411 -400288 -1125029
41542 -1125029 -1114916 -75548 1163487 1747390 1646072 1312317 1114054 1251097 1687510
41533 1687510 1933789 1340736 -60359 -1286725 -1345688 -381737 426050 183885 -748935
41524 -748935 -1304153 -998221 -275503 369097 961866 1451803 1239269 51666 -1151930
41515 -1151930 -1166581 -351237 -387123 -2006943 -3985809 -4846249 -4604183 -4140087 -3711257
41506 -3711257 -3051267 -2336337 -1940573 -1510534 -373764 1134112 1714390 678715 -1240528
41497 -1240528 -2815950 -3393913 -2879346 -1413098 473971 1857742 2086621 1344968 371774
41488 371774 -198140 -120903 535317 1527991 2574882 3399161 3624601 2887296 1362699
41479 1362699 -51919 -567948 -389193 -222483 -49868 800736 2220049 2852992 1651429
41470 1651429 -671896 -2393057 -2665834 -2084178 -1612807 -1625708 -1992668 -2503632 -2953175
41461 -2953175 -3127917 -2964596 -2619227 -2277212 -1981203 -1705608 -1524181 -1621299 -2098384 -2739451
41451 -2739451 -3024205 -2544189 -1498199 -647542 -598036 -1112153 -1262315 -366786 1262245
41442 1262245 2645978 3268227 3642617 4450313 5314241 5108781 3683212 2491772 2805671
41433 2805671 3839537 3692370 2017334 616009 1087364 2922286 4536933 5305743 5633328
41424 5633328 5597086 4736390 3193396 2000148 1801317 1975451 1576457 746618 562000
41415 562000 1530727 2789066 3027177 1929225 391705 -564995 -742145 -570876 -348905
41406 -348905 46584 858893 2141645 3665982 4951462 5559564 5600329 5730166 6299797
41397 6299797 6731268 6230871 4968493 3942200 3673181 3653205 3195893 2236431 1109566
41388 1109566 147413 -209736 512496 2175164 3807140 4428679 3892474 2743375 1597525
41379 1597525 849383 591781 561623 439411 296493 405469 679203 867632 1206475 2017034
41369 2017034 2658898 2030242 437527 -264924 962304 3002810 4368034 5040745 5438287
41360 5438287 4861972 2682740 227212 -433534 739752 1935535 2283907 2676650 3695933
41351 3695933 4540476 4555706 4332640 4569382 4989738 5043351 4728388 4206815 3520931 3138799
41341 3138799 3853874 5679958 7682250 9239051 10583191 11867844 12769717 13296032 13793751
41332 13793751 13846304 12554305 10387978 9186726 9540460 9789466 8704529 7523598 7810018
41323 7810018 8707870 8232185 6349667 4817970 4513721 4781752 5120714 5722241 6403172
41314 6403172 6588418 6362967 6157194 5550828 3931070 2236772 2314018 4318526 6365353
41305 6365353 7058038 6760781 6000733 4445715 2327284 1212288 2042510 3526738 3800909
41296 3800909 2935530 2567336 3525275 4938290 5486868 4694799 3130278 1977221 2254064
41287 2254064 3924221 5889525 7176140 7862862 8557174 9329308 9554905 8617787 6632052
41278 6632052 4766773 4743905 7265879 10787579 12675903 11934996 10032599 8753422 8248736
41269 8248736 7762710 7180045 6848248 6656321 6428178 6743758 8261892 10474633 12085647
41260 12085647 12475884 12039782 11352204 10814073 10822649 11380094 11726716 11245480 10519722 10516562
41250 10516562 10883276 10218714 8177239 6194286 5703222 6491129 7324299 7553971 7544984
41241 7544984 7857341 8432434 8547043 7583575 5975825 5033258 5351470 5820713 5015852
41232 5015852 3227851 1996151 1714817 1061608 -809851 -2764210 -3121779 -1706032 308144
41223 308144 1861476 2566022 2460238 2082169 2349956 3571362 4879031 5281118 4859181
41214 4859181 4258873 3518892 2333426 1120820 752570 1265010 1809789 1967521 2198178
41205 2198178 2781105 3185611 2917646 2331677 2108332 2340053 2534548 2245124 1448965
41196 1448965 584823 368262 1208615 2651296 3789068 4365191 4977972 5987798 6836310
41187 6836310 6893695 6438868 6156646 6013426 5369544 4097526 2884915 2328661 2285781
41178 2285781 2286237 2110288 1716292 1009077 73590 -533586 -123408 1358789 3023078 3694752
41168 3694752 3081385 2257490 2653487 4377812 5908969 5842909 4604520 3799298 4079442
41159 4079442 4523510 4230274 3555533 3242546 3109493 2409436 1070355 -188935 -718322
41150 -718322 -254123 1270599 3391363 4851310 4734157 3886129 4140754 5914019 7705475
41141 7705475 8471791 9306692 11808780 15686263 19225002 21604219 23365121 24717728
41133 24717728 24840621 23298380 21040995 19293604 18162713 17022372 15741387 14746594
41125 14746594 14109689 13319917 12054288 10692496 9862122 9669736 9518703 8682710 7107263
41116 7107263 5636827 5260500 6034524 6934293 6914375 5955831 4917240 4523501 4730724
41107 4730724 5028646 5162607 5458707 6382075 7734309 8481590 7723685 5835211 4254648
41098 4254648 4008031 4810157 5791854 6623456 7480824 8258306 8451970 7814290 6659170
41089 6659170 5440766 4357853 3425282 2635879 1970904 1476371 1373670 1889039 2948705
41080 2948705 4219552 5410184 6315017 6662928 6311551 5671052 5598672 6675693 8723017
41071 8723017 11060592 13049890 14434056 15540543 17277877 20516514 25086200 29485229
41063 29485229 31834657 31176688 27953580 23567104 19588291 16965366 15546537 14434975
41055 14434975 13034935 11616996 10691301 10173131 9623473 9072188 8912388 8911638 8071212
41046 8071212 5954571 3691897 2960378 4014800 5354172 5560435 4962937 5001364 6203294
41037 6203294 7491952 7708781 7242139 7534102 9151105 11047014 11946769 11868316 11768290
41028 11768290 12024215 11952168 10877939 9138718 7747199 7340164 7697008 8151264 8316622
41019 8316622 8479132 9285947 10892943 12485164 12979802 12248537 11241197 10779346 10749090
41010 10749090 10801549 11252630 12594082 14456668 15928307 16889037 18213074 20491699 23380993
41001 23380993 26566137 30514342 35555717 40860594 45342457 49409656 54927688 63396361
40993 63396361 74929464 89137682 106203075 126758214 151343622 180110334 211822298
40986 211822298 242135609 263794163 270505484 261472220 241651366 217501504 193182825
40979 193182825 170658477 151528201 137054399 126926867 119692457 114799846 113246561
40972 113246561 115904666 122201501 131087633 142649079 158107332 178560949 203853965
40965 203853965 231543362 256034006 269834557 267812501 250948701 225230586 196847183
40958 196847183 169260932 144339866 123879601 108576666 96843867 86439804 76936350
40951 76936350 69333690 63660501 58445075 52589472 46432266 40704835 35652166 31600031
40943 31600031 29195412 28313356 27600373 25996145 24159579 23540409 24373377 25357222 25141186
40934 25141186 23490753 21123022 19005054 17787131 17399044 17123430 16378043 15372930
40926 15372930 14690364 14359136 13792200 12654815 11402582 10811846 11153405 11898074 12172385
40917 12172385 11557246 10479068 9688521 9385466 9169704 8866100 8876062 9466439 10222253
40908 10222253 10593440 10531945 10162209 9331184 8074462 7073481 6942967 7427336 8032304
40899 8032304 9027189 10847340 12779481 13404254 12391237 10812460 9601375 8823717 8631214
40890 8631214 9573499 11358492 12528091 12278878 11660773 11960840 12677237 12259466 10372867
40881 10372867 8275280 7184756 7291980 8217961 9436209 10260164 10322029 10124016 10364200
40872 10364200 10789108 10554914 9623482 8765117 8135306 7048336 5496314 4647245 5104459
40863 5104459 5724258 5197607 4090060 4122866 5738264 7518452 8059168 7486725 6904986
40854 6904986 7084777 8025098 9254319 10168578 10384085 10079133 9875357 10303295 11556257
40845 11556257 13669567 16463410 19187963 20761580 20783224 20043485 19645061 19785941 19774731
40836 19774731 19102988 18054539 17240926 16956143 17154555 17752429 18684884 19785419 20823020
40827 20823020 21681584 22483114 23590257 25428798 28109531 31231294 34346399 37714351
40819 37714351 42237889 48350985 55192314 61225714 65543928 68205381 69406109 68831335
40811 68831335 65998706 60950416 54445900 47636779 41573153 36751126 32996852 29899787
40803 29899787 27328126 25346224 23792180 22354852 21036803 20074736 19368756 18520585
40795 18520585 17553795 17010123 17102420 17367832 17461845 17634011 17966156 17839121 16847835 15681018
40785 15681018 15285297 15597880 15969996 16438124 17527563 19010318 19997564 20306947 20691020
40776 20691020 21591694 22733903 24200200 26826382 31071646 36395084 42156825 48161141
40768 48161141 53776898 57529692 58354243 56528261 52790057 47498776 41451206 36412080
40760 36412080 33513691 31785112 29534535 26643800 24194081 22382784 20439592 18372344
40752 18372344 17041036 16359453 15146162 13204136 11884903 11847738 11846239 10845015 9947183
40743 9947183 10712297 12524919 13373522 12820761 12445437 13202624 13902173 12958058 10598440
40734 10598440 8523212 7939153 8674912 9950974 11286372 12512983 13357299 13421205 12623917
40725 12623917 11432458 10413579 9614124 8684711 7642410 7075065 7307465 7714540 7321240
40716 7321240 5966644 4471394 3671044 3635066 3909894 4253364 4922659 6227368 7862340
40707 7862340 8891146 8687976 7851556 7750309 9023987 10973239 12635597 13912463 15198739
40698 15198739 16426625 17175499 17446200 17582806 17507484 16715054 15055552 12922059 10624545
40689 10624545 8213330 6072969 5057384 5649656 7292131 8780923 9144552 8185053
40681 8185053 6576737 5464313 5480066 6031881 5981768 5075522 4172455 3995168 4353256
40672 4353256 4881595 5817055 7465101 9340365 10404541 9956115 8031837 5366847 3258561
40663 3258561 2834440 3870854 4869299 4956056 5117523 6655048 8977874 10261737 10159755
40654 10159755 10341868 11924891 13783154 14344962 13981789 14284043 15517157 16292764 15861060
40645 15861060 15415159 16484434 18861958 20945680 21777384 21989594 22773677 24541738 26848766
40636 26848766 29281655 32075614 35858399 40957190 47105585 53917329 61511531 70249952
40628 70249952 79572924 87401457 91281243 90273701 85463715 78682219 71233368 63900907
40620 63900907 57376166 52016043 47542317 43617196 40538210 38834424 38431136 38920539
40612 38920539 40522765 43933617 49127276 55159598 61429484 68259677 75642181 82058600
40604 82058600 85285286 84103758 78826223 70697087 61449223 52946295 46231198 40840387
40596 40840387 35661869 30448423 25954933 22758113 20695935 19478178 19048452 19112615
40588 19112615 18991535 18283774 17166124 15780806 13919743 11727941 10159354 10062563 11010286
40579 11010286 11603028 10938011 9406744 8020228 7246939 6635909 5493029 3858732 2691832
40570 2691832 2870974 4071524 5041692 5138985 5136754 6124859 7974769 9496934 10026230
40561 10026230 10207115 10998201 12396301 13559545 13948109 13882905 13981613 14430220 14966194
40552 14966194 15301417 15297601 14858397 13951353 12780048 11758258 11264855 11498630 12471791
40543 12471791 13929867 15332819 16184086 16395696 16144222 15520697 14691360 14200423 14427848
40534 14427848 14723443 13907414 11932314 10233783 9943055 10555384 11027556 11346510 12038776
40525 12038776 12843538 13114133 13080642 13383573 13662692 13106360 12311332 12911519 15061409
40516 15061409 16966668 17552713 17992098 19614631 21796250 23312820 24678590 27523196
40508 27523196 32248663 37801462 43399317 48993351 54062629 57309576 57863819 55928846
40500 55928846 52156928 47266728 42383554 38822293 37116265 36742463 36957652 37455354
40492 37455354 38193121 39134558 40300018 41721875 43368566 45386828 48155179 51679746
40484 51679746 55273940 58332494 60942405 63002126 63258801 60329291 54546727 47803473
40476 47803473 41628871 36359372 32034202 28853698 26543531 24392727 22296756 20841489
40468 20841489 20053008 19021257 17163609 15012009 13384051 12595901 12759414 13834951
40460 13834951 14932051 14596287 12487218 9978404 8481997 7959682 7675303 7528549 7826725
40451 7826725 8423888 8905057 9134355 9031280 8392897 7436422 6746594 6154159 4674453
40442 4674453 2337720 969882 2000983 4416246 6177483 6849927 7331549 7703154 7182821
40433 7182821 5946819 5162958 5116008 4960491 4574330 5007660 6576246 8022631 8348840
40424 8348840 8271710 9030102 10723455 12611313 14185618 15164596 15214517 14514260 13988310
40415 13988310 14241849 14822319 15174613 15637976 16683451 17796910 18128427 17861637 17899992
40406 17899992 18352524 18334417 17366055 16143325 15669497 16194537 17223155 18103917 18402123
40397 18402123 18075391 17521995 17218478 17131811 16657559 15281476 13214392 11295182 10304995
40388 10304995 10381938 11060499 11840376 12609620 13417890 14035585 14116630 13794124 13670018 14023054
40378 14023054 14384993 14158853 13371553 12533214 11967777 11554333 10990157 10127461 9190108
40369 9190108 8713941 8983607 9459578 9191961 7981190 6650829 5918498 5573669 5194128
40360 5194128 5038274 5509947 6215560 6450310 6374373 6749887 7561178 7906016 7465718 7116796
40350 7116796 7593982 8318526 8222937 7244733 6319229 6160357 6653684 7309933 7761557 7816439
40340 7816439 7462541 6910352 6397916 5968086 5598060 5372520 5256223 4900041 4079051
40331 4079051 3210355 2992842 3573224 4517460 5575693 6906017 8412532 9448056 9499452
40322 9499452 8757780 7763121 6981899 7032292 8626008 11577169 14361473 15576221 15646148
40313 15646148 16191974 17800794 19414459 20019451 19846606 19478857 18790234 17491267 15976032
40304 15976032 14828683 14008860 13229838 12634963 12385220 12106690 11538303 11181159 11393897
40295 11393897 11422826 10485592 9327940 9287525 10110294 10377784 10119362 11051273 13604730
40286 13604730 15617874 15246787 13737805 13734530 15761102 18011985 19105817 19448729 19986099
40277 19986099 20969011 22044940 22482841 21275471 18088259 14214680 11577740 10620715
40269 10620715 10133276 9256524 8478820 8260250 7904941 6677369 5212140 4781794 5530244
40260 5530244 6308988 6135759 5120550 3978991 3223723 2935031 2905276 2851546 2690483
40251 2690483 2628992 2804197 2899105 2408679 1348074 441029 422694 1261934 2257792 2887757
40241 2887757 3341635 4075229 5015143 5535180 5248280 4495228 3892312 3675209 3705040 3847561
40231 3847561 4023827 4067593 3883073 3667589 3696436 3937144 4067446 3771166 2903620 1632573
40221 1632573 591774 503345 1337876 2279284 2913093 3886336 5746237 7696946 8482284
40212 8482284 8156536 7851692 7913614 7507748 6217279 4773863 3774166 2818874 1538103
40203 1538103 451149 77137 99470 210645 903753 2458845 3927702 4275584 3943703
40194 3943703 4039279 4425784 4043239 2958703 2529301 3219643 3703559 2877188 1658569
40185 1658569 1771089 3366202 4867365 4939703 3756850 2310042 1191357 345936 -396295
40176 -396295 -952286 -1125111 -903320 -495123 -55602 530290 1486692 2773893 3966719
40167 3966719 4560034 4425603 3999741 3939232 4426289 4867433 4566177 3702857 3222731 3577634
40157 3577634 4070912 3860587 3191689 3009667 3548164 3978703 3512877 2307330 1129779
40148 1129779 528259 473240 539479 376075 196099 664658 1966652 3214926 3364284
40139 3364284 2602589 2117291 2437948 2838237 2665070 2399263 2764437 3433407 3486472 2865424
40129 2865424 2502351 2981494 3802623 4177489 3968719 3503570 2930561 2282259 1930926
40120 1930926 2315731 3088401 3132976 1904208 360844 -116034 421051 599808 -110710
40111 -110710 -374389 1140315 3664402 5246455 5405231 5604458 7026053 9070106 10477629
40102 10477629 10982498 11295491 12158337 13891786 16206388 17986997 17958354 16118397 13881758
40093 13881758 12290418 10848563 8812950 6791140 5986783 6378668 6783161 6484799 5804136
40084 5804136 5247638 5104049 5752665 7304279 8891800 9310707 8506112 7555337 7111447
40075 7111447 6825474 6424632 6255020 6381577 6183505 5403686 4733768 4743220 4981323 4787027
40065 4787027 4310664 4031736 3849134 3406300 2866156 2598221 2416640 1865166 1062673
40056 1062673 592100 632031 758574 590565 197657 -142166 -300898 -416563 -752600 -1315177
40046 -1315177 -1646644 -1329895 -608640 63103 1013033 2998321 5689911 7568986 7832325
40037 7832325 7380619 7253559 7168516 6552677 5970830 6251834 7011291 7450781 7966859 9400525
40027 9400525 11145255 11701592 10934878 10091764 9583559 8499652 6552858 4770098 3749275
40018 3749275 2816917 1550175 670620 719959 1227246 1919189 3347435 5451703 6891608
40009 6891608 6840025 6185805 5927899 5695070 5021041 4666600 5153654 5260848 3783693
40000 3783693 1771211 1034307 1219353 545460 -1007934 -1601414 -666276 114843 -552074
39991 -552074 -1893012 -2707149 -2952546 -2817173 -1723518 603094 3090543 4362208 4168850
39982 4168850 3154667 1961464 1132443 1073371 1456643 1370995 605535 34443 219225
39973 219225 496231 90435 -725744 -1343017 -1863339 -2526042 -2768094 -1913434 -420868
39964 -420868 526432 503107 131186 32127 202282 393199 541805 773026 1264283 1996669
39954 1996669 2488902 2149634 1157799 537281 973610 1980342 2643053 2748593 2714073
39945 2714073 2814553 3010849 3249927 3483585 3615869 3706230 3895707 3981838 3624455 3150952
39935 3150952 3351301 4083278 3999552 2333824 129253 -1113554 -1231866 -934270 -347037
39926 -347037 752735 1794102 1864096 1153545 796895 1316998 2242077 3202972 4354378
39917 4354378 5595847 6301883 6085414 5254579 4463117 4333071 5137577 6280329 6516819
39908 6516819 5416014 4079851 3558107 3263306 2177484 898645 773141 1407290 1078594
39899 1078594 -304499 -770816 619791 2222403 2302984 1389112 944946 1146757 1353695
39890 1353695 1655817 2462159 3289193 3329862 2742327 2233698 1850279 1275618 852424 1136798
39880 1136798 1740175 1741796 1112807 736015 1080170 1733577 2216123 2466102 2524861 2409859
39870 2409859 2294640 2295199 2211998 1947279 1846630 2020001 1722105 246485 -1781830 -2879587
39860 -2879587 -2434067 -1215252 -203516 345751 629513 789701 823427 521053 -482253
39851 -482253 -2094953 -3336462 -3161162 -1712291 -175620 599652 770643 863867 1138126
39842 1138126 1639422 2288108 2804697 3014805 3199488 3648362 4018248 3802556 3301128
39833 3301128 3279868 3675240 3608968 2879209 2379592 2538968 2347663 805852 -1340625
39824 -1340625 -2376133 -1889912 -1276955 -1847079 -3261562 -4277008 -4495016 -4693153 -5475578
39815 -5475578 -6227579 -5819237 -4082221 -2057037 -745666 -130865 365146 976478 1586096
39806 1586096 2214588 2918159 3388210 3232187 2594636 2001970 1639779 1271871 838396
39797 838396 610523 692879 823236 754793 506392 256386 311944 1015750 2209588 2973906
39787 2973906 2545496 1437955 962010 1596191 2545587 3026524 3204404 3551080 3987738
39778 3987738 4150483 4012004 3763906 3410092 2863951 2226561 1725094 1576835 1982145
39769 1982145 2911135 3849129 4190086 3954404 3642906 3344484 2592567 1202676 -439977
39760 -439977 -2092175 -3852217 -5339183 -5543126 -4067042 -1830007 38316 1328698
39752 1328698 2201975 2366018 1770170 1473482 2584695 4540362 5568372 4891534 3464132
39743 3464132 2376921 1545785 438645 -701495 -1111350 -711961 -438496 -1215526 -2778841
39734 -2778841 -3696216 -2756339 -409506 1429671 1254588 -550546 -2329610 -2957512 -2609470
39725 -2609470 -1964194 -1251611 -216227 1326872 3040787 4061931 3583748 1704470 -433118
39716 -433118 -1649854 -1805868 -1656435 -1836202 -2308806 -2649637 -2501106 -1842192 -1087316
39707 -1087316 -747930 -741288 -353017 745071 1845548 2132209 1880583 1996213 2619161
39698 2619161 3052022 2956664 2660069 2204541 1126966 -460516 -1488135 -1205187 -196875
39689 -196875 413491 242804 -365599 -1087504 -1750162 -2130337 -2216849 -2383248 -2805675 -3046613
39679 -3046613 -2728748 -2231933 -2081256 -1994311 -1328746 -255851 442162 746012 1536024
39670 1536024 2972951 3679826 2374532 -137768 -1531739 -572744 1505916 2482755 1534868
39661 1534868 -235763 -1365017 -1540860 -1450999 -1608085 -1814445 -1725673 -1461801 -1372147 -1378181
39651 -1378181 -874149 615291 2744332 4395420 4573174 3433373 2351809 2638568 4068760
39642 4068760 5002119 4175264 2071781 198466 -673294 -986378 -1263045 -1235716 -400772
39633 -400772 1077987 2468870 3214904 3195281 2472901 1257288 63968 -546089 -495891
39624 -495891 -167433 194637 710801 1414140 1991299 2238796 2422508 2783387 2930876 2264288
39614 2264288 987444 172703 562749 1623376 2105894 1450099 385095 106718 966523
39605 966523 2062200 2216464 1371920 772703 1505354 3071963 3918088 3370130 2403433
39596 2403433 2188836 2508530 2270756 1226922 314735 259472 621986 567590 -9159 -605718
39586 -605718 -956124 -1178323 -1245568 -887681 -87398 757313 1308266 1584514 1622098 1180466
39576 1180466 98133 -1256091 -2221329 -2468573 -2146376 -1537948 -922970 -693825 -1116801
39567 -1116801 -1859700 -2223479 -2083297 -2141062 -2854506 -3543895 -3173965 -1797955 -523205
39558 -523205 -45763 84909 550952 1264065 1697715 1796506 2053514 2825438 3925630 4857891
39548 4857891 5254560 5117472 4702481 4112202 3112977 1630062 315646 114423 1142693
39539 1142693 2463475 3144273 3064610 2508717 1603434 578340 -1772 127871 446463
39530 446463 362840 63436 57053 224988 27615 -573748 -1112266 -1360058 -1350032 -814383
39520 -814383 523533 2057041 2595181 1854342 944457 1006197 1944911 2908183 3511293
39511 3511293 4086890 4990401 6093741 6906283 7001064 6397600 5580568 5021419 4732449
39502 4732449 4467976 4178426 3906807 3419590 2466279 1348503 686437 608527 685304 631584
39492 631584 484209 136212 -554295 -1132405 -877721 4581 396079 -148357 -687117 -308211
39482 -308211 560876 990003 991414 1219452 1700901 1861214 1638581 1646287 2150652 2615922
39472 2615922 2478748 1896656 1511136 1721739 2314976 2725794 2713138 2764666 3537734 4832065
39462 4832065 5573893 5050104 3694327 2370694 1427256 862339 826351 1342767 1989986
39453 1989986 2484488 3148978 4164241 4846284 4453959 3292597 2158400 1100698 -254660
39444 -254660 -1494130 -1737912 -1072544 -440929 -54758 804993 2168966 2907379 2439300
39435 2439300 1716089 1718791 1975489 1491317 357441 -565941 -985979 -1171874 -996413 -14110
39425 -14110 1597256 2992464 3565032 3338538 2609243 1779566 1335243 1319273 990990 -280172
39415 -280172 -1889627 -2527344 -1827266 -731633 -147987 -36567 -19915 -91897 -337951 -618019
39405 -618019 -957310 -1647895 -2478234 -2449250 -902143 1474483 3381448 4282401 4388599
39396 4388599 3709284 2125596 349964 -262512 722636 2131017 2460822 1331462 -626607
39387 -626607 -2625917 -3919701 -3784089 -2174278 -187952 875126 872603 659183 714153
39378 714153 678648 283016 -98008 -142615 -182326 -664714 -1478617 -2228448 -2775070 -3073465
39368 -3073465 -2857828 -2022449 -1060838 -569475 -447114 -117731 516938 912061 752123
39359 752123 471075 643372 1201438 1574261 1434154 1017504 739978 715795 710064 411659
39349 411659 -364505 -1642341 -3230342 -4673364 -5503047 -5681025 -5568294 -5277226 -4400039
39340 -4400039 -2784226 -1251670 -871478 -1599402 -2346897 -2438895 -2237847 -2182788 -2112659 -1943652
39330 -1943652 -2124019 -2756724 -3029518 -2339069 -1385916 -1247368 -1817636 -2124639 -1858023
39321 -1858023 -1569902 -1552072 -1545132 -1519124 -1754971 -2103687 -2120560 -2040451 -2641971 -3907617
39311 -3907617 -4748755 -4402513 -3269636 -2031105 -822822 215597 418951 -632136 -2319400
39302 -2319400 -3598911 -4057719 -3894190 -3238019 -2011835 -254533 1761040 3539488 4386406
39293 4386406 3868099 2443610 1148568 438346 -110347 -762081 -1041509 -598358 98479
39284 98479 529712 923009 1545184 1747504 626629 -1570687 -3459639 -3899464 -2911377
39275 -2911377 -1429741 -596104 -1019334 -2207489 -2934144 -2583119 -1819145 -1517229 -1525532
39266 -1525532 -1135525 -330264 268420 437499 487701 484548 163610 -376984 -664852 -621176
39256 -621176 -670122 -956585 -1035795 -498885 511343 1443270 1657162 824895 -449051 -687427
39246 -687427 955155 3305154 4148850 2730457 522546 -625016 -317621 586435 1132808
39237 1132808 797531 -412053 -1825395 -2539931 -2377663 -1971303 -1665726 -1028725 101960
39228 101960 842671 334677 -853829 -1259285 -322094 1051193 1690964 1311807 415901
39219 415901 -372856 -679040 -486460 -149621 -136203 -628035 -1457107 -2391595 -3259861 -3767515
39209 -3767515 -3486437 -2282458 -696106 351878 387788 -169011 -565956 -667401 -1021636
39200 -1021636 -1874516 -2549157 -2243395 -1200688 -518130 -802200 -1535323 -1864303 -1532678
39191 -1532678 -874402 -331660 -188401 -390709 -441501 111203 884353 860019 -300203 -1646958
39181 -1646958 -2115298 -1849853 -1752652 -2080200 -2293927 -2178798 -2199721 -2500517 -2342647 -1117672
39171 -1117672 550079 1406025 1133724 669117 849155 1357165 1376186 797300 148774
39162 148774 -401968 -1104219 -1597685 -845475 1265967 3052279 2791741 990576 -225532
39153 -225532 122395 925791 1004402 736460 984032 1516439 1584520 1347329 1538091 2089379
39143 2089379 2271503 2077719 2326634 3261141 4082995 4190748 3977472 3961352 3907745 3391299
39133 3391299 2637248 2166369 1980721 1684227 1173360 712753 484650 451244 503806 443570
39123 443570 53517 -497813 -639816 -176551 281946 184520 -29051 432208 1405073 1997777
39113 1997777 2052115 2343993 3080709 3256925 2138966 549647 -177301 53892 322818
39104 322818 256879 309408 584823 486619 -181595 -623137 -28638 1358980 2502194 2510727
39094 2510727 1190289 -802517 -2153140 -1868373 -430325 555309 199663 -774861 -1363147
39085 -1363147 -1719410 -2506169 -3414063 -3398903 -2243280 -935643 -406373 -629274 -1099685
39076 -1099685 -1519807 -1781188 -1819939 -1773524 -1912393 -2217757 -2328409 -2042988 -1624682 -1535448
39066 -1535448 -2057108 -3101548 -4148474 -4533044 -4136053 -3600546 -3471609 -3396605 -2739160
39057 -2739160 -1731506 -1281036 -1735788 -2595518 -3392549 -4034122 -4261587 -3722280 -2802025
39048 -2802025 -2482421 -3017567 -3552550 -3395558 -2827165 -2251205 -1481025 -483038 56351
39039 56351 -258856 -616529 44214 1619725 3143166 4028778 4239728 3686107 2375146
39030 2375146 896930 -101905 -787683 -1754583 -2955108 -3764539 -3970503 -3934529 -3812568
39021 -3812568 -3321135 -2321775 -1087240 8891 649414 629596 265269 447360 1630143
39012 1630143 3009549 3412647 2770041 1950733 1401576 867482 299590 9700 -115429
39003 -115429 -573368 -1281290 -1533172 -1029104 -75075 1245848 2997611 4362083 4019728
38994 4019728 2091012 506770 703101 1941723 2660742 2450380 1744284 576008 -1036107
38985 -1036107 -2134399 -1712894 -343098 364619 -113889 -757195 -676409 -112601 425214
38976 425214 908297 1258617 1020159 140611 -621453 -649717 -273839 -87017 -15537 279870
38966 279870 542927 293264 -139046 187724 1493297 2878100 3543211 3776668 4236920
38957 4236920 4725212 4408819 3189932 2112609 2084409 2686361 2770416 2011717 1252773
38948 1252773 1216683 1442398 912012 -536536 -1912218 -2181066 -1276361 118958 1444036
38939 1444036 2620728 3730053 4694171 5327891 5502903 5235450 4774025 4541524 4692500
38930 4692500 4715143 3871521 2190020 597113 -220045 -621770 -1224997 -1771239 -1542100
38921 -1542100 -654427 -30071 -53452 -160835 50290 216716 62570 -46988 79067 -49486
38911 -49486 -633794 -930068 -392521 269038 156593 -326494 -179269 508653 842793 773021
38901 773021 1061047 1660050 1546963 404172 -811687 -1350718 -1556654 -1841881 -1913319
38892 -1913319 -1606773 -1477259 -1870078 -2247243 -2097909 -1744070 -1604917 -1445145 -1065394
38883 -1065394 -1007085 -1769244 -2892720 -3547987 -3511988 -2937939 -1799200 -298113 799160
38874 799160 1070745 1164362 1824252 2732229 3133737 3024536 2783370 2236666 1210206 477139
38864 477139 832601 1569555 1340474 417248 478262 1879697 2760915 1637421 -412056
38855 -412056 -1207578 -239107 1163255 1896881 2104722 2199802 2011616 1371789 844656 1140613
38845 1140613 1979331 2242064 1467837 603496 746779 1624770 2195090 2516340 3763588
38836 3763588 6079275 7733148 7327065 5843248 5327911 6208948 7187675 7350621 7016604
38827 7016604 6625625 6121812 5585090 5360705 5349336 5092381 4665448 4555879 4600842 4072151
38817 4072151 2950497 2105992 2056822 2523391 3259360 4190461 4696218 4138462 3284990
38808 3284990 3607575 4736490 4424714 1926857 -395343 -220384 1532226 2379082 1929384
38799 1929384 1832684 2804778 3847292 4255883 4430257 4478084 3753261 2276520 1187311
38790 1187311 1147617 1402817 1039992 249280 -289838 -520563 -863388 -1454661 -2021598 -2181772
38780 -2181772 -1627862 -417817 779704 1208741 904312 533779 326585 -164707 -1113293
38771 -1113293 -1987845 -2360923 -2462811 -2599019 -2665004 -2583603 -2552067 -2459336 -1781054 -573940
38761 -573940 180093 -29531 -143991 1198040 3660402 5490890 5683082 4874380 4035222
38752 4035222 3303293 2528369 2072287 2281441 2632071 2257142 1256936 736161 1307712
38743 1307712 2137592 1959003 739948 -270885 -202749 331140 190936 -601076 -802647
38734 -802647 342005 1932447 2390396 1359172 125289 90567 1214281 2221454 2136775
38725 2136775 1246438 532524 525226 960853 1336571 1397352 1085926 421055 -379214 -918736
38715 -918736 -1011339 -914826 -999495 -1288182 -1448245 -1124198 -223797 912811 1567181 1200848
38705 1200848 143177 -616669 -569289 -261995 -449235 -1108218 -1752211 -2269121 -2767494
38696 -2767494 -2906745 -2231957 -1109871 -485017 -580942 -629078 -141545 280999 -174678 -1420637
38686 -1420637 -2684387 -3408309 -3487372 -2947144 -1868457 -533535 623748 1178708 870543
38677 870543 -96659 -956502 -1092325 -915402 -1444047 -2844996 -4053103 -4122550 -3255853
38668 -3255853 -2097005 -792483 578911 1341453 925384 -120270 -691984 -530131 -306729
38659 -306729 -492455 -894931 -1225155 -1394295 -1296423 -975611 -941252 -1615439 -2532387 -2844879
38649 -2844879 -2589624 -2598013 -3083464 -3249752 -2569322 -1567906 -914289 -499442 69877 721218
38639 721218 1220751 1685656 2236185 2599843 2603602 2628160 2999121 3292242 2833771 1620751
38629 1620751 231819 -863128 -1361420 -872520 630915 2250642 2832353 2324347 1917108
38620 1917108 2672418 4384713 5858805 5979381 4529528 2359379 796768 541092 1056362
38611 1056362 1259735 716411 -109551 -574840 -371840 524744 1847936 2961979 3355860
38602 3355860 3344097 3804112 5066252 6486331 7254364 7194645 6612067 5818130 5075868
38593 5075868 4623902 4430753 4153344 3536189 2642084 1650950 814161 646284 1554905
38584 1554905 3006848 3691842 3029119 2011263 1907551 2515583 2516039 1431285 343238
38575 343238 423072 1430450 2120616 1741013 642001 -418902 -1087406 -1419845 -1404634
38566 -1404634 -801665 491730 2094614 3336149 3771727 3401476 2492918 1467080 929112
38557 929112 1359630 2493838 3301475 2984897 1913174 1217284 1431225 1820970 1215694
38548 1215694 -591046 -2405905 -2698662 -1146208 1010316 2314090 2625304 2947309 3866123
38539 3866123 4806413 4986468 4402022 3422590 2055234 309735 -1150096 -1564464 -1111512
38530 -1111512 -620713 -374780 6084 557409 798025 723517 991684 1678593 1729810 343789
38520 343789 -1729164 -3029724 -3079698 -2452915 -1538479 -212849 1307147 2279919 2433745
38511 2433745 2386318 2590855 2481618 1385972 -42641 -205468 1429287 3366498 3627286
38502 3627286 1919284 -245207 -1409049 -1511677 -1301806 -1103469 -661429 143924 1009686
38493 1009686 1593845 1787537 1619731 1218053 849908 711748 708561 700796 837057 1255492
38483 1255492 1561889 1129647 -7349 -1032346 -1258467 -751007 102400 1179593 2494496
38474 2494496 3822772 4789134 5168701 4933169 4206718 3324723 2721818 2623321 3007081
38465 3007081 3855886 5137202 6536747 7640661 8475515 9444102 10644146 11762891 12766077
38456 12766077 14031293 15480738 16258381 15814669 14780747 14115384 13764936 12873134 11117113
38447 11117113 9167455 7868523 7486536 7736404 8099955 8136460 7852850 7735728 8152415
38438 8152415 8898452 9647523 10547600 11848157 13114646 13428270 12436371 10792019 9477466
38429 9477466 8927619 8730663 7958923 6032033 3601469 2282981 2989933 4726146 5589974
38420 5589974 4838077 3374045 2326338 1885908 1671587 1565688 1795788 2476592 3320889
38411 3320889 3749293 3383044 2600798 2359745 3140281 4349018 5167722 5603646 6090160
38402 6090160 6441534 6090951 5196046 4534385 4239575 3557759 2056171 265549 -1067976
38393 -1067976 -1566730 -916295 1018993 3393768 4714608 4648321 4682322 6192120 8473675
38384 8473675 9534881 8409282 5895379 3379512 1816834 1696512 3022847 5013498
38376 5013498 6383122 6350790 5287779 4278205 4078107 4431941 4325355 2994020 731506
38367 731506 -1377047 -2426394 -2206420 -984304 726751 2235008 3062473 3351408 3447871
38358 3447871 3192480 2282030 1232485 1055835 1853728 2705518 3166060 3735969 4445102
38349 4445102 4329373 3179461 2525060 3578167 5168313 5261396 3896928 2935592 3152525
38340 3152525 3324353 2408448 1073847 506706 890046 1725057 2726907 3688851 4120882
38331 4120882 3718008 2839584 2096972 1770126 1849427 2213435 2532483 2476236 2295598 2734594
38321 2734594 4046942 5528050 6388406 6738370 7306906 8423260 9685846 10582069 11145436
38312 11145436 11926048 13402196 15524623 17957836 20701293 24111219 28182849 32290466
38304 32290466 35979508 39487404 42896901 45280161 45568592 44027274 41942005 39975868
38296 39975868 37857669 35695157 34374141 34232407 34389333 34050630 33682609 34190331 35582149
38287 35582149 37203495 38762645 40239940 41025776 40029150 36803086 32107586 27267059
38279 27267059 23251194 20358819 18443443 17215998 16315691 15231241 13532942 11486650
38271 11486650 10129642 10171148 10954103 11156467 10441111 9593681 8979341 7909528 5979249
38262 5979249 4062471 3217500 3279142 3333651 3066937 2804862 2601982 2185158 1656687 1484339
38252 1484339 1818404 2403949 3076321 3774413 4188368 4036164 3673712 3824066 4624760
38243 4624760 5446612 5734783 5572155 5315937 5108927 4932479 4855604 5043312 5597435 6396858
38233 6396858 7083057 7405901 7654366 8386775 9558698 10413261 10593416 10795628 11727010
38224 11727010 12964059 13707119 14254095 15601516 17686838 19269825 19836900 20429738 21919782
38215 21919782 23410660 23294462 21352506 18880105 17009780 15792368 14846477 14035707
38207 14035707 13290200 12421348 11453328 10711580 10306387 9921141 9408110 9171305 9488017
38198 9488017 9770704 9146071 7680043 6351219 5713952 5301724 4665010 4262827 4690319
38189 4690319 5577927 6093172 6209279 6555694 7167218 7416135 7269259 7537689 8531953
38180 8531953 9490995 9919706 10564467 12243760 14399443 15729309 15866056 15651284 16060223
38171 16060223 17508863 19836868 22290432 23910796 24600612 25299223 26361686 26474559
38163 26474559 24314605 20703351 17694890 15890592 14320470 12881857 12865438 14440023
38155 14440023 15483584 14152491 11314864 9099099 8016516 6991071 5592381 4652217
38147 4652217 4787660 5637386 6671844 7679591 8276426 7931398 6835905 5966625 5886053
38138 5886053 6088361 5902029 5459553 5280465 5322382 5036343 4208445 3251635 2650394 2467000
38128 2467000 2468065 2487272 2560511 2866793 3603810 4727665 5687300 5647484 4305208 2443911
38118 2443911 1333749 1473701 2165668 2386194 1764032 634959 -382450 -612858 328149
38109 328149 1918494 2890652 2584102 1749940 1375701 1216865 472707 -465798 -304756
38100 -304756 1053038 2115636 1984192 1610345 2061989 2676820 2101399 443185 -820141
38091 -820141 -715913 456198 1925990 3014409 3109497 2154998 1200510 1514596 2951158
38082 2951158 3954484 3410830 1872410 743944 813845 1800842 2858098 3263365 2933835
38073 2933835 2434156 2286609 2325271 2018772 1298185 652971 475845 691583 929972 718546
38063 718546 -247117 -1547753 -2051192 -1109084 503395 1528656 1798220 1991523 2158140
38054 2158140 1741616 1074809 1395959 2886694 4012564 3632203 2661486 2600998 3275545
38045 3275545 3291474 2250758 1201673 942880 1002620 568173 -356440 -1114087 -1323811
38036 -1323811 -1356191 -1941533 -3271492 -4524390 -4681712 -3913521 -3447788 -3636306 -3037392
38027 -3037392 -438127 2812530 3920631 2117621 -313931 -886384 372781 1706675
38019 1706675 2102601 1891885 1444883 573180 -623764 -1301788 -790716 530321 1777349
38010 1777349 2673734 3566047 4467180 4772185 4137322 3011915 1819960 183597 -2229613
38001 -2229613 -4472727 -5096957 -4208578 -3485155 -3717330 -3663858 -2225593 -469705 -65719
37992 -65719 -659667 -612264 161751 150540 -955507 -1579876 -963809 -508791 -1302251 -2085861
37982 -2085861 -1269741 370697 855663 8798 -598833 -273184 142454 211992 713107
37973 713107 2105541 3660936 4675844 5374184 6038093 6261412 5658277 4471861 3000866
37964 3000866 1275593 -257735 -720690 -88242 474210 312821 357714 1505769 2821140
37955 2821140 2693461 1287255 366607 735492 1234254 628141 -612757 -1024119 41311
37946 41311 1863776 3219681 3417203 2785820 2414479 3142399 4616877 5586717 5216525
37937 5216525 3812210 2206431 874363 -141239 -854535 -1275567 -1553005 -1868727 -2201979
37928 -2201979 -2322459 -2012387 -1321618 -672135 -564033 -965584 -1167173 -602898 304969
37919 304969 609699 138643 -250429 105869 760178 866592 427019 319448 1191526 2715244
37909 2715244 3976281 4383349 4124989 3806513 3726650 3660507 3402640 3187976 3205501 2976079
37899 2976079 1864278 172884 -1002911 -1189685 -1080070 -1339688 -1629190 -1392908 -959757
37890 -959757 -1034249 -1486986 -1537020 -979063 -382931 -76434 244781 717064 865416 323093
37880 323093 -548877 -1176997 -1553532 -2112259 -3028879 -3932353 -4197179 -3407757 -1765274
37871 -1765274 -167650 416320 -89690 -725282 -537292 414829 1316106 1627947 1504576
37862 1504576 1286162 1009790 562614 44500 -254101 -174920 117329 225632 -221116 -1247459
37852 -1247459 -2341658 -2740299 -2164996 -1240242 -882068 -1234148 -1571858 -1398365 -1159887
37843 -1159887 -1480477 -2132552 -2428157 -2344216 -2387726 -2415081 -1664312 -271791 365356 -491080
37833 -491080 -1540213 -1069435 599499 1544526 947183 98168 476857 1884590 2960896
37824 2960896 2812324 1656097 392222 -72402 468999 1194932 1075498 178120 -473124
37815 -473124 -544169 -1007416 -2518977 -3995979 -3800955 -1954358 -174191 182664 -682428
37806 -682428 -1887527 -2963404 -3665432 -3501122 -2272734 -870002 -713642 -2073256 -3363262
37797 -3363262 -2713243 -301181 1455005 515572 -2317269 -4281059 -3918883 -2543207 -2130735
37788 -2130735 -2744016 -2927351 -2058280 -1111014 -1065780 -1560553 -1527963 -601327 505488 740992
37778 740992 -331328 -2040953 -3002194 -2361027 -756607 311874 158753 -460336 -506209
37769 -506209 93469 701951 1032663 1358952 1774519 1816854 1076320 -84910 -778883 -633771
37759 -633771 -335468 -806367 -1919919 -2567497 -2256033 -2035263 -3127679 -4972458 -5611975
37750 -5611975 -4123745 -1731671 -107736 586938 1300647 2370983 3092295 2777221 1512650
37741 1512650 -85896 -1315167 -1659938 -1150111 -387973 181253 777994 1549898 1763247
37732 1763247 706624 -782161 -945247 491217 1811068 1797930 1433900 2022336 2753768
37723 2753768 1859758 -309515 -1341041 -167721 1383327 1307353 202888 18994 1049728
37714 1049728 1836208 1687488 1615643 2511919 3795790 4511857 4701576 4814614 4485297
37705 4485297 2953545 475674 -1621288 -2441613 -2472953 -2820381 -3878292 -4983276 -5157177
37696 -5157177 -4010791 -2016792 -12931 1535042 2721090 3687774 4212703 4029860 3354823
37687 3354823 2733025 2396807 2061154 1369550 326331 -683156 -1100896 -546441 717769
37678 717769 1755001 1797499 1139206 795316 1258285 2060305 2611880 2820355 2592169 1434092
37668 1434092 -777016 -3041338 -4026898 -3497702 -2320082 -1174793 -33884 1023505
37660 1023505 1357614 620890 -483824 -868571 -244910 749070 1386744 1472729 1339373
37651 1339373 1569158 2539649 3932762 4882681 4873501 4198956 3250431 1883298 140130
37642 140130 -878951 46162 2439592 4292657 4352025 3366202 2681298 2557416 2550320 2690144
37632 2690144 3264486 3933863 4106760 3943350 4014411 4136374 3599226 2569903 2166032
37623 2166032 2810480 3452017 2925529 1389131 -79856 -734467 -548194 73284 443495
37614 443495 -70130 -1296045 -2149537 -1733621 -303695 1158505 1946025 1899662 1197049
37605 1197049 323414 -210495 -595632 -1688112 -3733154 -5667466 -6333194 -5858063 -5097471
37596 -5097471 -4281032 -3180259 -2150302 -1802963 -1807254 -1194782 121540 1239058 1742665
37587 1742665 2148964 2706465 2959014 2853465 3052549 3553526 3143203 1073198 -1599410
37578 -1599410 -3209639 -3335569 -2693308 -1910562 -1278031 -1094170 -1301733 -1220606 -487786
37569 -487786 195531 99044 -287313 -60634 476763 204998 -968417 -1818135 -1439112 -224028
37559 -224028 886081 1288257 829262 -107589 -572270 61134 1132484 1448973 950017
37550 950017 632237 821825 737425 50018 -364747 170666 1010775 1185274 716030 237655
37540 237655 -13070 -150603 -155957 -48639 -61050 -202013 -213427 -300620 -1127159 -2636331
37530 -2636331 -3749896 -3794644 -3298092 -2748278 -1689584 40627 1351849 1447788 1326723
37521 1326723 2241609 3498778 3496932 2344867 1563748 1521856 1162998 275403 14886 834374
37511 834374 1747597 2143527 2578663 3204370 3212199 2588969 2570657 3327128 3041814 702436
37501 702436 -1842254 -2327466 -1230236 -596658 -790393 -526010 484491 1091001 812605
37492 812605 507559 780981 1271222 1695098 2234366 2736881 2800611 2726285 3105124 3423400
37482 3423400 2484863 390839 -1319238 -1775269 -1615255 -1392713 -671048 691515 1775220
37473 1775220 1919590 1624136 1363144 658429 -807821 -2202258 -2563983 -1946035 -820534
37464 -820534 632466 1892498 1956441 829305 -7712 234999 229730 -1299395 -3155185
37455 -3155185 -3273714 -1933448 -1258665 -1875679 -2208988 -1207736 243361 1083949 1447059
37446 1447059 1584275 1011382 -357313 -1471711 -1481308 -812505 -89359 995490 2726630
37437 2726630 4146574 3988363 2376389 570700 -663495 -1473787 -1956356 -1831397 -1186738
37428 -1186738 -660469 -505733 -37111 1510028 3774585 5336012 5084825 3349299 1476164
37419 1476164 380382 -117957 -397707 -63190 1462056 3601990 4755490 4003905 2117424
37410 2117424 578151 47798 75361 -71204 -619979 -1157587 -1122454 -554791 -229041 -721143
37400 -721143 -1565376 -1876125 -1584902 -1296560 -1069094 -371092 628556 877609 8772 -926374
37390 -926374 -916788 -304137 13511 -215448 -962982 -2530791 -4707474 -6095007 -5583887
37381 -5583887 -4027624 -3126143 -2971083 -2177025 -420041 754514 165620 -1271117 -1863262
37372 -1863262 -1280234 -467222 -40344 211551 408112 120075 -861013 -1844269 -1829791 -683599
37362 -683599 665019 1311184 1316343 1271449 1282008 1029482 689591 885011 1520561 1627721
37352 1627721 880028 311055 715379 1236236 722565 -177261 224035 2007967 3292918
37343 3292918 2740014 1090397 -227291 -851952 -1222276 -1480087 -1391800 -840719 80651
37334 80651 1002332 1086391 -362231 -2743662 -4378125 -4326536 -3318251 -2487643 -2041947
37325 -2041947 -1741909 -1774377 -2246811 -2496195 -1899572 -930239 -466000 -414418 -23280 662286
37315 662286 699365 -354300 -1826137 -2867106 -3272084 -3175327 -2582516 -1526208 -304467
37306 -304467 654573 989034 565113 -219894 -470764 359306 1718978 2546098 2529430 2252551
37296 2252551 2176211 2163029 2074540 2114320 2314072 2297095 1928062 1722942 2188161 3039136
37286 3039136 3411612 2676493 912352 -1117967 -2315532 -1991564 -585194 628522 787012
37277 787012 140810 -628118 -1322912 -2105907 -2856753 -3183955 -2922777 -2228040 -1335184 -595194
37267 -595194 -513923 -1248825 -2185007 -2552014 -2442320 -2662402 -3495604 -4197557 -3974580 -2968937
37257 -2968937 -1905705 -1141253 -504519 155544 723269 1026367 940998 401285 -329047
37248 -329047 -546181 190417 1216023 1223482 -149934 -1685077 -1972082 -1103856 -417062
37239 -417062 -669384 -1110483 -573549 967552 2338711 2518502 1696287 915566 881920
37230 881920 1310648 1427898 920959 215835 -140459 -136669 -219120 -713571 -1498204 -2185864
37220 -2185864 -2480337 -2365233 -2026605 -1586323 -952153 -83965 637701 663192 38998 -461540
37210 -461540 -284708 164673 163107 -230674 -260253 516013 1896675 3599905 5401978 6623479
37200 6623479 6293209 4280089 1773253 211976 51172 822709 1935353 2992445 3686231
37191 3686231 3880392 3686553 3223213 2524670 1849885 1684722 2150869 2777453 3126039
37182 3126039 3223091 3135673 2738287 2314074 2652647 3843848 4638496 3949424 2474896
37173 2474896 1735331 1888000 1811552 1203377 1056426 1755676 2204951 1579373 693146 643190
37163 643190 1096400 1098675 861497 1407119 2751737 3711890 3519820 2559000 1388106 56584
37153 56584 -1304550 -2094150 -1932796 -1173971 -363285 295199 648068 392830 -377279 -952778
37143 -952778 -849957 -439957 -212086 125593 1093446 2309692 2775150 2241923 1482345
37134 1482345 1075309 719532 75081 -422094 -138095 792131 1615643 1856137 1650350
37125 1650350 1388569 1387001 1763356 2334757 2769726 2997136 3166238 3061002 2114636 395559
37115 395559 -1047957 -1479932 -1535072 -2108398 -2709129 -2143128 -617302 259082 -222874
37106 -222874 -945273 -848564 -444060 -619312 -1039556 -825413 -51148 560741 917916 1438996
37096 1438996 1997438 2014538 1427535 696767 36574 -574016 -895433 -799541 -848374 -1565172
37086 -1565172 -2387617 -2355518 -1594237 -974860 -498321 617940 2205793 2979761 2474451
37077 2474451 1750522 1561412 1117783 -454044 -2485748 -3607896 -3479389 -2773801 -2047969
37068 -2047969 -1456195 -1066067 -698384 75664 1149562 1682935 1327604 930408 1226999
37059 1226999 1630934 1368165 1079000 1910963 3410934 3815512 2483312 755461 174494
37050 174494 924396 2266787 3455181 3822403 2921935 1180564 -202175 -475443 -7042
37041 -7042 523453 1029029 1753860 2566259 2898160 2209438 493674 -1362327 -1924749 -565809
37031 -565809 1627657 3056928 3596001 4328319 5301675 5020137 2812445 341585 -380195
37022 -380195 500371 1429487 1898143 2550062 3249768 2899737 1510346 848920 2175969
37013 2175969 4401404 5421345 4551339 2712692 817097 -884278 -2083670 -2305390
37005 -2305390 -1830649 -1778000 -2663993 -3517354 -3117955 -1686283 -532595 -263295 -320392
36996 -320392 -372055 -991557 -2311049 -3029565 -1980918 -176640 164104 -1366076 -2780297
36987 -2780297 -2572229 -1698977 -1707152 -2163639 -1547607 -5019 668815 -175505 -1005678 -395752
36977 -395752 1119750 2293354 2980898 3567351 3584515 2383663 710240 101558 723648
36968 723648 1110937 271252 -1115366 -1962327 -2141734 -2006235 -1516273 -656190 -15717
36959 -15717 -55452 -244858 185277 931833 978572 190196 -325066 358981 1801741 2668057
36949 2668057 2039963 215846 -1466700 -1690804 -462424 756001 683083 -191396 -302202
36940 -302202 828424 1967694 1825697 473880 -1188340 -2530366 -3202194 -2760226 -1095004
36931 -1095004 1010784 2351487 2298664 1146352 -245731 -972285 -701860 -70406 -11399
36922 -11399 -441353 -219076 1203745 2792393 3183320 2284460 916256 -485807 -1858102
36913 -1858102 -2702661 -2441397 -1421547 -577622 -205123 -23026 -275352 -1563777 -3463537
36904 -3463537 -4501818 -3929955 -2566261 -1456698 -604680 438605 1525828 2120423 2043811
36895 2043811 1523860 917021 657732 931084 1174538 619653 -402940 -584205 495892
36886 495892 1591830 1572222 1036061 1203293 1967980 2188515 1399056 103436 -1234157
36877 -1234157 -2318666 -2464262 -1246757 304750 490549 -832665 -1967654 -1659726 -534081
36868 -534081 228614 486062 566929 74148 -1540029 -3602397 -4563765 -3787819 -2238959
36859 -2238959 -1252049 -1161616 -1270833 -721974 751734 2572800 3660671 3332166 2020336
36850 2020336 821794 168149 -699798 -2554125 -4724172 -5485566 -4120416 -2008046 -1044326
36841 -1044326 -1238929 -738746 1563700 4292022 5129820 3586460 1328411 -73801 -715574
36832 -715574 -1433946 -2276026 -2634474 -2416657 -2231349 -2462172 -2807621 -2857649 -2614040 -2228328
36822 -2228328 -1655837 -925354 -486042 -829897 -1762032 -2397778 -2056925 -1014969 -240127
36813 -240127 -450416 -1463578 -2345624 -2149298 -715297 1068806 1947295 1478739 491311
36804 491311 161879 739075 1448142 1551175 1076438 467962 15231 -121693 246047 1036765
36794 1036765 1669654 1592806 1000987 660843 973341 1496667 1513636 872777 87045 -339523
36784 -339523 -466243 -643718 -824585 -557033 154435 433404 -499445 -2196797 -3483524
36775 -3483524 -3959435 -4192928 -4373261 -3784589 -2087342 -245862 552159 314882 -94935
36766 -94935 -182130 3023 377160 715757 499694 -285855 -657323 115631 1200335 1241686
36756 1241686 347969 -248885 -302029 -809029 -2017248 -2688084 -1882710 -232652 1173422
36747 1173422 2060307 2525577 2455518 2106095 2193071 2578184 1923176 -350413 -2732485
36738 -2732485 -3427369 -2673371 -1991530 -1833065 -1474962 -844077 -811461 -1603666 -2314403 -2287775
36728 -2287775 -1875980 -1527719 -1121732 -549018 -84665 171711 466300 715108 421855
36719 421855 -432303 -1197634 -1600203 -2163613 -3108549 -3631616 -2989883 -1718764 -972819
36710 -972819 -1002070 -1069556 -731407 -416391 -582904 -885830 -569406 499970 1521308 1589249
36700 1589249 732868 -87067 -101144 399123 585255 260564 12972 217108 443405 118213
36690 118213 -618959 -1084800 -922645 -514661 -528973 -1179692 -1962499 -2153691 -1592548 -825253
36680 -825253 -366840 -57267 580262 1544778 2307419 2476130 2156369 1672191 1189825 553364
36670 553364 -650654 -2564049 -4360378 -4625064 -3007631 -995198 -245201 -581239 -634299
36661 -634299 -68760 197252 -92564 3826 816403 1209991 368855 -776129 -908534 -169753
36651 -169753 404882 520672 601487 718374 614308 385799 202192 -226039 -997282 -1349752
36641 -1349752 -661238 379873 750164 770523 1439811 2377188 2022116 15988 -2131691
36632 -2131691 -3167616 -3506555 -3910526 -4043955 -3281871 -2019934 -1131483 -695776 -247051
36623 -247051 57264 -519948 -2079425 -3613818 -3962063 -2935784 -1402700 -389846 -147245
36614 -147245 -141458 -14845 -232678 -1339142 -2809761 -3392208 -2659711 -1473362 -669933
36605 -669933 -85184 647848 1071931 476236 -863405 -1807972 -1692211 -960510 -383298
36596 -383298 -82185 412751 1278421 1830340 1089416 -962867 -2949725 -3321516 -1977979
36587 -1977979 -300531 411753 132979 -238886 83219 1192049 2478203 3049495 2503709
36578 2503709 1349337 369531 -269686 -816219 -1140807 -945425 -590056 -721388 -1077930
36569 -1077930 -758831 194696 721049 527828 560741 1111616 958927 -617286 -2350219
36560 -2350219 -2823199 -2582176 -2832484 -3046307 -1835742 305755 1220845 121843 -1407203
36551 -1407203 -1796479 -1303602 -916262 -835999 -800344 -852095 -990519 -790490 -59307 637581
36541 637581 635833 -8216 -690695 -953425 -865316 -981503 -1810096 -2974185 -3308537 -2421462
36531 -2421462 -1591992 -2059540 -2942530 -2372528 -490556 538867 -171702 -820258 289155
36522 289155 2148213 2537131 1002626 -969175 -1985328 -1743570 -592790 728165 1244137
36513 1244137 598827 -431308 -880419 -657917 -185514 366716 858177 935690 744778
36504 744778 1093469 2100970 2607563 1964683 1417416 2288202 3605354 3284293 1235400
36495 1235400 -531994 -813118 -423270 -345261 -433643 -471306 -920605 -1857670 -2477505 -2495077
36485 -2495077 -2877171 -4232086 -5452783 -5048013 -3168875 -1309190 -462074 -487031 -922386
36476 -922386 -1470333 -1798326 -1663496 -1293289 -1112250 -1088423 -788252 -84694 541522 454189
36466 454189 -530775 -1887840 -2651724 -2226580 -1110327 -513055 -1034309 -2043048 -2608626
36457 -2608626 -2615169 -2515540 -2348142 -1665354 -421849 630167 685233 -192960 -1087618 -1164877
36447 -1164877 -549694 -172437 -646214 -1481983 -1761372 -1452088 -1428179 -2028284 -2319194 -1365169
36437 -1365169 245768 905846 -96589 -1803532 -2743382 -2317512 -1001714 237682 534312
36428 534312 -317404 -1537779 -2007297 -1597330 -1423752 -2255810 -3105461 -2288694 178208
36419 178208 2272133 2432733 1406820 892145 1137480 1059533 345238 -17132 486901
36410 486901 933051 430520 -470087 -699195 -236316 174603 289099 323932 54368 -958871
36400 -958871 -2365148 -3227752 -3242356 -2908840 -2506858 -1800225 -859980 -291751 -385055 -759431
36390 -759431 -1068452 -1332600 -1337923 -471174 1427269 3607054 5169874 5848043 5825717 5347253
36380 5347253 4764511 4407931 4086789 3223279 1810611 756044 879478 1897931 2723754
36371 2723754 2589138 1776767 1412427 2364164 4006381 4472845 2824695 535536 -236756
36362 -236756 472393 728007 -178780 -719926 162283 1126067 432438 -1453758 -2715139
36353 -2715139 -2741321 -2406846 -2405219 -2682841 -3149944 -3687552 -3662903 -2533298 -769815 712026
36343 712026 1702700 2341781 2099844 381133 -2059105 -3569393 -3523420 -2743113 -2040125
36334 -2040125 -1464203 -1079019 -1286005 -1978010 -2294226 -1691757 -651021 -9028 -91571
36325 -91571 -663455 -1255437 -1454990 -1287424 -1260527 -1672869 -2164235 -2383448 -2548149 -2665668
36315 -2665668 -1967926 -267834 827373 -313517 -2694419 -3677691 -2707992 -2080747 -3433804
36306 -3433804 -5394652 -5803234 -4676111 -3528191 -2896947 -2133905 -1039560 -229877 -49648
36297 -49648 -205423 -385514 -444304 -158784 471256 903116 723187 393188 611068 1144369
36287 1144369 1079983 186054 -678538 -593804 519535 2103264 3584286 4615204 5012788
36278 5012788 4733863 3970674 3251650 3238711 4091428 5084022 5287372 4687032 4170111 4324672
36268 4324672 4783886 4910604 4550000 3856768 2961420 2157899 1914051 2312634 2862669
36259 2862669 3108676 3005277 2563150 1722267 751782 98634 -345504 -1044265 -1731764
36250 -1731764 -1586905 -827032 -823041 -1905066 -2410848 -1070593 886700 1539677 1209570
36241 1209570 1698635 3124880 3633999 2396584 934602 804268 1504012 1592036 757581
36232 757581 -186764 -625666 -584525 -350385 -351760 -1022958 -2183392 -2863563 -2270042 -683624
36222 -683624 983913 2177701 2778431 2566277 1356176 -291783 -1138293 -425574 1275188
36213 1275188 2722376 3408871 3903630 4706759 5293411 4832271 3567564 2674018 2614593
36204 2614593 2432133 1100833 -1036107 -2727104 -3251280 -2845542 -2086946 -1429041 -1057600
36195 -1057600 -688062 214800 1598940 2634455 2827516 2757560 3074567 3401822 3102421
36186 3102421 2535183 2419832 2348738 1200370 -1065644 -3190109 -4178522 -4014726 -2911001
36177 -2911001 -1094323 607621 1288896 1307204 1823510 2742117 2574180 901058 -548534
36168 -548534 -265372 844774 845833 -551958 -1966921 -2394511 -2049516 -1499066 -1087592
36159 -1087592 -1150778 -1908274 -3063383 -4022803 -4435549 -4213212 -3409030 -2477931 -2130533
36150 -2130533 -2400320 -2417626 -1712211 -1088886 -1426101 -2261134 -2571696 -2410531 -2568701 -2990365
36140 -2990365 -2885568 -2332909 -2355669 -3157324 -3602439 -2994353 -2253039 -2553892 -3580409
$$ [...]
##END NTUPLES=NMR SPECTRUM
##END=
