##TITLE=31Pdec_DE-135_4h
, 24 sc
 19.3.2026
##JCAMPDX= 6.0         $$ Bruker NMR JCAMP-DX V2.0
##DATA TYPE= NMR SPECTRUM
##DATA CLASS= NTUPLES
##ORIGIN= UXNMR, Bruker Analytische Messtechnik GmbH
##OWNER= root
$$ XWIN-NMR		Version 3.5
$$ Thu Mar 19 15:18:58 2026 Russian Standard Time (UT+4h)  she@DPX200
##.OBSERVE FREQUENCY= 81.013821
##.OBSERVE NUCLEUS= ^31P
##.ACQUISITION MODE= SIMULTANEOUS
##.ACQUISITION SCHEME= undefined
##.AVERAGES= 24
##.DIGITISER RES= 17
##SPECTROMETER/DATA SYSTEM= spect
##.PULSE SEQUENCE= zgpg30
##.SOLVENT NAME= CDCl3
##.SHIFT REFERENCE= (INTERNAL, CDCl3, 0, 197.392)
##AUDIT TRAIL= $$ (NUMBER, WHEN, WHO, WHERE, WHAT)
$$ ##TITLE= Audit trail, XWIN-NMR		Version 3.5
$$ ##JCAMPDX= 5.01
$$ ##ORIGIN= Bruker BioSpin GmbH
$$ ##OWNER= she
$$ F:/spectra/data/she/nmr/P31/2/pdata/1/auditp.txt
$$ ##AUDIT TRAIL=  $$ (NUMBER, WHEN, WHO, WHERE, WHAT)
(   1,<2026-03-19 15:17:08.00 +0400>,<she>,<DPX200>,
      <created by zg, POWCHK disabled, PULCHK disabled
       configuration hash MD5:
       00 E9 B6 7A A2 85 ED C7 34 08 36 98 17 FE 4E 26
       data hash MD5: 32K
       C7 34 44 4B FB 8B 1A 89 88 9C 47 F8 A8 D6 A8 19>)
(   2,<2026-03-19 15:17:38.53 +0400>,<she>,<DPX200>,
      <Start of raw data processing
       efp BC_mod = 2 LB = 1.5 FT_mod = 6 PKNL = 1 PHC0 = 1391.123 PHC1 = 70.10066 SI = 64K 
       data hash MD5: 64K
       0F 1D C5 58 5C 09 21 9D 6C C1 B9 86 8A 5B 23 4D>)
(   3,<2026-03-19 15:18:12.75 +0400>,<she>,<DPX200>,
      <pk PHC0 = 2.566669 PHC1 = -12 
       data hash MD5: 64K
       58 9A 08 AC B6 D8 ED 2F 17 94 6E 5D 19 40 6A 02>)
(   4,<2026-03-19 15:18:18.85 +0400>,<she>,<DPX200>,
      <abs ABSG = 5 
       data hash MD5: 64K
       FC 54 4D B5 22 96 C3 F5 0C B3 CA 15 C7 5A D1 10>)
$$ ##END=
$$ 
$$ hash MD5
$$ 16 18 15 FE AF E2 B7 26 CE EF F4 79 E4 88 C6 67
##$RELAX= 
##$RELAX= 
##$RELAX= 
##$RELAX= 
##$RELAX= 
##$RELAX= 
##$RELAX= 
##$RELAX= 
$$ Bruker specific parameters
$$ --------------------------
##$DU= <F:/spectra>
##$EXPNO= 2
##$NAME= <P31>
##$PROCNO= 1
##$TYPE= <nmr>
##$USER= <she>
##$AMP= (0..31)
100 100 100 100 100 100 100 100 100 100 100 100 100 100 100 100 100 100 
100 100 100 100 100 100 100 100 100 100 100 100 100 100 
##$AQSEQ= 0
##$AQ_mod= 1
##$AUNM= <au_zg>
##$AUTOPOS= <>
##$BF1= 81.014009
##$BF2= 200.13
##$BF3= 200.13
##$BF4= 200.13
##$BF5= 200.13
##$BF6= 200.13
##$BF7= 200.13
##$BF8= 200.13
##$BYTORDA= 1
##$CFDGTYP= 0
##$CFRGTYP= 5
##$CHEMSTR= <none>
##$CNST= (0..31)
1 1 145 1 1 1 1 1 1 1 1 1 1 1 1 1 1 1 1 1 1 1 1 1 1 1 1 1 1 1 1 1 
##$CPDPRG= <waltz16>
##$CPDPRG1= <>
##$CPDPRG2= <waltz16>
##$CPDPRG3= <>
##$CPDPRG4= <mlev>
##$CPDPRG5= <mlev>
##$CPDPRG6= <mlev>
##$CPDPRG7= <mlev>
##$CPDPRG8= <mlev>
##$CPDPRGB= <>
##$CPDPRGT= <>
##$D= (0..31)
0 1 0 0 0 0 0 0 0 0.06 0 0.03 2e-05 3e-06 0 0 0.0002 0 0 0 0 0 0 0 0 0 
0 0 0 0 0 0 
##$DATE= 1773919027
##$DBL= (0..7)
120 120 120 11 120 120 24 19 
##$DBP= (0..7)
150 150 150 150 150 150 150 150 
##$DBP07= 0
##$DBPNAM0= <>
##$DBPNAM1= <>
##$DBPNAM2= <>
$$ [...]
##$SUBNAM3= <"">
##$SUBNAM4= <"">
##$SUBNAM5= <"">
##$SUBNAM6= <"">
##$SUBNAM7= <"">
##$SUBNAM8= <"">
##$SUBNAM9= <"">
##$SW= 400.765351723535
##$SWIBOX= (0..15)
0 1 3 0 0 0 0 0 0 0 0 0 0 0 0 0 
##$SW_h= 32467.5324675325
##$TD= 32768
##$TD0= 1
##$TE= 0
##$TE2= 300
##$TE3= 300
##$TEG= 300
##$TL= (0..7)
0 120 53 12 22 120 120 120 
##$TP= (0..7)
150 150 150 150 150 150 150 150 
##$TP07= 0
##$TPNAME0= <>
##$TPNAME1= <>
##$TPNAME2= <>
##$TPNAME3= <>
##$TPNAME4= <>
##$TPNAME5= <>
##$TPNAME6= <>
##$TPNAME7= <>
##$TPOAL= (0..7)
0.5 0.5 0.5 0.5 0.5 0.5 0.5 0.5 
##$TPOFFS= (0..7)
0 0 0 0 0 0 0 0 
##$TUNHIN= 0
##$TUNHOUT= 0
##$TUNXOUT= 0
##$USERA1= <user>
##$USERA2= <user>
##$USERA3= <user>
##$USERA4= <user>
##$USERA5= <user>
##$V9= 5
##$VALIST= <valist>
##$VCLIST= <CCCCCCCCCCCCCCC>
##$VD= 0
##$VDLIST= <DDDDDDDDDDDDDDD>
##$VPLIST= <PPPPPPPPPPPPPPP>
##$VTLIST= <TTTTTTTTTTTTTTT>
##$WBST= 1024
##$WBSW= 4
##$XGAIN= (0..3)
0 0 0 0 
##$XL= 0
##$YL= 0
##$YMAX_a= 28947
##$YMIN_a= -41316
##$ZGOPTNS= <>
##$ZL1= 120
##$ZL2= 120
##$ZL3= 120
##$ZL4= 120
##$ABSF1= 197.3918
##$ABSF2= -203.3724
##$ABSG= 5
##$ABSL= 3
##$ALPHA= 0
##$AQORDER= 0
##$ASSFAC= 0
##$ASSFACI= 0
##$ASSFACX= 0
##$ASSWID= 0
##$AUNMP= <proc_1d>
##$AZFE= 0.1
##$AZFW= 0.5
##$BCFW= 0
##$BC_mod= 2
##$BYTORDP= 0
##$COROFFS= 0
##$CY= -3
##$DATMOD= 1
##$DC= 0
##$DFILT= <>
##$DTYPP= 0
##$F1P= 0
##$F2P= 0
##$FCOR= 1
##$FTSIZE= 65536
##$FT_mod= 6
##$GAMMA= 0
##$GB= 0
##$INTBC= 1
##$INTSCL= 9.790993e-09
##$ISEN= 30
##$LB= 1.5
##$LEV0= 0
##$LPBIN= 0
##$MAXI= 10000
##$MC2= 0
##$MEAN= 0
##$ME_mod= 0
##$MI= 50
##$NCOEF= 0
##$NC_proc= -6
##$NLEV= 6
##$NOISF1= 182.463
##$NOISF2= 159.3651
##$NSP= 0
##$NTH_PI= 0
##$NZP= 0
##$OFFSET= 197.3918
##$PC= 4
##$PHC0= 1393.69
##$PHC1= 58.10066
##$PH_mod= 1
##$PKNL= yes
##$PPARMOD= 0
##$PSCAL= 0
##$PSIGN= 0
##$REVERSE= no
##$SF= 81.014063255964
##$SI= 65536
##$SIGF1= 159.3651
##$SIGF2= -187.1042
##$SINO= 113.3802
##$SIOLD= 16384
##$SREGLST= <1H.CDCl3>
##$SSB= 0
##$STSI= 65536
##$STSR= 0
##$SW_p= 32467.5324675325
##$SYMM= 0
##$S_DEV= 0
##$TDeff= 32768
##$TDoff= 0
##$TI= <>
##$TILT= no
##$TM1= 0
##$TM2= 0
##$TOPLEV= 0
##$USERP1= <user>
##$USERP2= <user>
##$USERP3= <user>
##$USERP4= <user>
##$USERP5= <user>
##$WDW= 1
##$XDIM= 65536
##$YMAX_p= 507665738
##$YMIN_p= -8254448
$$ End of Bruker specific parameters
$$ ---------------------------------
##NTUPLES= NMR SPECTRUM
##VAR_NAME=  FREQUENCY,     SPECTRUM/REAL,   SPECTRUM/IMAG
##SYMBOL=    X,             R,               I
##VAR_TYPE=  INDEPENDENT,   DEPENDENT,       DEPENDENT
##VAR_FORM=  AFFN,          ASDF,            ASDF
##VAR_DIM=   65536,         65536,           65536
##UNITS=     HZ,            ARBITRARY UNITS, ARBITRARY UNITS
##FACTOR=    0.49542278885378, 1,            1
##FIRST=     15991.5117654749, 0,            0
##LAST=      -16476.0207020576, 0,           0
##MIN=       -16476.0207020576, -8254448,    0
##MAX=       15991.5117654749, 507665738,    0
$$ Real data points
##PAGE= N=1
##DATA TABLE= (X++(R..R)), XYDATA
65535a48899N9886j15486k57759j14938J07820L1694j97712q6235L23860M14852
$$ -148899 -89013 -204499 -462258 -577196 -469376 -437682 -635394 -721629 -397769 17083
65525A7083j1723l76573k28910J20554K17902J27939P7281j2159j83311j48534
$$ 17083 5360 -371213 -600123 -479569 -261667 -133728 -56447 -68606 -251917 -400451
65515d00451J82784L61024R1879j93085k1826L15708K85795K2524O775J63520
$$ -400451 -217667 143357 235236 42151 20325 336033 621828 644352 651127 814647
65505H14647O1135j99852j06005L34153N38209K58273j44313l86068n65103o80360
$$ 814647 875782 675930 569925 904078 1442287 1700560 1556247 1170179 605076 -75284
65495g5284m88751k9640K54996J37873r9407j52629o4211K3408Q1514M8866j41384
$$ -75284 -564035 -593675 -338679 -200806 -300213 -452842 -517053 -493645 -412131 -363265 -504649
65484e04649l08920j98429M8222L7544k09418k42989O5135K97280J83615j3476
$$ -504649 -813569 -1011998 -963776 -926232 -1135650 -1378639 -1313504 -1016224 -832609 -846085
65474h46085l4100k1836j11147j02641J22329L00282K38214J60156K57124K97231
$$ -846085 -880185 -902021 -1013168 -1115809 -993480 -693198 -454984 -294828 -37704 259527
65464B59527O7836j79958j53615l1124q8728j42800J08226M34484L45080j20119
$$ 259527 327363 147405 -6210 -37334 -126062 -268862 -160636 273848 618928 498809
65454D98809m24930l27379j24266p7224p2940K9013J08102J9981j47453k07790
$$ 498809 73879 -253500 -377766 -454990 -527930 -498917 -390815 -370834 -518287 -726077
65444g26077r2361J41666L61060L87553J49291j76782l23152k23568q708K15173
$$ -726077 -818438 -676772 -315712 71841 221132 44350 -278802 -502370 -511078 -295905
65434b95905L79669L29164k3735m15592m14688J6628M00064L26138m1166k20513
$$ -295905 83764 412928 389193 -26399 -441087 -424459 -24395 301743 260577 40064
65424D0064l6771K12478J79209j12571l26319k26355N8554K21245J56988L5320
$$ 40064 3293 215771 394980 282409 -43910 -270265 -211711 9534 166522 201842
65414B01842K791R15l9291k4898R8772J47844m5310k89942k57208m280O4216j81728
$$ 201842 204633 205548 166257 141359 240131 387975 342665 52723 -204485 -208765 -144549 -326277
65402c26277l56704j16604L21658M74212K29974q1178j72869p6978O0318J92638
$$ -326277 -682981 -799585 -477927 -3715 226259 145081 -27788 -104766 -44448 148190
65392A48190K95250K72856R1453j06007j53645p3577j2256j2173J4289R5030J37645
$$ 148190 443440 716296 807749 701742 548097 474520 462264 450091 464380 559410 697055
65381F97055J00097P2841R7913L7359k26191n34877n84955l11212J4486J06856
$$ 697055 797152 869993 967906 1005265 779074 244197 -340758 -651970 -637484 -530628
65371e30628l2644j81340j48590R1384M17427O34950N98460L35477K3810j77330
$$ -530628 -563272 -744612 -893202 -801818 -384391 250559 849019 1184496 1208306 1030976
65361A030976k33488j84524q6111k5956q9276k39615l07699j71259R4548K93149
$$ 1030976 797488 612964 526853 500897 411621 172006 -135693 -306952 -212404 80745
65351H0745K99009J49326j6527r2005j05919j71004k92191l00305q6902J66828
$$ 80745 379754 529080 512553 420548 314629 143625 -148566 -448871 -535773 -368945
65341c68945J77327m4340j90067q0089J21950J93305J39841P5723M003j12863
$$ -368945 -191618 -235958 -426025 -506114 -384164 -190859 -51018 24705 28708 -84155
65331h4155j96950j47465j2189P8803Q9908P2961N0322J8532Q603L7827N3580
$$ -84155 -281105 -428570 -440759 -361956 -272048 -199087 -148765 -130233 -121630 -83803 -30223
65320c0223J3287l4579k6007J9538M0064J1629n6658j36389j61728q8609J6574
$$ -30223 -16936 -51515 -77522 -57984 -17920 -6291 -62949 -199338 -361066 -449675 -433101
65309d33101O1071Q5450J76407K41359J06098j44755k10481l2053R7599J06j35109
$$ -433101 -372030 -286580 -110173 131186 237284 92529 -117952 -150005 -52406 -52300 -187409
65298a87409j28395r4863j27272n4278J83587K69801O474k49263j01339K08415
$$ -187409 -315804 -410667 -537939 -592217 -408630 -138829 -132355 -381618 -482957 -274542
65288b74542J70036j55456k62694n8547M3714r8674j16298J91890M89496M38225
$$ -274542 -104506 -259962 -522656 -581203 -537489 -636163 -752461 -560571 -71075 367150
65278C67150J56951p5422j89055j91436l1882J96915K52901J17144M2844R5325
$$ 367150 524101 448679 259624 68188 36306 233221 486122 603266 646110 741435
65268G41435L8487j55130j44496J66888L23508j0816m84113n83914l76606k47801
$$ 741435 779922 624792 480296 647184 970692 959876 475763 -108151 -484757 -732558
65258g32558k17598o0280J15050J847k71940k29132K02532N28124L88323P064
$$ -732558 -950156 -1010436 -895386 -893539 -1165479 -1394611 -1192079 -663955 -275632 -268568
65248b68568j97581j00178J72739M66595O28863N50517L08725R4692n2361k37790
$$ -268568 -466149 -566327 -393588 73007 701870 1252387 1561112 1655804 1603443 1365653
65238A365653m23100m13831k00322l6274p0587j55128j41786j12425j45442r5264
$$ 1365653 942553 528722 328400 292126 221539 66411 -75375 -187800 -333242 -428506
65228d28506J63569M40291M28225J26150j52351j70624j4092O2127o6534k58682
$$ -428506 -264937 175354 603579 729729 577378 406754 392662 454789 388255 129573
65218A29573k50893K3471K77268J60277k69022n38515l27621J30334L68662K71561
$$ 129573 -121320 -97849 179419 339696 70674 -467841 -795462 -665128 -296466 -24905
65208b4905J17067J02773R5705o9802k53423j62103K05187M58033K63629k00232
$$ -24905 92162 194935 290640 220838 -32585 -194688 10499 468532 732161 531929
65198E31929m19296j86077J37680J36812q0961j04432J02784J44374j35968l48788
$$ 531929 112633 -73444 64236 201048 120087 15655 118439 262813 126845 -221943
65188b21943j55167J89848K48178R4222J43635M10355M50357J01790k11778j36828
$$ -221943 -377110 -187262 60916 155138 298773 709128 1159485 1261275 1049497 912669
65178I12669N2314j08114n37423p19043m47696q5104k4366k02695k81792j15962
$$ 912669 964983 856869 319446 -399597 -847293 -932397 -956763 -1159458 -1441250 -1557212
65168a557212J27806K32462J77112J28088K46096M99483O54418M86720L5671l75498
$$ -1557212 -1429406 -1196944 -1019832 -891744 -645648 -146165 508253 994973 1030644 655146
65158F55146m15822p1162L03790K95423j53378o50623p47456m11003l333J91095
$$ 655146 239324 168162 471952 767375 613997 -36626 -784082 -1195085 -1198418 -1007323
65148a007323K22475K08972Q5210j66575k62907M8456N00937N53108J41884k04286
$$ -1007323 -784848 -575876 -490666 -657241 -920148 -871692 -370755 182353 324237 119951
65138A19951j20842J10744N6934k28613l69640k24668O2147L87179O90110P37230
$$ 119951 -891 109853 166787 -61826 -431466 -656134 -593987 -206808 483302 1220532
65128A220532L11235l58496p03791m58249M9612L16783J68239k14390n41435n97729
$$ 1220532 1531767 1173271 469480 11231 60843 377626 545865 331475 -209960 -807689
65118h07689l57211k0482J68472J73083J19966N0831p6516j65942l6686K48418
$$ -807689 -1164900 -1185382 -1016910 -843827 -723861 -673030 -749546 -915488 -952174 -703756
65108g03756L76189K02612o3161j97476k28905k32459j26644J22899L24292L11668
$$ -703756 -327567 -124955 -188116 -385592 -614497 -846956 -973600 -850701 -526409 -214741
65098b14741J91301J17023J8438j80840k62378J7247M47989N35267J70517k02090
$$ -214741 -23440 93583 112021 -68819 -331197 -313950 134039 669306 839823 637733
65088F37733j87414P5185J90310N6881q1538l9928P6625O8143q8106k48111l00978
$$ 637733 450319 525504 715814 772695 691157 651229 727854 795997 707891 459780 158802
65077A58802k46135j12645M3377N3054k29809n90682n11321J58855P95189O70486
$$ 158802 -87333 -199978 -156601 -103547 -333356 -924038 -1435359 -1276504 -481315 189171
65067A89171o3817n50555l76589Q638J42659J78450L33780L30561o7741m38473
$$ 189171 125354 -425201 -801790 -793152 -650493 -472043 -138263 192298 124557 -313916
65057c13916k86947Q6501L9953l13282k80708J98417L95324J837l41379q5386
$$ -313916 -600863 -514362 -474409 -787691 -1068399 -869982 -474658 -472821 -814200 -899586
65047h99586L83796M42698J84619Q0403J20893m2032l56112m26169k10677o5487
$$ -899586 -515790 -73092 111527 191930 312823 270791 -85321 -511490 -722167 -787654
65037g87654r5698j8971K36131L17993M8773k01766n0899K96303L46073M2159
$$ -787654 -883352 -902323 -666192 -348199 -299426 -501192 -552091 -255788 90285 132444
65027A32444j92974j10098M6063j3877j54526m6548K91069M80098L01147m8018
$$ 132444 -60530 -170628 -124565 -138442 -292968 -339516 -48447 431651 732798 684780
65017F84780k78641l50142l58185l11848k11378j61101j84519r2571K12493M61648
$$ 684780 406139 55997 -302188 -614036 -825414 -986515 -1171034 -1263605 -1051112 -589464
65007e89464L55182M4520p9412J7673M9870J040J73701N53731O36958J40231n21245
$$ -589464 -234282 -189762 -269174 -251501 -201631 -200591 -26890 526841 1163799 1304030 782785
64996G82785p70526n67178k68537p8169K3889J5246j30677k32987m2911M07378
$$ 782785 12259 -554919 -823456 -901625 -877736 -862490 -993167 -1226154 -1269065 -861687
64986h61687P76104P23826K06470m27752o33922k00732L92662M76218Q5207r6639
$$ -861687 -85583 638243 844713 416961 -216961 -417693 -25031 451187 536394 439755
64976D39755J89056L56137l9658n17030m38725m6409N754k18105j19582K98279
$$ 439755 628811 984948 945290 428260 -10465 -56874 -51120 -269225 -388807 -90528
64966i0528L76525p7334m48623k99802K8491Q9641j3410J6016J63342K88554L95269
$$ -90528 285997 208663 -239960 -539762 -511271 -421630 -435040 -419024 -255682 32872 428141
64955D28141M30537K27845r3638j19813J86427K88103r3138m43015k34915J94942
$$ 428141 858678 1086523 992885 873072 1059499 1347602 1254464 811449 576534 771476
64945G71476J64230k59282l66523P4957M65886K51818l51715p28378o22677k91468
$$ 771476 935706 676424 309901 384858 850744 1102562 750847 22469 -600208 -891676
64935h91676o5826J5756J27123L08960L42598Q7358j73860l3125L86263M71313
$$ -891676 -957502 -941746 -814623 -505663 -163065 -75707 -249567 -282692 103571 574884
64925E74884j3169n07755m25500K0911J95831q220j15069J26508L79550K44086
$$ 574884 561715 53960 -371540 -350629 -154798 -163018 -278087 -151579 227971 472057
64915D72057k04828n24963l74538J51177N49162L85619j47136l86511q2225K41462
$$ 472057 267229 -257734 -632272 -481095 68067 453686 306550 -79961 -162186 79276
64905G9276J25396o9114J86352N57650K83760n06073q20768k64918M01524M55520
$$ 79276 204672 135558 321910 879560 1163320 657247 -163521 -428439 -26915 428605
64895D28605J53396K4674m4502l78052p08063n51394p1685J44484o85q6110L6841
$$ 428605 582001 606675 562173 184121 -523942 -1075336 -1147021 -1002537 -1003222 -1089332 -1052491
64884a052491P1344q2217j25471M5383Q2238k20973m94636k85312K81009O56489
$$ -1052491 -981147 -1063364 -1188835 -1143452 -1061214 -1282187 -1776823 -2062135 -1781126 -1124637
64874a124637N61145K31362K1088j81R595l6260m9308N9539K20519K90770K31014
$$ -1124637 -563492 -332130 -311042 -311223 -301628 -337888 -387196 -327657 -107138 183632 414646
64863D14646R6000q8184k82384l23296r3339J87257J32134k50895m86084k94145
$$ 414646 510646 422462 140078 -183218 -276557 -89300 42834 -208061 -694145 -988290
64853i88290j758n596j40532L921L52144M26479J01455k06882j57002J26042L66480
$$ -988290 -990048 -995644 -1136176 -1132255 -780111 -353632 -252177 -459059 -616061 -490019 -123539
64842a23539M69632M12360J52196j77019k66035j6005K96364L83417K57390O0000
$$ -123539 346093 758453 910649 733630 467595 451590 747954 1131371 1388761 1448761
64832A448761j56386l18599k69106k7798R9828r6267m13707n08963l22695m3240
$$ 1448761 1292375 973776 704670 676872 776700 680433 266726 -242237 -564932 -608172
64822f08172J70519K18931J5762l23103m24300r8599L02164L05945j2741j75757
$$ -608172 -437653 -218722 -202960 -526063 -950363 -1048962 -746798 -440853 -453594 -629351
64812f29351n6244k2988k34937k70602K24119Q46494Q46997J52281m52430l08903
$$ -629351 -685595 -708583 -943520 -1214122 -990003 -143509 703488 855769 403339 94436
64802I4436K54063L53243k68880q84909p43521n4445L52171J80256k9128J83346
$$ 94436 348499 701742 432862 -452047 -1195568 -1250013 -897842 -717586 -746714 -563368
64792e63368N14227M63344J53622P2610K30853J74416j87802l57904k7246L98314
$$ -563368 -49141 414203 567825 640435 871288 1045704 857902 499998 472752 871066
64782H71066L57826j04660m83885n23582m28942m20718l88437r5116M14898P53446
$$ 871066 1228892 1124232 640347 116765 -312177 -732895 -1121332 -1216448 -801550 -48104
64772d8104N78200J1563m43042m66968k65121j87924j91395J8081L96428N31759
$$ -48104 530096 541659 98617 -368351 -633472 -821396 -1012791 -994710 -598282 -66523
64762f6523K52862j27273l00525l16330k85076j41017N5968M675l07852l69328
$$ -66523 186339 59066 -241459 -557789 -842865 -983882 -927914 -923239 -1231091 -1600419
64752a600419J10944N87069L93974j89847k97254K20162N99375L61477m7809q3506
$$ -1600419 -1489475 -902406 -508432 -698279 -995533 -775371 -175996 185481 137672 54166
64742E4166R7891Q9263m4372k0041N1454j27357m15575l49732J59746O75300P89475
$$ 54166 152057 241320 196948 176907 228361 101004 -314571 -664303 -504557 170743 960218
64731I60218N03583M2277l99304o67424o55353l92297j8882L20194M84423L61861
$$ 960218 1463801 1506078 1106774 439350 -216003 -608300 -627182 -306988 177435 539296
64721E39296L9003j84664j36897R985N0352P0054J87053J96945j16731m77330
$$ 539296 578299 393635 256738 266723 317075 387129 574182 771127 654396 177066
64711A77066m09439J6002K40249M1930k19457k67464k53743k56664k0139M73801
$$ 177066 -232373 -216371 23878 65808 -153649 -421113 -674856 -931520 -951659 -477858
64701d77858O95460K81069l48245n55007l34653j06214K4502K14754L34053J08315
$$ -477858 217602 498671 150426 -404581 -739234 -845448 -820946 -606192 -272139 -163824
64691a63824k80912l60259j11696L0637n8627n3007J36100J83367M4428J55434
$$ -163824 -444736 -804995 -916691 -886054 -944681 -997688 -861588 -678221 -633793 -478359
64681d78359O14682Q01550K90929l79490m37052K4061K99086J53910k8543m3255
$$ -478359 136323 937873 1228802 849312 412260 436321 735407 889317 860774 817519
64671H17519r5394k01215l1193M34004O52071K62130l24414m59796j22611J47408
$$ 817519 722125 520910 489717 923721 1575792 1837922 1513508 1053712 931101 1078509
64661A078509L2675k40951l66332l82309m76915n83548m34448K503L72751L53984
$$ 1078509 1111184 870233 503901 121592 -355323 -938871 -1373319 -1370816 -998065 -644081
64651f44081R2154J4509K53222N01870M87536L17593K17066J68888L7458j39421
$$ -644081 -551927 -537418 -284196 217674 705210 1022803 1239869 1408757 1446215 1306794
64641A306794k34516k62890k81430k04484L378J05850r4048l47466k57331J00261
$$ 1306794 1072278 809388 527958 323474 326852 432702 338654 -8812 -266143 -165882
64631a65882K85946J81602P3154M3706j38382m01562k79496K54932M74356q7341
$$ -165882 120064 301666 374820 418526 280144 -121418 -400914 -145982 328374 241033
64621B41033p93322p06884Q4080O32321M65796M9033j10517j28417k82029m28412
$$ 241033 -552289 -1259173 -1175093 -542772 -76976 -27943 -138460 -266877 -548906 -977318
64611i77318k57429J78679N19715N26933K49611r0380k20338J4982M38836O34516
$$ -977318 -1234747 -1056068 -536353 -9420 240191 149811 -70527 -55545 383291 1017807
64601A017807M07989K7565j48575j32822j89324l68396m26141k09054J18620L12857
$$ 1017807 1425796 1453361 1304786 1171964 982640 614244 188103 -20951 97669 410526
64591D10526L36404K84325J61804p4463l06864l17528j17392m87j20754k12597
$$ 410526 746930 1031255 1193059 1118596 811732 494204 376812 376325 255571 42974
64581D2974P628L08929K00777k92898n67439k96507R0437Q9243j33029j30196
$$ 42974 50602 359531 560308 267410 -300029 -596536 -506099 -416856 -549885 -680081
64571f80081O437j66495n76192o17625q2943M99897O62729N86216N86926N09880
$$ -680081 -673644 -840139 -1416331 -2033956 -2116899 -1617002 -954273 -368057 218869 728749
64561G28749Q3794m58519o23839l59194n8297M7951R0277J70561J71394L4396
$$ 728749 812543 354024 -269815 -629009 -687306 -639355 -549078 -378517 -207123 -172727
64551a72727q0895l1926J23024K53110K91136K00760r777k06183k48773k24307
$$ -172727 -253622 -285548 -162524 90586 381722 582482 572705 366522 117749 -106558
64541a06558l42155n52021n26121j49329K28767K51360O9001J09166M32594O42624
$$ -106558 -448713 -1000734 -1526855 -1676184 -1447417 -1196057 -1127056 -1017890 -585296 57328
64531E7328M55805O4950j80155k04596j35242N220K56298M55691L23236j38975
$$ 57328 513133 578083 397928 193332 58090 63310 319608 775299 1098535 959560
64521I59560n73161o92562n76258m20624k27881M2257K05963O5469j85207j15689
$$ 959560 386399 -306163 -882421 -1303045 -1530926 -1488669 -1282706 -1217237 -1402444 -1518133
64511a518133L22890O45855M50839m6885k93501p3734K84659L31823j4921l98108
$$ -1518133 -1195243 -549388 -98549 -145434 -438935 -512669 -228010 103813 88892 -309216
64501c09216l96281p416K84482O6289m20085n07864K4679O19996O50694J74816
$$ -309216 -705497 -712913 -428431 -362142 -782227 -1290091 -1265412 -645416 5278 180094
64491A80094k86083m67205m78606l65921k6885M12436N74558L42225O3624M4749
$$ 180094 -105989 -573194 -1051800 -1417721 -1444606 -1032170 -457612 -115387 -51763 -7014
64481g014J01218j25603n72142p58465l69065L68770R19713R51752N94109K38796
$$ -7014 94204 -31399 -603541 -1362006 -1731071 -1362301 -442588 509164 1103273 1342069
64471A342069J05983M1529j91553m92542n05455j65052J00226q7608m97899n73859
$$ 1342069 1448052 1489581 1298028 805486 300031 134979 235205 147597 -350302 -924161
64461i24161j96343J72855J62754k2762J6902K69769L78249K02037j1840m7178
$$ -924161 -1120504 -947649 -784895 -807657 -790755 -520986 -142737 59300 47460 282
64451B82j5666r5698j82131j4357M14941P65475O90375J89969l77446n97284l50661
$$ 282 -15384 -111082 -293213 -307570 107371 872846 1563221 1753190 1375744 778460 427799
64440D27799Q2650L08522K22042L8246q6286k59993n59242p41989n23164k3236
$$ 427799 510449 818971 1041013 1079259 992973 732980 173738 -568251 -1091415 -1114651
64430a114651L45936L95155K79484J50560J9708k3374J64483M28334L55625j41994
$$ -1114651 -768715 -373560 -94076 56484 76192 52818 217301 645635 1001260 859266
64420H59266o04155o01158k50086Q6869L14448M93700M93580J77936k04627k47314
$$ 859266 255111 -346047 -596133 -509264 -194816 298884 792464 970400 765773 518459
64410E18459L2415K06777M6626k05216k14535M8762L35125L38510p7115o63883
$$ 518459 550874 757651 804277 599061 384526 433288 768413 1106923 1029808 365925
64400C65925q78837m56689J77569L80968J08229j26761o7807n550j42108j77752
$$ 365925 -512912 -969601 -792032 -411064 -302835 -429596 -497403 -502953 -645061 -822813
64390h22813J65571N89345N79897J12642l66398n38922m55943k36100J35028O12046
$$ -822813 -657242 -67897 512000 624642 258244 -280678 -736621 -972721 -837693 -225647
64380b25647R24188P82421K23284l53071n49825l78095k21912l55088o02560o04095
$$ -225647 698541 1480962 1704246 1351175 801350 423255 201343 -153745 -756305 -1360400
64370a360400k98662O6265L35996N74248P67432P04586K93830k05300m27510k78160
$$ -1360400 -1659062 -1592797 -1256801 -682553 84879 789465 1083295 877995 450485 172325
64360A72325K2612J83069Q8101j13520j84960j34691k34186n33951n90718m3984
$$ 172325 194937 378006 466107 352587 167627 32936 -201250 -735201 -1325919 -1369903
64350a369903P07836R18796N22639J53034R2525r0947o03645q52395l36951M38969
$$ -1369903 -662067 256729 779368 932402 1024927 933980 330335 -522060 -859011 -420042
64340d20042O01443J05067l44435l42471j31338o717K9129K5487j8888k771J37722
$$ -420042 181401 286468 -57967 -400438 -531776 -538493 -509364 -483877 -502765 -505536 -367814
64329c67814J88088m3867k79326r1949L72021N06729J02285m02975n87337m89277
$$ -367814 -179726 -223593 -502919 -594868 -222847 283882 386167 -16808 -604145 -1093422
64319a093422k97154o6548J10551Q2702n2483O041K77664M38124L45262K04676
$$ -1093422 -1390576 -1457124 -1346573 -1263871 -1316354 -1310313 -1032649 -594525 -249263 -44587
64309d4587J00576j46067m68422m34071O9996N28144N35531L75789M23694M33427
$$ -44587 55989 -90078 -558500 -992571 -922575 -394431 141100 516889 940583 1374010
64299A374010J2159n32833n17317O6900M79188K59264k18960l56140m9712L63016
$$ 1374010 1386169 853336 336019 402919 882107 1141371 922411 566271 516559 879575
64289H79575N38320L27952j78140o40505p08546m08986j28387j19461k22199j83933
$$ 879575 1417895 1745847 1567707 927202 218656 -190330 -318717 -438178 -660377 -844310
64279h44310m2740p589j00289j33748p681J49989J62596J3510j68337k58171k07901
$$ -844310 -887050 -894639 -994928 -1128676 -1136357 -986368 -823772 -810262 -978599 -1236770 -1444671
64268a444671j2943K87435N42511N28452J77186k67372m56821l14013q6038j5192
$$ -1444671 -1457614 -1170179 -627668 -99216 77970 -189402 -646223 -960236 -1046274 -1061466
64258a061466r1530j51771p2679J68171M60102N50606K70562j66257l23631j11027
$$ -1061466 -1152996 -1304767 -1377446 -1209275 -749173 -198567 71995 -94262 -417893 -528920
64248e28920P6664l7990j72665M8882M34463M53472L4000l13388k19703P8132
$$ -528920 -452256 -490246 -662911 -614029 -179566 273906 307906 -5482 -225185 -147053
64238a47053J49093m0251j53207M7445M29881O43624M66306L9663k43261j56460
$$ -147053 2040 -38211 -191418 -143973 285908 929532 1395838 1435501 1192240 1035780
64228A035780R9954J74126K3770q7259j7977O5077j8036j92929k55467j18834
$$ 1035780 1135734 1309860 1333630 1246371 1228394 1293471 1275435 1082506 827039 708205
64218G08205J41454L67097L90825J62036j51520l12409k92182k55432k53266j47578
$$ 708205 849659 1216756 1607581 1769617 1618097 1305688 1013506 758074 504808 357230
64208C57230Q1292J89183J2239k15150j26752K56025N00904K90548j98422n23871
$$ 357230 438522 627705 639944 424794 298042 554067 1054971 1345519 1147097 623226
64198F23226m81124k60663j32643j18861p0688K8728L8959n2855n1701J28132
$$ 623226 142102 -118561 -251204 -370065 -440753 -412025 -373066 -425921 -477622 -349490
64188c49490K79434K15361O4330J1747m8400k65378m03938j17026M10765N95523
$$ -349490 -70056 145305 209635 221382 172982 -92396 -496334 -613360 -202595 392928
64178C92928K89030k6244k2209K4188j68363l50745k16665K2984L8816J3789L01353
$$ 392928 681958 655714 633505 657693 489330 138585 -78080 -55096 -16280 -2491 298862
64167B98862O85720O10740N5138m29896n51763n41601n20089k38603L11760O11622
$$ 298862 984582 1595322 1650460 1220564 668801 127200 -392889 -631492 -319732 291890
64157B91890L16016j85998l36823k02498k31179m44150l94313R3168N92562O17744
$$ 291890 607906 421908 85085 -117413 -348592 -792742 -1187055 -1093887 -501325 116419
64147A16419K03160k05314k74991p0658J11341R3995j6710j5309J12957J98676
$$ 116419 319579 114265 -160726 -231384 -120043 -26048 -42758 -58067 54890 253566
64137B53566J74128J65777K28980J97269m1043k85964k66072l0303J31849J06804
$$ 253566 427694 593471 822451 1019720 978677 692713 426641 396338 528187 634991
64127F34991O2568J38567K33468J54475j40480m71782n50961k40256K02993K78858
$$ 634991 697559 836126 1069594 1224069 1083589 611807 60846 -179410 23583 302441
64117C02441j72795o78189o82264k83455n8238j90637k31464J41878N72176N40289
$$ 302441 129646 -548543 -1230807 -1514262 -1572500 -1763137 -1994601 -1852723 -1280547 -740258
64107g40258J17970j84294j31693P7606K69309M66546N76718L42799j99877n57528
$$ -740258 -622288 -806582 -938275 -860669 -591360 -124814 451904 794703 594826 37298
64097C7298l62144Q7533J95804j26890l88407k52763K0571M7130q5801j6185K62939
$$ 37298 -324846 -237313 -41509 -168399 -556806 -809569 -788998 -741868 -827669 -843854 -580915
64086e80915L62821J00035k23161k74316j30669n8216r0607r4012q0977j54338
$$ -580915 -218094 -118059 -341220 -615536 -746205 -804421 -895028 -989040 -1070017 -1224355
64076a224355k29204j18380J33714K88991K83473K74443L09979K59025J22795
$$ -1224355 -1453559 -1571939 -1438225 -1149234 -865761 -591318 -281339 -22314 100481
64067A00481Q7923J52969K8821l92063p46153o32705j46384K65111L36244J66302
$$ 100481 188404 341373 370194 -21869 -768022 -1400727 -1547111 -1282000 -945756 -779454
64057g79454j0378m3668M6948P1308j21626l53094k72319O8365J36430l10444
$$ -779454 -789832 -833500 -786552 -715244 -836870 -1189964 -1462283 -1393918 -1257488 -1567932
64047a567932p18830m32693L49391Q21879O59417L19485K60423L89647M16033
$$ -1567932 -2286762 -2719455 -2370064 -1548185 -888768 -569283 -308860 80787 496820
64038D96820K90446R4561j43503l15535k26430P2576K20234K8075k16956j57525
$$ 496820 787266 881827 738324 422789 196359 268935 489169 517244 300288 142763
64028A42763J28443K61977O8566k53331l92046k21328R2860K30341N9099j72576
$$ 142763 271206 533183 601749 348418 -43628 -264956 -172096 58245 117344 -55232
64018e5232j52419L8779N8545j38715k48056j65194j50475k87484k45351J34201
$$ -55232 -207651 -168872 -110327 -249042 -497098 -662292 -812767 -1100251 -1345602 -1211401
64008a211401M45733L11632J2352N6836L74029M38156P1546l51756m62976k61090
$$ -1211401 -765668 -454036 -441684 -384848 -10819 427337 498883 147127 -315849 -576939
63998e76939N5016K69335K04165q4281k37503m7319J53647l5055l54350j82807
$$ -576939 -521923 -252588 -48423 -132704 -370207 -417526 -263879 -298934 -653284 -836091
63988h36091M54115P94254M18883j67392l37202j93464j82381k65645n5000M06078
$$ -836091 -381976 412278 831161 663769 326567 133103 -49278 -314923 -369923 36155
63978C6155N70264J52204m51673o57879l45716J31762L98148L56010J46046l1846
$$ 36155 606419 758623 306950 -350929 -696645 -564883 -166735 189275 335321 303475
63968C03475o1238K2467O8072l8824k24938k75847r0034J62120K38867J48720
$$ 303475 242237 264704 332776 293952 69014 -206833 -296867 -134747 104120 252840
63958B52840R5098R5289p5551m27046n41820j33516L91790L63601k16060o21407
$$ 252840 347938 443227 367676 -59370 -601190 -734706 -342916 20685 -195375 -816782
63948h16782l82557J15637K50432L0151j5616L49136P32338O21883j0587p04317
$$ -816782 -1199339 -1083702 -833270 -803119 -818735 -469599 262739 884622 874035 169718
63938A69718r92573q03820m08503m8608K78398O35641Q94332Q49680N39033K29741
$$ 169718 -822855 -1626675 -2035178 -2083786 -1805388 -1169747 -275415 574265 1113298 1343039
63928A343039P1580l2539j61336k01343n1625J75691K98110K78215J77991K3979
$$ 1343039 1414619 1382080 1220744 1019401 967776 1143467 1441577 1719792 1897783 1921762
63918A921762j50724k38754j80169q4582j02696k25013l23255l48237l58368l55054
$$ 1921762 1771038 1532284 1352115 1267533 1164837 939824 616569 268332 -90036 -445090
63908d45090k19739J03968M17892L90481m4700m93391m84086n4328K72035J79336
$$ -445090 -664829 -560861 -142969 247512 202812 -290579 -774665 -828993 -556958 -377622
63898c77622m2454j5601J38406N8623j93968k50166j21669k03178n06282m80594
$$ -377622 -420076 -435677 -297271 -238648 -432616 -682782 -804451 -1007629 -1513911 -1994505
63888a994505J33657P80487Q09697L47070M212N269R6515J50329L13989N52982
$$ -1994505 -1860848 -1080361 -270664 76406 80618 85887 182402 332731 646720 1199702
63878A199702N39376J49903k83296m17566l28171k64053j82014J57895O78968
$$ 1199702 1739078 1888981 1605685 1188119 859948 595895 413881 571776 1250744
63869A250744R05528N50539l7430k85340j54777j41953m79217p41369m84243P6719
$$ 1250744 2156272 2706811 2669381 2384041 2229264 2087311 1608094 866725 382482 459201
63859D59201M01431L72748K50741Q4491k60449n74871m56989o7090p9937o61713
$$ 459201 860632 1233380 1484121 1568612 1308163 733292 276303 209213 129276 -532437
63849e32437j098273p79746l3234M22016L95102J66549p8397k60369j61384L10534
$$ -532437 -1630710 -2410456 -2443690 -2021674 -1626572 -1460023 -1538420 -1798789 -1960173 -1649639
63839a649639P96745Q61776N37775J54719j39744l23683k40245J51041M76076
$$ -1649639 -852894 8882 546657 701376 561632 237949 -2296 148745 624821
63830F24821L63909k401j82497j38679j44402k22066j76406n1117m5447q0258
$$ 624821 988730 986329 803832 665153 520751 298685 122279 71162 25715 -54543
63820e4543N6895K33143J45425j07149j45064N5153J66393J10621J23650K35691
$$ -54543 2352 235495 380920 273771 128707 183860 350253 460874 584524 820215
63810H20215K12459K7567r5960j05508j04083O876L27119N04494J32794m57002
$$ 820215 1032674 1060241 964281 858773 754690 761566 1088685 1593179 1725973 1268971
63800A268971n35379j13046N8352k79005n17293k79555j0759q4204j41950J52011
$$ 1268971 733592 620546 678898 399893 -117400 -396955 -407714 -491918 -633868 -481857
63790d81857M23682K56500n4224l7149J65451J53821j6202o4439m2495r9958p5123
$$ -481857 -58175 198325 144101 106952 272403 426224 410022 345583 303088 203130 128007
63779A28007J28927J52137k50113o20877m20924J06318L49863K94397L49456M76982
$$ 128007 256934 409071 158958 -461919 -882843 -776525 -426662 -132265 217191 694173
63769F94173K80230j64799l44029j54453j2545q9551j03217O7095J89519J99260
$$ 694173 974403 809604 465575 311122 298577 209026 105809 172904 362423 561683
63759E61683L19221N46683N69214L10384M3441j22044l22324m40440j63251L00195
$$ 561683 880904 1427587 1996801 2307185 2350626 2228582 1906258 1465818 1302567 1602762
63749A602762K40550m92616j076093p92947j2753L99034K28777p3003k07723k51899
$$ 1602762 1843312 1350696 274603 -518344 -531097 -132063 96714 23711 -184012 -435911
63739d35911k11211O1539M62282O00030K90315k05788n24845n54562l88188j59035
$$ -435911 -647122 -585583 -123301 476729 767044 561256 36411 -518151 -906339 -1065374
63729a065374j5556o0831j84144j04769K60441N90103N22452J69265K417J77332
$$ -1065374 -1080930 -1141761 -1325905 -1430674 -1170233 -580130 -57678 111587 114004 291336
63719B91336K78238m2137m47442l53852J52026L64641J03l68453j85321K70294
$$ 291336 569574 527437 79995 -273857 -121831 242810 242913 -125540 -310861 -40567
63709d0567L67931N5345k06380j95134q4765Q690J19218J45594k7387j71934J2238
$$ -40567 327364 382709 176329 -18805 -103570 -94880 24338 169932 142545 -29389 -17151
63698a7151L02217J86163k71845m11648J7964M35678L07593p1265p9450L33822
$$ -17151 285066 471229 199384 -212264 -194300 241378 548971 477706 398256 732078
63688G32078O91010O79095M03268R4537j14011k03070k66108l85298m03272n6478
$$ 732078 1423088 2102183 2505451 2599988 2485977 2282907 2016799 1631501 1228229 1171751
63678A171751N20765P54452L61319j82985k57198Q0761L05047K69184L33503O75208
$$ 1171751 1692516 2446968 2808287 2625302 2368104 2448865 2753912 3023096 3356599 4031807
63668D031807R66845Q75159N05958J68867k0475j05348p6229P5685K27076K70999
$$ 4031807 4998652 5873811 6379769 6548636 6528161 6422813 6346584 6422269 6649345 6920344
63658F920344L30528N99890R65760J008810N05627k02671n16878k28534K89029
$$ 6920344 7250872 7850762 8816522 9825332 10330959 10128288 9611410 9382876 9671905
63649I671905N58560N21666N11933Q26046J428560K007315K225670J993418J594205
$$ 9671905 10230465 10752131 11264064 12090110 13518670 15525985 17751655 19745073 21339278
63640B1339278J486187J875721K539267L139980L622116M182601M961228N923227
$$ 21339278 22825465 24701186 27240453 30380433 34002549 38185150 43146378 49069605
63632D9069605O997915Q189753R570859J1257587J3379953J6057948J9469458
$$ 49069605 56067520 64257273 73828132 85085719 98465672 114523620 133993078
63625A33993078K3875866K9415242L5985725M3532754N1873396N9049406N9843743
$$ 133993078 157868944 187284186 223269911 266802665 318676061 377725467 437569210
63618D37569210M7997209K2099319j0763982l8873472n4231389n6955246n2220849
$$ 437569210 485566419 507665738 496901756 458028284 403796895 346841649 294620800
63611B94620800m4776772l6946259k9891129k4462751k0689577j7763926j5067574
$$ 294620800 249844028 212897769 183006640 158543889 137854312 120090386 105022812
63604A05022812j2716099j0949729r515333p939887o161150m652585l937279l996758
$$ 105022812 92306713 81356984 71841651 63901764 57740614 53088029 49150750 45153992
63596D5153992m184372l850324l045487k390643k248532k349215k296886k047248
$$ 45153992 40969620 37119296 34073809 31683166 29434634 27085419 24788533 22741285
63588B2741285j720213j345273j027371r83687j150385j120734p46752m11886
$$ 22741285 21021072 19675799 18648428 17664741 16514356 15393622 14646870 14234984
63580A4234984m04150m46136k26503K6677l5352k66116l32134l12833m64069o60319
$$ 14234984 13830834 13384698 13158195 13184872 13149520 12883404 12551270 12238437 11774368 11114049
63570A1114049o08772l81227k20118p4817J38753J28394k90489o04138k64684
$$ 11114049 10505277 10124050 9903932 9829115 9967868 10096262 9805773 9201635 8936951
63561H936951K64168J7869r41037j437607q21202J56685M46451l2559o54415j005550
$$ 8936951 9201119 9218988 8277951 6840344 6019142 6175827 6622278 6589719 5935304 4929754
63551D929754j020531o50023K4027N51366M83665n2250m56496l26479J50647M61245
$$ 4929754 3909223 3259200 3283227 3834593 4318258 4266008 3809512 3483033 3633680 4094925
63541D094925L22116l6941j72255q717O6483j80645m07549k05973K13104K95992
$$ 4094925 4417041 4380100 4207845 4199128 4265611 4084966 3677417 3471444 3684548 3980540
63531C980540m9104m16403n59737n46256l32647J86210O82195O07447L8671l23665
$$ 3980540 3931436 3515033 2955296 2409040 2076393 2262603 2944798 3552245 3590916 3267251
63521C267251j87037n0548k90233n33805l72618r6123j53622l36146j27728L94996
$$ 3267251 3080214 3029666 2739433 2205628 1833010 1736887 1583265 1247119 1119391 1514387
63511A514387O30683L27179j28877l11059k40023j79018k07087j48094J24315
$$ 1514387 2145070 2472249 2343372 2032313 1792290 1613272 1406185 1258091 1382406
63502A382406L99640K99122j62983m18035p1817M09756K75646l44807n51955n2842
$$ 1382406 1782046 2081168 1918185 1500150 1428333 1838089 2113735 1768928 1216973 1164131
63492A164131L55497L2716n07150m19749K04841N73178L21301k27829o82878q48618
$$ 1164131 1519628 1552344 1045194 625445 830286 1403464 1724765 1496936 814058 -34560
63482c4560n64103J17543O80693O17477J05120k30871j43808R0091K50619L91392
$$ -34560 -598663 -481120 199573 817050 922170 691299 547491 637582 888201 1279593
63472A279593M95841L95645J02858j43106k08739j59132n3860N0210j8515l10204
$$ 1279593 1775434 2171079 2273937 2130831 1922092 1762960 1709100 1759310 1740795 1430591
63462A430591m97418k60418J47213J79514j72210l33303j4902L64867L32547J3662
$$ 1430591 933173 672755 819968 999482 827272 493969 479067 843934 1176481 1190143
63452A190143j60150j00852o9053j56912j08159K60967O55776N45738j35356p50450
$$ 1190143 1029993 929141 860088 703176 595017 855984 1511760 2057498 1922142 1171692
63442A171692o84889j82985k9047l86816n38863k4387N82898N36350M3630j43435
$$ 1171692 486803 303818 274771 -112045 -650908 -675295 -92397 443953 487583 344148
63432C44148Q6552J92007m2502k91401l78526m21441l01298K16800P68712O40216
$$ 344148 430700 622707 580205 288804 -89722 -511163 -812461 -595661 173051 813267
63422H13267p6628m30140k9122L54326Q8485k75724o688M83091K89793m27629
$$ 813267 736639 306499 277377 631703 720188 444464 437776 920867 1210660 783031
63412G83031o15390L3431O07769L62515k56292l98438l1795J79865p1514l66989
$$ 783031 167641 201072 808841 1171356 915064 516626 484831 664696 593182 226193
63402B26193k47353J35641K63478k0756k97250j56330K08822K63461o5562k14478
$$ 226193 -21160 114481 377959 357203 59953 -96377 112445 375906 310344 95866
63392I5866K23575Q50555R42836L96411k00424l84867k91675k24143j64552J6746
$$ 95866 319441 1169996 2112832 2509243 2308819 1923952 1632277 1408134 1243582 1260328
63382A260328J44264p5234n11124o34749k07066L38303M22645O4831j85443j629
$$ 1260328 1404592 1329358 818234 183485 -23581 314722 737367 802198 616755 615126
63372F15126L43955M28169K09738o4721k53656l58723l16870o0224K50719L28962
$$ 615126 959081 1387250 1596988 1532267 1278611 919888 603018 542794 793513 1122475
63362A122475J26996j14126k05142j82658j08848N6147K65488K76833p2717n67246
$$ 1122475 1249471 1135345 930203 747545 638697 694844 960332 1237165 1164448 597202
63352E97202p62293m55418P2797L29171J10201l03588m89329l54478j43108k1188
$$ 597202 -165091 -620509 -547712 -218541 -108340 -411928 -901257 -1255735 -1398843 -1420031
63342a420031R8871K67897L32558K27467J49653K04325J70737n7201j08675L12373
$$ -1420031 -1321160 -1053263 -720705 -493238 -343585 -139260 31477 -25724 -134399 177974
63332A77974P49068M72788m21854j025267p89588j17272L64605N28085M93120
$$ 177974 927042 1399830 977976 -47291 -836879 -954151 -589546 -61461 431659
63323D31659K29292j75363k82963J60930P12383P02889J03930m52536m57948m5670
$$ 431659 660951 485588 202625 363555 1075938 1778827 1882757 1430221 972273 926603
63313I26603K48354N1975m87066q20903n69904L356K85516R7123j30679n6488
$$ 926603 1174957 1226932 739866 -81037 -650941 -647585 -362069 -264946 -395625 -452113
63303d52113R6772Q807j73522j06438J78243L63493L40867K42884J02349j51261
$$ -452113 -355341 -346534 -520056 -626494 -448251 -84758 256109 498993 601342 450081
63293D50081m01567l81706k7317M29006P20081P42962N44554K66350N5569q2266
$$ 450081 48514 -333192 -360509 68497 788578 1531540 2076094 2342444 2398013 2315747
63283B315747k57622m48304m51646k15001j1096q6400k98648l15791n5452K53581
$$ 2315747 2058125 1609821 1158175 943174 932078 845678 547030 231239 175787 429368
63273D29368L42572J10763k98387n40001l82592n3842l277k41253k89387N5248
$$ 429368 771940 882703 584316 44315 -338277 -392119 -395396 -636649 -926036 -870788
63263h70788L64224K78317J01470K60027N62857N36017K08491j1223n3741j94618
$$ -870788 -506564 -228247 -126777 133250 696107 1232124 1440615 1429392 1375651 1181033
63253A181033m30564m25441j07776J61810J05052j49906l06695j89766J67380
$$ 1181033 750469 325028 217252 379062 484114 334208 27513 -162253 5127
63244E127M71579L37098k07371n68339k93364K93541N69923M66463L25798J74232
$$ 5127 476706 813804 606433 38094 -255270 38271 608194 1074657 1400455 1574687
63234A574687j93908n48674l92911J73777M56444J39596l64092o39241o99661
$$ 1574687 1380779 832105 439194 612971 1069415 1209011 844919 205678 -493983
63225d93983n68112j16066M40324N46542J36504j40133J22674M56025K61815k98333
$$ -493983 -1062095 -1178161 -737837 -191295 -54791 -194924 -72250 383775 645590 347257
63215C47257o23491m96661j38125K44700N22405N05085J49712k45162l49057j59652
$$ 347257 -276234 -772895 -911020 -666320 -143915 361170 510882 265720 -83337 -242989
63205b42989J29980L89332M97612L19283n7620l26255l73731l89533m34326l04981
$$ -242989 -113009 276323 773935 1093218 1035598 709343 335612 -53921 -488247 -793228
63195g93228j5144N1148k49901m88782k64499K50326O65149Q50014P58986K81442
$$ -793228 -808372 -757224 -1007125 -1495907 -1760406 -1510080 -844931 5083 764069 1045511
63185A045511l36030m52562P3046M62061R7521m62130l07880L66004N37848o6005
$$ 1045511 709481 256919 329965 792026 889547 427417 119537 485541 1023389 957384
63175I57384n96088l81327J86838L43614n1684n15074n69950j56502L52793M55424
$$ 957384 361296 -20031 166807 510421 458737 -56337 -626287 -782789 -429996 25428
63165B5428M2598m01400l54178R1606M15871L72094J51306j9108n6844O8675K24826
$$ 25428 68026 -333374 -687552 -595946 -180075 192019 343325 324217 267373 336048 560874
63154E60874P5334m21830o93089k68164L79953L83695k42519o37648m19032j39084
$$ 560874 636208 214378 -478711 -746875 -366922 16773 -225746 -863394 -1282426 -1421510
63144a421510k18809k58353J51095O05167M65806j57933n73665m26163l455K52782
$$ -1421510 -1640319 -1898672 -1747577 -1142410 -676604 -834537 -1408202 -1834365 -1837820 -1585038
63134a585038K04533M2820N1738K97048N17476M72797L29729L93848N28045L04058
$$ -1585038 -1380505 -1337685 -1285947 -988899 -471423 1374 331103 724951 1252996 1557054
63124A557054k32537m87564j72584K78243L72881J60505p9183k50186k61197N0383
$$ 1557054 1324517 836953 664369 942612 1315493 1475998 1396815 1146629 885432 935815
63114I35815M70589M10454k30049p28977n71375k68848m98381r02869n95522L95189
$$ 935815 1406404 1816858 1586809 857832 286457 17609 -480772 -1383641 -1979163 -1583974
63104a583974J083572R25530M54361L54130N62869N75750J74024m16806q03115
$$ -1583974 -500402 425128 879489 1233619 1796488 2372238 2546262 2129456 1326341
63095A326341p15674k71140L8051j07503l80240k47449K08337M06938J77697m2804
$$ 1326341 610667 339527 377578 270075 -110165 -357614 -149277 257661 435358 392554
63085C92554j0202l6074l10987m69169k12763J38438J77053N7549J04598J50414
$$ 392554 382352 346278 35291 -433878 -646641 -508203 -331150 -273601 -169003 -18589
63075a8589j19938m24749j99788M20291O60947K55521j56834n5770J76206l0838
$$ -18589 -138527 -563276 -763064 -342773 318174 573695 416861 361091 537297 506459
63065E06459m38090l74303J54399M53830K20343p5822p2453j11527n27403q74122
$$ 506459 68369 -305934 -151535 302295 522638 446816 374363 262836 -264567 -1138689
63055a138689n06794L34235P20101K96761k84145l37905J3645K40759J71322r722
$$ -1138689 -1645483 -1311248 -591147 -294386 -578531 -916436 -902791 -662032 -490710 -500432
63045e00432j85434l32192l33387j25158J16675K19571K76836L98806M16764J65565
$$ -500432 -685866 -1018058 -1351445 -1476603 -1359928 -1140357 -863521 -464715 -47951 117614
63035A17614j36252j62374K5753J32612J04569M6098j30032m56698n14579N7431
$$ 117614 -18638 -181012 -155259 -22647 81922 128020 -2012 -458710 -973289 -915858
63025i15858P46248O42207j85493o28848j31918N03549L95566j27212k45337k8951
$$ -915858 -169610 472597 287104 -341744 -473662 29887 425453 298241 52904 23953
63015B3953j63641o51767p89252l73358j973l3483p9944J81045M14889K57822
$$ 23953 -139688 -791455 -1580707 -1954065 -1956038 -1989521 -2069465 -1888420 -1473531 -1215709
63005a215709m6830j12821n5842j62294k59294K0872N35850P43968M78333J31843
$$ -1215709 -1262539 -1375360 -1431202 -1593496 -1852790 -1831918 -1296068 -552100 -73767 58076
62995E8076K4620R935j50097l51316l10692J6440L74024M90783L23217O2275m9357
$$ 58076 82696 92631 -57466 -408782 -719474 -703034 -329010 161773 484990 547265 497908
62984D97908M6401J55919O8076j57038k47079q6111J03381K7773l05193n72544
$$ 497908 544309 700228 768304 611266 364187 278076 381457 409230 104037 -468507
62974d68507m74969l6125M27123O02247M57415K41655K10841L59910M47021K80298
$$ -468507 -943476 -979601 -552478 49769 507184 748839 959680 1319590 1766611 2046909
62964B046909n3498k74290k20064l7966j3771k09146l60094k16318R7646K14802
$$ 2046909 1993411 1719121 1499057 1461091 1447320 1238174 878080 661762 759408 974210
62954I74210M170k61157k61462R840L17419M44707K79883j71348o85483q83624
$$ 974210 978380 717223 455761 465601 783020 1227727 1507610 1336262 650779 -232845
62944b32845o06965j39841J30812J79164K53886M28713N02634L15289p1799m79240
$$ -232845 -839810 -979651 -848839 -669675 -415789 12924 515558 830847 759048 279808
62934B79808o81863m61428J23973N85795M71495j8227k49300j8097K31510J58326
$$ 279808 -402055 -863483 -739510 -153715 317780 299553 50253 32156 263666 421992
62924D21992J4803J32923L37376K48655r8719l18435k01808J06849L32759K45592
$$ 421992 436795 569718 907094 1155749 1057030 738595 536787 643636 976395 1221987
62914A221987k12840p54783q97037n09602k947K35047K95888L87109L77413J02346
$$ 1221987 1009147 254364 -642673 -1152275 -1155222 -920175 -624287 -237178 140235 242581
62904B42581j93980j96361m3058k6704l2091J73861L47255J28184j93803l7680
$$ 242581 48601 -147760 -190818 -217522 -249613 -75752 271503 399687 205884 168204
62894A68204M34061M76073n318k67873K2639K67878K2618k62349j22300O8682
$$ 168204 602265 1078338 1073020 805147 827786 1095664 1118282 855933 733633 802315
62884H02315j89517n84625n31256j70620l6901q7678J01719M12423L14940j39797
$$ 802315 612798 28173 -503083 -673703 -710604 -798282 -696563 -284140 30800 -108997
62874a08997k93306O6432L68690J85866j43428j20567J81267L40845K07127k8962
$$ -108997 -402303 -335871 32819 218685 75257 -45310 135957 476802 683929 654967
62864F54967j73608j87740j23285o2818n5082n9041k8739j9804q9680j66905j75828
$$ 654967 481359 293619 170334 107516 52434 -6607 -35346 -55150 -144830 -311735 -487563
62853d87563j81370k20628j47466R7864K42255M7581k31643j78390J13561J86237
$$ -487563 -668933 -889561 -1037027 -939163 -696908 -649327 -880970 -1059360 -945799 -759562
62843g59562j1242n4433J90581L14534P9077j55928l9379J84940R7828k19221
$$ -759562 -770804 -825237 -634656 -320122 -241045 -396973 -436352 -251412 -153584 -372805
62833c72805l54678k04508k8715J8920M3469J11683J12852k8332k06919k78379
$$ -372805 -727483 -931991 -960706 -941786 -898317 -786634 -673782 -702114 -909033 -1187412
62823a187412k28675j47991q7122J6715K48997N49077P04166N81029K86857O209
$$ -1187412 -1416087 -1564078 -1651200 -1634485 -1385488 -836411 -132245 448784 735641 741850
62813G41850k10870l61123l41822j17727J02740J38361J49410L36341M62233J52642
$$ 741850 530980 169857 -171965 -289692 -186952 -48591 100819 437160 899393 1052035
62803A052035l70430m24227J37495O10653L89115k33383n45152l37426J6346J34140
$$ 1052035 681605 257378 394873 1005526 1394641 1161258 616106 278680 295026 429166
62793D29166n9687l98717n76667l53711J28272M19258L00267J1928j64856k12491
$$ 429166 369479 -29238 -605905 -959616 -831344 -412086 -111819 -99891 -264747 -477238
62783d77238j24954J88806N02228K88713m56201q99009m05877N12302Q93021O07155
$$ -477238 -602192 -413386 88842 377555 -78646 -977655 -1383532 -871230 21791 628946
62773F28946K68909J53068Q225j80486j03882J30784j2946n60678q09211l65314
$$ 628946 897855 1050923 1059148 878662 774780 905564 892618 331940 -477271 -842585
62763h42585K42758L78347J51547J2460n571r2564r9977K07740N54964M28809
$$ -842585 -599827 -221480 -69933 -57473 -63044 -155608 -255585 -47845 507119 935928
62753I35928r9787l94578j69518J14650k9214l99012m31377j5400L90237M13274
$$ 935928 836141 441563 272045 386695 357481 -41531 -472908 -488308 -98071 315203
62743C15203K09463J27357J71380N4528k80987m80594k27474L07066O40284N25435
$$ 315203 524666 652023 823403 877931 596944 116350 -111124 195942 836226 1361661
62733A361661J63598r5306j16945m2158q9010l19954n63108n80372l33903k6447
$$ 1361661 1525259 1429953 1313008 1270850 1181840 861886 298778 -281594 -615497 -641944
62723f41944J43382J71815J69576K12659L04238L43425J30677l70810p63515n41422
$$ -641944 -498562 -326747 -157171 55488 359726 703151 833828 463018 -300497 -841919
62713h41919J95396P25953O07940J86843o7078k40493n32192o05425q1293O23753
$$ -841919 -646523 79430 687370 874213 807135 566642 34450 -570975 -652268 -28515
62703b8515P44691L15414N8396J67381Q8685l56889n67671k27726Q8020r1750
$$ -28515 716176 1031590 1089986 1257367 1346052 989163 421492 193766 281786 190036
62693A90036k97614K8897M60106K00381n84540r17237l72464M52477Q42848P07415
$$ 190036 -107578 -78681 381425 581806 -2734 -919971 -1292435 -839958 2890 710305
62683G10305L30679n9314k92339k29701N5493K89044K71612k317m22191p31642
$$ 710305 1040984 981670 689331 459630 515123 804167 1075779 1073462 651271 -80371
62673h0371n69514J01548P00945N85545j11775o21695n46685k71327k47613l51099
$$ -80371 -649885 -548337 152608 738153 626378 4683 -542002 -813329 -1060942 -1412041
62663a412041k32573N8350J83425O4235k4812J43467M97190P88597Q01904M76027
$$ -1412041 -1644614 -1586264 -1402839 -1338604 -1363416 -1219949 -722759 65838 867742 1343769
62653A343769l2731m31424n39839m30300k56053l9672K45664M83807N02556L37774
$$ 1343769 1311038 879614 339775 -90525 -346578 -386250 -140586 343221 845777 1183551
62643A183551K15311K21939J71237j02673m69521o68446o27301m28214p2236M21379
$$ 1183551 1398862 1620801 1792038 1689365 1219844 551398 -75903 -504117 -576353 -154974
62633a54974P17016L84920m05178q14158l20748N04753O77013P1072n21196n50148
$$ -154974 562042 946962 541784 -272374 -593122 -88369 588644 659716 138520 -411628
62623d11628k92725j48624k451L40394N97242M09242j0402j54712J9040J01167
$$ -411628 -704353 -852977 -855428 -515034 82208 491450 481048 326336 345376 446543
62613D46543p8604k38751j50556M5050J27144J05052J13291J82415K10950P6103
$$ 446543 367939 129188 -21368 23682 150826 255878 369169 551584 762534 838637
62603H38637k32819n27564n48617k66797O4884K40594K80744J83081j72350o28586
$$ 838637 605818 78254 -470363 -737160 -672276 -431682 -150938 32143 -140207 -768793
62593g68793o40280J3217P00394O70444J25222o7521L29549O03310K01572m73123
$$ -768793 -1409073 -1395856 -695462 -25018 100204 32683 362232 965542 1167114 693991
62583F93991o87790l17267J92456M44320L28287q8235n56608o96462l53982J58415
$$ 693991 6201 -311066 -118610 325710 653997 565762 9154 -687308 -1041290 -882875
62573h82875L79054J95831r2506j37880J14878L79234L10941p4977l58739k54534
$$ -882875 -503821 -307990 -400496 -538376 -423498 -44264 266677 191700 -167039 -421573
62563d21573l8203j26990l83409l07671J19290L44928R7007k35939k77325j62446
$$ -421573 -459776 -586766 -970175 -1277846 -1158556 -813628 -716621 -952560 -1229885 -1392331
62553a392331q2111J15062M64661N54040J64023j99834j6489L72181K79089j83197
$$ -1392331 -1474442 -1359380 -894719 -340679 -176656 -376490 -392979 -20798 258291 75094
62543G5094k56500K23661N40941K18005k74501k72142J42463L80390J95584j34151
$$ 75094 -181406 42255 583196 801201 526700 254558 397021 777411 972995 838844
62533H38844k96882k29694K5129L97784O62320N04466r3900o63299o74827j86360
$$ 838844 541962 312268 337397 735181 1397501 1901967 1808067 1144768 469941 283581
62523B83581J61959n7674m78414m35438R8465M98660M07872J65942J46476J72698
$$ 283581 445540 387866 -90548 -525986 -427521 71139 479011 644953 791429 964127
62513I64127m8097l31743l36761j71479j52741j69034J35403O27476P23826K19860
$$ 964127 916030 584287 247526 76047 -76694 -245728 -110325 517151 1240977 1460837
62503A460837m13980o69691n20035k04981R6733K53493J93316O7477J10301K60585
$$ 1460837 1046857 377166 -142869 -347850 -251117 2376 195692 263169 373470 634055
62493F34055K32720M970j35823j04837j58375l92993n25656l66455j22370p684
$$ 634055 866775 871745 735922 631085 472710 79717 -445939 -812394 -934764 -942448
62483i42448Q4796K83984M59568M89538M62766L61005o3075p42914j029529m54158
$$ -942448 -857652 -573668 -114100 375438 838204 1199209 1136134 393220 -636309 -1090467
62473a090467N02289R14376N36209n6794l30534k78913p0053K54522N72084N89522
$$ -1090467 -588178 326198 862407 805613 475079 196166 126113 380635 952719 1542241
62463A542241K17312j98663k39892R0884L67676J95335l64427p99746o51987o5536
$$ 1542241 1759553 1560890 1320998 1411882 1779558 1974893 1610466 810720 158733 93197
62453I3197L19624J48042j93796j43694K25486L49942K9498l18557l09308o4409
$$ 93197 412821 560863 367067 223373 448859 798801 828299 509742 200434 136025
62443A36025J20962K14490L12772L60476K87222K26220L00845L19055q048n69811
$$ 136025 256987 471477 784249 1144725 1431947 1658167 1959012 2278067 2270019 1700208
62433A700208q68365o07142o4883K38983J26416j24401j72105L8689L21825M81919
$$ 1700208 831843 224701 159818 398801 525217 400816 228711 267400 589225 1071144
62423A071144M19569J35738k20179l87563k63333q9237j53072l25741j94206K74616
$$ 1071144 1490713 1626451 1406272 1018709 755376 666139 513067 187326 -6880 267736
62413B67736N47482K17244m01695o67458m02466K3743K58514K84325K53148K91469
$$ 267736 815218 1032462 630767 -36691 -439157 -415414 -156900 127425 380573 672042
62403F72042M10037M02101J0330n61721o31155K5086N59405Q3444r09973j068956
$$ 672042 1082079 1484180 1494510 932789 301634 326720 886125 969569 59596 -1009360
62393a009360j41913O31364M05007q1198J29650O31752M74982j37005k20749K57453
$$ -1009360 -1151273 -519909 -114902 -196100 -66450 565302 1040284 903279 682530 939983
62383I39983L47460j99764n15095j70251P3830l36922o82756j60856O72595O87414
$$ 939983 1287443 1087679 572584 402333 476163 139241 -543515 -704371 -31776 655638
62373F55638r4705o36698n14296l31487m79439n04940l3883N09194N93356L88307
$$ 655638 560933 -75765 -590061 -921548 -1400987 -1905927 -1939810 -1430616 -837260 -448953
62363d48953L41026L82885J41178l13251n08347k96062n0037q3941k47120k28130
$$ -448953 -107927 274958 416136 102885 -405462 -701524 -751561 -835502 -1082622 -1310752
62353a310752n989J63572R7877r4888j40675P4184L34517L49700J61629J03849
$$ -1310752 -1316741 -1153169 -1055292 -1150180 -1290855 -1216671 -882154 -532454 -370825 -266976
62343b66976K99298M65824L78078K21270K07379J41103k08393n42952m04190Q479
$$ -266976 32322 498146 876224 1097494 1304873 1445976 1237583 694631 290441 298920
62333B98920M5159l28421l90306J76100O98086N41219Q7348N6676L49864L32362
$$ 298920 344079 15658 -374648 -198548 499538 1040757 1128105 1184781 1534645 1867007
62323A867007m8055k70134k19182k82416m44138j88370M66460O96580P3076o90003
$$ 1867007 1818952 1548818 1329636 1047220 603082 414712 881172 1577752 1650828 960825
62313I60825p38902k37612R9913J33441K21492L64369K17041j67103l34122j76951
$$ 960825 221923 -15689 84224 217665 439157 803526 1020567 853464 519342 342391
62303C42391n4887j19808j13686O6711J64519P3978M5108J92957K69223J19442
$$ 342391 287504 167696 54010 120721 285240 359218 404326 597283 866506 985948
62293I85948p3218j91662l70242n57856m00053J26948M55454K14593j56020p3358
$$ 985948 912730 721068 350826 -207030 -607083 -480135 -24681 189912 33892 -39466
62283c9466K80645K96305p9787l28146k06795q676K8725J5787M0888M981n7195
$$ -39466 241179 537484 457697 129551 -77244 -85920 -57195 -41408 -520 4461 -52734
62272e2734N6019K69694J82178l14775p19569n05642K06644Q08321Q74856M89485
$$ -52734 3285 272979 455157 140382 -579187 -1084829 -878185 -69864 804992 1294477
62262A294477K9577j86588j05413Q6005J87618J64903M9649j93404n06684n99013
$$ 1294477 1324054 1137466 1032053 1118058 1305676 1470579 1520228 1326824 820140 221127
62252B21127k84548J34010K07427M485l2545J17290p37m37450n67213n2395N20389
$$ 221127 -63421 70589 278016 282501 249956 367246 366509 -70941 -638154 -690549 -170160
62241a70160M95709J52639J92703N55857N03148k12223r56998j079186o03624
$$ -170160 325549 478188 670891 1226748 1729896 1517673 560675 -518511 -1122135
62232a122135L4389M59445M39467l6977n85895p02782l66271l1330P0886J97216
$$ -1122135 -1087746 -628301 -188834 -225811 -811706 -1514488 -1880759 -1912089 -1841203 -1643987
62222a643987M86549N65155J12152n17190o55915j59595M68122P01229M64878
$$ -1643987 -1157438 -592283 -480131 -997321 -1653236 -1812831 -1344709 -643480 -178602
62213a78602M2576k28591j57724K04966N85394O56807K71455l82696q15470n93526
$$ -178602 -136026 -364617 -522341 -317375 268019 924826 1196281 813585 -1885 -595411
62203e95411J45264O90995N56524J09705P403J75242l255n02817n19055J77970
$$ -595411 -450147 240848 797372 907077 914480 1089722 1086467 583650 64595 242565
62193B42565O28304O9583p84484p52389K5845L72813p4637m41465j28361L53743
$$ 242565 870869 940452 155968 -596421 -570576 -197763 -272400 -713865 -842226 -488483
62183d88483M24344L31944M40785M30614n1846n37824l66322J88611K58983k95904
$$ -488483 -64139 267805 708590 1139204 1087358 549534 183212 371823 630806 334902
62173C34902p01718m41574Q1765K51834O1027n8832J29941M81348P05652O14589
$$ 334902 -366816 -808390 -726625 -474791 -413764 -472596 -342655 138693 844345 1458934
62163A458934K60774q0906j91413j57453j73662j75006L8366L46366L66550M3275
$$ 1458934 1719708 1638802 1447389 1289936 1116274 941268 979634 1326000 1692550 1735825
62153A735825k10320j24096M5368j4427j58383p9915J36188J59863k5215j20943
$$ 1735825 1525505 1401409 1446777 1432350 1273967 1194052 1330240 1490103 1464888 1343945
62143A343945m2489n6439l13609n64735n00506j65559J34490K19598J80047J79991
$$ 1343945 1301456 1245017 931408 366673 -133833 -299392 -164902 54696 234743 414734
62133D14734K28198J80991l2195k30960j44425K05917M34065K43374j68096l58491
$$ 414734 642932 823923 791728 560768 416343 622260 1056325 1299699 1131603 773112
62123G73112k21904p3657j67838l78940m23920k07401J16963K79787Q8250l23687
$$ 773112 551208 477551 309713 -69227 -493147 -700548 -583585 -303798 -215548 -539235
62113e39235m64706R629P40090R64328M80174q7134j89543q9357k95965o54805
$$ -539235 -1003941 -994312 -254222 710106 1190280 1103146 913603 824246 528281 -126524
62103a26524n99054j36476R7110j53132l25879R9954P92315J007057N46591j25153
$$ -126524 -725578 -862054 -764944 -918076 -1243955 -1144001 -351686 655371 1201962 1076809
62093A076809n54711o87841o37193m33526j11574J76945K67968J34085j01047
$$ 1076809 522098 -165743 -802936 -1236462 -1348036 -1171091 -903123 -769038 -870085
62084h70085k41956j46891J25074L03865J51496k56084n46091l73524K61131R63355
$$ -870085 -1112041 -1258932 -1133858 -829993 -678497 -934581 -1480672 -1854196 -1593065 -629710
62074f29710J206995P65479k6255n22930l93312N3305K48006r763m20743n96674
$$ -629710 577285 1342764 1316509 793579 400267 453572 701578 691815 271072 -325602
62064c25602m27935p4181K17646K52660J5936k59025k70617J5693K99341K88748
$$ -325602 -753537 -827718 -610072 -357412 -341476 -600501 -871118 -855425 -556084 -267336
62054b67336L2263j85452k06345j26124p0949J538J80505L58345K75675j21301
$$ -267336 -235073 -420525 -626870 -752994 -823943 -822405 -641900 -283555 -7880 -129181
62044a29181m84266l91242J23563N31672L95080j22931m60978l05806J16729L79988
$$ -129181 -613447 -1004689 -881126 -349454 45626 -77305 -538283 -844089 -727360 -347372
62034c47372L23780J25599J7410L2257J7960j44897l66286m32335k85646j22425
$$ -347372 -23592 102007 119417 151674 169634 24737 -341549 -773884 -1059530 -1181955
62024a181955j00879m6723L22798Q65370R87754L55160n54793r07269m90490N5298
$$ -1181955 -1282834 -1329557 -1006759 -141389 846365 1201525 646732 -260537 -751027 -695729
62014f95729P1542l33955n44017k71157J77692M20001M36296L87019K78585L6486
$$ -695729 -624187 -958142 -1502159 -1773316 -1595624 -1175623 -739327 -352308 -73723 -37237
62004c7237k45478l66465k75482r5371N6516J25106Q5395L2436J88781N67296
$$ -37237 -282715 -649180 -924662 -1020033 -963517 -838411 -753016 -720580 -531799 35497
61994C5497P29819K50686n73415q98604l73607L76457N59848J80834j56517j55061
$$ 35497 765316 1016002 442587 -456017 -829624 -453167 106681 287515 130998 -24063
61984b4063q4246k10009m00398l89999j39190J94588M53858N50996M74963L08441
$$ -24063 -108309 -318318 -718716 -1108715 -1247905 -1053317 -599459 -48463 426500 734941
61974G34941J69772J14623J23418J19273m1008m28052p75868n93530J92809R09656
$$ 734941 904713 1019336 1142754 1262027 1221019 792967 17099 -576431 -383622 526034
61964E26034Q37194J46658l04861j21621J78326J3174m33063n68526k58561Q4539
$$ 526034 1363228 1509886 1205025 1083404 1261730 1274904 841841 273315 14754 99293
61954I9293J40612K5080j5087M0200K2104j84984n16560p71996p54878m23896
$$ 99293 239905 264985 249898 290098 312202 127218 -389342 -1161338 -1916216 -2340112
61944b340112O1118M43088N27660K98400n3545k41387j16833K03153M90923O29207
$$ -2340112 -2278994 -1835906 -1308246 -1009846 -1063391 -1304778 -1421611 -1218458 -727535 -98328
61934i8328N99880L71939j7410l46519l99382k51156j60174k09346k75125k94439
$$ -98328 501552 873491 856081 509562 110180 -140976 -301150 -510496 -785621 -1080060
61924a080060k83471j44400J95256M67309L10113j12692k12997J55389M37987
$$ -1080060 -1363531 -1507931 -1312675 -845366 -535253 -647945 -860942 -705553 -267566
61915b67566K48395k5868R1224L32738J30239m01377n80351j83132K53545K30011
$$ -267566 -19171 -45039 46185 378923 509162 107785 -472566 -655698 -402153 -172142
61905a72142j16750l63900l58447k23085q3602R098M0754N3687J21019K52776
$$ -172142 -288892 -652792 -1011239 -1234324 -1317926 -1308828 -1268074 -1214387 -1093368 -840592
61895h40592L88417M46402L13899q4408n75042p69553n25666k01404j75885k92853
$$ -840592 -452175 -5773 308126 223718 -351324 -1120877 -1646543 -1847947 -2023832 -2316685
61885b316685j34348K96946O02225O22761N73758N24059K43781k88116o72122
$$ -2316685 -2451033 -2154087 -1551862 -929101 -355343 168716 412497 124381 -547741
61876e47741o02583k44535R4542L21870L88869J50533l01012m96162j61748L03753
$$ -547741 -1150324 -1394859 -1300317 -978447 -589578 -439045 -740057 -1236219 -1397967 -1094214
61866a094214L34228P439r7719J95679L78391J4863n83210p25642k13318M50244
$$ -1094214 -759986 -752547 -850266 -654587 -276196 -261333 -844543 -1570185 -1783503 -1333259
61856a333259O98053M97716K07705M4359n6557j22813l3328J64909J48713k11568
$$ -1333259 -635206 -137490 70215 114574 58017 -64796 -98124 66785 215498 3930
61846C930n16439l19731K11224N14131M17634K58174K22772Q4729k64898m94647
$$ 3930 -512509 -832240 -621016 -106885 310749 568923 791695 876424 611526 116879
61836A16879l08142J03322L48080K96871M0774l10175n46277l94590O9541L42659
$$ 116879 -191263 -87941 260139 557010 597784 287609 -258668 -653258 -583717 -241058
61826b41058J46402j35288m4222K29723J98379q5592j25750J66599L24439R8202
$$ -241058 -94656 -229944 -274166 -44443 153936 68344 -57406 109193 433632 531834
61816E31834j75332j54227L0735J15579J15251J16615J2867k21001k78589N3115
$$ 531834 356502 202275 233010 348589 463840 580455 593322 372321 93732 146847
61806A46847M11279K42715l82782p68290m64507K09359O48552O44929L80818K6625
$$ 146847 558126 800841 418059 -350231 -814738 -605379 43173 688102 1068920 1095545
61796A095545l24136m67645k23229K21948M20199K17502n6216p4799N9317O4005
$$ 1095545 771409 303764 80535 302483 722682 940184 883968 809169 868486 932491
61786I32491p8199j81553j97346k04415j67387n025J59235J14954q9918k04983
$$ 932491 854292 672739 475393 270978 103591 98566 257801 372755 282837 77854
61776G7854j57046q2241j3414J19790J90932j5456l43391l54637o245K16832N1039
$$ 77854 -79192 -161433 -174847 -55057 135875 120419 -222972 -577609 -583854 -367022 -315983
61765c15983j25446P7341M37034N06635K67609j5223k63409m59047l65468Q8149
$$ -315983 -441429 -364088 72946 579581 847190 831967 568558 109511 -255957 -167808
61755a67808L94337N4243n73625o69901j51441K28914O5899j42316R3571M44465
$$ -167808 226529 280772 -292853 -962754 -1114195 -885281 -819382 -961698 -868127 -423662
61745d23662L47854o9078k25177J6265K51108K42168J96411K77544K91070M5050
$$ -423662 -75808 -144886 -370063 -353798 -102690 139478 335889 613433 904503 949553
61735I49553k89464m17930l21225j72301n896K28596L57644J07722l73210n04530
$$ 949553 660089 242159 -79066 -251367 -257263 -28667 328977 436699 63489 -441041
61725d41041m0983M68442L74627j55968m14029j96123K5521r268K1488K86882
$$ -441041 -482024 -13582 361045 205077 -208952 -405075 -379554 -388822 -367334 -80452
61715h0452L70601j0734m18936l45675P34J25958O9582J61075K92078J51475m5217
$$ -80452 290149 279415 -139521 -485196 -484462 -358504 -288922 -127847 164231 315706 270489
61704B70489J59317N54691M36303k79523q70271q55351n16130k00999J69070O18012
$$ 270489 429806 984497 1420800 1141277 271006 -584345 -1100475 -1301474 -1132404 -514392
61694e14392P96787N29153J55144k0723j44939l47025l54562J5036M02930L86496
$$ -514392 282395 811548 966692 945969 801030 454005 99443 114479 517409 903905
61684I03905Q0490j28108j42499q8084K3422J92118K43762P9528j21001k17609
$$ 903905 984395 856287 713788 625704 649126 841244 1085006 1164534 1043533 825924
61674H25924l41744n38650n21745j21574L44817N08579M38984L48087J61297k01540
$$ 825924 484180 -54470 -576215 -697789 -352972 155607 594591 942678 1103975 902435
61664I02435m58796l52166j04305k6958J0064K00659K33747k44424q38901q02580
$$ 902435 443639 91473 -12832 -39790 -29726 170933 404680 160256 -678645 -1481225
61654a481225j32302M24755M42260K15055N0012j40534l63120l07606J10442M65668
$$ -1481225 -1613527 -1188772 -746512 -531457 -481445 -621979 -985099 -1292705 -1182263 -716595
61644g16595L94915P8983j09034r6704l52J69999M10863N44903L93238J3421l73324
$$ -716595 -321680 -242697 -351731 -448435 -448787 -278788 132075 676978 1070216 1083637 710313
61633G10313n79712n27079k88818r2989r9680j68171n0103K05769K95879J10919
$$ 710313 130601 -396478 -685296 -778285 -877965 -1046136 -1096239 -890470 -594591 -483672
61623d83672j15233j18858J55828N82970Q67774O54880j8902n04211k40596L92061
$$ -483672 -598905 -717763 -561935 21035 888809 1543689 1524787 1020576 779980 1172041
61613A172041M83399j30693o38408m53067J3444R5757j95326m22203m22497k79109
$$ 1172041 1655440 1524747 886339 433272 446716 542473 347147 -75056 -497553 -776662
61603g76662L0284M46839N85018J86532l74773n07968j71861J95005L42734L54411
$$ -776662 -746378 -299539 285479 472011 97238 -410730 -582591 -387586 -44852 309559
61593C09559K59366L843k28868j45269J68816K94182P5538j96503k65143j97862
$$ 309559 568925 572768 343900 198631 367447 661629 737167 540664 275521 77659
61583G7659r5933J10896L89415M37485O2697m53363o22001l11978J22109K46027
$$ 77659 -18274 92622 482037 919522 982219 528856 -93145 -405123 -283014 -36987
61573c6987j7890l33234k86704J66538N92460N15500k5869n07028n42341k97813
$$ -36987 -54877 -388111 -674815 -508277 84183 599683 573814 66786 -475555 -773368
61563g73368j58050j67243n3067K59754M68175L26891K0070j17100r1201j72123
$$ -773368 -931418 -1098661 -1151728 -891974 -423799 -96908 -76838 -193938 -285139 -457262
61553d57262l73042l65265k1663K92096K22468l2053l2370K10165K68401j0895
$$ -457262 -830304 -1195569 -1217232 -925136 -702668 -734721 -767091 -556926 -288525 -299420
61543b99420k81030k44749l4423J31160L11748N88743P05215L19594m56017j046904
$$ -299420 -580450 -825199 -859622 -728462 -416714 172029 877244 1196838 740821 -306083
61533c06083r75551l14680L95639O26418L32953j2145L2374L12510K93478j39689
$$ -306083 -1281634 -1596314 -1200675 -574257 -241304 -253449 -221075 91435 384913 245224
61523B45224m50423k09649K56952L27784l6396k96738j40634J41118J58371k8720
$$ 245224 -205199 -414848 -157896 169888 133492 -163246 -303880 -162762 -4391 -33111
61513c3111m9120K52474O02407N99514J67113l36434n02908l24051j13982j2219
$$ -33111 -82231 170243 772650 1372164 1539277 1202843 699935 375884 261902 249683
61503B49683J58442M43762N12019J44346k89812k56645J57434L17611q5413o31302
$$ 249683 408125 851887 1363906 1508252 1218440 961795 1119229 1436840 1351427 720125
61493G20125p58864m27557n216K43895L11440K42457O0501j15887j06719Q4301
$$ 720125 -38739 -466296 -471512 -227617 83823 326280 386781 270894 164175 248476
61483B48476J84916l9713m25323n22061j45806L36310M35488J39806j52795k20684
$$ 248476 433392 393679 -31644 -553705 -699511 -363201 72287 212093 59298 -161386
61473a61386k08887k20193j09227J53581K71496M4183k69855l07913j05493N2434
$$ -161386 -370273 -590466 -699693 -546112 -274616 -230433 -500288 -808201 -913694 -861260
61463h61260R1910J48369K60898L77775N25778O71085N72629J18391l39815l72567
$$ -861260 -769350 -620981 -360083 17692 543470 1214555 1787184 1905575 1565760 1193193
61453A193193q3192O6369n4849j68403j44764j66190l00365l60296k74087j93829
$$ 1193193 1110001 1176370 1121521 953118 808354 642164 341799 -18497 -292584 -486413
61443d86413j50284J3730K77719L98595L25172K68225K68559J23016j42950k01868
$$ -486413 -636697 -622967 -345248 53347 378519 646744 915303 1038319 895369 693501
61433F93501p842L2754k60785m67383k17121K00934K98467J01371m7385r7857
$$ 693501 685659 718413 457628 -9755 -226876 -25942 272525 373896 326511 228654
61423B28654k03948k43183K4437M00458L79263j10969n27488m00704J03543M45521
$$ 228654 24706 -218477 -194040 206418 585681 474712 -52776 -453480 -349937 95584
61413I5584L31188m7001k80426j87286O247j5271j85387j41069J48718J96733
$$ 95584 426772 379771 99345 -87941 -81694 -96965 -282352 -423421 -274703 -77970
61403g7970k91931q51845q25163k80014J37987J61470J51662L60970N12176L27328
$$ -77970 -369901 -1221746 -2046909 -2326923 -2188936 -2027466 -1875804 -1514834 -1002658 -675330
61393f75330J5854p9998j042M017o0654q075J27989J17035m8656p4402J91674
$$ -675330 -659476 -739474 -740516 -736499 -797153 -805228 -677239 -560204 -608860 -683262 -491588
61382d91588M59871L35197j37517m72581l34607L6984J55969m8870j60982Q4778
$$ -491588 -31717 303480 165963 -306618 -641225 -604241 -448272 -497142 -658124 -573346
61372e73346L83885L11041k2614j11817J95677M63096K80958j70708l76438j39115
$$ -573346 -189461 121580 98966 -12851 182826 645922 926880 756172 379734 240619
61362B40619K25307K97242J3302k99609l03106m1248J04367q5564l29610k05815
$$ 240619 465926 763168 776470 476861 173755 132507 236874 151310 -178300 -384115
61352c84115K17872M24914J82700j13963m5676J95008J35551j96512k97073R858
$$ -384115 -166243 258671 441371 327408 281732 476740 612291 415779 118706 128564
61342A28564K75942J39734p3635J51277O54918P18509O2201o98432p96011k39226
$$ 128564 404506 544240 470605 621882 1276800 1995309 2057510 1359078 563067 323841
61332C23841K65111J78146l45319p59074p15929l01877J53073L84457L55955J85444
$$ 323841 588952 767098 421779 -337295 -1053224 -1355101 -1202028 -817571 -461616 -276172
61322b76172l2150k56140l78760k55167M7908K22800J28370N2002K89518O11657
$$ -276172 -308322 -564462 -943222 -1198389 -1150481 -927681 -799311 -747309 -457791 153866
61312A53866N38765R5839j74683l9420Q1546j63566m57080l29980P5347K53665
$$ 153866 692631 788470 613787 574367 655913 492347 35267 -294713 -219366 34299
61302C4299J19879J1004K6195o9319k79860k92588q5564p5475m01462n52196q9190
$$ 34299 154178 165182 191377 122058 -157802 -450390 -535954 -611429 -1012891 -1565087 -1654277
61291a654277O36033R33462O70792K43066j42320n78989r20464p50993o9974N06713
$$ -1654277 -1018244 -84782 586010 829076 686756 107767 -812697 -1563690 -1633664 -1126951
61281a126951N16421K24432J07121J26605m0127l13513l00899O176J73371L7642
$$ -1126951 -610530 -386098 -278977 -152372 -192499 -506012 -806911 -800735 -627364 -589722
61271e89722k6609K43417N26115M07476J5436k09701j61328r8642j57767k09977
$$ -589722 -616331 -372914 153201 560677 576113 366412 205084 106442 -51325 -261302
61261b61302j74707j35754j13079O615K49662M64347M91203K87490p9102m02830
$$ -261302 -436009 -571763 -684842 -678227 -428565 35782 526985 814475 735373 332543
61251C32543m02134m3012K80857J71926k15613l51986n3975K91396K66993j06374
$$ 332543 -69591 -112603 168254 340180 124567 -227419 -281394 10002 276995 170621
61241A70621n02258o28273l95036Q57J55686j13691m58151m25707j18364P148
$$ 170621 -331637 -959910 -1354946 -1354089 -1198403 -1312094 -1770245 -2195952 -2314316 -2307168
61231b307168p2162Q0390N48080Q42972O88821M25200L68541L52462K18934J68385
$$ -2307168 -2379330 -2298940 -1750860 -907888 -219067 206133 574674 927136 1146070 1314455
61221A314455K25264l6121p24418j164095q05859j03838J83235J05617J83588
$$ 1314455 1539719 1503598 779180 -384915 -1190774 -1294612 -1111377 -1005760 -822172
61212h22172L57512J55841l19958m76965k25176n8341j40318j03930J74270L54873
$$ -822172 -464660 -308819 -628777 -1105742 -1330918 -1389259 -1529577 -1633507 -1459237 -1104364
61202a104364L08752K98931L44022R1665m69944q10519o01703j12415L15226O25657
$$ -1104364 -795612 -496681 -152659 -60994 -530938 -1341457 -1943160 -2055575 -1740349 -1114692
61192a114692P34614M68127K8357p1391K31196M17297K25661R827K1294q339k51454
$$ -1114692 -380078 88049 116406 45015 276211 693508 919169 928996 950290 941951 690497
61181F90497l93627k41416j24274k85886m42455l52213k47602k78798j38422K77652
$$ 690497 296870 55454 -68820 -354706 -797161 -1149374 -1396976 -1675774 -1814196 -1536544
61171a536544M66329J42633j46100J14817N13756M33401J30653K29126N47192
$$ -1536544 -1070215 -927582 -1073682 -958865 -445109 -11708 118945 348071 895263
61162H95263L84959k51444o47476n17229k84526k30911j56770M1373J65705J84577
$$ 895263 1280222 1028778 381302 -135927 -420453 -651364 -808134 -766761 -601056 -416479
61152d16479K84247L93125K51363r359L1236L49922M64089K08184r0060k67332
$$ -416479 -132232 260893 512256 502897 534133 884055 1348144 1556328 1466268 1198936
61142A198936m94253o83844m43280J66721N02458K61186q0432o9467P9665J7673
$$ 1198936 704683 20839 -422441 -255720 246738 507924 427492 358025 437690 455363
61132D55363j31474j39778j55049l25766l76222p5404K32516J20034j84429j33887
$$ 455363 323889 184111 29062 -296704 -672926 -748330 -515814 -395780 -580209 -714096
61122g14096K44879M03475J63166l9861R8191K74962J03121k67566l90000j94861
$$ -714096 -469217 -65742 97424 57563 155754 430716 533837 266271 -123729 -318590
61112c18590o2436k11931l41164q2572L65130M08506r9991n46322l18198L62632
$$ -318590 -381026 -592957 -934121 -1016693 -651563 -243057 -343048 -889370 -1207568 -844936
61102h44936P09383L50783l06837o59710n08596n3734L95743O04057N13936K66601
$$ -844936 -135553 215230 -91607 -751317 -1259913 -1313647 -917904 -313847 200089 466690
61092D66690L2863j22234j25728J23186M39631L27486l30512q42932n26619K59934
$$ 466690 499553 377319 251591 374777 814408 1141894 811382 -31550 -558169 -298235
61082b98235N74880K52031k896J26694J43236j98296l53002p29K53636j35531
$$ -298235 276645 528676 525780 652474 795710 597414 244412 243683 497319 361788
61072C61788o68994n80744n6677J69849M1926J02925M28300N36943L18107K04789
$$ 361788 -307206 -887950 -944627 -774778 -732852 -629927 -201627 335316 653423 858212
61062H58212L34794K91459j25916n13699n04633k86651k10844k73921k35411L2365
$$ 858212 1193006 1484465 1358549 844850 340217 53566 -157278 -431199 -666610 -634245
61052f34245M56722P75716O18951p2472p04223n65886K02181O65614K86648m30127
$$ -634245 -177523 598193 1217144 1144672 440449 -125437 76744 742358 1029006 598879
61042E98879p19975m89482j18616K03907M61761M66042Q9994l21426l05414L0323
$$ 598879 -121096 -610578 -729194 -525287 -63526 402516 492510 171084 -134330 -104007
61032a04007J66963j0729q4670J46383L35799K26602J11304K73799L74987p3935
$$ -104007 62956 52227 -32443 113940 449739 676341 787645 1061444 1436431 1362496
61022A362496q31669j103260o02726Q4807L39607K35000J74480K06803R4969j69413
$$ 1362496 530827 -572433 -1175159 -1090352 -750745 -515745 -341265 -134462 -39493 -208906
61012b08906l31747k65706p6562J20017K48194J97571q051p8085J68481M01964
$$ -208906 -540653 -806359 -882921 -762904 -514710 -317139 -325190 -403275 -234794 167170
61002A67170J74336l43785n04142j01814L44159L63713J02675q8624j61936j77563
$$ 167170 341506 -2279 -506421 -608235 -264076 99637 202312 113688 -48248 -225811
60992b25811k5205L07295N15792L73459O5035j57185l20863m34530k48327K56364
$$ -225811 -251016 56279 572071 945530 1010565 853380 532517 97987 -150340 106024
60982A06024N23439J20318n10378o07752j94408M4363j24584k18046M6951K81591
$$ 106024 629463 749781 239403 -368349 -562757 -518394 -642978 -861024 -814073 -532482
60972e32482J19760j97640k76831j65424j13836p4006J52047M52644M91774K11787
$$ -532482 -412722 -610362 -887193 -1052617 -1166453 -1240459 -1088412 -635768 -143994 67793
60962F7793o0561o4328N2430l5782l50323n25287k69839K13423M59277L43026
$$ 67793 7232 -57096 -4666 -40448 -390771 -916058 -1185897 -972474 -513197 -170171
60952a70171J86186K11446K15513l4079l73245m82557l30109j05947P2972J31818
$$ -170171 16015 227461 442974 408895 35650 -446907 -777016 -882963 -809991 -678173
60942f78173l3316k91006k23356K88587P23779O11675K60883K51766M87585M28554
$$ -678173 -711489 -1002495 -1225851 -937264 -213485 398190 659073 910839 1398424 1826978
60932A826978O7044j16387q7348k85654o49235n15507K28000P42662M29242k06805
$$ 1826978 1894022 1777635 1690287 1404633 755398 239891 467891 1210553 1639795 1432990
60922A432990m10173k67251l15094n47716n17759j60792J30702J53766R7419J28846
$$ 1432990 1022817 755566 440472 -107244 -625003 -785795 -655093 -501327 -403908 -275062
60912b75062J74416J24734n35q3695J8384L19929N58127M25257K1975k25692j82411
$$ -275062 -100646 24088 23553 -60142 -41758 278171 836298 1261555 1283530 1057838 875427
60901H75427j36845j98375p4346K95911M33663O1755l25325j39657M23939P05256
$$ 875427 738582 540207 465861 761772 1195435 1257190 931865 792208 1216147 1921403
60891A921403M64817l8654n46751q59946p01381r4629L70370K22955j76813k10710
$$ 1921403 2386220 2347566 1800815 940869 239488 144859 515229 738184 561371 350661
60881C50661j4997j84987o49318o97863j60796K80103J62860j17161o1039J77659
$$ 350661 335664 150677 -498641 -1196504 -1357300 -1077197 -914337 -1031498 -1092537 -914878
60871i14878K02449N3815L3782J69908K51014J99709J04529K1597l5499k5177
$$ -914878 -712429 -658614 -624832 -454924 -203910 -4201 100328 121925 86426 61249
60861F1249N7664J56504K53852L49053L32137J02828j74694k11073l2498J1512
$$ 61249 118913 275417 529269 878322 1210459 1313287 1138593 927520 895022 906534
60851I06534k29712m68202m01215j30753J6180p0605j78737n4160K68912M25395
$$ 906534 676822 208620 -192595 -323348 -307168 -377773 -556510 -610670 -341758 83637
60841H3637J22058l71745m09624J53002O06061L01856l91590o12282k43208P5241
$$ 83637 205695 -166050 -575674 -422672 183389 485245 93655 -518627 -761835 -686594
60831f86594P0383J50745M75316N41670O2436m34977l58984J06364L71431K39502
$$ -686594 -616211 -465466 9850 551520 613956 178979 -180005 -73641 297790 537292
60821E37292p9570l75337m60499j50869L87148O10088K85318j48761k54432j93707
$$ 537292 457722 82385 -378114 -528983 -141835 468253 753571 604810 350378 156671
60811A56671k45605k15968J10331L67206J32957k75306k56448P8151J39965o6941
$$ 156671 -88934 -304902 -194571 172635 305592 30286 -226162 -148011 -8046 -74987
60801g4987L9657N32400P44611L09528l03802n51479m72228l02997m6261K28755
$$ -74987 -35330 497070 1241681 1551209 1247407 695928 223700 -79297 -125558 103197
60791A03197K02095j66897l92492j82271J9400k89041p87839p24764p770O63886
$$ 103197 305292 138395 -254097 -436368 -416968 -706009 -1493848 -2218612 -2226382 -1562496
60781a562496P39391L94971R8045M065l7036j34679k16380j48666Q1169K78828
$$ -1562496 -823105 -428134 -330089 -326024 -363060 -497739 -714119 -862785 -781616 -502788
60771e02788J92884j63354m36906l28053L8444L18292M13731M68418M65753K00474
$$ -502788 -309904 -473258 -910164 -1238217 -1199773 -881481 -467750 668 466421 666895
60761F66895k64371m71971j45214L54766M44123O1903l11782l35149j64966p1746
$$ 666895 402524 -69447 -214661 140105 584228 646131 334349 -800 -165766 -237512
60751b37512k5895J18362K56286J52575j54775l60401l12431j73589j08410o6917
$$ -237512 -263407 -145045 111241 263816 109041 -251360 -563791 -737380 -845790 -912707
60741i12707l194n2771k58564l16081O4825O00374O21237n2009p37694o58723
$$ -912707 -915901 -968672 -1227236 -1543317 -1478492 -878118 -256881 -308890 -1046584 -1705307
60731a705307J02615P25846O63733J97122q2836r746J66624K72899L32710K73465
$$ -1705307 -1602692 -876846 -213113 -15991 -98827 -108573 58051 330950 663660 937125
60721I37125q3685o27039q74910n28020R4129M10529K48047p2611k12411j17826
$$ 937125 853440 226401 -648509 -1176529 -1082400 -671871 -423824 -496435 -708846 -826672
60711h26672R4049K81081K91744P3009j83725j91414Q2387L52388L23954m2674
$$ -826672 -732623 -451542 -159798 -86789 -270514 -461928 -379541 -27153 296801 254127
60701B54127n21141p32731l96325L03520P32073N03223L2155k1271K64180K23981
$$ 254127 -267014 -999745 -1396070 -1092550 -360477 142746 174901 153630 417810 641791
60691F41791k65021n38597k51052K6473k12950n02278j58431N44819P75520M24830
$$ 641791 376770 -161827 -412879 -386406 -599356 -1101634 -1260065 -715246 60274 485104
60681D85104J35979J66990R9071k34887l64484j0119L90441L68302R8061j6972
$$ 485104 621083 788073 887144 652257 287773 277654 668095 1036397 1134458 1117486
60671A117486J5122k1008p1470J606L2292j88751m56719m19078j88545k15307
$$ 1117486 1132608 1111600 1040130 1041736 1074028 885277 428558 9480 -179065 -394372
60661c94372n40341o29246j10911O49592R65339O47153J59483p237J10612J36776
$$ -394372 -934713 -1563959 -1674870 -1025278 -59939 587214 746697 739460 850072 986848
60651I86848n1482j66702M042K09476N7267m09641p50798p03007m13248q0363
$$ 986848 935366 768664 772706 982182 1039449 629808 -120990 -823997 -1237245 -1317608
60641a317608K88843O41946P36536M74280J37126K5873N2418k9145j64131j33766
$$ -1317608 -1028765 -386819 349717 823997 961123 986996 1039414 1010269 846138 712372
60631G12372n4336k92355p92952r19052k54639O95125R99151M28896k93832m52924
$$ 712372 658036 365681 -427271 -1346323 -1600962 -905837 93314 522210 228378 -224546
60621b24546j60329K7045j6955L6786K44318K11368k03142n13386k75649K38611
$$ -224546 -384875 -357830 -374785 -337999 -93681 117687 -85455 -598841 -874490 -635879
60611f35879M51710K93952J52626J91283K09921R1522q9698l47982o82404p39021
$$ -635879 -184169 109783 262409 453692 663613 755135 665437 317455 -364949 -1103970
60601a103970j50708P30340J045914N50085o2934j81660l0333n3232j40652P721
$$ -1103970 -1254678 -524338 521576 1071661 1008727 827067 796734 743502 602850 610571
60591F10571K09597J07085j48016j30458J08687J18604j93164m26541l38517j53031
$$ 610571 820168 927253 779237 648779 757466 876070 682906 256365 -82152 -235183
60581b35183j31724k19642k45226j94673j65864k13610k89669k47943J7067L44585
$$ -235183 -366907 -586549 -831775 -1026448 -1192312 -1405922 -1695591 -1943534 -1926467 -1581882
60571a581882M06711J89942J15451M20940P13648N17480R868k56357j73021q4540
$$ -1581882 -1175171 -985229 -869778 -448838 264810 782290 792158 535801 362780 278240
60561B78240r5568L5503L06757L59876P3724k31434l21590l16609k87897o9006
$$ 278240 182672 218175 524932 884808 958532 727098 405508 88899 -198998 -268004
60551b68004L15990M71789J59149l26636n48970m23975j38877J26758K27883J09118
$$ -268004 47986 519775 678924 352288 -196682 -620657 -759534 -632776 -404893 -295775
60541b95775p275J85022N47407N43992P293n58276o80177m89553k88451j9062
$$ -295775 -303050 -118028 429379 973371 980664 422388 -257789 -747342 -1035793 -1054855
60531a054855L99091O26487L59048o3903r2158J87976K31159o1614k37100q3906
$$ -1054855 -655764 -29277 329771 265868 173710 361686 592845 531231 294131 210225
60521B10225P9113K4384k7307J19824K75031K36639J41548J45950Q3945k17784
$$ 210225 289338 313722 286415 406239 681270 917909 1059457 1205407 1289352 1071568
60511A071568n30174m94366j58685J13168J92264K77487M36154M36721J81001
$$ 1071568 541394 47028 -111657 1511 193775 471262 907416 1344137 1525138
60502A525138l7446K0717R1474k00149o21036n12030K12692P68872N31193q2475
$$ 1525138 1487692 1508409 1599883 1399734 778698 266668 479360 1248232 1779425 1696950
60492A696950k67451m0868q6318n14412o28629j19154L38793J53096k21396p9087
$$ 1696950 1429499 1388631 1302313 787901 159272 40118 378911 532007 310611 231524
60482B31524K98579P8356o94112j036895m74859K95849M69581J75005L9008K20694
$$ 231524 530103 608459 -85653 -1122548 -1597407 -1301558 -831977 -656972 -617964 -397270
60472c97270L85179L33990J75473J1925j40142j85186l9638J34629P0491k21803
$$ -397270 -12091 321899 497372 509297 369155 183969 144331 278960 349451 127648
60462A27648m47079m16354k23978J304K82188O04875P41672M85809K222k79831
$$ 127648 -319431 -735785 -959763 -958459 -676271 -71396 670276 1156085 1158307 878476
60452H78476j70252O4356Q3861q7365j74376p8955M4126Q0460N6469m4926k63359
$$ 878476 708224 772580 856441 769076 594700 515745 559871 640331 696800 651874 388515
60441C88515m14645k23320J74496K52911j51686n10621l60799J418N1203r4007
$$ 388515 -26130 -249450 -74954 177957 26271 -484350 -845149 -843731 -792528 -886535
60431h86535M1727L72521L58642k0287j90341l794l3473n29598q42710m20311
$$ -886535 -844808 -472287 -113645 -133932 -324273 -328067 -361540 -891138 -1733848 -2154159
60421b154159K41457L28602m4446r9673L21512N68255K95461j2140R9779K98879
$$ -2154159 -1912702 -1584100 -1628546 -1728219 -1406707 -838452 -542991 -555131 -455352 -156473
60411a56473K8571n60420p75753l61395J69173K61303J5043p8420J21019K58844
$$ -156473 -127902 -688322 -1464075 -1825470 -1656297 -1394994 -1379951 -1458371 -1337352 -1078508
60401a078508P3687j98702j79636J21664L86321M56654M27658L30474O5645l04480
$$ -1078508 -1004821 -1203523 -1383159 -1261495 -875174 -418520 9138 339612 405257 100777
60391A00777n10315m28565k25884n7689J09617K73384K88407J42127N6731J38714
$$ 100777 -409538 -838103 -1063987 -1121676 -1012059 -738675 -450268 -308141 -251410 -112696
60381a12696J98752J07301L1715Q7187O0742k15503m91152m38384j33713J41039
$$ -112696 86056 193357 225072 312259 373001 157498 -333654 -772038 -905751 -764712
60371g64712L38117N04356M52473M5975l64538l08191R5558L04639J74219O4439
$$ -764712 -426595 77761 530234 576209 211671 -96520 -962 303677 477896 542335
60361E42335J24939N6652k81894n67265n21537k77037k0165K82741N51212M27946
$$ 542335 667274 723926 442032 -125233 -646770 -923807 -943972 -661231 -110019 317927
60351C17927j90696p97595q23985l11596K73251O39963P42177M99543q7433o36293
$$ 317927 127231 -670364 -1494349 -1805945 -1532694 -892731 -150554 348989 261556 -374737
60341c74737o39958r1039M52391N08974J69760j22605j20405J6632j907j95132
$$ -374737 -1014695 -1105734 -653343 -144369 25391 -97214 -217619 -200987 -202894 -398026
60331c98026k59075K7550M34011N11074J91748r5490q855K64508L26411J19427
$$ -398026 -657101 -629551 -195540 315534 507282 411792 402937 667445 993856 1113283
60321A113283p3923o4967K5166n7701m23864q69291r44179l80822M66603Q68049
$$ 1113283 1039360 974393 999559 941858 517994 -351297 -1295476 -1676298 -1209695 -341646
60311c41646N65401J02128P9378L77794M61017J98225p6270j91293l16639m95099
$$ -341646 223755 325883 405261 783055 1244072 1442297 1366027 1174734 858095 362996
60301C62996m74473j52049J93675L11363L17147M05645M58935K14776k86269o66227
$$ 362996 -111477 -263526 -69851 241512 558659 964304 1423239 1638015 1351746 685519
60291F85519o31380k95802m5679j18363l44641l51439k9530L12249L51391J81739
$$ 685519 54139 -241663 -287342 -405705 -750346 -1101785 -1131315 -819066 -467675 -285936
60281b85936J50844L39089M37657J70887l48645p44578p37588l66756M8012J91628
$$ -285936 -135092 203997 641654 812541 463896 -280682 -1018270 -1385026 -1337014 -1145386
60271a145386J00253J30194M43261O92521M90870L9520j16075R4062J77540r3783
$$ -1145386 -1045133 -914939 -471678 220843 711713 751233 635158 729220 906760 812977
60261H12977k84808m040M18867L77702j46704n93551n66244j98389J53400K49867
$$ 812977 528169 524129 942996 1320698 1173994 580443 14199 -184190 -30790 219077
60251B19077M2058k87357l71486l4926L90825M21751Q3168j24744K9524J93104
$$ 219077 261135 -26222 -397708 -432634 -41809 379942 463110 338366 367890 560994
60241E60994L2420k22885j67429J08364J58856r7993k48504n3053J48038n0730
$$ 560994 593414 370529 203100 311464 470320 372327 123823 70770 218808 168078
60231A68078m55356m71849Q4802O98625P68327L07575j33758j54585O7264N8548
$$ 168078 -287278 -759127 -674325 24300 792627 1100202 966444 811859 879123 937671
60221I37671l43856p76625p62744k70118K49299L80058J56684j14742k61736k79723
$$ 937671 593815 -182810 -945554 -1215672 -966373 -586315 -429631 -544373 -806109 -1085832
60211a085832j30093J69349L23593L9459m25222m43451P4043M31445J40787k97930
$$ -1085832 -1215925 -1046576 -722983 -683524 -1108746 -1552197 -1478154 -1046709 -905922 -1203852
60201a203852j30704M89165P52225M35331J32517K00830K44284p3903l71219j56994
$$ -1203852 -1334556 -845391 -93166 342165 474682 675512 919796 845893 474674 317680
60191C17680L62313N88349L47953m1304l04870l98705l28046j60616j03604k45233
$$ 317680 679993 1268342 1616295 1574991 1270121 871416 543370 382754 279150 33917
60181C3917l49642k05111N31j1678j21099l0725J81784K06435R1411J65474L80183
$$ 33917 -315725 -520836 -520305 -531983 -653082 -683807 -502023 -295588 -204177 -38703 341480
60170C41480K88426j99283n62353m08203k2134J14913n198p4531k0607k1976j13169
$$ 341480 629906 430623 -131730 -539933 -562067 -447154 -452352 -526883 -547490 -569466 -682635
60159f82635j09161J08351M37413O43080M84845q7429p06307p65892j01419O55654
$$ -682635 -791796 -683445 -246032 397048 881893 794464 88157 -677735 -779154 -123500
60149a23500P21528Q8273n17248n72413k78922o4801L3036K21796M66974N31511
$$ -123500 598028 686301 169053 -403360 -682282 -747083 -714047 -492251 -25277 506234
60139E06234M04989L18720K96958N8938m47335p24873k93259N58748R80938N54879
$$ 506234 911223 1229943 1526901 1585839 1138504 413631 120372 679120 1660058 2214937
60129B214937k66933q13703r23232q01561n25631j01284J94947M2858l57372m09143
$$ 2214937 1948004 1134301 211069 -590492 -1116123 -1217407 -1022460 -979602 -1336974 -1746117
60119a746117P8840O06207O67507L71727J39003Q8121M5228m6187p0910K529J10726
$$ -1746117 -1667277 -1061070 -393563 -21836 117167 205288 250516 204329 133419 135948 246674
60108B46674K69405M76055N02991J16300m83648p67829n24214j15610N0727M4328
$$ 246674 516079 992134 1495125 1611425 1127777 359948 -164266 -279876 -229149 -184821
60098a84821J75849M47647N55036L66173Q6752r5904k52250m62462n64510l76828
$$ -184821 -8972 438675 993711 1359884 1446636 1350732 1098482 636020 71510 -305318
60088c05318l6272J49890J41243J77078L28848L43459P4960j98987j44166J23455
$$ -305318 -341590 -191700 -50457 126621 455469 798928 873888 674901 530735 654190
60078F54190J98074k6262k27549j27620J64692L39499K28263p3101k70806r7488
$$ 654190 852264 826002 598453 470833 635525 975024 1203287 1130186 859380 761892
60068G61892L36397N02944P0141n20732n25239L7676L35582o8458n47615l70940
$$ 761892 1098289 1601233 1671374 1150642 625403 663079 998661 930203 382588 11648
60058A1648J93713L68619J02197L6052L47794M46681j5483n45453n63573k10253
$$ 11648 205361 573980 676177 712229 1060023 1506704 1491221 945768 382195 171942
60048A71942J4977O287m890L1797k5907j76667l09351m30242n14140l03408L33367
$$ 171942 186919 193206 188316 220113 194206 17539 -291812 -722054 -1236194 -1539602 -1206235
60037a206235R63010R71757L75997j85726l08155k28978k81832l91449l41886
$$ -1206235 -243225 728532 1104529 918803 610648 381670 99838 -291611 -633497
60028f33497j75264k7001J58047M33115N85260L87421k1033k99110l43833k95106
$$ -633497 -808761 -835762 -677715 -244600 340660 728081 707048 407938 64105 -231001
60018b31001k14080o0497Q2673Q1993K8245J31569L38680L61175J20554j34917
$$ -231001 -445081 -505578 -422905 -340912 -312667 -181098 157582 518757 639311 504394
60008E04394k15960j97267j61587n2781R5253R1522q8177j95340r8660J4024J5303
$$ 504394 288434 91167 -70420 -123201 -27948 63574 -24603 -219943 -318603 -304579 -289276
59997b89276Q3620K93953L05103j47047p05360q02961m50694j34306m0713P9174
$$ -289276 -205656 88297 393400 246353 -459007 -1261968 -1712662 -1846968 -1887681 -1808507
59987a808507K96189L31057J30926Q3143L91276O74348N19602R7691j35764r5300
$$ -1808507 -1512318 -1181261 -1050335 -967192 -575916 98432 618034 715725 579961 484661
59977D84661l1058j5348J04489K82599K27392j06775l11839n0160L91222L76495
$$ 484661 453603 438255 542744 825343 1052735 945960 634121 583961 975183 1351678
59967A351678k26850p50845n04802K91922P05463K67437m24312n34743q3878K22779
$$ 1351678 1124828 373983 -130819 161103 866566 1134003 709691 174948 91070 313849
59957C13849N0517k32847k71115j97939k25252k30781l7213K43125M16786M82969
$$ 313849 364366 131519 -139596 -337535 -562787 -793568 -830781 -587656 -170870 312099
59947C12099M63291K47532j36416l82793l18844j89869k42852l01597j01282K06474
$$ 312099 775390 1022922 886506 503713 184869 -5000 -247852 -549449 -650731 -444257
59937d44257K83297J48377P9440J10868N2512q1736q5274M0661R4007O5477J37295
$$ -444257 -160960 -12583 66857 177725 230237 148501 63227 103888 197895 263372 400667
59926D00667K70839J80629j99395n52802n90514l68007j14912K9349N7684O7903
$$ 400667 671506 852135 652740 99938 -490576 -858583 -973495 -944146 -886462 -818559
59916h18559K02903M40421N13245K73176J6526J08881L80609L35915m2598k03355
$$ -818559 -615656 -175235 338010 611186 627712 736593 1117202 1453117 1410519 1207164
59906A207164J23491M70598L10117j93168m67234l29674j17425j15975k04418
$$ 1207164 1330655 1801253 2111370 1918202 1450968 1121294 1003869 887894 683476
59897F83476j23515J22358K65364J25891j49295k81048k38873k46411l64143l20365
$$ 683476 559961 682319 947683 1073574 924279 643231 404358 157947 -206196 -526561
59887e26561O1154N04236O27730M55338K60186R1908j46456l11704j92049J3605
$$ -526561 -465407 38829 666559 1121897 1382083 1473991 1327535 1015831 823782 837387
59877H37387r8993m59955n70560k74790M3168J27935J71392K95495K65016k0916
$$ 837387 738394 278439 -292121 -566911 -523743 -395808 -224416 71079 336095 315179
59867C15179k32018j05604J58054K73665K63482K16194M0379k72399m96366n14255
$$ 315179 83161 -22443 135611 409276 672758 888952 929331 656932 160566 -353689
59857c53689m45423k74665J58401O12754N08491j38989n02720j20726L63807K25051
$$ -353689 -799112 -1073777 -915376 -302622 205869 66880 -435840 -556566 -192759 32292
59847C2292k20530k62423j7180r3141m12255l55815P9049K35318q1136l08935
$$ 32292 -188238 -450661 -467841 -560982 -973237 -1329052 -1250003 -1014685 -1095821 -1404756
59837a404756p9607L04939N03803N70731N83175M40676J96475N1222p9812m33845
$$ -1404756 -1484363 -1179424 -675621 -104890 478285 918961 1115436 1166658 1086846 653001
59827F53001p86409o25961n1986K07963j16316m39782k92311J3350O4958L8963
$$ 653001 -133408 -759369 -811355 -603392 -719708 -1159490 -1451801 -1438451 -1373493 -1334530
59817a334530K19179L95840K85119Q3779O9183O2231j60618l09209m6775L00417
$$ -1334530 -1115351 -719511 -434392 -350613 -281430 -219199 -379817 -689026 -735801 -435384
59807d35384J73022k75996l57157R0966M77876L77464O7984l4850K5394J1797
$$ -435384 -262362 -538358 -895515 -804549 -326673 50791 118775 83925 109319 121116
59797A21116k0827J27101L71525M18734K09652r669r2391j86642l80512m04478
$$ 121116 100289 227390 598915 1017649 1227301 1217632 1125241 938599 558087 153609
59787A53609j8761M17624K47982m84840q59455k79869N83281O61013k889l99280
$$ 153609 134848 552472 800454 315614 -543841 -823710 -240429 420584 417695 18415
59777A8415j31810P0528l43627q13790n77760J51883N97303N49011L91663K99897
$$ 18415 -113395 -42867 -386494 -1200284 -1778044 -1626161 -1028858 -479847 -88184 211713
59767B11713J24826n8243L0809L10245L69601J23963p7150p2843j21957l52441
$$ 211713 336539 278296 309105 619350 988951 1112914 1035764 962921 840964 488523
59757D88523m35564q0044M62647O81283M24993L093k44275k77729k70068l25498
$$ 488523 52959 -27085 435562 1116845 1541838 1544931 1300656 1022927 752859 427361
59747D27361l68238k98563j65633q2295k9527O8013R4118j55161n54598o60621
$$ 427361 59123 -239440 -405073 -487368 -516895 -448882 -354764 -509925 -1064523 -1725144
59737a725144l12965Q7133J50372N4696J97159N37849O85433M79562J04278k56839
$$ -1725144 -2038109 -1950976 -1800604 -1745908 -1548749 -1010900 -325467 154095 258373 1534
59727A534m94212m08704R8076O95028Q83274O14888L10536K46113K61286J11223
$$ 1534 -492678 -901382 -803306 -108278 774996 1389884 1700420 1946533 2207819 2319042
59717B319042k18788o04107q93497q86699m80714J08152N07639N91637N01634
$$ 2319042 2100254 1496147 602650 -284049 -764763 -656611 -148972 442665 944299
59708I44299L29942P2548j60448k25047k05973k65771k87354n3263K74310L13095
$$ 944299 1274241 1346789 1186341 961294 755321 489550 202196 148933 423243 736338
59698G36338Q9939J515J10659N3870k28742k95145J4722K10704m9609l52410k07185
$$ 736338 826277 827792 938451 992321 763579 468434 483156 693860 644251 291841 84656
59687H4656J43284J75243k8197o694J89018N2387m63560p44316l78037K73750
$$ 84656 227940 403183 374986 368292 557310 609697 146137 -598179 -976216 -702466
59677g02466N72851L23387j73370m96439l91530O9655M77714M42430O3602j77172
$$ -702466 -129615 193772 20402 -476037 -867567 -797912 -320198 122232 185834 8662
59667H662q6670k9679l28423o76343n16807J15904N64962M40537J43811K27242
$$ 8662 -78008 -107687 -436110 -1112453 -1629260 -1513356 -948394 -507857 -364046 -136804
59657a36804N21522L63545l59249r13241o75396M2001M91635M89559M07801L66114
$$ -136804 384718 748263 389014 -524227 -1199623 -1157622 -665987 -176428 231373 597487
59647E97487P8444m39028o43376k37686L14458M25613J81402Q7967K79038M22767
$$ 597487 675931 236903 -406473 -644159 -329701 95912 277314 365281 644319 1067086
$$ [...]
##END NTUPLES=NMR SPECTRUM
##END=
