##TITLE=31Pdec_DE-135K_TFA
 CCl4,64 sc
 8.4.2026
##JCAMPDX= 6.0         $$ Bruker NMR JCAMP-DX V2.0
##DATA TYPE= NMR SPECTRUM
##DATA CLASS= NTUPLES
##ORIGIN= UXNMR, Bruker Analytische Messtechnik GmbH
##OWNER= root
$$ XWIN-NMR		Version 3.5
$$ Wed Apr  8 13:57:51 2026 Russian Standard Time (UT+4h)  she@DPX200
##.OBSERVE FREQUENCY= 81.013821
##.OBSERVE NUCLEUS= ^31P
##.ACQUISITION MODE= SIMULTANEOUS
##.ACQUISITION SCHEME= undefined
##.AVERAGES= 64
##.DIGITISER RES= 17
##SPECTROMETER/DATA SYSTEM= spect
##.PULSE SEQUENCE= zgpg30
##.SOLVENT NAME= DMSO
##.SHIFT REFERENCE= (INTERNAL, DMSO, 0, 197.392)
##AUDIT TRAIL= $$ (NUMBER, WHEN, WHO, WHERE, WHAT)
$$ ##TITLE= Audit trail, XWIN-NMR		Version 3.5
$$ ##JCAMPDX= 5.01
$$ ##ORIGIN= Bruker BioSpin GmbH
$$ ##OWNER= she
$$ F:/spectra/data/she/nmr/P31/2/pdata/1/auditp.txt
$$ ##AUDIT TRAIL=  $$ (NUMBER, WHEN, WHO, WHERE, WHAT)
(   1,<2026-04-08 13:56:44.60 +0400>,<she>,<DPX200>,
      <continue with go, POWCHK disabled, PULCHK disabled
       configuration hash MD5:
       00 E9 B6 7A A2 85 ED C7 34 08 36 98 17 FE 4E 26
       data hash MD5: 32K
       0A 1D 0B CB F5 78 D8 E1 EE B7 E4 6A C2 B5 77 EB>)
(   2,<2026-04-08 13:56:50.65 +0400>,<she>,<DPX200>,
      <Start of raw data processing
       efp BC_mod = 2 LB = 1.5 FT_mod = 6 PKNL = 1 PHC0 = 1060.445 PHC1 = 849.7007 SI = 64K 
       data hash MD5: 64K
       EF 44 78 6D 45 4E F9 66 19 9D 46 AA 73 42 6E F3>)
(   3,<2026-04-08 13:57:07.98 +0400>,<she>,<DPX200>,
      <pk PHC0 = 66.15459 PHC1 = 0 
       data hash MD5: 64K
       8E E4 F2 C2 4C CC 1A 70 D1 92 14 96 5A E5 C7 E9>)
(   4,<2026-04-08 13:57:11.98 +0400>,<she>,<DPX200>,
      <abs ABSG = 5 
       data hash MD5: 64K
       CB 93 34 3A 91 7E C8 0C 27 43 A1 BF B2 7B C1 95>)
$$ ##END=
$$ 
$$ hash MD5
$$ 47 47 1D 04 C8 8C 90 3C 07 28 62 13 50 2C 23 2E
##$RELAX= 
##$RELAX= 
##$RELAX= 
##$RELAX= 
##$RELAX= 
##$RELAX= 
##$RELAX= 
##$RELAX= 
$$ Bruker specific parameters
$$ --------------------------
##$DU= <F:/spectra>
##$EXPNO= 2
##$NAME= <P31>
##$PROCNO= 1
##$TYPE= <nmr>
##$USER= <she>
##$AMP= (0..31)
100 100 100 100 100 100 100 100 100 100 100 100 100 100 100 100 100 100 
100 100 100 100 100 100 100 100 100 100 100 100 100 100 
##$AQSEQ= 0
##$AQ_mod= 1
##$AUNM= <au_zg>
##$AUTOPOS= <>
##$BF1= 81.014009
##$BF2= 200.13
##$BF3= 200.13
##$BF4= 200.13
##$BF5= 200.13
##$BF6= 200.13
##$BF7= 200.13
##$BF8= 200.13
##$BYTORDA= 1
##$CFDGTYP= 0
##$CFRGTYP= 5
##$CHEMSTR= <none>
##$CNST= (0..31)
1 1 145 1 1 1 1 1 1 1 1 1 1 1 1 1 1 1 1 1 1 1 1 1 1 1 1 1 1 1 1 1 
##$CPDPRG= <waltz16>
##$CPDPRG1= <>
##$CPDPRG2= <waltz16>
##$CPDPRG3= <>
##$CPDPRG4= <mlev>
##$CPDPRG5= <mlev>
##$CPDPRG6= <mlev>
##$CPDPRG7= <mlev>
##$CPDPRG8= <mlev>
##$CPDPRGB= <>
##$CPDPRGT= <>
##$D= (0..31)
0 1 0 0 0 0 0 0 0 0.06 0 0.03 2e-05 3e-06 0 0 0.0002 0 0 0 0 0 0 0 0 0 
0 0 0 0 0 0 
##$DATE= 1775642125
##$DBL= (0..7)
120 120 120 11 120 120 24 19 
##$DBP= (0..7)
150 150 150 150 150 150 150 150 
##$DBP07= 0
##$DBPNAM0= <>
##$DBPNAM1= <>
$$ [...]
##$SUBNAM3= <"">
##$SUBNAM4= <"">
##$SUBNAM5= <"">
##$SUBNAM6= <"">
##$SUBNAM7= <"">
##$SUBNAM8= <"">
##$SUBNAM9= <"">
##$SW= 400.765351723535
##$SWIBOX= (0..15)
0 1 3 0 0 0 0 0 0 0 0 0 0 0 0 0 
##$SW_h= 32467.5324675325
##$TD= 32768
##$TD0= 1
##$TE= 0
##$TE2= 300
##$TE3= 300
##$TEG= 300
##$TL= (0..7)
0 120 53 12 22 120 120 120 
##$TP= (0..7)
150 150 150 150 150 150 150 150 
##$TP07= 0
##$TPNAME0= <>
##$TPNAME1= <>
##$TPNAME2= <>
##$TPNAME3= <>
##$TPNAME4= <>
##$TPNAME5= <>
##$TPNAME6= <>
##$TPNAME7= <>
##$TPOAL= (0..7)
0.5 0.5 0.5 0.5 0.5 0.5 0.5 0.5 
##$TPOFFS= (0..7)
0 0 0 0 0 0 0 0 
##$TUNHIN= 0
##$TUNHOUT= 0
##$TUNXOUT= 0
##$USERA1= <user>
##$USERA2= <user>
##$USERA3= <user>
##$USERA4= <user>
##$USERA5= <user>
##$V9= 5
##$VALIST= <valist>
##$VCLIST= <CCCCCCCCCCCCCCC>
##$VD= 0
##$VDLIST= <DDDDDDDDDDDDDDD>
##$VPLIST= <PPPPPPPPPPPPPPP>
##$VTLIST= <TTTTTTTTTTTTTTT>
##$WBST= 1024
##$WBSW= 4
##$XGAIN= (0..3)
0 0 0 0 
##$XL= 0
##$YL= 0
##$YMAX_a= 4234
##$YMIN_a= -16093
##$ZGOPTNS= <>
##$ZL1= 120
##$ZL2= 120
##$ZL3= 120
##$ZL4= 120
##$ABSF1= 197.3918
##$ABSF2= -203.3724
##$ABSG= 5
##$ABSL= 3
##$ALPHA= 0
##$AQORDER= 0
##$ASSFAC= 0
##$ASSFACI= 0
##$ASSFACX= 0
##$ASSWID= 0
##$AUNMP= <proc_1d>
##$AZFE= 0.1
##$AZFW= 0.5
##$BCFW= 0
##$BC_mod= 2
##$BYTORDP= 0
##$COROFFS= 0
##$CY= -3
##$DATMOD= 1
##$DC= 0
##$DFILT= <>
##$DTYPP= 0
##$F1P= 0
##$F2P= 0
##$FCOR= 1
##$FTSIZE= 65536
##$FT_mod= 6
##$GAMMA= 0
##$GB= 0
##$INTBC= 1
##$INTSCL= 9.790993e-09
##$ISEN= 30
##$LB= 1.5
##$LEV0= 0
##$LPBIN= 0
##$MAXI= 10000
##$MC2= 0
##$MEAN= 0
##$ME_mod= 0
##$MI= 50
##$NCOEF= 0
##$NC_proc= -9
##$NLEV= 6
##$NOISF1= 182.463
##$NOISF2= 159.3651
##$NSP= 0
##$NTH_PI= 0
##$NZP= 0
##$OFFSET= 197.3918
##$PC= 4
##$PHC0= 1126.599
##$PHC1= 849.7007
##$PH_mod= 1
##$PKNL= yes
##$PPARMOD= 0
##$PSCAL= 0
##$PSIGN= 0
##$REVERSE= no
##$SF= 81.014063255964
##$SI= 65536
##$SIGF1= 159.3651
##$SIGF2= -187.1042
##$SINO= 113.3802
##$SIOLD= 16384
##$SREGLST= <1H.CDCl3>
##$SSB= 0
##$STSI= 65536
##$STSR= 0
##$SW_p= 32467.5324675325
##$SYMM= 0
##$S_DEV= 0
##$TDeff= 32768
##$TDoff= 0
##$TI= <>
##$TILT= no
##$TM1= 0
##$TM2= 0
##$TOPLEV= 0
##$USERP1= <user>
##$USERP2= <user>
##$USERP3= <user>
##$USERP4= <user>
##$USERP5= <user>
##$WDW= 1
##$XDIM= 65536
##$YMAX_p= 376843509
##$YMIN_p= -46362391
$$ End of Bruker specific parameters
$$ ---------------------------------
##NTUPLES= NMR SPECTRUM
##VAR_NAME=  FREQUENCY,     SPECTRUM/REAL,   SPECTRUM/IMAG
##SYMBOL=    X,             R,               I
##VAR_TYPE=  INDEPENDENT,   DEPENDENT,       DEPENDENT
##VAR_FORM=  AFFN,          ASDF,            ASDF
##VAR_DIM=   65536,         65536,           65536
##UNITS=     HZ,            ARBITRARY UNITS, ARBITRARY UNITS
##FACTOR=    0.49542278885378, 1,            1
##FIRST=     15991.5117654749, 0,            0
##LAST=      -16476.0207020576, 0,           0
##MIN=       -16476.0207020576, -46362391,   0
##MAX=       15991.5117654749, 376843509,    0
$$ Real data points
##PAGE= N=1
##DATA TABLE= (X++(R..R)), XYDATA
$$ [...]
9366 14913032 20171288 18327801 9929892 2899959 1996727 4030884 4260107 2831400
9358 2831400 2842071 5131752 7475472 7693161 5925332 4106463 3685583 3747941 1799244
9349 1799244 -3128750 -8967533 -12943082 -14321790 -13780633 -11455207 -7438313 -3227006
9341 -3227006 -515789 1074636 3147525 5657354 6830905 6073976 5207951 6327849 9617942
9332 9617942 13611220 16607841 17563905 16484818 14477052 13143411 13580235 15497192 16840079
9323 16840079 14965535 9614493 4302657 2597117 3035335 707231 -5331925 -9833306
9315 -9833306 -8631004 -4609766 -3044057 -3953983 -3523816 -1115330 300672 41649 828006
9306 828006 3412557 4737799 2799316 -528133 -2965905 -4556092 -5365769 -4057348 -888807
9297 -888807 922366 -809306 -4340083 -7076570 -8868395 -9970111 -8594764 -3764763
9289 -3764763 1304845 2112389 -1646101 -6130961 -8126104 -7409728 -5176701 -2514450 -116654
9280 -116654 2231799 5186913 7392485 5091777 -3299716 -13448048 -19020397 -18948913 -17797911
9271 -17797911 -18934782 -20606189 -19796306 -17111931 -15672243 -16407653 -16492946 -12684082 -5424883
9262 -5424883 1010343 2891570 1170553 -9614 1053130 1640820 -705072 -4031274
9254 -4031274 -4832569 -3181115 -2085198 -2885726 -4122413 -3967461 -1007043 5894545 14832391
9245 14832391 19398958 14909342 5742844 1158129 3352395 5464350 2675969 -1457593
9237 -1457593 -2888085 -4355030 -9093557 -12703260 -8753806 463824 6244571 5130752
9229 5130752 1236205 -2245830 -6155971 -9286546 -7125691 318351 5921123 4544286
9221 4544286 -470157 -3743454 -5636811 -8812118 -11766757 -11944044 -11833971 -14913718 -17382675
9212 -17382675 -11625594 1841475 13221637 16260663 15675816 18208062 21804882 19117678
9204 19117678 8683541 -2950163 -9319397 -9735091 -7080990 -4066927 -2490370 -2933520
9196 -2933520 -3920978 -3872796 -4887464 -11548304 -23747825 -33325886 -31695382 -20328511
9188 -20328511 -10074009 -9193195 -15045655 -19150911 -17448745 -12445862 -7336182 -2692166
9180 -2692166 840075 1258597 -1097686 -1974737 1556024 6496482 7683445 4292729 -817437
9171 -817437 -6384754 -12787245 -17788950 -17831147 -14349206 -13313254 -16447868 -18252640 -14985023
9162 -14985023 -11266959 -12576225 -15453931 -12195350 -3262997 2519137 332808 -5256163
9154 -5256163 -9021875 -12109841 -16348497 -17486623 -10510230 1177764 8423410 7683812
9146 7683812 4006769 1796273 -1744925 -10404604 -19789250 -19806201 -6828176 10287289
9138 10287289 18559024 13716543 2678641 -5525205 -8069129 -7162764 -4321743 1065506
9130 1065506 9048948 18291652 27518834 34951527 36820021 30303319 18835344 10716493
9122 10716493 10201018 12659711 11033017 4788894 -449972 -543417 3197262 7050627 8836028
9113 8836028 8555900 7443069 7148112 8617364 11314542 13997639 15705864 15367810 11826976
9104 11826976 5900866 1365940 1718650 6122135 10171297 10513542 7513748 3959930
9096 3959930 2509126 3677971 4901157 2542700 -3445900 -8029885 -6449842 -30675
9088 -30675 5961822 9325157 12432264 16825616 19914562 18474421 13240891 8696910 9276208
9079 9276208 15742856 23916973 27520311 24209244 18199619 15023068 15179029 15830249 16581963
9070 16581963 18575595 19062675 13503408 3948354 -1462948 56754 1491077 -3024614
9062 -3024614 -8943069 -8743398 -3724523 -1257101 -3220787 -4732634 -3373214 -2301249
9054 -2301249 -3246894 -2703202 2504970 10167975 15502064 16041881 12251944 6132185 748240
9045 748240 -1287865 -513549 -288544 -2878189 -7146338 -10436306 -11355035 -10570392 -9838071
9036 -9838071 -9602494 -6803311 2671896 17216387 27987198 27977668 20496467 14190289 11777794
9027 11777794 9500364 6151157 5032556 6313254 5296548 1054800 -174076 5747493
9019 5747493 13926096 17220381 15099499 11258165 7084548 2719207 733854 3104886
9011 3104886 7142849 9283586 10303375 12273567 13552647 11907118 9362582 8312424
9003 8312424 6173363 489452 -3886241 -636225 7266146 11351950 10774642 11920219
8995 11920219 15190557 13289358 4953000 -810750 1113316 4013372 2132685 1507495
8987 1507495 8942795 18234090 18606176 11830768 9257952 14345536 19579654 20074047 18934740
8978 18934740 17958230 14055783 8163951 7445725 13409599 16730536 10585339 1686977
8970 1686977 4822 3329734 1647031 -6245446 -10660155 -5776837 2451861 5794072
8962 5794072 4235383 3015515 3955664 4384699 2448822 -414968 -1838170 -1129257 366269
8953 366269 660349 -577387 -1068791 1320741 4936682 5700101 2644987 -441383 34787
8944 34787 3565273 8125985 13573597 19473269 21916659 16752973 5609058 -4937041
8936 -4937041 -10637638 -13020345 -14893073 -15613757 -12860863 -7108255 -1856072 124337
8928 124337 -870039 -2731827 -3776410 -3372146 -1311233 2347929 6447225 8426154 6106852
8919 6106852 152321 -6222829 -10431208 -12203009 -11631402 -7737277 -926354 5021390
8911 5021390 6571523 5339640 6193872 10624794 15318506 17561545 18276002 18411271 15981096
8902 15981096 9139654 -159321 -7665830 -10191409 -6483868 2207924 10940343 14289461
8894 14289461 13347636 15413206 23046154 28018716 22125819 10516499 6292698 12853443
8886 12853443 20023073 18976175 12809655 8888458 8087655 7181634 6390290 7705728 8743424
8877 8743424 4962591 -3002464 -9739862 -12298350 -12039730 -9598890 -3572482 4540545
8869 4540545 9194426 7462471 3578908 3834593 8865179 13551643 13329172 8389112 2361023
8860 2361023 -1313864 -1973453 -1942985 -3862792 -7144185 -8075670 -4493339 984051 4308720
8851 4308720 5638779 8755198 14555738 18332273 15685959 9020600 4975888 6106346
8843 6106346 8508837 8139144 5905039 4647611 4309031 3407086 3156065 5858733 9827024
8834 9827024 10278461 5973234 1019762 -1309106 -2764609 -5854559 -8793578 -8080243 -4000223
8825 -4000223 -188648 1032180 -49136 -2601180 -5354694 -5517867 -1236196 4699168
8817 4699168 6725027 2721385 -3989858 -8991134 -10441870 -8232460 -2962406 2551980
8809 2551980 3484296 -2542505 -11920092 -17662053 -15504701 -7150104 1646029 5866234
8801 5866234 5202075 3718418 4879038 7401836 7739144 6145188 7213530 13330267 20416101
8792 20416101 22460121 18668943 13743032 11806886 12258718 11758588 8790291 5396075
8784 5396075 4402950 5287311 4093546 -1201982 -6507500 -5748309 898910 6531135 6428793
8775 6428793 3576201 2857245 3661914 2594046 804463 2875734 8835104 12780661 10774383
8766 10774383 5729167 2574871 2339907 3429323 5460825 8599662 11237428 11602535
8758 11602535 10475433 9597358 8639775 6729730 5932232 9505575 16546452 21917073 22649681
8749 22649681 21446213 22012814 23371716 21505577 15603095 10008728 9485409 13783799
8741 13783799 17455320 14965665 6350739 -2244915 -4704885 -1775109 -82892 -3654674
8733 -3654674 -8825211 -9693921 -6448436 -4589362 -6656502 -9055016 -8101114 -5182497 -3319826
8724 -3319826 -1632753 2917467 9440760 12770487 9994718 4484899 1650139 2224430
8716 2224430 1927197 -2354249 -8047354 -9858602 -6288433 -1109282 1852941 2886550
8708 2886550 3808307 3918084 1984986 493238 2856051 6330257 3474484 -7066093
8700 -7066093 -16684027 -17900330 -14834043 -16720650 -23853681 -27224795 -22077161 -14893935
8692 -14893935 -14354552 -20214519 -24705186 -22279329 -14662388 -7208668 -2661539 1021501
8684 1021501 7143736 15153381 20518619 20396590 17133710 14152664 11005985 5882650
8676 5882650 576030 -1692373 -1672700 -1991654 -1006226 4883725 13223292 16985243 14828851
8667 14828851 12378183 11690302 7889249 -376786 -5967475 -4383384 -1828652 -4729976
8659 -4729976 -8130175 -3649863 6056910 10897576 8532275 6053863 7770537 10865393
8651 10865393 13220784 16446210 19931164 20116910 17405745 16299163 16987811 14438673
8643 14438673 8066450 4488428 7224196 10823321 9508854 5455860 3884661 5276417
8635 5276417 7075546 8454569 9018011 7123404 3592419 2724073 5693269 7737055 6062246
8626 6062246 5020677 8137767 10841194 8298555 5545666 10938400 22385995 29378380
8618 29378380 27763753 23540368 21551375 19319415 14453989 10253017 9864200 10692204
8610 10692204 8867409 4967166 1378198 -2426323 -7854822 -12875640 -13662677 -9592264
8602 -9592264 -3970847 -468585 -435031 -2754266 -5068652 -6049668 -7015428 -9900308 -13522428
8593 -13522428 -14308940 -11448473 -8566998 -8834589 -10910523 -11553273 -9988025 -7578063 -5164320
8584 -5164320 -3186696 -2944104 -5094564 -7686312 -7987171 -5844025 -3354838 -1758996 -608871
8575 -608871 400187 950466 1516685 3138330 5089308 4502636 -427974 -7742319 -13341434
8566 -13341434 -14913553 -13259597 -10021789 -5632886 -342288 3934812 4756530 2321862
8558 2321862 -239906 -579749 349531 569716 173295 203167 -172373 -2581295 -5992261
8549 -5992261 -7236994 -5295281 -2419970 -431273 1380411 3693055 5387335 6050948
8541 6050948 7623132 11222545 14520733 15024600 14217922 15260487 17827671 18909559 18232732
8532 18232732 18762631 21112879 21513133 17365987 11552523 8420367 7946279 7152722 5553488
8523 5553488 5343871 6949300 8483300 9816184 12904055 16820917 16861003 11311752 5278616
8514 5278616 3849131 4608909 2213591 -1548799 1085308 12056260 23127683 25884709
8506 25884709 21088744 14901801 10449577 7617379 7571094 11634474 16955907 18499878
8498 18499878 15415859 11554829 9864893 10060486 11561070 14303457 15906418 12352838
8490 12352838 3411830 -5742444 -10174990 -9948447 -7783490 -4786775 -736416 3524592
8482 3524592 6599281 8437859 9701261 9836506 7483703 2671668 -2556970 -5975262
8474 -5975262 -7306045 -8328263 -10510030 -12708962 -12572598 -10588497 -10317955 -12790052 -13315410
8465 -13315410 -7388207 1960075 7036306 5131363 1031525 91468 3284523 9259808
8457 9259808 16184400 20378438 18171756 11129007 5085769 2360424 -197512 -3680637
8449 -3680637 -3873033 892458 4641201 1727158 -5008310 -9829840 -13424157 -19719823
8441 -19719823 -26712866 -28340821 -24194279 -19871819 -17702188 -14062161 -6916328 178546
8433 178546 3451865 3437903 2406560 1227464 -80338 -2225752 -7293121 -15474185 -21532500
8424 -21532500 -19870883 -13293212 -10361914 -12754320 -12396731 -4331123 4728924 6226338
8416 6226338 2459837 2167865 6629497 8186228 2582469 -4168215 -3808397 3520663 9900833
8407 9900833 9247010 3747112 556872 3293125 7995619 8080491 2235180 -4500303 -7232613
8398 -7232613 -6272176 -5065577 -5635493 -7514568 -9198926 -9053729 -6298540 -2379905 105989
8389 105989 751914 1725939 3984209 5521289 4648616 2375805 -126593 -3658755 -8484436
8380 -8484436 -12490068 -14378395 -15891568 -17843249 -16901485 -10398278 -1936039 2773664
8372 2773664 4281208 8056475 14719066 17275129 10319673 -1877655 -9247698 -6006110
8364 -6006110 4641838 14106355 15629703 9687942 3318253 2880750 7349947 10628919
8356 10628919 10267265 10532401 15452472 21947088 22837623 15405764 4288218 -3966299
8348 -3966299 -7182583 -7812018 -8096129 -6446884 263234 10895914 18657585 17771309 10673823
8339 10673823 5604682 6787487 10152805 10008395 6635096 4497125 5274754 6489641
8331 6489641 6320417 5909142 6090412 5061476 1235529 -3649573 -6517917 -6896442 -6621155
8322 -6621155 -6224115 -4152433 112994 4551098 7222300 8321243 8254460 5969463 1652914
8313 1652914 -840352 2038161 7788739 10235880 8179649 7403691 12248530 19209180
8305 19209180 21939751 19278396 14397984 8642678 1231170 -5952150 -8499693 -5259754
8297 -5259754 -166732 2659489 2485613 62958 -4122733 -8151191 -8480603 -3748578 3262653
8288 3262653 9054481 12742385 14624900 14099909 11307579 8764655 8651960 9701925 9184446
8279 9184446 6983531 5278255 4859000 4354803 3216379 3204390 5977477 10292871 12407156
8270 12407156 9170027 909685 -8448537 -14497553 -15913521 -14655980 -12914746 -10944771
8262 -10944771 -7863205 -3053351 3515543 10704404 15629413 15849554 12875880 10975230
8254 10975230 11149953 9111023 1498347 -8452667 -14510873 -14774882 -12076956 -8786567
8246 -8786567 -5307863 -2902713 -3424644 -5674618 -5965510 -3474094 -1714191 -3416444 -7003631
8237 -7003631 -9517618 -9981379 -8194235 -3430434 3029690 6623600 4027840 -2212965
8229 -2212965 -6145798 -4704908 330770 5427924 8139852 7848146 5928962 4654379
8221 4654379 4345273 2756257 -1001855 -3797578 -2515210 897325 2120738 1185119 1965881
8212 1965881 4815856 4687184 -1473637 -9636298 -13863343 -13388325 -11350458 -9174470 -6121257
8203 -6121257 -2778694 -768076 607792 3441738 6409595 4534068 -4401447 -15412206
8195 -15412206 -20338792 -15678661 -5565821 2333380 3388702 -702031 -4426816 -4095461
8187 -4095461 -527401 3709741 7644849 10917952 11678009 8811554 5173479 4464265 4844950
8178 4844950 239493 -10696359 -21597205 -27034720 -29618078 -34042068 -37567261 -32761470
8170 -32761470 -19080142 -5702699 -1132240 -4166279 -7401814 -6532097 -3482848 -2368763
8162 -2368763 -5249054 -11237337 -17417200 -20294969 -17976186 -12094854 -7367544 -8142038
8154 -8142038 -14400785 -21412247 -24504386 -24152739 -24730787 -28155405 -31483476 -31957494 -31054025
8145 -31054025 -30600681 -27819722 -18749149 -5189454 6439552 12627072 14553350 12839851
8137 12839851 6298163 -2931313 -8690984 -7913170 -3935365 -261109 4162931 10152902
8129 10152902 13715279 11179769 5453634 2154236 2120102 2507204 2642152 3413385 3137783
8120 3137783 117335 -2236933 480136 4962330 2760749 -7424003 -16820993 -18177260
8112 -18177260 -14200193 -11628492 -12660388 -16012300 -21258791 -27273910 -30277987 -28497106
8104 -28497106 -25878181 -26346005 -27036553 -22633940 -14504090 -9481044 -10048181 -11613065 -10333523
8095 -10333523 -8200794 -8278668 -9366536 -8422968 -5406422 -2813122 -2194535 -3354918 -5344088
8086 -5344088 -6106022 -2780661 4924949 12416704 13987405 9203811 3536880 1996120
8078 1996120 3652846 3454608 -1492121 -8722058 -13405005 -13522903 -11348971 -9949162 -9148130
8069 -9148130 -5998178 567750 6593810 6046173 -2568140 -13377863 -18198054 -14537886
8061 -14537886 -7468605 -3101643 -1895748 -277631 2384462 2110740 -3165779 -8620658
8053 -8620658 -7370354 817210 8935402 11141407 9035376 8557649 12820662 19639523
8045 19639523 24768722 25703245 22772021 18160283 14246937 12176206 11666521 12045700 12887650
8036 12887650 13454720 12523177 9751803 6788365 5951068 7686816 9917539 9967099 6797026
8027 6797026 1557727 -3485999 -6556771 -7345328 -6579720 -4727053 -1656745 2130228 4779660
8018 4779660 4662205 2442388 458421 -150800 -703433 -2773373 -5314828 -4789059 1535230
8009 1535230 12281497 21994077 25118847 20730155 13172035 7542703 5095914 3839234
8001 3839234 2473226 1589265 1443103 1536992 3105134 8683339 17069170 21707660 17686766
7992 17686766 8604660 2411400 1274230 247768 -3605820 -5974826 -1758207 7152260
7984 7152260 14212448 16097164 14760234 13116773 12198416 12127111 12842992 13519092 13127496
7975 13127496 11556483 8993558 5304606 1623691 774014 3469472 5715321 3381912
7967 3381912 -1839568 -4888642 -4659006 -4062003 -3178881 1639571 10300629 16427071 15449283
7958 15449283 10514663 6798055 4506844 2040855 1785283 6502949 12381762 12299759 5527017
7949 5527017 -1485590 -4017966 -3580443 -3360204 -4556353 -7908487 -13207656 -15840741 -9902353
7940 -9902353 2196330 8767551 2054134 -11599721 -19555941 -17566140 -11337420 -6128021
7932 -6128021 -1609273 3062840 5723797 5313391 5116258 8641493 14623993 18814390 19220242
7923 19220242 17111927 13694648 8414328 1208389 -5219094 -7089063 -3800847 691751
7915 691751 2104740 914815 1158677 4040097 5910840 4475423 3686857 8444847 16352948
7906 16352948 19948088 17049685 13516950 14193979 16293723 14965452 11083362 8812384
7898 8812384 8084203 4728517 -2650622 -10401454 -14407106 -13142017 -6360326 4677434
7890 4677434 14632687 16395333 8824759 -769468 -4682766 -3072829 -1526395 -2878521
7882 -2878521 -5319930 -7266971 -9465080 -11646043 -11169190 -7140029 -3194067 -3398112 -6647110
7873 -6647110 -7933593 -5121612 -1863284 -2464631 -5519551 -5141949 1162130 8150669 8546915
7864 8546915 2335586 -2467401 695286 9120164 14740685 14088522 10999212 9646487
7856 9646487 8818116 5184901 -397095 -3312623 -1673360 386694 -2838080 -12002082
7848 -12002082 -21685060 -25710923 -22660192 -16004780 -9752687 -5226298 -2151302 -987515
7840 -987515 -2218853 -4018583 -3232277 456284 3348507 2268303 -1029558 -1810385 1878974
7831 1878974 7090353 9488889 7620432 3666216 1166282 2196947 5849984 9165423
7823 9165423 9989550 8800724 7380626 6385855 5140090 3227364 1114218 -451698 -647184
7814 -647184 1154516 4019236 5277114 3676746 1971240 3738782 7900731 9613436
7806 9613436 7143736 4314050 4529252 5816991 4444269 574226 -3045735 -5789876
7798 -5789876 -8634765 -10473889 -9336488 -6695986 -6080068 -7155312 -5627306 29104
7790 29104 6040662 9036353 10079110 10991991 10948537 9544407 9088598 10219607 9360712
7781 9360712 5201757 3653630 9884853 18407449 19288674 13404026 12378904 21391282
7773 21391282 30880627 30073577 21437469 15117335 14402156 14536574 12861882 11759343 11902733
7764 11902733 10099065 5517070 2428000 4469903 10135863 15633295 18618646 17623348
7756 17623348 11603251 2445587 -4832679 -6686204 -4087218 184120 4921505 9806195
7748 9806195 13735878 15544322 14751107 10838701 4072143 -2307975 -3765438 263877
7740 263877 5524122 8484364 9469863 9090059 5984312 780769 -2067048 -283755 2128833
7731 2128833 1376134 1091301 7307460 18243807 25341151 24100603 18313423 13203519
7723 13203519 9632880 6278474 2991307 110313 -2479087 -4393117 -5201563 -5742142
7715 -5742142 -6138601 -3446713 4523125 13601008 16555248 12212613 6008084 1135096
7707 1135096 -4343006 -10009110 -10198998 -2752091 5493713 7267973 4341259 3302270
7699 3302270 6121682 10405726 14974316 18790620 17730738 9787095 1485817 1518540 8661977
7690 8661977 13277412 10721655 5831412 3423290 2380363 1590687 3906787 9650284
7682 9650284 12474999 7482386 -649437 -3146437 2010706 9447170 14050482 14429267
7674 14429267 10873477 5259992 2171979 5084601 11198485 14060179 11495925 7229901
7666 7229901 4595427 2934237 1280702 1481089 5262775 10807635 14478578 14394411 11008101
7657 11008101 6013485 1946119 833457 1708322 1374373 -801519 -1091277 3346830 9435489
7648 9435489 11439485 8092998 3230513 -182139 -3137886 -7214106 -11407924 -13943482
7640 -13943482 -14994390 -15833253 -16716585 -17155941 -17229324 -17266107 -16948393 -15673769 -13102978
7631 -13102978 -8824072 -2643032 4134258 9063110 10994268 10787948 9098172 5559910
7623 5559910 1083853 -1846148 -3012295 -5564781 -10413607 -12630384 -7868730 -143462
7615 -143462 2389857 -1310819 -4068588 -1224833 3552192 5275476 4841925 5670741 7515219
7606 7515219 7917285 7005703 6914105 8409912 11326418 16259568 22606683 26869948 26119188
7597 26119188 21418607 15119087 7325545 -1517745 -7379242 -6641324 -1488604 3309473
7589 3309473 7205326 12342951 16857032 16013176 9998617 4551847 2994839 3122285 2859485
7580 2859485 3023607 2748028 -1583533 -9618478 -14649517 -12010120 -5625450 -2110967 -2118167
7571 -2118167 -2033011 -1110019 -1767613 -4380507 -6255389 -5092142 -341170 7422756 15196723
7562 15196723 17400793 11160966 866468 -6497810 -10038316 -14889622 -23417025 -30879989
7554 -30879989 -31562851 -26069610 -20084844 -17348892 -15969410 -11558254 -2831205 6540088
7546 6540088 11638147 11126325 7479389 3181197 -1163932 -4918231 -6447666 -5282072
7538 -5282072 -2850616 267201 5303229 11979856 17141340 18899742 19242342 19837653 18345985
7529 18345985 12578007 5755711 3292129 5870955 9602822 11430658 10435423 5791065
7521 5791065 -1646006 -7145487 -6916989 -4358591 -5977811 -11578632 -14663631 -12867588
7513 -12867588 -11257730 -13598819 -16812577 -16882158 -14436240 -11155226 -6150474 -11812
7505 -11812 2552275 -917427 -5540854 -5508854 -2422828 -1961642 -4789999 -6474148 -4954535
7496 -4954535 -2410890 -87151 3346134 7481691 8731889 4906858 -1576082 -6377189
7488 -6377189 -7351691 -5518066 -3505642 -3192880 -3866246 -3447500 -2329357 -3701995 -8089229
7479 -8089229 -10585730 -7335901 -2258821 -2097811 -6132317 -7049799 -2411809 1304864 -1438044
7470 -1438044 -6994792 -8080410 -3474461 2240955 5762017 7093273 6070057 1827819
7462 1827819 -3954893 -7137494 -5664329 -1651477 1903465 4322903 6090573 6519403
7454 6519403 4642656 1894233 2049615 7654719 16957593 25031486 28000310 25750533
7446 25750533 20577464 14422243 8598134 5294037 6953082 13370796 21008080 26266223
7438 26266223 28280954 27593155 23890134 17363382 11421863 10921817 16529031 22732951
7430 22732951 23187222 17325978 10344815 7060444 7256183 7223060 4469877 6828 -3321681
7421 -3321681 -3788081 -2212511 -1045263 -1901153 -3733224 -4066301 -2580922 -2360857 -5982197
7412 -5982197 -10981284 -11540219 -5150011 4488152 12017424 15566670 15789699 12311417 4499750
7403 4499750 -4993160 -11016003 -11248987 -8559268 -6980895 -7055114 -6370406 -3365619 989068
7394 989068 4762092 6918848 7545864 7291864 7273260 9101184 13802079 19951101 23763923
7385 23763923 22721405 18944269 16830387 16893529 14721781 7690300 -227392 -3533160
7377 -3533160 -3003408 -4257334 -9365394 -14334769 -15283129 -12842731 -9308109 -5509344 -2405950
7368 -2405950 -1991659 -3954353 -4542899 -1685867 1417616 914160 -1958190 -3285309 -2554812
7359 -2554812 -2249808 -2864627 -2956498 -3617565 -7803910 -14189046 -16398019 -10965813 -2760954
7350 -2760954 708589 -1547919 -3819282 -1908325 1748039 2024060 -2219026 -7487895
7342 -7487895 -10796700 -12745315 -14494048 -14276115 -10094662 -4785816 -3903728 -7541760 -8970467
7333 -8970467 -4455505 -115546 -3871770 -13454524 -19033786 -17000748 -14004654 -15878027
7325 -15878027 -19404021 -18637368 -13830909 -9232415 -6088226 -3342236 -2575879 -6225464
7317 -6225464 -11790126 -13415945 -9730548 -5551328 -4939831 -6597014 -7348417 -6437560 -4617090
7308 -4617090 -2197952 -43143 227860 -794723 425673 5698418 11750644 14191212
7300 14191212 13049239 11363095 9780958 6435168 1789912 -637878 381012 1269290
7292 1269290 -1340277 -5750572 -8174593 -8668405 -10527113 -14236795 -15715035 -11819299
7284 -11819299 -5080335 -1157414 -3021681 -9113837 -15821455 -19863688 -19283114 -14651474
7276 -14651474 -9555839 -7965322 -10329049 -13245743 -13160681 -9297091 -3130976 3098532
7268 3098532 6768124 5789066 754250 -4803302 -7590470 -7313576 -5431121 -2462407 1812884
7259 1812884 6337055 9045668 9171600 7590239 4683228 -337988 -7106301 -12617249
7251 -12617249 -13905201 -12046465 -11716122 -15515226 -19600321 -17190791 -7234085 2592598
7243 2592598 3877552 -2870869 -9854523 -12616010 -14214473 -17315690 -17557058 -9640107
7235 -9640107 3045848 10803608 9048692 2267969 -3570073 -7407732 -10570035 -12705462
7227 -12705462 -13112726 -12945555 -13378195 -13775999 -13615089 -13734084 -13711581 -10805861 -4191519
7218 -4191519 2051346 3099303 -1099482 -6824362 -11057521 -12422798 -10143010 -5620869
7210 -5620869 -3186873 -5322738 -8357055 -6780591 -758513 4736997 7214894 8271742
7202 8271742 8435816 6035021 2072683 667704 2602744 3556544 1557875 1184120 6137946
7193 6137946 11747608 10376457 2130806 -5466212 -8043633 -9431672 -14910035 -23316469
7185 -23316469 -28335380 -26046723 -19351557 -15017548 -16763091 -21411362 -22598525 -18381031
7177 -18381031 -13439288 -12774629 -15503387 -17277637 -17010851 -17520653 -19802899 -20567469 -17013946
7168 -17013946 -11434493 -8748676 -10449835 -12961130 -12074945 -7634697 -2788492 992804
7160 992804 6228278 15051316 23728986 25085886 17507361 8276977 5368701 8286250
7152 8286250 10263741 7781464 3928456 2982007 5778016 10975449 17290108 23159931
7144 23159931 26827966 28016380 27657199 25569591 20781347 14606838 10686403 11028227
7136 11028227 14294093 18433830 22094546 22847033 17881297 8500736 788245 -622517
7128 -622517 2903516 7358578 10838131 12671728 11490913 7903478 6306040 9720387
7120 9720387 14652062 15282558 11247181 6890129 4226725 1832255 161560 2140540
7112 2140540 7339266 10749020 9450798 6198178 4067970 1696323 -3033296 -8063204
7104 -8063204 -9850222 -8778191 -8039455 -8473080 -8309299 -7535913 -8757096 -12872254 -16615153
7095 -16615153 -15918214 -10468382 -3766968 824965 3254028 5791835 9229075 11095316
7087 11095316 8750942 3530799 -271228 -675119 115179 -181662 -805149 -743395 -1825377
7078 -1825377 -5872909 -10568003 -11901358 -9994848 -8541984 -8209526 -4741661 4476635
7070 4476635 15094034 19880469 16693330 10004894 5436786 5114557 7966065 11812712
7062 11812712 14075366 12385963 6716803 691082 -1142374 1667933 4185506 1153545
7054 1153545 -6970869 -14338398 -15933413 -11955390 -5931450 -723791 2325901 2361487 -331012
7045 -331012 -3261644 -3591656 -1199448 1561457 3035348 3799977 5312428 8574291 13913072
7036 13913072 20364679 25230233 25820817 21804575 14819419 6631994 -514577 -3080659
7028 -3080659 765795 7387836 10575844 8921856 6671214 6260029 4616775 -418972
7020 -418972 -4464586 -2092154 4702740 8704709 7007978 3373550 1307902 -93401
7012 -93401 -2105920 -2600428 922555 6795209 10013340 6890046 -1581849 -9623555 -10126157
7003 -10126157 -819548 12313861 20076148 19103336 13589410 8133345 3098121 -1309909
6995 -1309909 -1176423 6404919 17160883 22948700 20765000 14832654 10082519 7307914
6987 7307914 5206039 3608252 3133892 4087743 7161062 13155655 20401306 24228478 21126778
6978 21126778 12670006 3681965 -2819685 -7104381 -9709293 -9574972 -6352834 -2573616
6970 -2573616 -1029409 -472681 3294185 11191167 18456737 20646987 19689931 20338574 21967995
6961 21967995 18924815 9677221 331082 -3650983 -4677198 -7870518 -12240500 -12334293
6953 -12334293 -6875771 -345575 3531491 4988335 5079327 4243778 4262260 6658413 8547070
6944 8547070 5465250 -515362 -1650378 4023723 8539791 5553746 -43970 -233968
6936 -233968 3467050 3617011 326773 1747415 10610579 18946454 19285734 14207806 10270701
6927 10270701 7770486 2407915 -5629520 -10353370 -7920146 -1618591 2559182 2997776
6919 2997776 3375281 7167093 12690320 14649403 10519131 3717503 -886210 -2916674
6911 -2916674 -5274733 -8215803 -8763826 -6379625 -4812871 -6534393 -9293418 -10671923
6903 -10671923 -12037222 -14338478 -13762103 -6880744 2173235 5703177 2876517 100871
6895 100871 675406 632557 -2924582 -5715601 -2939898 2704303 5202962 4348091 4568554
6886 4568554 6223414 4801818 -498930 -3668018 -165486 6284096 8864121 6610440
6878 6610440 4358384 5578741 8966537 11360094 10909182 7762675 4324595 4305829 8640577
6869 8640577 12750554 11118967 4578357 -527460 -898175 149302 -831128 -1811203 502098
6860 502098 4306973 5072471 2495757 563318 1199374 1978615 405968 -3117826 -7099087
6851 -7099087 -10299585 -10495841 -5348477 3943396 12654277 17771048 20655849 22993783
6843 22993783 23181204 19412745 13912733 10571466 9413927 6717586 582580 -6336329
6835 -6336329 -10263394 -10555076 -9608613 -9451133 -9169335 -5881081 1398417 9177512 12286181
6826 12286181 9731129 5888272 4669649 4564370 1701165 -3725396 -7151745 -5470881
6818 -5470881 -386655 4563309 8200838 12052958 17839350 25254291 31445688 32746497
6810 32746497 28144274 21190067 17326231 18954035 23704252 27314003 27357896 24486037
6802 24486037 21066669 18656039 16398031 12442276 7074963 2866251 947380 -703119
6794 -703119 -3653921 -6111700 -6183618 -5680656 -7023699 -8284250 -5998038 -1902407 -1428310
6785 -1428310 -5220740 -7768539 -5886196 -3035162 -2730621 -2996861 -1153263 467930 -1583626
6776 -1583626 -5470972 -6483893 -3630424 797903 6157181 12797328 17845146 17306952
6768 17306952 12487655 9230927 9861581 10335363 6782415 936885 -2895820 -3257680 -1922289
6759 -1922289 -942502 -812114 -146241 3189070 8767267 11717227 7187120 -2947878 -11038537
6750 -11038537 -11952737 -7140855 -122275 7333130 12744100 11933279 4652583 -2413559
6742 -2413559 -2900693 1388379 4288153 4498588 5499641 7586277 6543867 1361048 -2545133
6733 -2545133 -684308 4042895 5583417 2583258 -1504666 -4337261 -6994219 -10726469
6725 -10726469 -14425225 -16012260 -14584613 -10548093 -4737555 2003624 8770816 14248293
6717 14248293 16532343 14407376 9625624 6652016 8194791 11370812 10592063 4838824
6709 4838824 -162884 1260372 7086978 9042526 1609834 -12237520 -24543665 -29627043
6701 -29627043 -26903535 -18666092 -7811205 2491103 9564489 13126969 15420734 18431865
6693 18431865 21607380 22987766 21720455 18440809 13847871 8215792 2195422 -2938527
6685 -2938527 -5903136 -5721203 -2062484 3486246 7113632 6010601 2485193 2627722 9227160
6676 9227160 17645145 21014491 18504940 15468084 15504246 16076649 13702558 10127824 9679445
6667 9679445 12129909 12606374 8832373 4314443 2763727 3044127 2450838 2132199 5396411
6658 5396411 11969541 17730930 19817430 18653056 15081374 9168152 2551781 -1471012
6650 -1471012 -1590315 540791 4027924 10146682 18280206 23900170 23622919 19873813 17365143
6641 17365143 16829909 15567948 12663741 9848285 7748941 4934265 1000218 -2274624
6633 -2274624 -3374198 -2538459 -730474 952862 1063809 -1135369 -4945535 -10191798 -18105325
6624 -18105325 -27412497 -31885130 -26756828 -16643213 -11386609 -13702625 -16807504 -15246693
6616 -15246693 -11206220 -7477304 -1776870 6378777 9696513 2268749 -8905473 -10596915
6608 -10596915 -797397 8891191 9334170 4405588 2540226 4788545 6345689 5106025
6600 5106025 2548540 -1628024 -9677749 -20267474 -27244698 -25753005 -17417905 -8226589
6592 -8226589 -2792872 -1816830 -3787463 -7039331 -9750033 -9608157 -5455504 628865 4593453
6583 4593453 4642003 2753576 877241 -2333306 -8364039 -13896972 -13191794 -6175884 -471812
6574 -471812 -2985556 -11518022 -17041610 -13145657 -1391469 11502957 19468977 20439934
6566 20439934 16290068 10652659 6406227 4767564 6112508 10320832 15763775 19292876
6558 19292876 18725559 15126639 11735984 10775429 11824826 12909555 12461240 10390889 7832013
6549 7832013 5933348 4860000 4118153 3556350 3398402 3482567 3396101 3440196 4608148 7450137
6539 7450137 11537658 15766229 18396986 17437295 12330165 4809628 -3253012 -11901589
6531 -11901589 -21027866 -27550863 -27980566 -23340819 -17745809 -12060859 -3565293 7137561
6523 7137561 14199417 14161197 10694167 8229293 5555432 377150 -4251894 -4386545 -3005831
6514 -3005831 -6259193 -13515971 -18464917 -19496228 -21122424 -24297654 -23675499 -17461470
6506 -17461470 -12280490 -13311934 -15755325 -12157297 -3740514 2095920 2630160 1518629
6498 1518629 1168554 87276 -1869002 -1459543 2953184 8494988 11677173 12088610 10669854
6489 10669854 7321142 2438414 -1294956 -1268719 1557170 3432512 2146843 -649947
6481 -649947 -1855616 -772771 601532 1152869 2567037 5707049 6564113 -43600 -11803425
6472 -11803425 -18301306 -12435382 346301 8236046 6794166 2143398 1361786 4741394
6464 4741394 8483936 10508328 11098809 10686158 9631435 8765466 8350966 7491448 5437615
6455 5437615 2145978 -2807241 -9506861 -14865369 -13383553 -3366584 9215333 15946085
6447 15946085 14670681 10791537 10014858 12083213 12615558 9608858 6194447 6497905 9946160
6438 9946160 11437436 7533859 625471 -4630870 -7419663 -10626218 -15332015 -18738209
6430 -18738209 -17970455 -12938339 -4766531 5198776 13393052 14755401 8453411 513408
6422 513408 -2307183 362645 4085292 6244181 7652279 8909510 9063987 7837063 6139753
6413 6139753 4340201 2511474 1927594 3418869 4606958 2065320 -3588413 -7894861
6405 -7894861 -8173512 -5842474 -2898342 213989 2394749 1683383 -765961 -231634 5261915
6396 5261915 11194348 12234894 9112089 6274137 4917695 2914559 863435 3098336
6388 3098336 10974962 18650882 18493093 9664736 -813573 -5633330 -4379604 -2248777
6380 -2248777 -2384107 -1694479 4317759 14374744 22191033 24137137 22609095 20952303
6372 20952303 18871371 15087434 11149661 9369148 9410982 10198939 12848311 17909054 21810080
6363 21810080 20624243 16047445 12823240 11173868 7332333 1536809 -881585 1642533
6355 1642533 2713863 -3637094 -14149626 -19718454 -15448650 -4736502 4548111 5847916
6347 5847916 -1557921 -11244504 -14729968 -9817444 -1949621 3714905 7945516 13049240
6339 13049240 17046076 16242122 10938932 4732934 119813 -2151670 -2033895 -1745986 -4993495
6330 -4993495 -10629716 -11212414 -3559753 3309292 -1331978 -13995404 -20808011 -16797973
6322 -16797973 -11404605 -12855421 -17039553 -16598797 -12472600 -9677248 -7943608 -4019761
6314 -4019761 879576 3159180 3785889 6605056 11326751 13885822 12475395 8098082
6306 8098082 800327 -8904091 -16039846 -15009312 -7836590 -2997465 -5008877 -9985142
6298 -9985142 -12513064 -12055236 -10859610 -10012934 -10002769 -11732414 -14496500 -15486663 -13270070
6289 -13270070 -9552557 -6034883 -1952218 3647464 9413337 13190630 14339498 13461707
6281 13461707 11596290 10326199 10336497 9159439 3287923 -6124310 -12663269 -11783746 -6094201
6272 -6094201 -1449794 -56893 196552 1438114 3340348 3901305 1179267 -4355319 -8360513
6263 -8360513 -6177875 630065 4622453 2019964 -1462263 1747653 10356587 16172362
6255 16172362 15344967 12151916 11542848 13239992 14667578 15103502 14342199 10645266 3297366
6246 3297366 -4379995 -7263625 -3474380 3816871 9060812 8610083 3728747 -219331
6238 -219331 999041 5762817 8713637 7629473 5738517 6523920 9113656 10614367 10569063
6229 10569063 10536123 10810768 10323018 9136346 8669317 9598483 11299257 12981489 13648885
6220 13648885 11546317 5978323 -329661 -3141774 -1771886 -231442 -2150055 -6158239
6212 -6158239 -7869908 -5392198 -1073520 1880511 2776400 3009001 3640796 4522806 5393201
6203 5393201 6683782 8774160 11037143 12361096 12483279 12008853 11005183 8704452 5442165
6194 5442165 3881221 6549395 12148005 15997582 14778084 9457267 2917759 -3321541
6186 -3321541 -8344842 -9836386 -6276599 -880651 308031 -4377968 -9739091 -10256277
6178 -10256277 -6631073 -3468055 -2964109 -4410053 -8078879 -14743055 -21306834 -21746234
6170 -21746234 -14115252 -3086426 6049480 12204371 15355091 13114818 4649074 -5052986
6162 -5052986 -9873803 -10045750 -10181091 -11055071 -9126138 -4546338 -3340508 -8716539 -14994710
6153 -14994710 -14391426 -7055754 -142750 1650994 525166 664977 2517823 3483201 2492906
6144 2492906 1991779 4956645 10391792 12992346 8742645 515052 -4089664 -1191942
6136 -1191942 5070566 7730602 4383703 -2058593 -7636991 -9799804 -7337658 -1353347
6128 -1353347 3811588 3568047 -2021931 -7866286 -9021222 -5433863 -1463129 -1390228 -5251760
6119 -5251760 -8780618 -8092516 -4272750 -1475883 -495075 2166420 7171990 8797021 2688875
6110 2688875 -6465611 -11008283 -11702814 -15598978 -22911992 -24531966 -15203448 -1616557
6102 -1616557 6999396 9854760 10690662 8896313 2264491 -5044770 -6029049 -1658114 -429462
6093 -429462 -6194452 -13070604 -14305151 -10394691 -5806934 -2561829 -305055 963140
6085 963140 1503919 2540606 3777563 2777884 -826317 -3296424 -1919977 41397 -3185405
6076 -3185405 -12602066 -23102063 -28430233 -25712337 -16744147 -7083263 -2468780 -3745725
6068 -3745725 -6151396 -5077857 -866132 3574739 7079184 9360550 8649560 4358511
6060 4358511 370758 1109366 5126501 7109033 5853848 5337459 7487540 9252423 8760912
6051 8760912 9506554 14972881 22356902 25400560 21835135 15044787 9436239 6674612
6043 6674612 5833178 5166495 3893126 3328698 5618609 10465670 14131845 12878053 6855019
6034 6855019 -18170 -3345953 -1362822 3885312 8191527 9294671 9043870 9652082 8874281
6025 8874281 2788263 -6460638 -10677676 -5669689 3054954 7932451 8827017 10576870
6017 10576870 14272118 16493987 15724332 13890919 11593922 6987440 568590 -3229479
6009 -3229479 -1275453 4212035 8616329 10046781 10320419 12336836 17282488 23262770
6001 23262770 26360191 24015116 17222484 8835690 1240434 -2931106 -447040 8588597
5993 8588597 17909977 20311297 15320536 8166343 2148377 -3213652 -6885198 -5400254
5985 -5400254 648801 4364710 319324 -8562566 -14912448 -15396776 -12801186 -11596865
5977 -11596865 -13644442 -17046959 -18041769 -15198538 -11610997 -10740085 -11005928 -8396480 -3808441
5968 -3808441 -2379389 -5146606 -7721072 -8545112 -10772208 -12747267 -5422559 13896155
5960 13896155 32332624 35093324 24125008 13971033 11793909 11355998 6214806 -1063322
5952 -1063322 -5123507 -5471574 -4624051 -3974125 -4063874 -4859347 -4360709 -865941 2989283
5943 2989283 2938800 -233519 -2019990 -2157397 -5025397 -11374148 -16216374 -16328079 -13347496
5934 -13347496 -8187792 55167 7593234 7012444 -1196049 -6544750 -3112829 2147723
5926 2147723 2135780 1993707 9467241 19709582 21071419 12549197 4604163 4180916 8735466
5917 8735466 14034156 17881714 16218306 5764683 -7840477 -13820223 -10414353 -6684575
5909 -6684575 -7976983 -8867193 -4314937 1310471 2007943 -626825 -2174764 -3023602 -4903281
5900 -4903281 -5607887 -3912419 -4401276 -9869224 -13536108 -7426987 4561677 10896621
5892 10896621 8131889 3544665 2455870 2138418 113764 -75684 4549885 10361772
5884 10361772 12371229 11344509 11381155 13255031 13995323 11430013 6326175 1174386 -1411119
5875 -1411119 -513730 1572451 1321859 -1538437 -3546774 -2441235 -107532 768202 522717
5866 522717 1146317 2984184 4457748 3581130 -1087719 -8808683 -15183190 -15410869 -10661414
5857 -10661414 -7994183 -11559934 -16905472 -16937211 -10719721 -2902809 2966092 6328705
5849 6328705 6839892 4595344 2244933 2069344 1203430 -5215605 -15464323 -20911670 -16490806
5840 -16490806 -7461486 -2800980 -4750902 -8139911 -8220913 -5659096 -3856711 -3924423 -3503661
5831 -3503661 -8978 5802706 10276389 10948303 8766495 5411486 780092 -4283576
5823 -4283576 -5179531 1611186 11416925 14817485 9720988 4672731 7251767 14137623
5815 14137623 17123171 15032723 13854269 16964081 21117663 22078867 19322646 14417303
5807 14417303 8753238 3955669 1339951 -61680 -2306871 -4884294 -5100448 -2624590
5799 -2624590 -490105 -630197 -1556869 -1785714 -2432607 -4510802 -6372235 -6023769 -3725165
5790 -3725165 -218033 5152991 11843549 15837469 13552983 7092127 2255716 1518455
5782 1518455 1981794 634038 -1156006 352690 6358744 13732530 17589434 15532945
5774 15532945 9998474 6038495 6035464 7575243 7806261 8200567 12015588 17841570 19796348
5765 19796348 15230612 8499932 4775690 3299614 253533 -3898529 -4562910 -375015
5757 -375015 3807612 2737365 -3191294 -9255006 -11479377 -8920554 -3272459 1514648
5749 1514648 1067687 -4998275 -11170604 -11168006 -4860590 2053422 4903437 4006938 1774443
5740 1774443 -1088516 -5193241 -10285634 -14643020 -15423424 -9810241 1480816 11592126
5732 11592126 12392734 3916435 -4712804 -6471385 -4661833 -6012059 -9700090 -9844675
5724 -9844675 -6676702 -6941926 -12331932 -15579226 -11507280 -5112487 -3394350 -4492939
5716 -4492939 -1703468 4909060 8305720 5086876 -467101 -3747837 -5157252 -6080490
5708 -6080490 -4888349 -452055 4130509 5326363 4300024 4223794 4002064 -611261 -9280176
5699 -9280176 -14941649 -11992737 -4060188 -150003 -3615302 -8359112 -7284255 -1872335
5691 -1872335 -405537 -7337983 -17587300 -22531645 -19514759 -13528961 -10686987 -12223212
5683 -12223212 -14890605 -15482823 -13979291 -12526618 -11957399 -10381735 -6336973 -2420464
5675 -2420464 -2946405 -7379466 -9576748 -5977094 -1329143 -2131208 -6574245 -6678478 -269280
5666 -269280 5265616 3219481 -3725157 -8505794 -9077841 -8163725 -6711116 -3319947 819848
5657 819848 1961850 -477674 -2588871 -1572411 1044919 3215737 5714680 9430155
5649 9430155 12423265 12613549 11246741 10703222 10415772 8006795 3386246 -1433665 -5932051
5640 -5932051 -11055635 -15527579 -15691333 -10239638 -2457973 3579158 6847320 8247563
5632 8247563 8182188 7186990 6916718 8175238 9368333 8987402 8126207 8252120 8246112 6844212
5622 6844212 6559246 10733871 16647460 16332528 6221214 -7659319 -16718023 -19183123
5614 -19183123 -19466487 -20508752 -20761366 -18160267 -13381479 -8369744 -4166054 -1219290
5606 -1219290 -29346 -317816 -701704 -241393 307968 -385253 -2071280 -2407113 1168035
5597 1168035 8801096 17340365 22483283 22239255 18226415 13729334 11135757 11061496 12507049
5588 12507049 13263265 11555826 8326031 6775548 8635091 12016723 13901542 13187730
5580 13187730 10029461 4383939 -2205948 -5076523 -242701 10498540 21138561 27908857
5572 27908857 31278409 31940863 28805512 22061107 14783100 9663918 6546295 4407093
5564 4407093 3050861 1587702 -1451144 -4525468 -3194360 3154179 7928054 4726343
5556 4726343 -4259431 -11595557 -14264301 -14622883 -13000843 -6223513 4956131 13101612
5548 13101612 12417855 5868943 413669 -1622364 -2508378 -3121224 -1842668 1421559 4464912
5539 4464912 6278616 7937868 9580960 9615130 7775137 6311917 6939786 8486585 8478917
5530 8478917 5588882 291485 -5036728 -6724048 -3123943 2299997 4132373 1930147
5522 1930147 651363 3097557 6068687 6367351 6208289 8594666 11008884 9165701 4783211
5513 4783211 3607196 6597262 9090419 8751339 8174788 8475094 6514832 1084993 -3570099
5504 -3570099 -3840426 -2057688 -2260093 -4420086 -6290906 -7329499 -7157994 -3810877 2281088
5495 2281088 5943426 3576833 -1082404 -2320721 -614891 -3909 -234227 1626571 3489946
5486 3489946 -82243 -8341885 -13861143 -13023437 -10373183 -10454017 -11700039 -11419434 -10973807
5477 -10973807 -12008805 -12274345 -9566268 -6258813 -5779161 -7387908 -8109673 -7169333 -5025093
5468 -5025093 -821181 5188939 9042608 7301446 2478902 135968 1471424 2754710
5460 2754710 1783696 1079449 3962494 10146718 16124820 18431619 16307802 12300069 10126659
5451 10126659 11185508 13674224 15375784 15714571 14484551 10904042 5441926 517468
5443 517468 -2200495 -3121833 -2056450 2744050 10513850 15976186 14747395 8573648 2135063
5434 2135063 -2915967 -7250371 -9946632 -9958827 -9587264 -11313496 -12316432 -7750219 603279
5425 603279 4681750 413066 -7226636 -11167494 -9909653 -6084837 -1466325 3279086
5417 3279086 6438173 6307172 3669240 1198619 773520 2239777 4038451 4506870 3369579
5408 3369579 2004529 1327378 90960 -3078932 -6871982 -8984223 -9930347 -11978387 -14341963
5399 -14341963 -13121298 -7162532 -824713 854897 -2438232 -7185984 -10421951 -11849963
5391 -11849963 -13095862 -16010228 -20747598 -25164470 -27043910 -26239798 -22998510 -15756245
5383 -15756245 -4076920 7069326 10546344 5284458 -2738597 -8472359 -12246907 -15015446
5375 -15015446 -14492115 -9263190 -2599689 1645148 4006890 6978037 10485269 13147848
5367 13147848 15256014 16984313 16364464 12714280 9180483 7650355 4240376 -4664035
5359 -4664035 -14329939 -16351937 -10570892 -5401319 -5731032 -7465280 -6130321 -4021402
5351 -4021402 -4622427 -5337917 -1440004 5771625 10293898 9609822 6738369 4495174 2195339
5342 2195339 -1163307 -4178377 -5297936 -5496350 -6867815 -9662897 -11914345 -11345032 -7156320
5333 -7156320 -874232 4123101 5007471 2078023 -1933594 -5479904 -9714000 -15501599
5325 -15501599 -20386498 -20293831 -13844732 -3855862 4775102 7589873 2417920 -8641743
5317 -8641743 -19116559 -22512042 -17730620 -9003903 -681916 5789103 9807037 9861951
5309 9861951 5638843 -205594 -4200200 -4758805 -1964856 3071223 7301397 6747760 621184
5300 621184 -7374215 -13525174 -17604506 -20234823 -20114570 -16855791 -13450354 -12187188 -11034461
5291 -11034461 -8270239 -7380731 -11575815 -16060275 -12971415 -3119572 4479973 4951191
5283 4951191 2188715 398606 -1191886 -3105612 -2956278 -1495641 -3886405 -10252618
5275 -10252618 -11792480 -2220748 12568081 22526061 25946249 26867393 24828905 16495022
5267 16495022 5622666 2002135 8980083 18778626 22218419 18113338 11349803 6001011
5259 6001011 2511311 -1033134 -6359690 -12272506 -14703204 -11417386 -5619963 -2246516
5251 -2246516 -1921070 -1782719 -983561 -1330717 -3007545 -3740007 -2453030 -453824 1028385
5242 1028385 1527508 134395 -3184874 -5926236 -6241836 -6491571 -9096609 -10167661 -3494232
5233 -3494232 8715586 15811135 12021539 4203310 2504363 7568007 11497197 8824584
5225 8824584 1860925 -4008733 -6532460 -7510424 -9547680 -12680390 -13940123 -10569673
5217 -10569673 -3591228 2858956 5787383 5701099 4800908 4491327 4969983 5681000 5584446
5208 5584446 4071330 1996669 1179340 3057050 8072140 14939437 19595847 17164480
5200 17164480 7353023 -3711608 -9582404 -10052071 -9411093 -10466021 -13487355 -18616858
5192 -18616858 -24919124 -28847736 -28393998 -27114715 -28775819 -29785289 -23778102 -13148234
5184 -13148234 -8157303 -12947163 -19614713 -19057933 -11576165 -3503420 1027617 1312905
5176 1312905 -1796747 -4887319 -3209291 3324963 8917685 9570466 7820717 6847787 4858495
5167 4858495 -442001 -6309953 -8772630 -8275703 -6833859 -3317360 3187669 8834089
5159 8834089 9852805 9399655 13376364 21006758 25587283 23798326 18661486 13652897
5151 13652897 9347184 6185305 5560962 7139066 8864795 10185013 11914983 12897612
5143 12897612 10469257 4608888 -1663569 -6266932 -9339104 -10554684 -8556064 -3582666
5135 -3582666 2077191 6493830 8631817 7234823 2452690 -1953430 -1996094 647377 78928
5126 78928 -5465933 -10393540 -8695478 -1291782 5649405 7833535 6288905 4688519 4885699
5117 4885699 5315229 3566862 98303 -1942703 -1033512 661378 936964 798110 1538889
5108 1538889 962642 -3644761 -10097393 -13119656 -11369196 -8786980 -8666104 -9938590 -10000781
5099 -10000781 -8067486 -4889858 -1689583 221268 1106084 3701458 9363789 13898622
5091 13898622 11504741 3229482 -3234458 -3663297 -2586822 -5974567 -12856913 -17710799
5083 -17710799 -17779799 -13878696 -6557760 3437717 11909209 13793837 10068066 7621850
5075 7621850 9849212 10814596 2638821 -12900046 -24752487 -25467227 -19762213 -17637068
5067 -17637068 -21905296 -26750122 -27198509 -24598467 -21787803 -18259591 -13402553 -10434573
5059 -10434573 -12429002 -16615634 -17327186 -13641310 -9735525 -8076796 -6780852 -4254340
5051 -4254340 -1995092 -959972 1224871 6627363 12735364 14786732 11782904 7902670
5043 7902670 7493061 9915528 10293764 5192459 -3377086 -10233080 -12450629 -11130031 -8510677
5034 -8510677 -5887526 -4613196 -6051503 -8985910 -9618824 -6091890 -998787 2199684
5026 2199684 2930888 2059188 -374550 -3618365 -5329375 -4993950 -5387917 -7783787 -9134846
5017 -9134846 -7684180 -7492170 -12073224 -16649451 -13332261 -2548593 7344658 11550682
5009 11550682 13437887 16779760 19403928 16951985 8970381 -808602 -7823174 -9807230
5001 -9807230 -8958218 -10325105 -15092145 -17072436 -10228140 1717054 8633579 6515839
4993 6515839 974528 -2015000 -2841686 -4298857 -6382481 -7606537 -7748997 -7141120 -5644380
4984 -5644380 -3053255 1535078 9575091 19151627 23531495 18729333 10596969 8188076
4976 8188076 11594626 13561448 12008315 12096774 15223592 15378340 9413534 2826530 1581848
4967 1581848 5029124 10313681 16959810 23290135 24834841 20598297 15450587 12832900
4959 12832900 10715002 7770355 7012112 9504797 10829182 7892143 3232274 -1085646
4951 -1085646 -7043290 -13984096 -15774727 -10101581 -3773716 -2814301 -3760409 -1208640 2367343
4942 2367343 1759226 -1358047 -1819451 -111640 -744953 -4232177 -6956672 -6783874 -3976565
4933 -3976565 744617 5228331 6602725 6116732 8471461 13535643 15291904 12457033
4925 12457033 11954097 16718040 18865231 11911198 1342477 -4934589 -8470011 -13697071
4917 -13697071 -17537655 -15889956 -13646838 -17443595 -24044625 -26148088 -24015121 -21163681
4909 -21163681 -14913287 -2639820 8427175 9834562 5497180 4950854 8052243 8327768
4901 8327768 6161986 5716272 3657587 -5537424 -17251278 -22796027 -23308688 -24756490
4893 -24756490 -24908098 -19292253 -13668647 -15273578 -18583208 -16148035 -15261836 -24966197
4885 -24966197 -35564932 -33148001 -25375385 -27550684 -32654219 -25292112 -16187888 -26332132
4877 -26332132 -43985757 -41164840 -28267216 -35742468 -34931138 52222894 229549714 376053934
4869 376053934 376843509 263195924 160579241 128225516 120687782 92847611 63220292
4862 63220292 58967298 64351885 55476002 41738641 40798341 43924526 35684993 24482832
4854 24482832 26484415 36563126 39026828 33786667 30889096 29979568 24280196 16551680
4846 16551680 14288668 15711601 14897590 14567852 20519012 28730756 30248342 24770147
4838 24770147 19060835 15897198 13693174 12946542 14557383 15479654 13374626 11642528
4830 11642528 13466481 15559820 14025829 11194305 10252165 8684573 4134597 1484910
4822 1484910 6247301 14813079 18639762 15213182 8734462 3044153 -493268 -1247154
4814 -1247154 -722111 -2657527 -7402984 -9857184 -6783342 -1461351 2739209 7364290
4806 7364290 12609883 12953334 5957820 -497231 2213636 11090091 16468672 15486429 12828053
4797 12828053 11563117 11435157 13606935 18761303 22062434 17930883 9006965 3094317
4789 3094317 1839115 -284096 -5619095 -9017830 -5399019 3606466 12023291 14957762
4781 14957762 11455238 5314771 2689011 5771877 9841126 9400856 5216489 1868521
4773 1868521 1030520 1522208 3333869 6396346 7558317 4443382 785092 2325101 8531865
4764 8531865 13730462 15184530 14427618 11812489 6117900 -679501 -4466931 -5246857 -6612304
4755 -6612304 -8489614 -6261892 1653086 10763327 16702591 19721859 21371333 21321701 19592661
4746 19592661 17953273 16810317 14001197 8958382 5413830 7594215 15109352 23030538
4738 23030538 26353234 24348498 21303156 21823978 24147519 20550665 7214305 -8966628
4730 -8966628 -17742251 -17719702 -16019009 -16962721 -17391713 -13910384 -8793788 -6189917 -6599166
4721 -6599166 -7728936 -8149491 -8179777 -8869499 -10833855 -12623285 -10974118 -5103158 403651
4712 403651 264877 -4940502 -10331562 -13333575 -14458640 -13159510 -8413795 -2565600 1277878
4703 1277878 5097249 12766890 21356770 23234168 17743529 12700392 12146939 11119937
4695 11119937 6253283 2932073 5970270 10448726 9033326 2893076 -1909011 -4067573
4687 -4067573 -5320802 -3339435 4627476 13383722 14514456 9221064 7560169 13673912
4679 13673912 20218823 20390837 17799563 19330213 23719156 23580126 16479585 8454743
4671 8454743 6517144 11302437 17901747 21748006 22461619 22427940 22482354 20248546 13860818
4662 13860818 6248845 2856297 4333038 4216034 -3862243 -18056013 -29812776 -32998981
4654 -32998981 -29175170 -23636829 -18901805 -13997657 -8669416 -5305762 -5865803 -8722810
4646 -8722810 -10221241 -8889786 -6768732 -6446552 -7750606 -7909448 -4739469 698824 4883875
4637 4883875 5336009 2746172 -986274 -5738299 -12142287 -18078208 -19559749 -16449901
4629 -16449901 -14057610 -16337013 -20030275 -19130089 -13455937 -8655668 -8328524 -10323804
4621 -10323804 -11138669 -10170558 -8771582 -8417249 -10752615 -16240767 -21551773 -21351854 -14377129
4612 -14377129 -5439099 -50917 913169 400477 1506342 5614792 11670672 16023684
4604 16023684 15179493 9875564 4658996 3027101 5049643 9312774 13718289 14481154
4596 14481154 9086289 1562291 160876 7498272 16906678 20650482 17633854 10948877
4588 10948877 3077337 -2866784 -2312725 4991961 11875748 11715852 6896292 4389722
4580 4389722 5606806 6217803 4075536 1291140 -823109 -3284109 -5809284 -6360359 -4632227
4571 -4632227 -2198790 569408 3990692 6150087 4778470 1845455 2030895 6324108
4563 6324108 10808757 12038742 10456080 8693493 9380656 13611232 18446381 17867032 10299279
4554 10299279 2759740 2018383 4037465 -438451 -11000128 -17143593 -13783813 -8191992
4546 -8191992 -8086784 -10856406 -9686405 -3978858 2116412 6700559 9792418 9520858 4303886
4537 4303886 -3162145 -8368195 -9765425 -8296050 -5044777 -2234966 -2951152 -6396034
4529 -6396034 -7212883 -3336601 -138652 -1876888 -3697988 979967 8564844 9029131 394761
4520 394761 -8548994 -10441392 -6787093 -1675785 4589656 11951597 16239136 13203193
4512 13203193 4387253 -4271146 -7887940 -4813186 3858506 14127734 20325373 19613483
4504 19613483 14933000 11656256 11582020 11537285 7781028 804769 -4682203 -4639272 -289537
4495 -289537 3114893 2202588 -1625751 -5871163 -10564662 -15701611 -17794383 -13405657 -5134891
4486 -5134891 531019 1527134 1935989 4418669 5366810 119393 -9982286 -18511501 -20397009
4477 -20397009 -15670903 -8156689 -1918160 1798946 4773688 8470791 11447663 11914906
4469 11914906 11412384 12516655 13921083 12447911 9699989 10853440 15586280 16721553
4461 16721553 11166871 6071301 9081151 17534257 23404850 24820568 25444863 25395938 21429868
4452 21429868 15713183 15771575 23559040 31591751 33020953 29600767 25998842 21724722
4444 21724722 13955306 4699938 -709551 -983518 -78547 -1535982 -5366188 -10135489
4436 -10135489 -14299033 -15093357 -9845619 -160229 7530307 7756958 1678205 -4250432
4428 -4250432 -4915210 -1141116 2006986 679386 -4399853 -9681655 -12713630 -13123780 -10381991
4419 -10381991 -3252668 7011364 14848797 14640637 6891454 -1830485 -5682261 -4892794
4411 -4892794 -3868322 -5421789 -7999983 -8031214 -4084429 1379611 4324662 3386665 1372041
4402 1372041 1692109 3839273 4138550 1077373 -2475443 -3605046 -3525671 -4779862 -5778569
4393 -5778569 -1936989 7326764 16116400 18234900 13547406 6619067 1366304 -799095
4385 -799095 191723 2850617 4003099 2154147 254900 1805590 4906502 4323489 -471732
4376 -471732 -4143819 -3703191 -2902164 -5648288 -9600919 -10493909 -9211247 -9382959 -10249029
4367 -10249029 -7573684 -858568 5619588 8980396 10179729 10133513 8466084 7034816
4359 7034816 9567779 15762879 20118461 18930305 14451042 9784296 4177013 -2960071
4351 -2960071 -7360617 -4360600 3903917 10495716 12138084 11735160 12743029 14680785
4343 14680785 14894356 12309417 8560532 6333801 6387594 5925000 1672044 -4613462 -6602789
4334 -6602789 -1524701 5168791 6606717 3417858 1726507 4285537 8508631 12094580
4326 12094580 14999477 15689128 11131441 2323814 -4652908 -5356017 -1373826 3788887
4318 3788887 9630204 16895821 23732125 26677483 24397941 18759046 13294115 11370752
4310 11370752 13961210 18160968 19719197 17949113 16314106 17567999 20577633 22670681
4302 22670681 22654538 20648344 17517024 15448526 16418952 19013626 19379632 16118204 11349295
4293 11349295 6687320 2321895 678291 5233913 13233492 15533037 7949686 -2406889
4285 -2406889 -7188312 -8177162 -12119936 -18479237 -20576617 -16796257 -12091820 -8729148
4277 -8729148 -3934077 2208304 4717838 2252542 443251 3030352 5965475 4723387
4269 4723387 1893807 2131891 3995944 2994272 -12213 181433 4605897 8178296 6751984
4260 6751984 1938951 -1890693 -2246455 627626 5046881 9225581 12836743 17207796
4252 17207796 22571358 26021501 24472064 19030367 13883218 11244892 10189907 10140567
4244 10140567 11887378 14458762 14774551 12359498 11166519 13900945 17044714 15065889
4236 15065889 8081177 1448327 -1719440 -3435616 -5624133 -6376923 -3811934 -281846
4228 -281846 823221 535076 2756078 8123898 13305400 16377863 18812571 20990189 19863430
4219 19863430 13857579 7075540 4776058 5927761 4073834 -4119892 -14190176 -18971481
4211 -18971481 -16545781 -11545883 -9085451 -8798946 -5853263 2249142 11507135 15745283
4203 15745283 14091056 11256240 10405994 9535923 6405300 3087642 2466491 3376326 3300878
4194 3300878 3588584 7242787 12771222 15188752 12967166 9455833 7276716 5920367
4186 5920367 5436532 7563901 11666674 14191770 14394589 16332443 22306955 28214786 29153531
4177 29153531 26734372 26551074 29888995 32026556 28663665 21050784 14292021 12384978
4169 12384978 15201231 19067733 19916041 16339475 9953200 3563450 -345454 -628042
4161 -628042 1138901 1316254 -1445227 -3681877 -1824396 2176208 4115687 5037680 9919025
4152 9919025 19424812 29373204 38454593 49120431 60584527 70735938 86622093 119125090
4144 119125090 159162260 172830396 135992116 67319670 11046313 -10539721 -12082184
4137 -12082184 -14481647 -18728522 -16528759 -9928261 -7374471 -9464132 -10946782 -11936805
4129 -11936805 -16489631 -22930110 -25207481 -22777277 -20824833 -20605447 -16872163 -6336615
4121 -6336615 6751291 15166083 15287954 8633923 367005 -3365634 -148291 5766454
4113 5766454 7720874 4031206 -1166352 -3777178 -3355163 -1327229 652925 255799 -3872673
4104 -3872673 -8930723 -9761271 -5265280 35661 2485490 4048324 7886237 12174257
4096 12174257 12645104 10068040 10149692 14829378 18127594 13882662 4650921 -1664765 -2888040
4087 -2888040 -4830253 -11370682 -17705924 -17037626 -9856251 -1793658 4561993 9670498
4079 9670498 11065247 5180950 -4433118 -8603987 -4843255 -1120285 -3637981 -7728063
4071 -7728063 -6272193 -920912 2205535 3155995 6228138 10694745 12435241 13101188 17979150
4062 17979150 24459159 22573467 9785655 -3627290 -8256517 -6881271 -6740312 -7514046
4054 -7514046 -4354988 1817021 5183797 4360401 3931827 7040642 11913274 15728504 17355168
4045 17355168 16237338 12573291 8555019 6027626 3786689 1058848 2140095 11859005
4037 11859005 26406047 34810476 31369595 21561018 13645270 9606218 7202020 5571108
4029 5571108 4219519 670483 -5364661 -8400941 -3754056 4022899 5686620 -21520
4021 -21520 -4852247 -3510657 -1052081 -4207046 -10567217 -11912886 -5655986 2662199 7608437
4012 7608437 9317939 9682229 7730650 2023162 -4634195 -6576909 -1719877 5530452
4004 5530452 8796420 6141099 1011540 -2439758 -3257547 -2618002 -996645 1342569 1864096
3995 1864096 -2955498 -12509506 -20591813 -21353515 -15563365 -8841633 -4811455 -2799450
3987 -2799450 -1777948 -2828721 -6263261 -9280528 -9244231 -7932445 -9644265 -15040504 -19262593
3978 -19262593 -17354809 -10305857 -4181310 -3413129 -6333829 -8093648 -6892988 -5479813
3970 -5479813 -6470491 -8503034 -8496490 -5959219 -2798344 -23279 2553422 3911925 2492504
3961 2492504 -375686 -1229503 109172 -579978 -5323751 -9474799 -7246487 429244 7342032
3952 7342032 9959771 10028831 9958252 9926643 9993924 10978347 11838723 9684349 4323346 -106058
3942 -106058 -229568 2358628 4373023 5801064 8205647 9720521 6056550 -3021186 -11569650
3933 -11569650 -13378718 -8217524 -1064838 3360354 4031646 2775959 1765943 1997637
3925 1997637 3452065 6199738 10668021 15978710 18487466 14126041 3673411 -5550888
3917 -5550888 -5683275 3476965 13834721 17404942 14019303 9461203 7456632 6298308
3909 6298308 3505697 610845 975465 4528816 7656669 8048150 6780624 5005401 1572166
3900 1572166 -4002400 -8382055 -7416353 -1961247 2025247 -137288 -7210632 -14358473
3892 -14358473 -18217268 -18551052 -16576837 -13644685 -11087836 -9681647 -8949210 -7712607
3884 -7712607 -5226367 -1353681 3571105 8102002 9879812 8096384 5041155 3083102
3876 3083102 662207 -5615408 -14392681 -18796719 -14619728 -6359503 -1720215 -2127857
3868 -2127857 -2883269 -1636404 -1505964 -4840024 -8799276 -9890598 -9231171 -9761069 -10806143
3859 -10806143 -9593089 -6940264 -7067945 -11349513 -15816066 -16244813 -13357847 -11447325
3851 -11447325 -13226973 -17191047 -19220034 -16227662 -9068839 -2093334 1108440 1443904
3843 1443904 2550160 5562343 7702884 6472835 2950110 -255673 -2226037 -3108752
3835 -3108752 -2070152 1477458 5329957 6016265 3386175 1441989 3315441 6744213
3827 6744213 6073024 -1571317 -13069736 -22058904 -24111418 -19534784 -12379116 -7213884
3819 -7213884 -5866208 -6267925 -4866160 -929931 2228679 1599203 -837354 -375859 3221368
3810 3221368 4206902 -1296304 -8760665 -10282582 -4661772 1932092 5183390 7577570
3802 7577570 12358578 17018096 16587831 10969882 4957414 1898036 995386 835366 2034586
3793 2034586 5096431 8110914 8586646 6674394 5060405 5686884 7403802 7357250 4765945
3784 4765945 2742636 5214257 11751741 16814213 15211327 7513874 -832617 -4745612
3776 -4745612 -2955041 2049099 5494140 3076423 -4959877 -12785132 -14526715 -10765937
3768 -10765937 -7099967 -6590731 -6990457 -5892896 -4601224 -4753696 -4474726 -1161099 3910513
3759 3910513 7083606 7266534 6204253 4465789 470701 -6122798 -12694763 -16130556
3751 -16130556 -15354109 -11218886 -5671247 -1167313 969219 1921003 3510428 5157409
3743 5157409 4847962 2934324 2077021 2993880 3496745 2764858 2983130 4838021 5192513
3734 5192513 2400245 398095 2941342 6404872 4202864 -2609651 -5707457 -1544757
3726 -1544757 3306221 1979694 -2816516 -3523840 1158507 5396878 4987589 1742481 -949033
3717 -949033 -2338639 -2869012 -2093588 83702 2505473 4838554 8674126 14770209 20548337
3708 20548337 22167059 18515394 11978398 5936074 2621331 2647350 4966568 7133805
3700 7133805 6765270 3363264 -1501458 -5836491 -8782881 -10626725 -11750106 -11964511 -10977583
3691 -10977583 -9259306 -7913098 -7474284 -7333895 -6783759 -6170695 -6466614 -8187920 -11361296
3682 -11361296 -15766089 -20045222 -21347148 -17823955 -11565511 -7084028 -6214249 -6234638 -3930606
3673 -3930606 302025 3868399 5779598 6749434 6500010 4000220 881087 1872747 9881017
3664 9881017 21815160 31150770 34189831 32192345 27693607 21134143 12333597 3457886
3656 3457886 -2005171 -3254539 -3232061 -4906126 -7690732 -8335655 -4503864 3101985 11068750
3647 11068750 14898406 11553470 1965287 -9223020 -17251793 -20271342 -18812916 -14218377
3639 -14218377 -8979099 -6624053 -8538834 -11675957 -11895601 -8926593 -5486168 -2467615
3631 -2467615 1339086 4956026 5126839 1873325 41986 2892347 7531567 9614045
3623 9614045 9525560 10244473 11478469 10436720 7366537 5734872 6650632 7131356 4976645
3614 4976645 1945932 436291 -194043 -1761561 -3674578 -3851521 -2515693 -2648366 -6145201
3605 -6145201 -10994805 -13282681 -11489011 -7860805 -5534644 -5378634 -6315143 -7537000 -8655581
3596 -8655581 -8324720 -5355341 -1620380 -977853 -3846059 -5594072 -2668122 2150184 3794366
3587 3794366 2175767 1171588 1399783 -848105 -6573196 -10808774 -9031863 -3444592
3579 -3444592 257368 21832 -1970948 -4194133 -7339242 -11146328 -13304739 -12782814 -11673974
3570 -11673974 -11850668 -11527442 -7674328 -1342944 2133163 -741590 -7246685 -11837098
3562 -11837098 -12434091 -10940024 -8432461 -3432544 4190098 11029020 14264308 15705173
3554 15705173 18958904 24094833 27970579 28773748 27264908 24218269 19765584 15120326
3546 15120326 12032648 10482656 9488583 9675243 11701091 12593453 8161779 -130076 -5383191
3537 -5383191 -4304505 -1615403 -2606839 -5571792 -5885382 -4330985 -5915290 -11608510 -16421500
3528 -16421500 -16112264 -11859655 -7424801 -4817734 -3837985 -3431988 -2381634 -426831 574715
3519 574715 -1713096 -6626667 -10145400 -8754953 -2792933 4089752 7730981 6171904
3511 6171904 1410612 -1524835 866371 6561673 10139189 8969160 5381010 2552394
3503 2552394 869952 -454405 -556181 2070955 6852118 11397839 14172694 15619665
3495 15619665 16875911 18249924 18693210 16333310 10298602 2639592 -2518439 -2712758
3487 -2712758 582470 4020911 5633083 5167232 2822612 -297716 -1312808 2291593
3479 2291593 9161433 14410039 14128260 8718292 1978887 -1652763 744361 8736733
3471 8736733 17924187 23045932 22896053 20758147 19300983 17369396 13385672 9291786
3463 9291786 8054387 8856522 8305653 5676855 3254966 1664682 -925498 -4060355 -3791452
3454 -3791452 1483992 7418024 8790115 5518764 812763 -3822781 -7973584 -9043654
3446 -9043654 -4502777 3133867 8024175 8138504 7089858 8441468 11770596 15066438
3438 15066438 17335763 17508957 14240631 8746219 4970837 4864528 5983832 5836267 5948149
3429 5948149 8723897 12193312 11361831 4435101 -4844230 -11176221 -12352809 -9999636
3421 -9999636 -7094703 -4987419 -2339396 2757351 9515806 14224427 13608235 7533877
3413 7533877 -1471807 -9758549 -13706276 -11877515 -6920618 -3209013 -1836653 -351980
3405 -351980 1973420 2203964 -1092934 -4385026 -3999361 -1638703 -1622585 -4750837 -8310677
3396 -8310677 -10166958 -9254166 -4159764 4284055 10478722 9232996 3199945 415992
3388 415992 4161025 9769723 12015697 10843998 8387020 4995453 790580 -2481947
3380 -2481947 -4016318 -5776243 -9381312 -13549345 -16796675 -20002880 -23478306 -23900870
3372 -23900870 -18008659 -8427290 -2126594 -2573975 -6040780 -6675018 -3393230 -289388
3364 -289388 -1005997 -4351253 -6148357 -4514295 -1694149 -383035 -135084 981054 2555677
3355 2555677 2122487 -1138022 -5418378 -9173187 -12689109 -16171340 -18327719 -17910143 -15293451
3346 -15293451 -11639885 -7443257 -2534476 2907432 7317948 7696423 2202907 -6053941
3338 -6053941 -10090520 -6573606 -494201 1038267 -1900776 -3239727 -394003 2679969
3330 2679969 2227860 -698535 -3548350 -5285680 -4594151 -26018 6085143 8806321 7907117
3321 7907117 8599584 12182541 12118247 4045749 -6005213 -9493008 -6827385 -4045349 -1840413
3312 -1840413 3837581 12050931 16336185 14393358 10929506 9363656 7195723 1849184
3304 1849184 -4508336 -8829099 -11442553 -13622643 -14450902 -12838564 -10055084 -8044913
3296 -8044913 -7188279 -6928271 -6455752 -4177736 798785 6160131 8380791 7534053 6492793
3287 6492793 5003756 -712305 -10923354 -19817613 -22723887 -21760817 -21168345 -20917479 -18806278
3278 -18806278 -15598634 -13517553 -11693161 -7543315 -1682320 2169449 1446120 -3855229
3270 -3855229 -12498263 -21387943 -25074278 -20165546 -10409444 -4048560 -5400666 -10980213
3262 -10980213 -13727038 -9284579 851175 9968209 11037044 3911565 -3301011 -3178360
3254 -3178360 1874084 3371783 -1256236 -5654920 -4236492 512837 2937246 1994210
3246 1994210 519832 -183889 -887625 -1103102 876220 4663685 7219656 6032600 1472142
3237 1472142 -3859841 -7093270 -7030527 -5179212 -4169674 -4493529 -4188399 -2564649 -2028570
3228 -2028570 -4343635 -7238343 -7476761 -5634014 -4600912 -4757606 -4733554 -6297894 -13304113
3219 -13304113 -24344200 -31158707 -27561671 -17029665 -8204407 -4994774 -4483251 -3013004
3211 -3013004 -299263 2440467 4827640 6534155 6406981 3909075 549844 -934355
3203 -934355 1432403 7385204 14115166 18000599 17978404 16966015 18661791 23103607 26485934
3194 26485934 24911426 17240018 5402521 -6070977 -11922513 -10574427 -6434126 -4715187
3186 -4715187 -4066805 1626860 13094388 21879606 19773875 8836000 -1709634 -6411760
3178 -6411760 -7416436 -8606405 -10345245 -10632344 -8315568 -4074886 -56314 1100038
3170 1100038 -1437646 -5306586 -7517038 -8044276 -8739526 -9043013 -5753577 2108659 10654794
3161 10654794 14761646 13041326 8508266 5663449 7234654 12006012 15267718 13144652
3153 13144652 7065299 2141379 745742 250826 -1876513 -3908198 -3335562 -2048856
3145 -2048856 -4176063 -9286758 -11407841 -5989392 4289454 12040825 12476295 7345100
3137 7345100 2348124 1480262 3796062 5410622 4399695 2916744 3837098 6300755 6445541
3128 6445541 2746378 -1261569 -833499 4478444 10586227 13484896 12453479 8907618
3120 8907618 4281728 14905 -2165614 -1781313 -610154 -528984 -1034461 -666292 -78576
3111 -78576 -1089791 -2816880 -1901064 2395456 6163376 5656617 1882983 -1413706 -2181877
3102 -2181877 -478265 3132969 6745010 6596286 866990 -6878077 -11071883 -10369646 -7948595
3093 -7948595 -6702237 -7122978 -8861918 -10885010 -10727204 -7085289 -2608678 -717851 -699839
3084 -699839 -25237 -109405 -4150890 -9818919 -10867617 -7023905 -5274526 -9002327 -12826314
3075 -12826314 -11830008 -9103728 -9104980 -9711552 -7161760 -3728086 -3291173 -3362443 553532
3066 553532 5489097 4458357 -1771857 -4796343 -889256 4465179 5637387 3374238
3058 3374238 389219 -2823201 -5091057 -3671410 358275 1232929 -3254149 -7604578
3050 -7604578 -6935886 -4802233 -7316850 -12863807 -13973783 -8289949 -1809261 -436845
3042 -436845 -2813991 -3501099 -477215 3101148 3889335 2915652 3869976 7421441 9513783
3033 9513783 6761890 1592838 -748672 1042617 4218985 7709671 13039694 19064665
3025 19064665 21328667 18917037 16886054 18552889 19976162 16419478 10304595 7417356
3017 7417356 8191051 8761820 8806053 11606734 16352529 16918857 10357873 1748387 -2030307
3008 -2030307 -16928 3548770 4801001 2803138 -1256044 -5000171 -6118405 -4345265
3000 -4345265 -1546052 771396 2798179 4808408 5874604 5142564 3132732 988641
2992 988641 -564429 -1211466 -1317421 -2457914 -6170172 -11795957 -16903463 -19861155 -20454508
2983 -20454508 -18505179 -14506002 -11472365 -12627339 -16256493 -16422747 -10677074 -3766313
2975 -3766313 -1171516 -2049779 -1841204 811407 3815587 6374643 9265240 11045169 8732772
2966 8732772 2891053 -1942097 -2978947 -2022686 -1649537 -1966018 -2417261 -3320956 -3859151
2957 -3859151 -2087027 701364 -719186 -8290150 -15829481 -16025719 -10388004 -7077529
2949 -7077529 -9549438 -12963101 -12683287 -10569430 -9899632 -8896599 -4258451 1368334 1099221
2940 1099221 -6603403 -14388566 -14124855 -6271757 971170 937746 -4850124 -9239232 -7293558
2931 -7293558 -756573 4882672 6477585 5468673 4833990 5675163 7285278 8824797 9610311
2922 9610311 8980022 7476674 7246448 9410863 11716438 11070920 8243975 7347565 9861201
2913 9861201 11873854 9272360 3811513 1300961 4402168 9891550 13214286 13080853
2905 13080853 10525232 6083060 471257 -3390030 -2424277 2180811 5385879 4234396
2897 4234396 986776 -1176560 -2981128 -6780591 -11289489 -12353050 -8599962 -2898226
2889 -2898226 1821452 4627252 4299208 -520952 -7399060 -10923610 -10170446 -10920886 -16488404
2880 -16488404 -20597971 -15367288 -3793011 2820660 -307798 -5909728 -5445803 607167
2872 607167 6208504 8776353 10770617 14793394 20357620 24289826 22818466 15190877
2864 15190877 6222980 2334872 3556391 2856001 -4383828 -13815339 -18184816 -16607897
2856 -16607897 -13649274 -11706499 -9311944 -5934093 -3520654 -2931933 -2761932 -2367967 -2832386
2847 -2832386 -4282913 -5289389 -5749339 -7557667 -11285117 -14660858 -15757935 -15691588 -16540212
2838 -16540212 -17953444 -17545835 -14267414 -10177025 -8449810 -9702358 -10774870 -8146126
2830 -8146126 -2570951 1333441 758119 -2109686 -3794516 -3838615 -3108205 -554584 4499611
2821 4499611 8678760 7873904 3653703 1512856 2469412 1557160 -3821380 -9094875 -9100629
2812 -9100629 -5585953 -4399018 -7689872 -12540020 -15711283 -16243794 -14176044 -9993647
2804 -9993647 -5542319 -3141426 -3196887 -3839136 -3014148 -352391 2459953 2667924 -1047767
2795 -1047767 -6252659 -8308118 -5419397 -1002794 89706 -3361823 -8424555 -11064469
2787 -11064469 -8988252 -3566577 -55296 -3218991 -10815821 -14435076 -9851312 -3598743
2779 -3598743 -4707469 -11938900 -15186699 -9525012 -1516874 792782 -1342710 -1027353
2771 -1027353 3295531 6043790 3098902 -2499498 -4914866 -2744402 77955 -666692
2763 -666692 -5301700 -10934030 -14935848 -16919929 -17570392 -16643567 -13089571 -6890748 353295
2754 353295 6994618 12541449 16719343 18234803 15646325 9417014 2292602 -2703180
2746 -2703180 -4550194 -4671666 -5389008 -7844426 -11100237 -13040006 -12036511 -7893370 -1854568
2737 -1854568 3658332 5821777 3259509 -2436884 -7871754 -10920678 -11787572 -10746859
2729 -10746859 -6559041 1255264 9705085 14368755 14262856 12426535 11003620 8203798
2721 8203798 1933684 -5580614 -9702318 -9186005 -7074188 -5679723 -3853320 -515873
2713 -515873 2069864 1244556 -1528333 -2275928 -379805 83711 -4194258 -10870921 -13959604
2704 -13959604 -10049264 -1591112 5866131 9216135 10232635 12210281 14844395 14352274
2696 14352274 9332228 3995662 3007761 4696915 3109642 -3173212 -8107856 -5686773
2688 -5686773 2443669 9101739 9551815 5200996 531110 -1335274 -230574 2071905
2680 2071905 3811890 4482028 4169578 2273132 -1713103 -6113911 -7740389 -5617133 -2570655
2671 -2570655 -2029847 -4337551 -6871378 -6485033 -1550984 6236446 11434443 9139013 1376204
2662 1376204 -3651987 -1096732 4487802 5629283 1748328 -1632216 -1402525 593848
2654 593848 2828472 6303110 10480880 11976333 9530914 6506104 5981807 6512831 5353352
2645 5353352 3152019 2416880 3272723 3769334 3063213 1451265 -1640253 -6552146 -10648938
2636 -10648938 -9842495 -3615862 3656512 7287293 6602046 4053757 1767672 276610
2628 276610 -458167 -484099 -239472 -372027 -1023173 -2028882 -3738485 -6489931 -8998295
2619 -8998295 -8792629 -5478365 -2366476 -2966958 -6531382 -9315033 -9829101 -9805106 -9644222
2610 -9644222 -6805605 -707932 4360455 4545467 1949900 962797 1237490 -902452 -5198742
2601 -5198742 -6957407 -4150922 -49808 2427210 4372853 7028568 8535404 7242737
2593 7242737 4880566 3517364 1973213 -1938789 -7687253 -13054017 -17104072 -19973077
2585 -19973077 -21369549 -21025373 -18915979 -14135013 -6473947 -114875 -1185486 -8853379
2577 -8853379 -13571338 -8648732 437647 3728987 308786 -2535466 -1223221 1041602
2569 1041602 2577395 5970776 10478907 9659655 917396 -8694224 -11466359 -9249230
2561 -9249230 -8824665 -10389699 -7650991 1238137 9469815 10258361 5009645 -155498 -2735743
2552 -2735743 -4651205 -6200667 -4316310 1394505 4942376 693096 -7777220 -10990922
2544 -10990922 -6543103 -3045632 -7747993 -15320138 -14882819 -5140079 4678223 8092007
2536 8092007 7973148 8537313 8054699 3284521 -4226445 -10623415 -14594235 -15750657 -11973919
2527 -11973919 -3211620 4763649 5398457 -1252228 -10164989 -18421929 -25986136 -31086340
2519 -31086340 -30741667 -26321601 -23425844 -24601411 -26076152 -23497185 -17614613 -12211959
2511 -12211959 -9119735 -7782375 -7972679 -10101586 -13028567 -13631974 -9658576 -2775620
2503 -2775620 2076145 1349983 -3206835 -6699130 -7222183 -7586899 -10022333 -12184327 -10930356
2494 -10930356 -7476579 -5331081 -5056684 -5113866 -6290691 -10257259 -14263640 -12921299 -6270766
2485 -6270766 -840514 -809823 -3098810 -3937566 -5356748 -10704505 -17126641 -17783818 -10458693
2476 -10458693 139986 8217450 11766169 11894486 10299731 7911493 4415735 -795915
2468 -795915 -6323367 -8817667 -7054296 -4424799 -5000557 -8127720 -9224160 -5119941 3294273
2459 3294273 12233224 16450322 11614804 -783208 -11907310 -13319973 -6296029 569689
2451 569689 2869839 4290614 7850934 9307779 3525773 -6617403 -13064000 -12652926
2443 -12652926 -9579959 -8462653 -9688858 -12239649 -16541735 -22044608 -24935128 -21520655
2435 -21520655 -12977648 -4329768 993584 3561662 4926373 4550044 1212136 -3747297
2427 -3747297 -6701159 -5622921 -2349648 -140160 145537 385877 2368350 6117660 10973091
2418 10973091 16473508 21124454 21727994 16128540 6832250 50260 -349889 2563870
2410 2563870 1734404 -5980113 -16107698 -21769416 -21533570 -20176373 -21880178 -25302910
2402 -25302910 -26683679 -25499442 -24298407 -23959873 -22400421 -18507830 -14616467 -13599064
2394 -13599064 -15185118 -16517469 -15042254 -9707764 -936882 8713325 14956769 15076605
2386 15076605 10668041 5525409 1229235 -3267606 -7943430 -10228303 -8302615 -3977324
2378 -3977324 -665491 462664 746299 1135172 761746 -1489984 -5306446 -9292127 -12197890
2369 -12197890 -13457784 -13234410 -12467774 -12473593 -13996055 -16710017 -19640914 -21628604 -21384347
2360 -21384347 -18071461 -12648743 -8134410 -7429820 -10595625 -14725914 -16616265 -15345818
2352 -15345818 -12540891 -10641336 -10708633 -11421040 -10576930 -8182078 -7238573 -10042081 -14220106
2343 -14220106 -14630049 -9627318 -3344184 -710190 -2096984 -4281530 -4854830 -3677312
2335 -3677312 -1420755 931523 1967302 1447290 1201324 2129914 1479542 -3593254 -10383136
2326 -10383136 -12813388 -9966707 -8031764 -11562858 -16710255 -16617627 -10781819 -4942030
2318 -4942030 -3253829 -4924329 -8166530 -12999055 -18931490 -23380564 -24485013 -23417970
2310 -23417970 -22069698 -19959518 -15268563 -8049929 -906699 3012375 1779633 -4483243
2302 -4483243 -13001225 -19204933 -20053455 -16764524 -13097712 -11033426 -9737962 -8943028 -10850383
2293 -10850383 -16658255 -22662195 -22891396 -16073373 -7566105 -3199279 -3112326 -3246100 -1153417
2284 -1153417 2041340 4424714 5317496 4693363 3018799 1780373 1855221 1343530 -2114361
2275 -2114361 -6482087 -6464923 -1202894 2918595 499052 -4624628 -3935062 4047308 11550199
2266 11550199 11888042 7640283 5924625 8386795 9658614 5440981 -1093362 -2838956
2258 -2838956 2325235 8477311 8675081 3623228 727387 4257504 9496878 8929902 2208892
2249 2208892 -3425912 -2239866 3847559 9124338 11332401 12904814 16110111 19216100
2241 19216100 18243981 11932077 3981948 -422995 -49861 1787047 2220267 2188882 3341024
2232 3341024 3964288 1256152 -3353847 -5021449 -2247889 530872 -1298836 -6743410
2224 -6743410 -11182740 -12218292 -11189231 -10047986 -9400401 -9608747 -11454316 -14648809 -17120557
2215 -17120557 -17289068 -16580117 -18109087 -22508393 -26496312 -26610058 -23068861 -18258475 -12672520
2206 -12672520 -5332237 2053326 5121398 2358124 -2670517 -6345810 -8942677 -11191946
2198 -11191946 -10616970 -5305997 1300080 3962190 2393160 141496 -1735260 -5059139
2190 -5059139 -9566974 -12621644 -13584391 -13713667 -12174955 -7431352 -2347558 -1838226 -4790486
2181 -4790486 -4623940 665988 5401799 5308661 3234074 2682254 1887536 -1543757 -5562151
2172 -5562151 -7784015 -9929768 -13727963 -16885246 -17429205 -17330447 -17363700 -13760903 -5428077
2163 -5428077 1080786 563010 -2005825 446244 4755260 2705397 -4461882 -7045185
2155 -7045185 -1524668 5687832 9488856 11436680 12403478 9396681 2839946 -1393889
2147 -1393889 -1255673 -2549227 -9260653 -16331508 -17104038 -12665787 -8580364 -6506089 -4196414
2138 -4196414 -796541 2532818 5320924 7602603 8708407 8674027 8889541 9588483 9098750
2129 9098750 6904728 4560352 2700010 901527 1176039 6374351 13472043 14467064 7171005
2120 7171005 -553186 -1330376 2303164 3616723 1535594 -934395 -3565417 -7606975
2112 -7606975 -10931236 -11084410 -10708655 -13423360 -16350364 -13617023 -6281076 -1980370 -4506903
2103 -4506903 -9486813 -10851341 -6662230 1436179 9434560 11614094 5475038 -3125128
2095 -3125128 -4646804 3246679 13690326 19879998 21361765 20140325 16099637 9221970
2087 9221970 2536869 -356996 1030333 4307202 6411700 5446374 2779388 2991847 8427996
2078 8427996 14235169 13142133 5243935 -2027825 -4551761 -6450378 -12120302 -18904116
2070 -18904116 -21587921 -19883277 -16935875 -13522136 -8420974 -2578741 1577200 4010498
2062 4010498 6468268 8583248 7992189 4264535 -89649 -2699812 -3323309 -2792514 -1745505
2053 -1745505 -243280 2703155 8388798 15392383 18411137 13124382 2443980 -5000794
2045 -5000794 -4112792 856714 1722189 -3510151 -8558118 -7265035 -1392761 2222127 712998
2036 712998 -2132433 -2344745 -949787 -672072 -980920 42178 1282625 349456 -1387121
2027 -1387121 130649 5742729 12060379 16045828 16627463 12432594 3295946 -5534836
2019 -5534836 -6854652 -1365389 1607689 -3537129 -11052638 -12931350 -10587242 -11399878
2011 -11399878 -17004326 -22009919 -23153831 -22939342 -23452035 -22364583 -17312050 -10205141
2003 -10205141 -4634624 -1489302 648078 2330617 2388680 -295879 -5148602 -9926047
1995 -9926047 -12404431 -12416457 -11707620 -11235239 -9686998 -5858045 -1393009 659161 -431059
1986 -431059 -2409296 -2864185 -1405229 657635 1507607 -123065 -3984105 -8357936 -11464606
1977 -11464606 -12339835 -10328085 -5201218 1517094 6787884 8543539 6924136 3048291
1969 3048291 -1394413 -3442573 -1273167 1682759 -761604 -8455082 -12438844 -5546246
1961 -5546246 7575598 15505094 13010573 4702139 -2297719 -4566761 -2546759 619533
1953 619533 709907 -3267558 -7131638 -7330729 -6675039 -9614583 -14070716 -14363953 -11110361
1944 -11110361 -10834240 -15272274 -18376890 -15622230 -9434108 -3142706 3599079 10254892
1936 10254892 12918229 10533035 7861325 7961443 7230050 2549810 -2308230 -3079371 -2523629
1927 -2523629 -4797909 -6703070 -2359664 6076155 10214314 6727794 -130632 -6220068
1919 -6220068 -10539449 -11116254 -5640429 2658427 6686168 4885459 2912337 4220589
1911 4220589 5400186 3525887 1664630 2841762 3935678 884701 -3853019 -4676692
1903 -4676692 -1414778 881923 -229169 -1880412 -1278805 328646 424682 -784865 -961044
1894 -961044 916394 3097818 3146819 940746 -1182138 -1782640 -2794199 -6887683 -12845189
1885 -12845189 -16043827 -13981009 -8917614 -4272887 -976338 1303613 1903635 199814
1877 199814 -2953757 -6721120 -11525752 -16941329 -20100387 -18461298 -13014424 -6898742
1869 -6898742 -1969784 1834615 5388143 10171263 17002266 23093721 23164569 16405131 9550055
1860 9550055 8995234 12147870 11588556 6298346 2755000 4854691 8953928 10544331 10085674
1851 10085674 9268208 6491968 272040 -6307924 -8985806 -8061063 -6757975 -5405135
1843 -5405135 -1272688 6339544 14313664 19164855 19969359 18112080 16031042 15442475 14898077
1834 14898077 10519033 1773649 -5127569 -3493997 4865384 11262026 11007213 8069488
1826 8069488 7472571 7919690 5511875 1286933 36190 2547299 3674709 -693556 -7802404
1817 -7802404 -11114084 -7826447 -1620671 1621545 -539109 -5934468 -11096277 -14454812
1809 -14454812 -16168433 -16180573 -13941353 -9878627 -5710030 -2788417 -1048446 28629
1801 28629 432886 222560 82562 247594 -542814 -3836274 -9210094 -14051569 -15855007
1792 -15855007 -14339421 -11177007 -8171915 -6314494 -6350019 -8785500 -12080461 -12026257 -5823599
1783 -5823599 2740736 5499331 -567062 -9027509 -12754448 -14285676 -21841055 -35854277
1775 -35854277 -46362391 -45833225 -38289465 -31641834 -26422883 -18388408 -8925435 -5088011
1767 -5088011 -9056656 -14017087 -12721826 -5732228 1314545 5220281 6970568 7926557
1759 7926557 7434942 4395088 -262335 -3469542 -2921611 -209211 378689 -2555781 -4856946
1750 -4856946 -2268127 2773441 3362704 -3086819 -12028396 -18292880 -21561739 -23866770
1742 -23866770 -25226441 -24295613 -20956938 -15897824 -9421966 -2632280 2107125 3989820
1734 3989820 5338628 8185340 10729005 9357714 3055282 -5987003 -14740976 -20516970
1726 -20516970 -21603079 -19292955 -17936298 -20251579 -23600237 -23704267 -21111011 -20498173
1718 -20498173 -23542149 -26067724 -23763165 -18294898 -15631138 -19084483 -25541501 -28762773
1710 -28762773 -25755771 -19204672 -13465729 -9524171 -5732575 -2465181 -2280031 -4650232
1702 -4650232 -4781495 -417754 3736581 2124631 -4119768 -10186637 -15371741 -21942821
1694 -21942821 -27834848 -27612084 -21413247 -16239522 -16181672 -17315443 -15232876 -11951943 -11214545
1685 -11214545 -11882860 -11259854 -11176940 -14689417 -18933150 -17642190 -10385919 -3607808 -1675978
1676 -1675978 -1738437 898580 6186298 10417181 11363048 10140430 9211153 9830622 10678425
1667 10678425 8704530 2557423 -4757108 -8189674 -5836497 -476548 3806941 4743441
1659 4743441 2046627 -2907959 -7262215 -9067813 -9983385 -12884858 -16300902 -14984445
1651 -14984445 -7972158 -2286351 -4818882 -12885134 -17397978 -14633644 -10161983 -10331168
1643 -10331168 -14166404 -16119369 -13808951 -9577833 -5543428 -697121 6038345 11933097
1635 11933097 11836614 3871717 -7082747 -12970757 -10475541 -4678542 -3435305 -8412121
1627 -8412121 -13732509 -13870187 -10116370 -7291256 -6602349 -5526209 -3838242 -5178589 -11281098
1618 -11281098 -18232670 -20773286 -17804081 -11478387 -3634859 3728940 7040188 4821472
1610 4821472 1622032 3248850 7995746 7912354 249714 -7625883 -7795944 -1832721 2831490
1601 2831490 3069865 1550153 333383 -1284687 -3033485 -3181781 -2695394 -5466118 -12947405
1592 -12947405 -21997576 -29140468 -33499183 -34521103 -31038390 -24793020 -20990657 -22167756
1584 -22167756 -24428188 -22975247 -18673994 -15432993 -13453618 -9713964 -4116179 -465187
1576 -465187 -957760 -3348703 -4227785 -2211178 2320900 7532396 9923812 7376773 3245132
1567 3245132 3678645 9213313 12620649 7733300 -2513168 -9964998 -10834886 -7740106
1559 -7740106 -3796854 746309 5697992 8917937 9200550 8762447 10489749 13696518 14616602
1550 14616602 11036798 5065663 926175 778878 3206013 5334820 5675229 4770826 3832857
1541 3832857 3445120 3338827 2740419 1047535 -1211567 -2307714 -1034016 1592392 3138021
1532 3138021 2002779 -1970655 -8239560 -14994409 -18439298 -15616254 -8647099 -3341146
1524 -3341146 -2318863 -2422476 -830816 -464475 -5837828 -15775013 -24387706 -28166131 -27956871
1515 -27956871 -24596851 -17526165 -8703628 -3441857 -5004962 -11100404 -17344465 -21453200
1507 -21453200 -22489025 -19286547 -12382242 -5225607 -797337 1237638 1937566 226442
1499 226442 -4281251 -7997368 -7207775 -4073044 -4271421 -8840202 -13072560 -14382651 -16219543
1490 -16219543 -21338423 -25381856 -21963129 -12423276 -5507490 -6767748 -12357300 -15179749
1482 -15179749 -13821045 -11998461 -11101230 -8120067 -1960804 2397762 -642003 -9769608
1474 -9769608 -18307732 -22374150 -23683855 -24249996 -22747798 -17994629 -12362094 -8761955
1466 -8761955 -6671496 -4090906 -1373125 141717 1551057 4591492 7294899 5449839
1458 5449839 -1461165 -9186826 -13851459 -14992541 -13322782 -9287361 -4946334 -3602611
1450 -3602611 -5421357 -6032037 -1612047 6428052 13224444 15024093 11093266 3802639
1442 3802639 -1738228 -1058367 4542026 8745192 8015743 5595583 5386794 5887807 4533036
1433 4533036 4509432 10749617 20314408 23684860 16892453 6569656 585287 -1321226
1425 -1321226 -4164203 -9029511 -12317966 -11703913 -8693275 -5816200 -4480584 -5468832 -8794329
1416 -8794329 -12571712 -13933914 -11729671 -7452786 -3657185 -2330675 -4160259 -7918305
1408 -7918305 -10852384 -11129707 -9843412 -9379313 -10009478 -9568333 -6551969 -2015967 2022500
1399 2022500 4690512 5976462 5382701 2095513 -3502184 -9121328 -11803160 -10210194
1391 -10210194 -5915531 -2219755 -1442744 -3442827 -6456376 -8428337 -7568915 -3406030
1383 -3406030 1664803 3567816 1027079 -2576583 -4009099 -5255733 -10346275 -17920716
1375 -17920716 -21588035 -18756138 -14557392 -14291487 -15812467 -13542972 -7584477 -3832323
1367 -3832323 -5405126 -8401632 -7335777 -1883261 3054848 2293250 -5079852 -14409399
1359 -14409399 -18729577 -15244886 -8520606 -5293420 -6670153 -8165439 -6879923 -4726734
1351 -4726734 -3941172 -3516285 -1898093 233167 1884037 3173326 2787678 -2126404 -10352389
1342 -10352389 -14609676 -9730320 -363035 4338332 2092150 -1443470 -1909470 -947167
1334 -947167 -1326608 -2738837 -4135640 -6029445 -8408829 -9639580 -9237169 -8800706 -8613170
1325 -8613170 -6314367 -750768 5619619 9878289 11377103 9707914 3520969 -5862634
1317 -5862634 -12940522 -13922065 -11898719 -12271207 -14958357 -15800688 -14674907 -16540793 -23009874
1308 -23009874 -27733305 -23717310 -12826738 -4312824 -4344606 -10017734 -14435668 -15131838
1300 -15131838 -15109161 -16585343 -17174925 -14016977 -9321143 -8241556 -11288752 -12408938 -6556138
1291 -6556138 2993320 7552439 2739038 -6784411 -12520567 -10606832 -4336815 824027
1283 824027 3025552 3933903 4224957 2188832 -2233650 -5166835 -3490026 269202 1470311
1274 1470311 358599 881905 3017833 1871661 -4261666 -10249488 -11183450 -8637205 -6667009
1265 -6667009 -5476476 -2956882 307425 1418401 -1264764 -7534655 -15811421 -21868603
1257 -21868603 -20762627 -13578509 -8704227 -12090834 -19411718 -22423399 -19655505 -15325898
1249 -15325898 -11166178 -6513490 -4333309 -8921911 -17626226 -22432333 -20896092 -18706975
1241 -18706975 -19993520 -21883522 -20989236 -18875059 -17834057 -16708087 -14506350 -13500225
1233 -13500225 -14943361 -15645035 -12653175 -8264704 -6747890 -8340521 -9540712 -7737225
1225 -7737225 -3595227 -526454 -2641181 -10601640 -18885798 -20620578 -15994183 -12012994
1217 -12012994 -13015731 -15952469 -16341270 -13815250 -9845867 -5260707 -2386120 -4071100
1209 -4071100 -7736042 -6383593 896312 5762816 2429774 -3995488 -6696068 -7807490
1201 -7807490 -12019256 -15285082 -9828911 2524800 11691325 12922092 10444758 8119369
1193 8119369 5130099 1718184 1228693 4481589 8225946 10524281 12198954 12445693 8917766
1184 8917766 2717681 -2567876 -6953310 -12753493 -17379554 -15410860 -8948364 -7204820
1176 -7204820 -12927329 -17622079 -14413642 -7646497 -4296918 -3298194 -418579 2274255
1168 2274255 25182 -5326948 -7730615 -6537998 -6338729 -8084471 -7333329 -1910128 4393052
1159 4393052 7129509 6021027 3243695 269996 -2232406 -3675727 -3861900 -2897688 -800877
1150 -800877 1850783 3642098 3778319 2689934 293504 -4351304 -10353656 -14653629 -16499638
1141 -16499638 -19341313 -25219239 -30099099 -28855603 -22772550 -17481778 -14904717 -12377931
1133 -12377931 -9258085 -8792784 -12264584 -16037311 -16434412 -13814848 -9783176 -4036269
1125 -4036269 3008980 7243089 4420394 -4050732 -11773747 -13704540 -9736087 -2418166
1117 -2418166 5935597 12850815 15077127 11176612 4127185 -1098885 -2624448 -2003589
1109 -2003589 433012 6450292 13988692 14910109 4039418 -11740471 -19754676 -16676009
1101 -16676009 -11154067 -10697400 -13082597 -13373169 -12104096 -11505989 -9805429 -5743054 -3866350
1092 -3866350 -7908819 -12603738 -10409789 -4030571 -2994838 -8238297 -9889223 -2521824
1084 -2521824 6525078 8459645 5119837 3792350 5464751 5148393 1028250 -3136124
1076 -3136124 -3904079 -1523040 2321870 6050883 7341347 4264159 -1847491 -6922591
1068 -6922591 -8200980 -6322445 -3501479 -1407958 -892014 -1829298 -2569008 -1180602 1582676
1059 1582676 1806273 -3126345 -9703988 -10388926 -2374151 7383624 9060304 1683456 -5766560
1050 -5766560 -5924140 -1302480 1746298 2780667 5757980 10717389 13484413 12821780 11478947
1041 11478947 9844014 5023668 -2294189 -6416629 -4839220 -2313427 -3411505 -6088955
1033 -6088955 -6473586 -5325677 -5177396 -5116239 -3409889 -1886125 -2438628 -2177470 2207352
1024 2207352 7631300 8303269 4558234 1488180 -307512 -5259566 -13267738 -16924575
1016 -16924575 -11496197 -2201617 2448329 773631 -2565591 -4364503 -5804025 -8620003
1008 -8620003 -12163357 -14919992 -16813420 -18966523 -21864994 -24462133 -25299192 -24170530
1000 -24170530 -21811757 -18025560 -12016465 -5507275 -3085100 -7070189 -13867827 -18234734
992 -18234734 -19437815 -19787612 -19022901 -15217981 -10600614 -10534868 -15437012 -19061288 -17156082
983 -17156082 -13144926 -12320842 -14692071 -17173286 -19127843 -21406856 -22621490 -20902960
975 -20902960 -17629203 -15277977 -13101430 -9124709 -5071994 -4475909 -6313032 -5523978 -598116
966 -598116 3980332 4433037 2609878 1644024 207325 -5047036 -12929447 -17601200 -15525885
957 -15525885 -9850956 -6385598 -6593214 -6625381 -3483911 16555 -1310359 -7319854 -11575008
948 -11575008 -9409953 -3909811 -1020395 -1113806 280489 4317643 6592871 4255345 773580
939 773580 786208 3417037 4118949 1217774 -2751028 -5138638 -5467082 -4183895 -2156129
930 -2156129 -1347451 -3123465 -5477770 -4696793 -751230 1435725 -2357811 -10552640 -17976082
921 -17976082 -21711105 -22856904 -23449849 -23792651 -22823854 -19658901 -14648949 -9760875 -7328917
912 -7328917 -7135830 -5544476 255987 7336180 9209909 3985458 -2299352 -2592043 2826076
903 2826076 7478112 6753767 1572630 -5364460 -12813205 -19109667 -20610517 -15069978 -5139509
894 -5139509 3984678 9581669 12076844 11858923 8397578 2635138 -2464553 -4829942 -5014522
885 -5014522 -4194637 -2292902 499930 1866839 -785428 -6832859 -12463866 -14528561 -13256121
876 -13256121 -10817463 -8387127 -5695280 -2926746 -1457713 -1905475 -2396852 -350085 3826698
867 3826698 6230820 3585518 -3032627 -9612906 -13445021 -14397634 -12707924 -8056373 -1665621
858 -1665621 2759913 2172124 -2200783 -5728085 -4963908 -799211 2761516 2499175 -1079732
849 -1079732 -4290522 -3929762 -423678 3114326 4589106 4300477 2616239 -1301831 -6775783
840 -6775783 -9626902 -6040070 1896076 7523689 7280388 4504675 4180878 6171466 6137497
831 6137497 1948142 -3819751 -7946746 -10448396 -13082075 -15882517 -17295428 -17128886 -17339224
822 -17339224 -19574374 -23396674 -27416113 -30755642 -32532772 -31387159 -27299047 -23113227
814 -23113227 -22083298 -23783337 -24497172 -22254669 -19336794 -18434034 -18409328 -16445226 -13327850
805 -13327850 -13297265 -18022605 -23555993 -25160753 -23431804 -23120578 -26315230 -29307430 -27188568
796 -27188568 -19920424 -12284711 -8600985 -9309015 -12611848 -17063610 -21125012 -22139701
788 -22139701 -18637113 -13291002 -10618345 -11012028 -9928811 -4690290 638058 175322 -5615347
779 -5615347 -10373682 -10095061 -7187417 -5454551 -4579951 -1902932 2549237 5584292 4703940
770 4703940 446045 -4839733 -9008424 -10935968 -10502080 -8149904 -4344763 165029 3610840
761 3610840 3900627 700823 -4017254 -7924632 -9765489 -8713952 -4437295 998832 3461605
752 3461605 1162829 -2821762 -4831846 -5813982 -8927612 -13106032 -13655794 -10045002 -8387098
743 -8387098 -13350384 -21055558 -23915445 -20454997 -15836697 -13343922 -10428113 -4754524
735 -4754524 218404 -710188 -7131137 -13651852 -17129655 -19396894 -22316886 -24048651 -22402180
726 -22402180 -19043462 -17285072 -17320452 -16897198 -15878062 -16650904 -19902677 -23218616 -24469621
717 -24469621 -23543225 -20092581 -13346519 -5853079 -3421937 -8053693 -13895043 -14102431 -9511180
708 -9511180 -6195679 -6152810 -5653168 -2539695 287766 35594 -1833842 -2661977 -2218143
699 -2218143 -1144908 1006622 3807261 4759938 2563944 -672262 -2589696 -3447090 -3618084
690 -3618084 -1298792 3906684 7676067 5500303 -817529 -5218250 -5066192 -2879492 -1223735
681 -1223735 -386103 -1090234 -4696195 -9566180 -11636733 -10404047 -10257325 -13435769 -15501994
672 -15501994 -11256100 -2318946 4878706 6554967 3257694 -3916032 -13814404 -22291604
664 -22291604 -23910300 -18295899 -11184341 -7148924 -4348379 955035 7272899 8995930
656 8995930 3816091 -4376199 -10441358 -13082729 -13883053 -13593168 -11597122 -8163106 -4911299
647 -4911299 -2577141 176740 4707490 9892959 12833888 11989865 8637862 4874600 1057073
638 1057073 -3856983 -9773686 -14406938 -15156096 -11494482 -5376248 -81755 1188394 -2828585
629 -2828585 -9482580 -13042393 -9815469 -2761862 942914 -2307927 -9055383 -14091760
621 -14091760 -16944361 -20603082 -25455272 -28244733 -27261139 -24964769 -23820940 -22398205
613 -22398205 -18262279 -12943510 -10705116 -12624017 -14901012 -13922382 -10686904 -8643737
605 -8643737 -8732129 -8809996 -7619265 -6888540 -8276012 -9735641 -7246656 -446717 5431021
596 5431021 4771497 -2135491 -9587449 -12743553 -11590121 -8908047 -6957050 -7320848 -11546478
587 -11546478 -19223578 -26297259 -28034247 -24104371 -18883217 -16200541 -15473027 -13879362
579 -13879362 -10742138 -8102773 -7707127 -9272323 -11882269 -15422029 -19642410 -22904087
571 -22904087 -23389895 -21310207 -18420864 -15251294 -10537881 -4081731 1799245 5315772
563 5315772 8048304 12251492 16256147 15547732 8473535 -1776164 -10954681 -16581587
555 -16581587 -16917764 -11328465 -3432233 65124 -3259980 -8225175 -9070941 -6734991 -5349728
546 -5349728 -4710418 -1794378 2061481 2080636 -1754463 -3930698 -2518127 -2908560 -9170914
537 -9170914 -16956071 -19761637 -18509979 -19254967 -23204663 -24846157 -20305688 -12747477 -7720865
528 -7720865 -6504576 -6436485 -5831829 -5791129 -7319490 -8796173 -7588062 -3662248 -224500
519 -224500 -150851 -2765765 -5318725 -6806585 -8383911 -10279812 -10951830 -10219047 -10835572
510 -10835572 -15071601 -21197404 -25326252 -25954275 -24922498 -24227350 -23355515 -20000821 -12916052
501 -12916052 -4118265 1987251 2626709 -426409 -3367306 -5263431 -7889592 -10821426
493 -10821426 -10664248 -6764558 -3611652 -4290896 -4865024 278830 9528251 15360919 13771737
484 13771737 7769088 1682043 -3143882 -6091769 -5470034 -1399410 2595286 3231094 747693
475 747693 -2803163 -6231954 -8791640 -9532582 -8811344 -8387355 -8578519 -7726452 -6153942
466 -6153942 -7705884 -14421602 -21855905 -23287244 -17694285 -10508266 -7070398 -8278943
458 -8278943 -12204157 -16492597 -18412380 -15478149 -7847792 1106766 7533666 9643433
450 9643433 7760413 3725053 629645 1081775 4524604 7557440 7805907 6172038 4447370
441 4447370 2489026 -544092 -3481950 -3985238 -1859798 392646 588251 -1005025 -2780857
432 -2780857 -3659790 -3406851 -2354527 -1503727 -1974433 -3747440 -5795109 -7942959 -11467646
423 -11467646 -16961661 -22607138 -25743536 -25498366 -22863612 -19052135 -15180118 -12786449
415 -12786449 -12726331 -13639913 -13250863 -11339738 -9926161 -10435180 -12271620 -14253802 -15653317
406 -15653317 -15666142 -13938075 -12024530 -12086930 -13550635 -13594362 -11822140 -11401440 -13916288
397 -13916288 -16309287 -15549976 -13405391 -13177459 -14196572 -13632392 -11851058 -11290320 -11184397
388 -11184397 -8524993 -3947643 -1324250 -1046793 646329 4191493 4410217 -1326861 -7885492
379 -7885492 -9440809 -7459225 -6769912 -7178862 -4804591 246505 3626249 3744057 3515810
370 3515810 4666162 5367480 4775391 5194189 7580324 8813878 6148861 1363899 -2306455
361 -2306455 -4865224 -8161440 -11846574 -14213232 -15949747 -19351355 -23670894 -24531494 -19184383
352 -19184383 -10279309 -3189695 -947092 -2631569 -5270329 -6175505 -4644942 -2740701
344 -2740701 -3537790 -7305323 -10368383 -9474159 -6466219 -6156724 -9580527 -12215721 -10021757
$$ [...]
##END NTUPLES=NMR SPECTRUM
##END=
