##TITLE=31Pdec_DE-134rm_3h
, 24 sc
 17.3.2026
##JCAMPDX= 6.0         $$ Bruker NMR JCAMP-DX V2.0
##DATA TYPE= NMR SPECTRUM
##DATA CLASS= NTUPLES
##ORIGIN= UXNMR, Bruker Analytische Messtechnik GmbH
##OWNER= root
$$ XWIN-NMR		Version 3.5
$$ Tue Mar 17 14:08:25 2026 Russian Standard Time (UT+4h)  she@DPX200
##.OBSERVE FREQUENCY= 81.013821
##.OBSERVE NUCLEUS= ^31P
##.ACQUISITION MODE= SIMULTANEOUS
##.ACQUISITION SCHEME= undefined
##.AVERAGES= 24
##.DIGITISER RES= 17
##SPECTROMETER/DATA SYSTEM= spect
##.PULSE SEQUENCE= zgpg30
##.SOLVENT NAME= CDCl3
##.SHIFT REFERENCE= (INTERNAL, CDCl3, 0, 197.392)
##AUDIT TRAIL= $$ (NUMBER, WHEN, WHO, WHERE, WHAT)
$$ ##TITLE= Audit trail, XWIN-NMR		Version 3.5
$$ ##JCAMPDX= 5.01
$$ ##ORIGIN= Bruker BioSpin GmbH
$$ ##OWNER= she
$$ F:/spectra/data/she/nmr/P31/2/pdata/1/auditp.txt
$$ ##AUDIT TRAIL=  $$ (NUMBER, WHEN, WHO, WHERE, WHAT)
(   1,<2026-03-17 14:07:11.67 +0400>,<she>,<DPX200>,
      <created by zg, POWCHK disabled, PULCHK disabled
       configuration hash MD5:
       00 E9 B6 7A A2 85 ED C7 34 08 36 98 17 FE 4E 26
       data hash MD5: 32K
       6C 26 0D 6C 2F 3E 00 C7 C7 41 F5 A8 56 CA 50 9D>)
(   2,<2026-03-17 14:07:36.59 +0400>,<she>,<DPX200>,
      <Start of raw data processing
       efp BC_mod = 2 LB = 1.5 FT_mod = 6 PKNL = 1 PHC0 = 1391.123 PHC1 = 70.10066 SI = 64K 
       data hash MD5: 64K
       B5 F6 24 5E 35 9F 34 A1 0E 86 82 01 32 CB 39 16>)
$$ ##END=
$$ 
$$ hash MD5
$$ C7 76 A2 9B 36 D7 2B 6F EC 69 E1 4D 1E 73 0A 2C
##$RELAX= 
##$RELAX= 
##$RELAX= 
##$RELAX= 
##$RELAX= 
##$RELAX= 
##$RELAX= 
##$RELAX= 
$$ Bruker specific parameters
$$ --------------------------
##$DU= <F:/spectra>
##$EXPNO= 2
##$NAME= <P31>
##$PROCNO= 1
##$TYPE= <nmr>
##$USER= <she>
##$AMP= (0..31)
100 100 100 100 100 100 100 100 100 100 100 100 100 100 100 100 100 100 
100 100 100 100 100 100 100 100 100 100 100 100 100 100 
##$AQSEQ= 0
##$AQ_mod= 1
##$AUNM= <au_zg>
##$AUTOPOS= <>
##$BF1= 81.014009
##$BF2= 200.13
##$BF3= 200.13
##$BF4= 200.13
##$BF5= 200.13
##$BF6= 200.13
##$BF7= 200.13
##$BF8= 200.13
##$BYTORDA= 1
##$CFDGTYP= 0
##$CFRGTYP= 5
##$CHEMSTR= <none>
##$CNST= (0..31)
1 1 145 1 1 1 1 1 1 1 1 1 1 1 1 1 1 1 1 1 1 1 1 1 1 1 1 1 1 1 1 1 
##$CPDPRG= <waltz16>
##$CPDPRG1= <>
##$CPDPRG2= <waltz16>
##$CPDPRG3= <>
##$CPDPRG4= <mlev>
##$CPDPRG5= <mlev>
##$CPDPRG6= <mlev>
##$CPDPRG7= <mlev>
##$CPDPRG8= <mlev>
##$CPDPRGB= <>
##$CPDPRGT= <>
##$D= (0..31)
0 1 0 0 0 0 0 0 0 0.06 0 0.03 2e-05 3e-06 0 0 0.0002 0 0 0 0 0 0 0 0 0 
0 0 0 0 0 0 
##$DATE= 1773742031
##$DBL= (0..7)
120 120 120 11 120 120 24 19 
##$DBP= (0..7)
150 150 150 150 150 150 150 150 
##$DBP07= 0
##$DBPNAM0= <>
##$DBPNAM1= <>
##$DBPNAM2= <>
##$DBPNAM3= <>
##$DBPNAM4= <>
##$DBPNAM5= <>
##$DBPNAM6= <>
##$DBPNAM7= <>
##$DBPOAL= (0..7)
0.5 0.5 0.5 0.5 0.5 0.5 0.5 0.5 
##$DBPOFFS= (0..7)
0 0 0 0 0 0 0 0 
##$DE= 6
##$DECBNUC= <off>
##$DECIM= 4
##$DECNUC= <off>
##$DECSTAT= 4
##$DIGMOD= 1
##$DIGTYP= 9
##$DL= (0..7)
0 0 52 120 120 21 21 25 
##$DP= (0..7)
$$ [...]
##$SUBNAM2= <"">
##$SUBNAM3= <"">
##$SUBNAM4= <"">
##$SUBNAM5= <"">
##$SUBNAM6= <"">
##$SUBNAM7= <"">
##$SUBNAM8= <"">
##$SUBNAM9= <"">
##$SW= 400.765351723535
##$SWIBOX= (0..15)
0 1 3 0 0 0 0 0 0 0 0 0 0 0 0 0 
##$SW_h= 32467.5324675325
##$TD= 32768
##$TD0= 1
##$TE= 0
##$TE2= 300
##$TE3= 300
##$TEG= 300
##$TL= (0..7)
0 120 53 12 22 120 120 120 
##$TP= (0..7)
150 150 150 150 150 150 150 150 
##$TP07= 0
##$TPNAME0= <>
##$TPNAME1= <>
##$TPNAME2= <>
##$TPNAME3= <>
##$TPNAME4= <>
##$TPNAME5= <>
##$TPNAME6= <>
##$TPNAME7= <>
##$TPOAL= (0..7)
0.5 0.5 0.5 0.5 0.5 0.5 0.5 0.5 
##$TPOFFS= (0..7)
0 0 0 0 0 0 0 0 
##$TUNHIN= 0
##$TUNHOUT= 0
##$TUNXOUT= 0
##$USERA1= <user>
##$USERA2= <user>
##$USERA3= <user>
##$USERA4= <user>
##$USERA5= <user>
##$V9= 5
##$VALIST= <valist>
##$VCLIST= <CCCCCCCCCCCCCCC>
##$VD= 0
##$VDLIST= <DDDDDDDDDDDDDDD>
##$VPLIST= <PPPPPPPPPPPPPPP>
##$VTLIST= <TTTTTTTTTTTTTTT>
##$WBST= 1024
##$WBSW= 4
##$XGAIN= (0..3)
0 0 0 0 
##$XL= 0
##$YL= 0
##$YMAX_a= 21353
##$YMIN_a= -29783
##$ZGOPTNS= <>
##$ZL1= 120
##$ZL2= 120
##$ZL3= 120
##$ZL4= 120
##$ABSF1= 0
##$ABSF2= 0
##$ABSG= 0
##$ABSL= 0
##$ALPHA= 0
##$AQORDER= 0
##$ASSFAC= 0
##$ASSFACI= 0
##$ASSFACX= 0
##$ASSWID= 0
##$AUNMP= <proc_1d>
##$AZFE= 0.1
##$AZFW= 0.5
##$BCFW= 0
##$BC_mod= 2
##$BYTORDP= 0
##$COROFFS= 0
##$CY= -3
##$DATMOD= 1
##$DC= 0
##$DFILT= <>
##$DTYPP= 0
##$F1P= 0
##$F2P= 0
##$FCOR= 1
##$FTSIZE= 65536
##$FT_mod= 6
##$GAMMA= 0
##$GB= 0
##$INTBC= 1
##$INTSCL= 9.790993e-09
##$ISEN= 30
##$LB= 1.5
##$LEV0= 0
##$LPBIN= 0
##$MAXI= 10000
##$MC2= 0
##$MEAN= 0
##$ME_mod= 0
##$MI= 50
##$NCOEF= 0
##$NC_proc= -9
##$NLEV= 6
##$NOISF1= 182.463
##$NOISF2= 159.3651
##$NSP= 0
##$NTH_PI= 0
##$NZP= 0
##$OFFSET= 197.3918
##$PC= 4
##$PHC0= 1391.123
##$PHC1= 70.10066
##$PH_mod= 1
##$PKNL= yes
##$PPARMOD= 0
##$PSCAL= 0
##$PSIGN= 0
##$REVERSE= no
##$SF= 81.014063255964
##$SI= 65536
##$SIGF1= 159.3651
##$SIGF2= -187.1042
##$SINO= 113.3802
##$SIOLD= 16384
##$SREGLST= <1H.CDCl3>
##$SSB= 0
##$STSI= 65536
##$STSR= 0
##$SW_p= 32467.5324675325
##$SYMM= 0
##$S_DEV= 0
##$TDeff= 32768
##$TDoff= 0
##$TI= <>
##$TILT= no
##$TM1= 0
##$TM2= 0
##$TOPLEV= 0
##$USERP1= <user>
##$USERP2= <user>
##$USERP3= <user>
##$USERP4= <user>
##$USERP5= <user>
##$WDW= 1
##$XDIM= 65536
##$YMAX_p= 393776749
##$YMIN_p= -68127501
$$ End of Bruker specific parameters
$$ ---------------------------------
##NTUPLES= NMR SPECTRUM
##VAR_NAME=  FREQUENCY,     SPECTRUM/REAL,   SPECTRUM/IMAG
##SYMBOL=    X,             R,               I
##VAR_TYPE=  INDEPENDENT,   DEPENDENT,       DEPENDENT
##VAR_FORM=  AFFN,          ASDF,            ASDF
##VAR_DIM=   65536,         65536,           65536
##UNITS=     HZ,            ARBITRARY UNITS, ARBITRARY UNITS
##FACTOR=    0.49542278885378, 1,            1
##FIRST=     15991.5117654749, 0,            0
##LAST=      -16476.0207020576, 0,           0
##MIN=       -16476.0207020576, -68127501,   0
##MAX=       15991.5117654749, 393776749,    0
$$ Real data points
##PAGE= N=1
##DATA TABLE= (X++(R..R)), XYDATA
$$ [...]
48037 -12807694 -12227905 -8863642 -4638733 -1435344 -1005716 -5620712 -15488748 -25383730
48029 -25383730 -27635374 -20332862 -9888954 -3630273 -2525749 -3389376 -4993011 -8003156
48021 -8003156 -10867573 -10605807 -7529637 -5045675 -4396602 -3534875 -1983482 -2537799 -6142443
48012 -6142443 -8904881 -7260857 -3267936 -1267211 -1352215 -123701 3115388 5123671
48004 5123671 3934149 1616010 655688 452242 -962483 -3739256 -6379862 -7747846
47996 -7747846 -7612911 -6216105 -4225160 -2170392 559425 4793359 9227548 10935774
47988 10935774 9192082 6836564 6593867 8036575 9577482 10941173 11461159 8654398
47980 8654398 1985236 -3942573 -4197519 -478415 1236001 -421772 -712619 3093512
47972 3093512 7310711 7691735 5174658 2849591 1035881 -1103533 -2183491 -772359
47964 -772359 1315083 1703484 1537948 3061691 4876408 3878612 690662 -1375734 -2106313
47955 -2106313 -4310374 -7864136 -8825509 -5696396 -1979488 -521262 521504 3294372
47947 3294372 5410114 3304943 -1656043 -4429402 -3189767 -1620189 -3540629 -7546381
47939 -7546381 -8750064 -5299020 -1239566 -1369632 -4068662 -2422880 6094258 14532817
47931 14532817 14859353 9010558 6006109 8745967 10427432 5869848 -358691 -1538754
47923 -1538754 722765 -262754 -5455020 -8984826 -7131954 -2706795 115782 623678
47915 623678 -52648 -1546157 -3424228 -4440449 -4257089 -3999308 -3960618 -2574278 1239384
47906 1239384 6202758 10015896 11272874 9669985 6052110 2887149 2809676 5552327
47898 5552327 7798792 7276517 5698471 6218508 8858561 10075837 6815215 -47917
47890 -47917 -6497773 -9053893 -7426813 -3813632 -224861 2755376 4800179 5004777 3157345
47881 3157345 569998 -1812294 -5055234 -10050259 -14547433 -15064115 -11840857 -9165939
47873 -9165939 -9901749 -12171069 -12873960 -12106292 -11745224 -11290083 -8239541 -2505803 2352460
47864 2352460 3423153 2173112 2360845 5188846 8261411 9184450 8401070 7702857 7381705
47855 7381705 6381260 4514084 2668120 939448 -1435320 -3850549 -4102176 -1457137
47847 -1457137 1844473 3488932 3716131 3370189 1281155 -3708770 -9299041 -11454089
47839 -11454089 -9406595 -6210124 -4220799 -2717364 -419401 2332592 4841490 7136836
47831 7136836 8631226 7783956 4537911 1480670 1158439 3361821 6026139 7512654
47823 7512654 7061166 4462257 635363 -2403810 -3270474 -2386929 -1146527 -901292 -2676500
47814 -2676500 -6056552 -8210885 -6517526 -2873339 -2483033 -6875172 -11250971 -11232016 -9118028
47805 -9118028 -9602161 -11631900 -9762806 -3169932 2166673 1937299 -326073 1408786
47797 1408786 7239489 12029948 13050945 12889021 14417826 16271787 15155227 10746948
47789 10746948 6053534 3451949 2368017 1097388 -797056 -2792063 -4815646 -6961106
47781 -6961106 -8378655 -7836436 -5301639 -1946059 1220637 3653087 4528102 3203842
47773 3203842 592355 -1259496 -1299912 -158418 1251404 2425890 2575745 1023812 -1269520
47764 -1269520 -2269440 -1485562 -367606 285278 1141735 1818803 113169 -4608827 -9404184
47755 -9404184 -11137228 -10186602 -8882500 -8040202 -7312649 -7306193 -8497144 -9020691 -6395089
47746 -6395089 -1140007 3606221 5698098 5185482 2697008 -831232 -3239638 -2691330
47738 -2691330 -349761 697517 -610126 -2308986 -2273491 -179287 3101421 6007232
47730 6007232 6588234 4572427 2683483 3397378 5002735 3988854 863320 -334818
47722 -334818 1413714 2430027 512198 -1572222 -1095425 107171 -655948 -2047716 -1549857
47713 -1549857 -821301 -3574139 -8940225 -11332015 -7448407 -136599 5642769 8160862
47705 8160862 9067041 10040100 10778884 9804821 6590735 2866905 1366244 2786139 4669091
47696 4669091 4068014 657961 -3483235 -6120073 -5915084 -2666949 1795070 4047166
47688 4047166 2448701 -604571 -1825248 -1664803 -3210357 -6752362 -8555610 -5860407
47680 -5860407 -372784 4685450 8617922 12133858 13829719 10739673 2530223 -6862141
47672 -6862141 -12529386 -12623717 -8921143 -4566865 -1950421 -1881924 -3546167 -5095018 -5051249
47663 -5051249 -3563565 -2010494 -1284145 -1032872 -824727 -1102179 -2015285 -2016133 764923
47654 764923 5576386 8872497 7688300 2356046 -4299934 -9244144 -10467815 -7763899
47646 -7763899 -3432023 -897995 -1331963 -2680470 -3163400 -4164650 -7662182 -11995339
47638 -11995339 -12958686 -9069840 -3313741 809115 2744616 3524330 3097212 865048
47630 865048 -2183695 -3884679 -3560815 -2908435 -3540747 -4422575 -3013844 756497 3037894
47621 3037894 238783 -5803903 -9169147 -6992638 -2758253 -801284 -62867 3518866
47613 3518866 9863741 13949199 12193922 6030385 -1601787 -9655682 -17086637 -20855735
47605 -20855735 -18980818 -14089743 -11088958 -11646061 -12857774 -11147099 -6149883 -1006715
47597 -1006715 394152 -2889994 -7344886 -8360727 -5745754 -4077065 -6364032 -9594882
47589 -9594882 -8842712 -3945774 922250 3244884 4374626 5983989 7540403 7894535
47581 7894535 6877722 4802728 2519963 1953614 3872294 5082007 1335729 -6117651
47573 -6117651 -10682231 -8851427 -4700166 -3342417 -3786635 -2403842 -296317 -1480106
47565 -1480106 -5037820 -5395960 -1326597 1111578 -2634333 -8375617 -8693519 -2956426
47557 -2956426 2440012 2769183 -46758 -1475619 -223162 1430420 1451455 501958 708883
47548 708883 2900172 5714932 7579827 8714694 10010969 10517977 8317529 4430913
47540 4430913 3266237 7283082 13095168 15353874 13307327 10768489 10251134 10289103 8916664
47531 8916664 6835199 5759183 5650729 5163993 3603141 1134133 -2088311 -5894090
47523 -5894090 -9701884 -12859475 -15000946 -15844370 -15289733 -13796598 -11835808 -9098007
47515 -9098007 -5449051 -2416556 -1785905 -2446272 -1001754 3345735 6807891 5843043 2153092
47506 2153092 243600 1059342 1163391 -1601263 -4706655 -4789268 -2838209 -2953070 -6250816
47497 -6250816 -8519515 -5299824 2119854 7995451 9223681 8569753 9693212 11552987
47489 11552987 10494064 6299782 2544656 1257136 975358 594089 1173805 2456132
47481 2456132 1625038 -1691885 -2635436 2842550 11397143 15838815 14006222 10134171
47473 10134171 8038246 7028838 4976053 1904825 -540157 -846307 1690633 5880730
47465 5880730 8123106 5495625 -273923 -4305053 -4325348 -2509050 -1418624 -1036058 -503016
47456 -503016 88699 745200 1888825 2684804 1647714 -233843 -69104 1953016 1608425
47447 1608425 -3147686 -8227545 -8619663 -4938536 -1474145 93289 1157564 1763520
47439 1763520 -4505 -4199177 -8126198 -9925946 -10330827 -10259523 -9154411 -6649620 -3973346
47430 -3973346 -2712831 -3428692 -5865022 -9129089 -11422707 -11256324 -9465585 -8495630 -9047494
47421 -9047494 -8949535 -6298151 -2443101 -627274 -2407886 -6529796 -10829026 -14057644
47413 -14057644 -15855682 -16020996 -14501146 -11862522 -9244095 -7695694 -7705300 -9210623 -11434962
47404 -11434962 -12570034 -10752495 -6459253 -3144462 -3804220 -7134173 -8985240 -7742917
47396 -7742917 -6002496 -6184087 -7043418 -6397319 -5307579 -6851474 -11486734 -16123924 -17883292
47387 -17883292 -16909880 -15068450 -13185104 -10298325 -5332137 734553 4858646 5033527
47379 5033527 3065727 2445359 3364862 2482550 -1435745 -4846253 -4668970 -3250201 -4637085
47370 -4637085 -7987375 -8782464 -5555162 -1276245 1622287 3492734 4420650 2917174
47362 2917174 -1186909 -5696215 -8951058 -10928815 -10718926 -6258733 1928852 9662669
47354 9662669 13495065 13832744 12450607 9717787 6002171 3090733 2007838 1528550
47346 1528550 719229 693677 1912216 2269993 426925 -1169680 464927 4221299 6451358
47337 6451358 5920070 4417023 3511805 3507372 4701474 6713896 7077127 3500042 -2377348
47328 -2377348 -6001845 -4942368 -972680 2694973 4094298 2563403 -1341563 -5278899
47320 -5278899 -6315028 -3650311 607122 3457056 3127701 -97286 -3933380 -5709879
47312 -5709879 -5257048 -5174090 -6706342 -6989732 -3035740 2817613 4980569 1937487 -2061144
47303 -2061144 -3259637 -3058487 -5026955 -9732035 -14053709 -14059979 -7884673 2350180 10949570
47294 10949570 13223753 10414961 7910809 8123148 8075101 5071959 1316511 548307 2778672
47285 2778672 5160557 6153080 5984039 4399800 839536 -3853926 -8187972 -11824514
47277 -11824514 -14784113 -15930179 -14313761 -10931785 -7049494 -2223061 3343949 6057274
47269 6057274 2398397 -5283287 -10363822 -9770697 -6611165 -4305523 -2143566 1450814
47261 1450814 4976144 6346667 6946555 9790361 14767336 18570737 18694030 15133758
47253 15133758 8947733 1796877 -3516229 -4913736 -3687803 -2820580 -2467729 56110
47245 56110 5066871 8500276 7133227 3295374 1603474 2638730 2999495 834704 -2019537
47236 -2019537 -3543201 -3920828 -3471334 -1204594 2675182 5159642 3810065 357448
47228 357448 -1501536 -1008207 -559333 -1494988 -2337583 -1555168 244946 1691441 2407504
47219 2407504 2487303 1679600 27616 -1784262 -3396451 -5021575 -6350863 -6643022 -6369968
47210 -6369968 -6968151 -8060642 -6908026 -2182520 3366082 5931676 5130194 3521819
47202 3521819 2686082 1871170 -121004 -3653386 -8156373 -11363053 -9704631 -2241688
47194 -2241688 6333869 9783146 7533933 4675447 4442436 4558352 2513256 422924
47186 422924 1456479 4356644 5537530 5016384 5967907 8774364 9820453 7215068 4101922
47177 4101922 4261444 6933142 8404938 7252282 5592318 5711043 7465398 9004276
47169 9004276 8550123 5404675 597172 -3140812 -3365618 -716192 1078289 -1015311
47161 -1015311 -5781043 -8875181 -7676536 -4365121 -3667676 -7787227 -14114293 -18043951
47153 -18043951 -17592147 -14884911 -13414549 -14491226 -16555874 -17327991 -15841008 -12421936
47145 -12421936 -7702218 -2604812 1023975 1205042 -1892442 -5281345 -6110993 -5167435
47137 -5167435 -6010910 -10211960 -14885036 -16048280 -13313093 -9641921 -7173810 -5485141
47129 -5485141 -4129799 -4384724 -6909583 -9382188 -8792683 -5587470 -3310496 -3865672 -5114500
47120 -5114500 -4035793 -649636 2545564 3975057 4294957 4817333 6034487 7470313
47112 7470313 7745066 5082776 -673699 -6501717 -8410096 -5856199 -2500906 -1820699
47104 -1820699 -3507600 -5253366 -6278650 -7110425 -7261414 -6004340 -5157759 -7957615 -14081137
47095 -14081137 -18314210 -16121105 -9067325 -2698222 39483 1021235 2832053 4904648
47087 4904648 4921374 2536396 -167097 -1749041 -3225676 -5859040 -8187723 -7149647
47079 -7149647 -2517756 1545502 799514 -4261469 -9650398 -13073101 -15337347 -16783732
47071 -16783732 -15730839 -11991851 -8929940 -9169961 -10128264 -7076283 285876 7679469
47063 7679469 12324300 15429062 17897368 17380410 11965370 4282239 -862959 -1751942
47055 -1751942 -545842 -48180 -1910774 -6833827 -13469265 -17254787 -13549894 -3282611
47047 -3282611 6520408 9387074 5546466 440353 -1682954 -1247931 -1148291 -2794499 -4801337
47038 -4801337 -4922575 -2868569 -1045226 -2062769 -5490341 -7994829 -7187600 -4253191
47030 -4253191 -1727177 211344 3250104 7083421 8531962 5584591 573841 -2218750
47022 -2218750 -1082296 2399334 6020564 8323920 7880901 3776504 -2471087 -7326409
47014 -7326409 -8681808 -7823121 -7306708 -8115366 -9629258 -10957747 -11168547 -9531842 -6976255
47005 -6976255 -6189311 -8661071 -12544819 -15097919 -16201230 -17359505 -18202608 -16921008
46997 -16921008 -14048199 -12586937 -13472232 -13850114 -11558163 -8870320 -9400006 -12812012
46989 -12812012 -15181259 -14037117 -10867596 -8639687 -8531897 -9378768 -9180862 -6894599
46981 -6894599 -3433447 -944195 -649824 -1652511 -2191915 -1488843 63319 1628455 2133329
46972 2133329 662122 -2467006 -5821917 -8734592 -11804814 -14597830 -14695176 -11137810
46964 -11137810 -7479678 -8562632 -14401367 -19680600 -19514564 -13660787 -5042543 3330323
46956 3330323 9204391 11250918 10034676 7720467 5917492 4825275 4827468 7113849 11600403
46947 11600403 15601934 15904777 11553955 4135693 -3497169 -8265081 -8375712 -5156728
46939 -5156728 -2269667 -1911240 -2791645 -2854730 -2559571 -3819881 -6715561 -9174026 -9591212
46930 -9591212 -8307715 -6730235 -6125501 -6820217 -7458335 -5716569 -1165143 3192602 3915999
46921 3915999 1337986 -971540 -873870 51225 -783439 -3693703 -6906291 -8721952 -8592924
46912 -8592924 -6837647 -4082974 -789793 2695966 5287903 5127608 1827129 -1738663
46904 -1738663 -2097205 16181 25403 -4009689 -7794744 -6303838 -1261801 456343 -4080737
46895 -4080737 -9837411 -10276409 -5095827 762927 3862408 4918513 5387209 4843833 2880630
46886 2880630 1229047 2060637 5073312 7614027 7267196 3716628 -1050530 -3745110
46878 -3745110 -2313542 1405116 2946970 674939 -1534872 669711 5636755 7446948
46870 7446948 3868447 -920367 -2422028 -1384733 -1461441 -3865296 -6756396 -8379995
46862 -8379995 -8479906 -7393791 -5603185 -3770347 -2106973 -387458 814446 434868 -613432
46853 -613432 630877 5093601 9523861 10619999 9375235 8628399 8125685 5552676 1375383
46844 1375383 -1322930 -1729078 -2298947 -4453569 -6754367 -8098874 -9330514 -10530448
46836 -10530448 -9952254 -7158356 -4207291 -2030253 1294350 6389997 9628103 7443910
46828 7443910 1636107 -2880771 -4375321 -5189668 -7036560 -8640119 -8372653 -6725313
46820 -6725313 -5347853 -5105094 -5498335 -4962746 -1876034 3443562 7894391 8155477 4156090
46811 4156090 -1211756 -5688547 -9350598 -12395483 -12970916 -8787689 -728812 6354577
46803 6354577 7577206 3181989 -945003 879147 7856970 13602879 13344965 8372267
46795 8372267 2771066 -1787188 -6119761 -10324956 -13226932 -14314079 -13905428 -11824275
46787 -11824275 -8127858 -4889686 -4911386 -8333436 -12249398 -13765635 -11901771 -6972960
46779 -6972960 -463504 4509922 5293423 2992348 1505169 2660731 4572406 5340246
46771 5340246 5438864 5116861 2610248 -2504384 -6648733 -6197446 -2703916 -974130 -2707439
46762 -2707439 -5215005 -6114632 -5927769 -5528663 -4195081 -1506852 1304734 3422136 5761344
46753 5761344 8581799 9810012 8036696 5695469 6351376 9195724 9120797 3061297 -5861990
46744 -5861990 -11776216 -12154237 -9010728 -5088308 -1030157 3309385 6607130 6953561
46736 6953561 4896853 3966090 6938697 12139909 14842913 12446819 6953909 2005169
46728 2005169 -783036 -1446783 316044 4105443 6614190 3716773 -4434926 -12770121
46720 -12770121 -16711073 -16053799 -12543942 -6621129 909387 6388118 6372926 2671131
46712 2671131 800918 2942786 5311301 3523677 -1828969 -6370671 -6978504 -4245937
46704 -4245937 -1142302 -490900 -3002290 -6828108 -9423575 -10036780 -9677023 -9049905 -8194529
46695 -8194529 -8001310 -9582973 -11332264 -9199895 -1742391 6949334 11381847 10378902
46687 10378902 6832913 3298811 428821 -1067009 75854 3686511 7661865 10131014
46679 10131014 10873481 10339922 8592892 5694497 2162585 -1463452 -5004696 -8446150
46671 -8446150 -11731884 -14653266 -16723031 -17632013 -17989537 -18584649 -18465386 -15296657 -8854347
46662 -8854347 -2706928 -552116 -1855253 -3157391 -2941162 -2768560 -3809620 -4882825
46654 -4882825 -4652470 -3732201 -3541486 -4387922 -5527814 -6104444 -5374819 -2934396 625057
46645 625057 3903790 5944608 6800605 6751073 5603375 3018139 -737119 -4223722 -4993304
46636 -4993304 -1377352 4961502 9146165 7157224 -347122 -8878220 -13959607 -13481099
46628 -13481099 -7980369 -614402 4093448 3715848 36536 -3516787 -5601791 -6693332
46620 -6693332 -6825378 -6229944 -6927063 -10432666 -14514509 -15516750 -13534091 -11799715 -11117006
46611 -11117006 -8880863 -4204119 -36539 1098042 -40405 -2153320 -5441131 -9108968
46603 -9108968 -10198623 -7218047 -2388125 1524809 3943085 4477221 1518801 -4768275
46595 -4768275 -10954638 -14377402 -16002672 -16916249 -15174682 -9417080 -2813730 435321
46587 435321 609100 907246 2180181 2881710 2726428 2512739 1303494 -2463841 -7548079
46578 -7548079 -10796094 -10973410 -9003610 -5481589 -1002398 2212665 2452534 1384325
46570 1384325 1481515 1769856 -111766 -2838463 -2932356 -798017 -373633 -2594288 -4055106
46561 -4055106 -2965290 -1672945 -1895301 -2005037 -1024774 -1093054 -3395185 -5232743 -4057331
46552 -4057331 -1645079 -1410185 -3653439 -5948368 -6527786 -5296798 -3232454 -2509796 -5242726
46543 -5242726 -10182387 -12547352 -9251628 -2904450 1148626 463353 -3162919 -6307762
46535 -6307762 -6379485 -3127277 705808 1676886 -157718 -1032474 1383032 4756736 5500384
46526 5500384 3148705 -489485 -4266680 -7516524 -8969500 -8375542 -7624746 -8001192 -8129132
46517 -8129132 -7075930 -7341083 -11380734 -16653732 -17912935 -13848209 -7978233 -3260848
46509 -3260848 569818 4021356 5816916 5121671 3137689 1185543 -623720 -1621726
46501 -1621726 241824 5555848 11242379 13299540 11234837 7991221 5507511 2252069
46493 2252069 -3647951 -10030106 -11905650 -7857817 -3090003 -3691066 -8823320 -11600552
46485 -11600552 -7762075 -252148 5615797 7955665 7305579 3385977 -3509354 -9828026
46477 -9828026 -11189830 -6938645 121354 7177506 11913274 11462797 4995928 -3222951
46469 -3222951 -7403024 -7095493 -7010621 -9825281 -13001018 -13500712 -11757749 -9375903 -6368873
46460 -6368873 -2891196 -948796 -1899252 -4098440 -5122276 -4865775 -4817676 -5789979 -7788178
46451 -7788178 -10398911 -11848762 -9699821 -4408916 -321027 -819129 -3982863 -5435805
46443 -5435805 -4111751 -2490662 -2215077 -2625154 -3242898 -4440238 -5270567 -3749227 -373192
46434 -373192 1407828 -49940 -1641216 344708 4705772 6760548 4682110 1381642
46426 1381642 -366213 -1608419 -4171464 -6340767 -4777677 31193 3653723 3596727
46418 3596727 2173000 2047207 2001208 -89405 -2433945 -1476509 1996912 3219251 543309
46409 543309 -1829554 -85941 3555336 4279015 1554888 -664836 374190 3417626
46401 3417626 5931931 6920490 6421208 4370311 1203144 -1524336 -2182851 -433712 2711716
46392 2711716 5690275 7191921 6941230 5967303 5461882 5051192 2814505 -2445909 -9251311
46383 -9251311 -14261553 -15061805 -11972517 -7275039 -3093263 -212544 1497496 2352364
46375 2352364 2862533 3785571 5343951 6543091 6022184 3688922 981807 -539667 -444345
46366 -444345 516973 929530 -496858 -3699913 -6787233 -7687072 -6286002 -3962668 -1251245
46357 -1251245 2352999 6051931 7424883 5747429 3769664 4164862 5485825 4213557
46349 4213557 365274 -1832839 369764 4344753 5557689 3342327 1010425 838591
46341 838591 1381935 354114 -1888873 -3386446 -3989012 -5604197 -8964120 -12023506 -12405791
46332 -12405791 -10167232 -7286896 -5658405 -6544392 -10371229 -15172970 -16566514 -12035599
46324 -12035599 -4903399 -1229399 -2528193 -4510872 -3764794 -2203547 -2794778 -4073628
46316 -4073628 -2596426 811649 1494265 -2246548 -6481043 -7054502 -4893197 -3991187 -5884580
46307 -5884580 -8326956 -8729357 -6954515 -4670044 -3403821 -3616855 -4603458 -4724926 -2586347
46298 -2586347 1222033 4186216 4709192 4419354 6112172 9413949 10572772 7475421
46290 7475421 2699604 -252922 -1591765 -3078407 -3053512 1592696 8450292 10040292
46282 10040292 3606588 -4148055 -5856079 -3315371 -3644419 -8230557 -11640892 -10957115
46274 -10957115 -9753911 -11074398 -12025885 -8920664 -3996237 -2662887 -5833490 -8933510
46266 -8933510 -8064248 -3976094 193111 2396562 2117707 -598933 -5150326 -10105541
46258 -10105541 -13695699 -14350860 -10872509 -3107794 6922228 15175298 17912144 14477435
46250 14477435 7921776 2722650 1469697 3313015 5379068 5583043 4072522 2249253
46242 2249253 944386 -100753 -1148548 -1459534 88243 3447059 7214095 10380616
46234 10380616 13349230 16198404 16936911 13616540 8025560 4630494 4991798 5887705
46226 5887705 4532727 2748768 3138605 3654984 176705 -6649490 -11656033 -12237345 -10765171
46217 -10765171 -9196166 -5903643 77429 5735962 8029422 8097604 8395409 8187747 5386164
46208 5386164 929289 -2365852 -4120681 -6067445 -8264252 -9076605 -8387477 -7405128 -5605273
46199 -5605273 -1504922 3349836 4920134 2138232 -1427268 -2523559 -1801745 -1184438
46191 -1184438 -807794 -513578 -1589424 -4552856 -7220217 -7326072 -5455204 -3404326 -1562683
46182 -1562683 -202044 -1230508 -5467826 -9628415 -9608538 -6178079 -3967105 -5015523
46174 -5015523 -6854101 -7212880 -6890980 -6950077 -6714970 -6347897 -8026396 -11937200 -13843690
46165 -13843690 -9884698 -1981419 4778245 8699090 11833540 14788270 15566107 14030232
46157 14030232 13228533 14414427 14229303 9580448 2864348 -832790 -321619 1029052
46149 1029052 517184 -1069773 -1828567 -1048491 1404031 5391516 9205476 10306693 8698738
46140 8698738 7435320 8184430 8575166 6416534 4499171 7365701 13839720 17009183
46132 17009183 12938178 5963819 3101131 5807762 10049492 12356783 12092718 8847045
46124 8847045 2212071 -4919460 -6962846 -2146811 4146647 5357408 1381410 -2577041
46116 -2577041 -3376339 -2593358 -2065700 -577972 3606539 9523401 14548679 16939767 15956079
46107 15956079 11274283 4175634 -1985642 -4582624 -4422776 -4157720 -4802762 -5514789 -5998148
46098 -5998148 -6945877 -8246532 -8740005 -7944574 -6439583 -4549494 -2345231 -852615 -1116541
46089 -1116541 -1738301 300223 5337971 9582555 9321155 5001504 -166355 -4018723
46081 -4018723 -6253608 -7014548 -6753017 -6523425 -6440339 -4741177 -547169 3232288 2412591
46072 2412591 -3150541 -9334696 -13032656 -14869869 -15948127 -15114890 -11641661 -8150622
46064 -8150622 -7746569 -9396977 -9417693 -7386779 -7228301 -11247411 -15882936 -15794410 -10770376
46055 -10770376 -5891132 -4959695 -6222087 -5555184 -2103745 986333 775541 -2193418
46047 -2193418 -4900490 -4871528 -1922885 1935723 3743571 1758244 -2670383 -5991666
46039 -5991666 -6031868 -4033507 -2251186 -593718 2406611 5726912 5752518 1295673 -3412716
46030 -3412716 -3063784 2147409 6438666 4972341 -1263482 -7367752 -9652441 -8189527
46022 -8189527 -5753646 -5450638 -8506919 -13084843 -15544396 -13802878 -9305925 -5123489
46014 -5123489 -2666441 -1241751 -352667 -893869 -3603476 -7319848 -9556954 -8655180 -5201214
46005 -5201214 -1524627 326527 480877 928458 2898837 4996233 4703155 1334442 -3430660
45996 -3430660 -7420544 -9030953 -6995389 -1288539 5438753 9482880 9986900 9364554
45988 9364554 9104009 7544507 3244239 -1988579 -5689840 -8067849 -9854749 -9012797
45980 -9012797 -3609854 3246068 6039161 4453161 3652357 6006012 7381826 4007467
45972 4007467 -1374276 -3803368 -3257504 -3263925 -4527365 -4564643 -2837144 -1766648 -2290875
45963 -2290875 -2243825 -302216 1435533 334896 -3277743 -6695249 -7420696 -4495543 1046665
45954 1046665 6163318 7773095 5797806 3220595 2539770 3327431 3676086 2501281 -236299
45945 -236299 -3885820 -6636543 -6301575 -3014969 34775 5186 -2441768 -4728162 -5903026
45936 -5903026 -6630082 -6453975 -3740608 1158218 4943761 5100843 3429803 4094045 8274497
45927 8274497 12322955 12011363 7691667 3899735 3924792 6263181 7205774 5584010 3338263
45918 3338263 2135145 1607573 1152897 1326433 2413712 3234203 2659932 1091775 -864174
45909 -864174 -3879484 -8265911 -11861922 -11928962 -9027069 -6644302 -6360675 -5573057 -1503263
45900 -1503263 4125452 6696191 4702982 1875004 2233816 4582798 4058813 -969487
45892 -969487 -5957503 -5585731 -439906 4098626 4890134 3954490 4008909 4448163 3612809
45883 3612809 2219848 1621053 609502 -2567075 -6169714 -6785044 -4782615 -3790716 -4293983
45874 -4293983 -2407161 3028383 6560580 2954714 -5203900 -11062136 -12753494 -14300466
45866 -14300466 -17789005 -19681064 -16481041 -10382425 -6783944 -8135219 -12278341 -15673251
45858 -15673251 -16577457 -15695602 -14905973 -15116677 -15052431 -12785405 -8433207 -4232788 -2010271
45849 -2010271 -2023267 -4080348 -7532529 -9830660 -7906250 -2345484 2302273 3137498 2414610
45840 2414610 3229173 4248773 2100288 -2678485 -5968644 -5673083 -3138150 895735
45832 895735 7543416 15884870 21690420 22272284 19921060 18186624 16854696 13177168
45824 13177168 6694170 226368 -3419215 -3745717 -1950310 200187 990647 -185498
45816 -185498 -2132021 -3156675 -3133206 -3483050 -5066048 -6746454 -6303385 -2675729 2658549
45807 2658549 6785282 8289274 8702301 10159007 12116297 11933684 8555107 3713533
45799 3713533 -735177 -4468785 -7005551 -6827774 -3775133 -353817 1221850 1832241
45791 1832241 3552331 6363385 8590756 9287527 8270847 5142228 503907 -2913936
45783 -2913936 -2661699 597132 4591341 8670203 13239764 17119091 18270448 16555345
45775 16555345 13152226 8052213 1237775 -4286581 -4512040 -39734 3660816 2572586
45767 2572586 -2047704 -6791441 -9850091 -10470408 -7865995 -2760184 2149190 5113716
45759 5113716 7097560 9403675 11467379 12259592 11857586 10306534 7098877 3358222
45751 3358222 2297502 5409480 9932817 12140251 11599609 10180741 8461189 5633725
45743 5633725 2076520 -365793 -474082 1429329 4137101 6012256 5777411 4146146
45735 4146146 3596921 5159925 6631829 5570413 2861436 1342052 1602106 1108909 -2534979
45726 -2534979 -8598499 -13391487 -13242062 -8379646 -3924412 -4962805 -10139486 -12946419
45718 -12946419 -10554636 -7749807 -9377471 -12405330 -10042583 -1824099 5446151 6483189
45710 6483189 2723560 -1765611 -5423839 -8691592 -11408330 -12660485 -11698008 -8057549
45702 -8057549 -2130772 4017692 7967124 9451752 10222565 11328668 11839948 10168155
45694 10168155 5593628 -819580 -5717576 -5521758 -1110366 1402250 -2284403 -8295862
45686 -8295862 -9208037 -4195665 -96 -1580591 -6442487 -9469576 -9139933 -6973207
45678 -6973207 -4321963 -2038988 -855811 -360649 290592 -96188 -3555526 -8543039 -10491337
45669 -10491337 -8274018 -6167932 -7272970 -9027336 -8104413 -5801772 -4834547 -4226346
45661 -4226346 -1848095 569779 -188772 -2999686 -3593499 -786438 2607892 4468404
45653 4468404 4945996 3762265 104909 -4419353 -6348027 -4497398 -581467 4375603
45645 4375603 10811756 17369362 20588085 19322599 16574036 15332562 14976107 13376474
45637 13376474 10514095 8237475 7789070 8919125 10381924 10443018 8144595 4923420
45629 4923420 3763533 5864068 9115140 10510484 9149576 6492279 4767171 5521570
45621 5521570 8626151 12313644 15072833 17328691 19927211 21451150 19405597 14404159
45613 14404159 10614133 10849163 13320966 14645162 13998453 12387013 9647022 4947703
45605 4947703 -399702 -3317636 -2484929 378959 3139684 5466250 7772729 9595160
45597 9595160 10410334 11096521 12807476 14521589 13558989 9353373 5226169 4838089 7664506
45588 7664506 9848627 9250268 7489387 6680525 6512682 5679632 4088567 2055896 -840687
45579 -840687 -4196978 -5704232 -3809490 -91433 3116999 5717604 7754869 6449670
45571 6449670 -337052 -8543841 -10844365 -5955727 -532882 -226296 -3077795 -4146900
45563 -4146900 -2704659 -1264808 -329398 1683385 4561782 6201354 6223430 6686575 8826394
45554 8826394 11262120 11955528 10530973 8295829 6762618 6092731 4601785 512620
45546 512620 -5347645 -9790841 -10919301 -10083826 -9291729 -8538949 -7245782 -6412727 -7084372
45537 -7084372 -8084884 -7743582 -6825554 -7208776 -8403266 -7923197 -4589221 893313 7783782
45528 7783782 14809945 18558654 16183372 10183364 6856650 8750425 11797903 11403662
45520 11403662 8101482 4945056 2410295 -624315 -2775726 -1179297 3557255 6935613
45512 6935613 6001453 2705216 767190 1292183 2971859 4952717 7393756 9867217
45504 9867217 11343331 11954355 12985630 14448217 14258592 11037893 6441697 3034998
45496 3034998 808779 -1976734 -4929484 -5314921 -2287839 1420387 3403872 4603106
45488 4603106 6456331 7558497 6154780 4092271 4510561 6404842 5497301 741638
45480 741638 -3876873 -5010304 -3847603 -2758384 -1416460 1206753 3545661 3198928
45472 3198928 625421 -1564307 -2131162 -1721171 -640205 1455087 3865104 5014892
45464 5014892 4574146 3874505 3993751 4565301 4553204 3334039 1200856 -458496 -16829
45455 -16829 2449106 4684022 4663597 2743123 533740 -1105698 -1593258 321345 4761766
45446 4761766 8990079 10046664 8591281 7514769 7222263 5465783 1970363 -271864
45438 -271864 684937 3359850 6178207 9953095 14975912 18696731 19164381 18263095 18166543
45429 18166543 16673225 10269274 815540 -5405198 -5736930 -4213911 -5407809 -8764913
45421 -8764913 -10816507 -9864884 -6102150 252213 7799557 12633118 11637189 6786553
45413 6786553 3396609 4102899 6995369 9629376 11848341 13661913 13251874 9409757
45405 9409757 4361207 1696476 2094114 3257514 3883543 5399643 9099395 13430074
45397 13430074 15487427 14269224 11262211 8399515 6547160 5624511 5077395 4286094
45389 4286094 3389501 3539280 5326032 7157427 6685370 4166823 2773926 4551417 7475119
45380 7475119 8164628 6600213 5943027 7624447 8867881 6309494 698042 -3638619
45372 -3638619 -3559698 90791 4495272 8272715 11966410 15759757 18035730 16855767
45364 16855767 12410980 7242802 4015470 3686042 5846949 9726376 14065771 16939944
45356 16939944 17183647 15976340 15825438 17671828 19807229 19888732 17397443 14094957 12689781
45347 12689781 14694212 18471570 19764187 15882264 9452743 6011938 7399324 9872929
45339 9872929 9849624 8772087 9903532 12561960 13131396 10942977 9368043 10631308 12860820
45330 12860820 13524702 12988383 12741392 12175020 9588064 5509666 2768280 3131192 5312284
45321 5312284 6785584 6871831 7450509 10480336 15060894 17813786 16790289 14043325 12964213
45312 12964213 13836635 14024260 12171312 9645052 7575342 5458414 3858140 5414852
45304 5414852 10809365 16028463 16574021 13046115 9778668 8979262 9185499 8985179 9145375
45295 9145375 10730132 13575513 17009480 19988282 20494418 17323695 12871632 11548080
45287 11548080 14599010 18869765 21485817 22973913 24373629 24351229 21913343 19818379
45279 19818379 21889953 27765240 33345778 36202697 37661437 39338471 40641884 40990326
45271 40990326 42131028 46224963 52931828 60427607 68638621 79224519 92040314 103644719
45263 103644719 110738630 114078594 117298846 122100338 126442982 128059782 127867408 128120256
45255 128120256 128238285 124980808 117170288 108194914 102542693 100908197 99857435 95637096
45247 95637096 87358966 77118546 68182740 62824295 60873459 60209836 59047266 57410740
45239 57410740 55940827 54043787 50451359 45411208 41021040 38999184 38974481 39382477
45231 39382477 39279036 38662772 37640024 36279909 35263562 35629676 37174191 37698487 35040397
45222 35040397 30059327 26523346 27270895 31134547 34358332 34250111 30515976 24183613
45214 24183613 17154565 12208628 10974697 11700388 11416531 10660594 13064724 19061970
45206 19061970 23381416 21532081 16211957 13768322 15999573 19402996 21499892 23192928
45198 23192928 24428505 22257744 15356943 7032402 1191878 -2058306 -4198221 -4072071
45190 -4072071 677198 9018176 16622208 20523935 21323070 20749872 19274201 16522217
45182 16522217 12298142 6733326 765734 -3390112 -3784870 -1083549 2029266 4110805
45174 4110805 6131283 8974479 11609847 12939388 13988972 16489127 19914474 21687430
45166 21687430 20383486 17345128 14723099 13067818 11653660 10415237 10277222 11335046
45158 11335046 11674581 9063109 4002376 385386 2214145 9291898 16507750 18067124
45150 18067124 12860017 5468906 1434544 1673965 2367621 469453 -2096725 -1046118
45142 -1046118 4380813 10239398 12702761 11979303 10640880 10106204 10385242 11714390 14203658
45133 14203658 16507321 16849361 15161659 12727897 10360981 8699260 9286435 12519377
45125 12519377 14924673 12094889 5168662 722574 2215276 4895621 2418761 -3996273
45117 -3996273 -7190067 -3725246 2522359 6795270 9311591 12895485 17902223 22193335
45109 22193335 24500528 25258671 24839625 23222424 21337015 20796316 21685968 21819347 19031604
45100 19031604 13845216 9365001 8492809 11210212 14516521 15240818 13120474 10836501
45092 10836501 10683318 11613448 10465617 6291051 2389236 2788315 6855478 9070767
45084 9070767 5310093 -1771483 -5599525 -3618693 99115 886197 -630696 -798187
45076 -798187 1158004 2952325 4077536 6849659 11869431 15901665 16088075 13742810
45068 13742810 11911719 11246804 10719389 10844513 13283681 17681543 21354116 22305513 20877097
45059 20877097 18401242 15782515 13561037 12110380 11484729 11586833 12022871 11410252 8406517
45050 8406517 4766982 5428871 12877899 22703829 28062575 27953711 27339963 29085743 30315486
45041 30315486 28271557 25351358 25174894 26836501 26813284 24553946 22394228 21196929
45033 21196929 19861245 18555207 18706593 19747966 19387659 17602610 16989775 18233641
45025 18233641 18538126 16110657 13195378 12522079 13244746 12928611 11606640 11034179 11209398
45016 11209398 10501153 8550981 6449061 4556854 2778221 2560332 5591064 10353095
45008 10353095 13146400 13357120 14581878 19030876 23805675 25002020 22962297 20575755
45000 20575755 18420961 15190535 11797205 11051177 13152942 15114639 15366052 15569292
44992 15569292 16711480 16842416 14815878 13338490 15350951 19289266 20999908 19227857
44984 19227857 16319458 14193658 12433624 10074111 6651982 1606702 -4736723 -9501517
44976 -9501517 -9315599 -4614473 536674 3499405 5357996 7318784 7777654 5000225
44968 5000225 699973 -1304948 979082 6477150 12408355 15678450 14668023 11328549
44960 11328549 9896449 11726957 13211814 11111114 8015511 9157648 14896208 20212630
44952 20212630 21607526 20662085 19974452 19372602 18126880 17810800 20028829 22977337 23092779
44943 23092779 19528805 14923768 12167736 12174298 14354000 17273418 18800553 17470929
44935 17470929 14348201 12366410 13353798 16599731 20472914 24086385 26774039 27352636
44927 27352636 25266540 21769734 18612388 15904400 12681894 9428273 8199517 9592443
44919 9592443 11291693 11005126 9584824 9396135 10391133 10116740 7600943 4839559 3704238
44910 3704238 3535587 3028929 2613182 3302752 4668064 5733831 6614790 7323360 6231548
44901 6231548 2243124 -2222307 -3156291 197328 4891056 8595201 11545076 13758652
44893 13758652 13469478 9861549 4918076 749337 -2929327 -6807076 -9406120 -8909062
44885 -8909062 -6314199 -4346962 -3957877 -4141717 -4643466 -6344835 -8873390 -10056402 -8380449
44876 -8380449 -4503316 42194 4293056 7820125 10713011 13815135 17404410 19411377
44868 19411377 16976769 10685185 5283971 4561458 6895737 7767632 5706970 3510498
44860 3510498 3857602 6038888 7534145 6880849 4094263 28002 -3293792 -3268927 201841
44851 201841 2948788 332042 -6857058 -12432384 -11652032 -6175148 -888302 2337655
44843 2337655 5291528 8738108 10245410 7662852 2571335 -1534592 -3514974 -5250865
44835 -5250865 -8176720 -10691145 -9759235 -4462363 2761719 8264834 10002411 8269378
44827 8269378 4633995 1017927 -749220 -20759 1627882 1776692 328612 38589 2791262
44818 2791262 6628801 8156762 7003566 5928372 7075459 10285339 14728054 19482859
44810 19482859 22113352 19597327 12282292 4981706 2423657 4785789 8832215 11880200
44802 11880200 13165691 12804817 11430816 10146133 9196627 7232987 3189748 -1836264
44794 -1836264 -5915216 -8611102 -10351961 -10264438 -6817168 -793073 4130421 4620408 1002462
44785 1002462 -2852363 -2821745 1728946 7064557 8604533 5730857 2203561 1611966 4042487
44776 4042487 7759851 11729500 14819569 14929768 11645878 8104830 7248170 7483195 5241284
44767 5241284 738026 -2565571 -3668862 -4957293 -7131653 -7605940 -5271228 -2792963
44759 -2792963 -2187555 -1891475 -849897 -1915686 -7359585 -13456097 -13979815 -8279589 -1996435
44750 -1996435 252785 -462980 -556368 1278717 3746299 5331438 5460351 4405807 3220468
44741 3220468 3106096 4041764 4577669 3662079 2210178 2069533 3496822 4419672 2785480
44732 2785480 -489823 -1700442 1863550 8602820 13870879 14513654 11379145 7374509
44724 7374509 4192478 1473165 -1680313 -5126028 -7343201 -6492396 -2306283 3151761
44716 3151761 7439396 10297439 13031366 15434976 15308495 11902957 8035725 7147067
44708 7147067 9269746 11528980 12050190 11772434 12432870 14041656 14837086 13328427 10115019
44699 10115019 7484623 6956249 7685405 8054374 8113489 8837944 9474853 8129640 5385202
44690 5385202 4647857 7647335 11955724 14551509 15603513 16818072 18212165 18882529
44682 18882529 19088592 18973942 16929883 12150552 7401197 6091338 7662955 9054654
44674 9054654 9623247 10889543 12159956 10775367 7019030 4622620 5417559 7157007
44666 7157007 7695814 7640383 7590674 6686150 5711742 7569721 11993269 13733252 9738957
44657 9738957 4881173 5894638 11728556 14948882 11861951 6206440 2487477 514222
44649 514222 -1699005 -3538285 -3143492 -972117 610457 315187 -1273391 -3045250 -4001235
44640 -4001235 -3254773 -873643 1672849 3169089 4461775 7357133 11772363 15242963
44632 15242963 15616554 13294402 10374561 8466484 7999709 8785279 10021194 10117575 8010939
44623 8010939 4959507 3754958 5519991 8353377 9818313 9526012 8259255 6034438
44615 6034438 2902160 665144 1442321 4771144 8291866 11112050 14027210 16395282
44607 16395282 15972614 12983166 11302891 13466191 16835863 17300516 15005628 13432472
44599 13432472 13805022 13681748 11248752 8196514 7264840 8671491 10145403 9669816 7395725
44590 7395725 5143143 4342902 4525320 4159845 2903548 2012405 2246785 2832571 3321168
44581 3321168 4754267 7396292 8879132 6936281 3109398 1202249 2261254 3492973
44573 3492973 2449795 163080 -639951 963025 2990927 2244187 -2650055 -8905600
44565 -8905600 -11120434 -6896756 -299830 2406829 108232 -2431769 -1071441 3090633
44557 3090633 6013990 5206140 1283196 -2737618 -3126916 1306800 7071734 9446205
44549 9446205 8456934 8360977 10364672 9745582 2612201 -7724714 -14390558 -14725823 -11166292
44540 -11166292 -6256357 -676478 4522963 7573393 8426414 8883643 9673583 9366989 6705567
44531 6705567 2535651 -847696 -1236821 2273809 8270546 13414218 14915612 12370590
44523 12370590 6879282 40919 -5170532 -5113140 288932 5873406 6956006 5334634
44515 5334634 6171525 10197030 13277170 13146626 11697939 10091396 6721447 1929775
44507 1929775 68359 3687200 8933711 10038162 6193241 1253178 -1340326 -686629
44499 -686629 2524933 6278750 8123798 8356570 10616942 16621376 22223556 22234384 17886841
44490 17886841 15526424 18086196 21621467 21014558 16065285 10740885 8536790 9706296
44482 9706296 11711012 11749914 9727050 8579170 10675345 14713040 17726964 19042686
44474 19042686 19971788 20654102 20206282 19421220 19873192 20313665 17612927 11997104 7808349
44465 7808349 7849127 10211409 11940902 12323567 10930713 6363647 -349134 -4637481 -3982811
44456 -3982811 -1536919 -550778 1539103 8548070 17536535 21414545 18755290 14881010
44448 14881010 12712893 8820915 776876 -7131867 -9226406 -5599393 -299955 4401671
44440 4401671 7997601 8800936 5870836 2557746 3366028 7358741 8817384 4989916
44432 4989916 -489396 -2861174 -1618639 728688 2373466 2986420 3154720 4826528
44424 4826528 10228990 18465746 25096070 27141014 26724930 27444382 28933910 28172085 25052930
44415 25052930 22848576 22870422 22185719 18053303 12059028 7990548 7215892 7954214 8233544
44406 8233544 8052218 8802806 11210482 13669678 12986566 8057224 2636777 2342582 8166973
44397 8166973 14923403 17208846 14985036 11934019 10479559 10595937 11726702 13037138
44389 13037138 12687299 9671671 6113365 5295737 7494073 9910168 10532024 9775615 8454273
44380 8454273 6692956 5148776 4848328 5289109 5019553 4647672 6773182 11986838 17300685
44371 17300685 19792399 19732770 18852499 17641237 16056285 15227021 16550027 19817571 23189088
44362 23189088 24243157 21135252 14662074 9254395 9100738 12571688 13674424 10215831
44354 10215831 6804052 7724220 10889072 12125376 11692389 12159122 12868677 11715209 10311092
44345 10311092 11745316 14367477 13612684 9687173 7595886 9162842 11012449 11642772
44337 11642772 14238231 19855477 23546484 21106317 15238945 11048131 9344194 8808542
44329 8808542 11159392 18493340 27322742 30958970 27925620 23757232 23994866 28723136
44321 28723136 34368486 37772277 37734017 35017751 31779594 29523303 27513869 24663683
44313 24663683 22435749 23662082 28592851 34419737 39024338 43074149 47788724 52476438
44305 52476438 55231753 54922932 51870259 47519786 43919523 42688325 43923666 46259854
44297 46259854 47895642 47585399 45533554 43755989 44392453 46950911 48588128 47892979
44289 47892979 46386031 44939115 41414049 34672803 28698778 28784984 34617434 41008274
44281 41008274 44818976 46856969 47128547 43479005 36499088 30962247 29538625 28853280
44273 28853280 25112162 20536142 20216902 24572257 29098937 30778732 30837796 31121633 31273983
44264 31273983 30495249 29490178 29343295 30139085 31785105 34844031 39388088 43964149
44256 43964149 46920842 48382344 49832948 51684222 52211976 49622738 44755151 40595842
44248 40595842 38777383 37751052 35510016 33093577 33453145 37038054 40623210 41074924
44240 41074924 38434561 34422236 29753928 24464064 19555857 16411562 14890680 13366108
44232 13366108 10671139 7337977 5065389 5246481 7550178 9842545 10269273 9398624
44224 9398624 9212782 10175508 11081892 11881797 14195817 18169402 21354693 22199409 22206755
44215 22206755 22722110 22084644 18648179 14501965 12914900 13533629 13490383 12136048 11002849
44206 11002849 9820932 6712016 2509235 905822 3461565 7918953 12238773 16528114
44198 16528114 19734970 18633088 12680003 6522748 4605035 5908620 7159124 8673679
44190 8673679 12965547 19071330 22745765 22254427 20154442 18721687 17007766 13703184
44182 13703184 10129788 8522772 9035689 10067051 10426104 9915086 8768889 7744422
44174 7744422 8029213 9969918 12417501 14149687 15269597 16305189 16685651 15370240
44166 15370240 12565040 9452779 6330135 2472463 -1811882 -4389685 -3469879 281964
44158 281964 4678909 8374653 11313474 13431914 14215726 13410536 11073521 7172774 2500156
44149 2500156 -317796 1106937 5235659 7244867 4860691 1704327 2769408 7966845
44141 7966845 12628820 13547898 11782313 9791804 8721116 8965157 10749208 13165957
44133 13165957 14723266 15658976 17656790 20579001 21912943 20484140 18074350 15904714
44125 15904714 12428963 6907168 2395518 1926432 3669065 3463623 877966 -948205
44117 -948205 -631703 276842 1237826 3662483 7219831 9180203 8919803 9592978 13338129
44108 13338129 17756883 19372983 18048750 15572821 12182234 7393063 2719863 606960
44100 606960 1362597 3381609 5581710 7623209 8859270 9294379 10301263 11811658 10330744
44091 10330744 3391389 -4895515 -7198504 -2278990 3473370 5071399 4845395 6719827
44083 6719827 9135629 8411750 6344902 8592448 15806193 21720699 21427324 17250165
44075 17250165 14196752 13186939 12051678 10800556 11763267 14891888 16455367 13452720
44067 13452720 7292372 2102600 731418 3127812 7348901 11066410 12814538 12867044
44059 12867044 12942224 14754296 18876214 24586690 29888736 31761246 27868792 18984427
44051 18984427 9102233 2427717 491722 2139184 5157240 7407547 7764415 7228621
44043 7228621 8337563 12271556 17129637 20115286 20679059 20272409 19828640 19138562 18204336
44034 18204336 17435025 16690571 15721521 15232851 15756182 15925749 14186925 12091649 13136842
44025 13136842 17773413 22338745 24039004 24316412 25679292 27656045 27967874 25754448
44017 25754448 21568747 16000296 10433509 7292401 7094773 7037127 5122234 3707244
44009 3707244 5624614 8645456 8169915 4512361 2709184 4982564 8290392 10394970
44001 10394970 13401260 18876012 23643963 23767829 19902433 15640385 12832988 11402258
43993 11402258 11520272 12678413 12257459 8374704 3116772 34337 -400865 236001 2577055
43984 2577055 8639554 16904161 22267886 21971938 18439894 14994249 11692272 7330193
43976 7330193 3307220 2823355 6728346 11911264 14130024 12085306 8803580 8749586 12982243
43967 12982243 17730310 18910919 17345463 17476381 21055167 24645614 24328755 20727275
43959 20727275 17743447 17723879 19629154 21189439 21110528 19253881 16092354 12603642 10199873
43950 10199873 10173285 12798562 16730664 19602991 19839331 17900891 15383485 13134419
43942 13134419 10775417 7759263 4287745 1505548 1160682 4139154 8577038 10808519
43934 10808519 9694319 8558869 10517680 13194153 11532401 5583580 1469483 3365442
43926 3365442 8061897 9717758 7327071 4764152 5191024 8187032 11525783 13387959
43918 13387959 13095321 11397679 9910109 9228163 8128122 5464090 1944857 -857511
43910 -857511 -2112241 -1397274 1704231 6239362 9587388 10359637 10457139 12331337 15214355
43901 15214355 16245246 14717115 12920791 12779408 13606861 13708233 12997744 13428951 16942857
43892 16942857 22709623 26762761 25994418 22747144 22986482 28648926 34419011 34333290 29232818
43883 29232818 24713727 23662656 24512861 25685355 27566849 30041521 31794088 32830544
43875 32830544 34758327 37784981 39911697 39742515 37916468 35461956 33021332 31850260
43867 31850260 32989338 35018378 35097620 32669217 29820648 27960066 26904358 27192529
43859 27192529 29711595 32420253 31399730 26694893 23353831 24438169 26465258 24798713
43851 24798713 20798055 19933330 24154289 29428937 30547315 26098058 18861511 12955186
43843 12955186 10655480 11253444 13047232 15862704 20089226 23849199 24087412 21070664
43835 21070664 18887523 20367894 24167640 27774279 30172217 30395113 27430055 23680102
43827 23680102 24392922 30502713 35745325 34545426 29268861 25434849 23239870 19293229
43819 19293229 14195268 12054917 13393010 14473251 13650154 12910862 12792883 11267328
43811 11267328 8757802 9077382 13563996 18810031 22227111 25559384 30357870 33983255
43803 33983255 33571223 31188586 31356191 34768552 37491416 36015545 31134627 26856359
43795 26856359 26406284 29127035 31185884 29786055 25988094 22337556 19275243 16387387
43787 16387387 15718060 19760687 26236691 29174854 26287218 21592957 19499044 20025260
43779 20025260 21492629 23999817 27678612 30755457 32192613 33644408 36041445 36585316
43771 36585316 32100302 23809689 16399586 13603733 16129787 21875205 26723433 27682163
43763 27682163 26856405 29306936 35195209 37985669 33377621 25946973 22725300 23745534
43755 23745534 24071049 22293474 20918401 19934992 16523176 11196667 8420053 10203501
43747 10203501 13971287 17635415 21862321 25967211 26528220 22618342 18599335 18893062
43739 18893062 22562410 25292257 24545967 20988615 16936968 15063410 16784962 20587712
43731 20587712 23540376 25013093 26668116 28448032 27807815 24128994 20665034 20301399
43723 20301399 22269934 24939540 28773956 33993111 38145607 39233798 39231365 41204719
43715 41204719 44377992 45355545 43384646 41154731 40476359 39993544 37776759 34272831
43707 34272831 31885673 32429822 35245882 37668898 37823679 36763848 36512147 36286053 33221403
43698 33221403 27289245 22236923 20211992 19003054 17055466 17467005 23013351 30164372
43690 30164372 33105421 32035319 32084623 34610400 35250753 31474107 26841151 25688286
43682 25688286 27652419 29893397 31539592 33391524 35586529 37829635 40169737 41906102
43674 41906102 41609826 39695415 38953176 41016670 44288354 46762704 48617231 50325054
43666 50325054 50632327 48649741 45957716 44426776 43843642 43802038 45616806 49612780 52822262
43657 52822262 52939627 52808250 56857095 64035457 68638603 68013689 65090124 62655812
43649 62655812 59542065 54321507 49135089 47158057 48500242 50915265 52871079 53882807
43641 53882807 53274719 50775599 47685241 46032968 47142818 51604596 59131942 67337698
43633 67337698 72331591 72333581 69768542 68394624 69357294 71354313 73354997 75307983 77060574
43624 77060574 78482795 80186551 82557228 84608481 85306448 85477369 86920638 90210359
43616 90210359 94763180 100142204 105466502 108497129 107788240 105411229 105047499 107331372
43608 107331372 109549101 110258397 111567607 115830639 122301100 128444977 133002654 136560389
43600 136560389 140429993 146012552 153991772 163095100 170766378 176025883 180633693 186592831
43592 186592831 193595009 199839496 204476188 208534041 214243122 223663718 236707281 250317618
43584 250317618 261235154 269721465 278433052 287499580 293914711 296884090 300081560 306196145
43576 306196145 312694125 316478377 319828971 327225378 338180554 348204976 355948911 364128495
43568 364128495 373286498 380056080 383018197 385394128 389612326 393349896 393776749 392160137
43560 392160137 390890887 388655663 382196230 371212666 358355473 345586574 333307500
43553 333307500 321885880 311312482 300338951 288445855 277476105 268667124 259448482
43546 259448482 246515938 231183710 218009470 208412411 199475170 189351918 179910362
43539 179910362 172916725 167314599 162036938 158130453 155708313 151719499 143809726 134419543
43531 134419543 127915897 124954030 122712960 119705750 116923522 114394395 110201425 104017738
43523 104017738 98799845 97195861 98115988 98673707 98202966 98366110 99977033 101752241
43515 101752241 102227328 101160601 98641886 94507032 89673650 86676047 87117803 89110770
43507 89110770 89092071 86269146 83382099 82470684 81968785 79519027 75869770 73542824 72642532
43498 72642532 70898741 67725182 65138261 63940850 62104620 58578329 55875882 56331455
43490 56331455 57937570 57088031 54156160 52790039 53966826 54393083 51757229 48614319
43482 48614319 49301046 54720861 61674754 66235631 66758849 64600649 62740074 62885661
43474 62885661 63568600 62145114 58667028 55975058 55692021 56453567 56963247 58149733 60542039
43465 60542039 61973486 60523459 58059736 58001875 60587301 63093480 64005231 64148817 64080151
43456 64080151 63154909 61236356 58919781 56202930 53388107 52837412 56564250 61960944
43448 61960944 63568209 60035919 55828609 54674865 55043720 54344061 53960475 56579537
43440 56579537 60998365 63577498 63666266 64004396 66287248 69509134 72441365 74727908
43432 74727908 75413868 73257978 69192459 66269348 66437702 68995028 72474633 76160539
43424 76160539 79187744 79966772 77688114 73751796 71207950 72877370 79226603 87176170
43416 87176170 91998762 91934619 90236793 91201617 95212646 99489214 102311846 103842381
43408 103842381 103959173 102744160 102615780 106162450 111634065 114423043 113756861 114050618
43400 114050618 118412007 124771636 130290360 135633796 142174523 148441920 152652538 156023465
43392 156023465 160229411 164005479 165833879 167858979 173169261 180654365 186501773 189841655
43384 189841655 193177218 198048905 204103080 211811954 221944810 232381268 239621995 243999852
43376 243999852 249477440 257521104 265171940 270369396 274991793 280521322 284618191 285117294
43368 285117294 284399724 286041459 288895067 288278862 282503470 275048540 270105792 268498246
43360 268498246 268632717 269563439 271966924 276835288 284015606 292081991 299560214 306077622
43352 306077622 311991550 317365023 322358850 328304081 336556583 345777210 352234000 354135676
43344 354135676 354366796 357361603 363987445 370923504 374635146 374600882 372692999 370552480
43336 370552480 368082011 364218632 358766668 352851267 347114130 340240782 330516416 318360355
43328 318360355 305721261 293360136 280868993 269169119 259993640 252181013 241829961
43321 241829961 228017817 215337870 208017222 203978881 198032668 189028561 180048030 172837818
43313 172837818 166487252 161399598 159896884 161544251 161632578 156367423 147011272 137282770
43305 137282770 129277366 123796793 121867493 122896304 123046790 118750180 111272019 105010376
43297 105010376 101502723 97966436 92256045 86523186 84380379 86142688 88731862 89469617
43289 89469617 88201958 85953185 83392824 81353573 81437080 84569091 89226761 92365714
43281 92365714 92305492 89790912 86196248 82172397 78796535 78397663 82222673 87706087
43273 87706087 90037093 86918310 80593172 75016667 72441578 73053117 75956126 79071924
43265 79071924 79444401 75814980 70779264 68654039 70755818 74045500 75027774 73771239
43257 73771239 72917391 73545118 73849165 72163111 69483394 67676266 66407869 63944044
43249 63944044 60686330 59425484 61213780 63215287 62462701 60147479 59805711 62158039
43241 62158039 64567710 65674317 67661562 72589906 78465340 80834213 77577839 70861661
43233 70861661 64710818 61498081 60527394 59449098 57074452 54705677 54318876 56016954
43225 56016954 58475058 61430983 65696456 70405960 72633874 71152537 68766070 68957723
43217 68957723 71224138 71714337 68228408 63021789 60466019 62728689 67803703 71572576
43209 71572576 72172323 72076606 74653874 79009417 80699538 78149068 75197802 75252851 75951289
43200 75951289 73075494 67678098 65017152 67119699 70634024 72321888 72771112 73713432
43192 73713432 75125299 76441812 77882428 79160263 79134504 77667077 75491988 71898766
43184 71898766 65846959 60003512 59277518 63410716 65656253 62133766 58113812 60253641
43176 60253641 66175821 67922015 63832708 60225178 61307297 63993112 64381456 63554369
43168 63554369 63832766 63687123 60260398 54410246 49924573 49242062 52186559 57106580
43160 57106580 61069962 60949445 57012688 53917002 55424032 59358094 60601161 58045491
43152 58045491 55337561 55029066 55409757 54019332 51526701 50403118 51319004 52611360
43144 52611360 52769212 52118337 51935643 52635673 53325382 53083920 52095917 50990738 49656065
43135 49656065 47977787 47497495 50297799 55470653 58639366 56545481 50816012 45732034
43127 45732034 43604148 43968922 45755967 47792864 48167347 45850702 42701667 41498808
43119 41498808 42265609 42928119 43167631 44610109 47135886 48402838 47935885 48387034 51106273
43110 51106273 53431911 52594117 49852394 48231235 48244298 48826236 50894322 56372350 64011762
43101 64011762 69515053 70502609 68953132 67952595 68140189 68495690 68949208 70568206 73672297
43092 73672297 76777362 77331391 73372151 65209053 55958127 49760383 48674715 51322673
43084 51322673 54719732 56993520 57969939 57760165 55980498 52793154 49859711 49119244
43076 49119244 50596470 52447126 53514097 54652227 56679193 58351117 58109475 56956412
43068 56956412 57239900 58787942 58957636 57084705 56028388 57833863 60438774 60792170
43060 60792170 58984975 56610384 53026046 46909204 40617937 38908731 42690275 47413367
43052 47413367 48937705 48309984 49207344 52955983 57979715 62422096 65158790 65280548
43044 65280548 62779449 59568734 58210002 59442422 61884729 64119091 66216796 69125306
43036 69125306 73161935 77349892 80131789 80734014 79672504 77725519 74945154 71410767
43028 71410767 68327596 66988061 66962186 67118527 68397218 73106002 80582174 86176161
43020 86176161 86626300 84548402 84971753 88602041 91449171 90730049 88156604 87016037
43012 87016037 88748707 93263519 99910835 106442039 109232945 106999225 103146765 102078338
43004 102078338 103773006 104393469 102108346 99679023 100448910 104069404 107826724 110500069
42996 110500069 112669262 114151251 113942608 113062120 114808663 120585541 127178676 130276345
42988 130276345 129779577 129312334 130816194 132511078 133175412 135592529 142928615 152850047
42980 152850047 158563962 156489779 150563684 147470347 149253102 152624419 154586945 155987052
42972 155987052 158921410 163010098 166196192 168179574 170844676 175304806 180635596 186344321
42964 186344321 194124253 205218891 217059695 225050653 228034950 229802889 233984696 239186965
42956 239186965 241173131 238928044 235996581 235402261 235507783 232459410 225491412 217940289
42948 217940289 213258236 211609737 210699887 208704653 205647628 202499643 199601214 196022382
42940 196022382 190674576 184398642 180268849 180508741 183349886 184822426 184063916 184633681
42932 184633681 189285486 195714518 199861598 201625649 203882552 206601442 206066686 200917386
42924 200917386 195328497 193940570 196007482 196994442 194416911 189787404 185845328 184057692
42916 184057692 184246988 184771504 183393128 179434436 174688105 171106413 168457654 165450372
42908 165450372 161828371 157558949 151328214 142440294 133549310 128723388 128603530 129654534
42900 129654534 128463218 124957469 121287489 119226678 118583575 116591749 109552968 97344114
42892 97344114 85617086 80524257 81347954 81611239 77868147 73788166 74250000 78796143
42884 78796143 83078587 84168018 82072761 77957624 73232228 69230047 66036257 62575025
42876 62575025 58821331 56427114 56253598 57085913 57674352 58013127 57943455 57232816 57823521
42867 57823521 62245326 68058550 68200586 60052192 50250174 46459621 47966294 49218477
42859 49218477 49024976 49628735 49106082 42963659 33655558 30586143 37901875 48388009
42851 48388009 52784862 50086254 45020459 40031864 34586184 29469052 26873045 27273693
42843 27273693 29546517 33064661 36961490 38805389 37058311 33952709 33355401 36575602
42835 36575602 42246863 48782004 54487386 57059977 56270260 55862085 59167123 63695385
42827 63695385 64094440 60224981 57875332 60649361 65443902 67762970 67600815 67310287
42819 67310287 66824392 64559759 61153586 58778034 57790782 57268026 58043652 61735266 66913224
42810 66913224 69819519 69503576 68866466 69571041 69545930 67597231 66971055 70876538 76920259
42801 76920259 80123179 80145718 81178632 85136045 89549862 92673893 95856067 99150783
42793 99150783 99201894 94479303 88843475 86267784 85150534 82056515 78408681 78188594
42785 78188594 80326264 79047265 72091000 63606288 57920658 55036303 53722984 54397318
42777 54397318 56374755 56247655 52362269 48065498 47147168 48315772 47686468 45041178
42769 45041178 43842456 45770348 48775897 50626479 51414093 51986447 52205094 51584922 50223763
42760 50223763 48712646 48215105 50331989 55222097 59950018 60680103 57057866 52792829
42752 52792829 51190408 51623500 51517428 50561362 51201690 55152510 60958001 65618489 67621800
42743 67621800 67347446 65146326 60816123 55432291 51880602 51976882 54065765 55232696
42735 55232696 55106131 55323254 55824469 54662142 52028455 51530124 55798736 62803878 68245580
42726 68245580 70253371 70315419 70814495 72996029 76359120 78982002 79319014 78148206 77488367
42717 77488367 77634214 77460089 77603861 79877229 82661142 81224504 75042927 70570000
42709 70570000 72957091 78572179 80342013 77577162 75101244 74830280 74472006 73687141
42701 73687141 74988853 78010285 79078611 77932703 79001875 83714646 87060797 85146435
42693 85146435 81508272 81856210 86032654 89361732 89422386 87466577 85043206 83168477
42685 83168477 83645968 87502988 92524397 95272676 95341692 95303472 96774707 98599524 98805398
42676 98805398 97000723 95210023 96876350 103508188 111613669 115531406 114902982 116336052
42668 116336052 124969276 137248953 145642432 147967661 147601764 146502597 143649156 139810348
42660 139810348 137907322 137569066 134568394 127557804 120777757 117760417 116610384 114390465
42652 114390465 112157689 111896944 111798809 109128472 105566933 104830552 106076836 104643229
42644 104643229 99494168 95306515 95864691 99231208 101432265 101804924 102142705 102824562
42636 102824562 102885628 103026956 105729562 112032185 119832427 125801369 128145109 127573789
42628 127573789 126470629 127044523 129446169 131716101 132275425 132256359 134465569 140047148
42620 140047148 147017832 152240659 154236448 154135242 154641260 158018180 164154513 170380154
42612 170380154 173871261 174326188 173718459 173869253 175463538 178991962 184564708 190369789
42604 190369789 193495225 193465904 193192961 195097315 198117849 200217804 201823893 204250457
42596 204250457 206371718 206163013 204730466 205256546 208024417 210071176 210195657 210450433
42588 210450433 211382160 209698590 203176848 194867898 189542706 188360089 189996102 194605976
42580 194605976 202681631 211363641 216226183 216676782 215925868 215394990 212849968 206955544
42572 206955544 200173481 195443750 192730854 190753011 189886978 191257729 194538802 198534212
42564 198534212 202685392 206503153 208978719 210161987 211726071 214093883 214727222 211754947
42556 211754947 207852113 207471613 211121281 215692898 219825949 224790762 229669959 230502209
42548 230502209 226582500 223521785 226316023 232238219 234994100 234040281 234554645 238465025
42540 238465025 241041555 238111821 231977034 227066797 223124281 216584780 206834041 197247395
42532 197247395 190693907 187244588 185983528 185875976 184566756 179338564 170322830 160660813
42524 160660813 152708886 146142485 140565518 137483812 137834038 139209645 137788836 132610669
42516 132610669 126437956 122489075 121270407 120577391 118071430 113903465 110781218 110962607
42508 110962607 113417135 114953776 113963694 111553051 108890472 105439492 100737484 96181560
42500 96181560 93607027 93113133 93334654 92800021 90249342 85296116 80177503 79115752
42492 79115752 83720538 90030915 92475467 90357322 88196686 89727762 93825766 96975921
42484 96975921 97914433 98634154 101638132 107082957 112385380 114383972 112178245 107917754
42476 107917754 104677243 103912839 105262637 108043588 111906731 116179463 119525659 120752623
42468 120752623 119929632 118523146 117817000 116730097 112185641 103094866 93136773 87196039
42460 87196039 85305570 83183520 79188894 76887585 78868440 81845025 81256527 77900089
42452 77900089 76012338 76694089 77501438 77440627 77976619 79282704 79523766 78282261 77296277
42443 77296277 77254221 76674846 74209224 69616135 63077643 56515888 54363185 58763405
42435 58763405 64788086 65577631 62149966 62177928 68190615 73755039 73865664 72133061 73093528
42426 73093528 73647456 68696141 60876038 57143703 57962715 57435980 53599727 51189332
42418 51189332 52906666 54597094 52231350 48715345 49517101 54281263 57124845 54688962
42410 54688962 50443243 49887929 53389167 55886232 53846102 50430275 51601653 57979725
42402 57979725 63804272 64596729 62338005 61163531 61428712 61377862 62016495 66014733 72941624
42393 72941624 79422087 83269404 84037554 80683806 72998162 64839131 61263115 61973546
42385 61973546 61894116 58864642 56241375 56635497 57804252 57121608 56011360 56890218 59011334
42376 59011334 60645263 62711493 66698325 70928449 72545058 72145407 73108329 76718755
42368 76718755 80782072 83094278 84037150 85480436 88655969 93174437 97039698 97932830
42360 97932830 95498230 91947940 89647434 88882567 88703680 88614445 88126202 85888205 80986792
42351 80986792 74478523 68347775 63660876 60779482 60215016 61829559 64206592 66223941
42343 66223941 68177707 70041521 70244788 68197846 66470799 67704777 70260073 69936503
42335 69936503 65854939 61874827 61960475 66590541 73960792 82038980 88577996 91499088
42327 91499088 90759630 88562353 86864162 85756962 84485030 82375740 78456959 72278723
42319 72278723 66008186 63638840 66602132 71581372 74129038 73353267 71750673 71546359
42311 71546359 72737405 73998024 74012486 72291580 69892089 69059937 71138122 74981580
42303 74981580 78086419 78828480 76946741 72662032 66665583 60826012 57715707 58958573
42295 58958573 64177594 71240048 77244628 80005318 79505944 77753909 76650217 76259501
42287 76259501 75559689 74258205 73080426 72690864 73176547 74374715 76007658 77687704
42279 77687704 79337196 81287128 83483463 85135309 85717699 85605885 85053069 83649598
42271 83649598 81985817 82530195 86667134 91569005 92796802 90232532 88530294 90585940
42263 90585940 93408085 92611973 88697224 85797750 85494208 85376595 83557002 81000746
42255 81000746 78478797 74728155 69847340 67629020 71030137 76759756 78289345 74281251
42247 74281251 70324853 71190579 74808042 76166098 74238150 71528712 68492667 62804385
42239 62804385 54375202 47157253 44423806 45077786 46269075 47025479 47213036 45536024
42231 45536024 41766751 39255149 41418199 46176179 47542865 43207764 37259825 34450741
42223 34450741 34959807 36497784 38587412 41993173 45756880 47830483 48027616 47924971
42215 47924971 48042916 47113062 44192009 40067185 36704345 36353092 40270525 46503361
42207 46503361 49765111 46169090 38267603 32981739 33962727 38334955 41830622 44330438
42199 44330438 48024293 52056254 52488479 47785525 41539779 38194898 37576579 35792002
42191 35792002 31357566 28068192 30168493 36064931 39668813 38290468 36225070 38668041
42183 38668041 44562886 48581089 48700052 47903979 48507893 48856823 46900186 43638606 41097254
42174 41097254 39555140 38818969 39817002 42586967 44718012 44214595 42128479 40076350
42166 40076350 37390913 33791041 32652161 37279303 44879687 48832878 47224352 44983772
42158 44983772 46704480 51213521 54633723 55244268 53465228 50279004 47883861 48907197
42150 48907197 52242385 52246373 45316116 35424093 29776864 30325809 33093047 34897856 36451866
42141 36451866 38364148 38306297 34348353 28507582 24597507 24065906 25981945 29730363
42133 29730363 35044503 39776763 40566240 36929729 32869772 32670547 35871225 38091916
42125 38091916 36654361 33721066 33464964 37523269 43903815 49099165 50436010 47720950
42117 47720950 43898171 42933535 45532222 48066426 47438783 45535135 46267654 49512623
42109 49512623 51663731 51731709 52402743 54203655 53448648 48506048 43883234 44342916 48182949
42100 48182949 50759917 52296092 56996193 65375076 72751293 75811207 75979185 75101710
42092 75101710 72255642 67192425 63411829 64539897 69403735 73407394 73906144 72224914
42084 72224914 71022700 71425475 72703398 73763917 74689646 76481039 78701880 78419172
42076 78419172 73580721 66962618 63675439 64114989 62757959 55826632 47202130 43896828
42068 43896828 47553369 53247087 55324331 51735220 43965397 35884230 31934260 33213792
42060 33213792 35534445 34369641 31514564 33271251 41469527 50073714 52481858 49097482
42052 49097482 45253434 44048314 44228006 43809143 42720016 41934889 42124258 43282657 44264878
42043 44264878 42957546 38386712 32381947 27702467 24933951 22967963 22089437 24041031
42035 24041031 28441909 31606503 30608009 27147518 25740082 28772885 34563670 39478860
42027 39478860 40607109 37153322 31110825 26519523 26269805 29041092 30588973 28587178
42019 28587178 25078887 23476102 24323095 25350811 25166986 25207179 27397671 30908240 32556683
42010 32556683 30618434 27152515 25551626 26326915 26855364 25447611 23723346 23754978 24655232
42001 24655232 24240730 23001317 23589395 26611649 29986286 32926101 37164055 42652465
41993 42652465 45294191 41832412 34901772 30089926 29290802 30075997 30689781 32105995
41985 32105995 35043366 38159018 40072123 40897563 41120435 40879443 40666454 40779152 40130108
41976 40130108 37978790 36648102 39283588 44472620 46757217 43778938 39227973 36761032
41968 36761032 34884808 31027607 27240392 27405374 30722736 32508178 30681563 27408225
41960 27408225 24677821 22278119 20411726 20508465 22473902 24208999 24812938 25511840 26627984
41951 26627984 26609448 25274933 25119253 27608009 30456063 30390946 26779324 21037385 14561951
41942 14561951 9168449 7644891 11275342 17560694 22365707 24018018 24183510 25408789
41934 25408789 28724663 32788495 34737252 33107625 30247669 29797944 31314951 30551257
41926 30551257 26574315 24725297 29173523 35931821 38134005 36040775 35957434 39942874
41918 39942874 43044475 41978014 40390969 42421711 46020780 46879595 45381099 44863211
41910 44863211 45237449 43405463 39341136 37147830 39486376 44484668 49087058 52592539
41902 52592539 55748946 58674066 60983830 62408079 62432143 60823572 59112535 59826603
41894 59826603 63425182 67526006 69830669 70048643 68317320 64321852 59674076 58489604
41886 58489604 62454300 66895966 65557409 58943403 54013152 54845078 57631683 57127463
41878 57127463 54401562 54152648 56296144 55239373 48019510 38907282 33904940 33662371
41870 33662371 34423918 33881384 32976193 32880314 33389318 34537015 37229598 41402022 45245516
41861 45245516 47047799 46600206 44479666 41418509 38773268 37939362 38566388 38866916 38431647
41852 38431647 39037115 41560066 43770960 42830491 38897122 34721891 32395662 31666051
41844 31666051 30677357 27474881 21903661 16852687 15989236 19168665 22158221 22395741
41836 22395741 22381302 25015495 28617625 30327684 31711116 35725574 39724213 37711644
41828 37711644 29564028 21784185 18209130 16555879 16076788 21096067 32409536 41831044
41820 41831044 41967198 36820129 35403856 38134881 37727671 32064624 27404662 27860592
41812 27860592 29725883 29082435 28235979 30325338 32619489 30206755 23402249 17040114
41804 17040114 14149480 13983385 15010488 16480946 17632756 18102802 18933329 21191999
41796 21191999 23866762 24671497 22592160 18517810 14000029 10397888 8443863 7703582
41788 7703582 7242871 7317490 9020070 11733007 13031510 12362760 12663628 16402001 21772475
41779 21772475 25025125 25220209 24443639 24405870 25075818 25838560 25856053 24014825 20572578
41770 20572578 18073448 18456652 19980643 19365678 16461506 14305816 14763675 16572647
41762 16572647 17790896 17843511 16877004 15355141 14816168 16915731 20885512 23620760 23110780
41753 23110780 20457490 17923577 16378267 15458480 15159126 16274761 19430359 23780426
41745 23780426 26679493 25659235 21569391 18510315 19132737 21196877 20804151 17845246
41737 17845246 15455679 14794358 13811967 11468563 9701336 9953641 10637568 9820799 8358036
41728 8358036 8601370 11386479 15540945 19162076 20638962 19850667 18860803 19745811 21560515
41719 21560515 21856128 21473715 24349231 31037449 35984710 34105246 27497686 22440269
41711 22440269 21621537 22697270 23141106 22810055 22048129 20562684 18617722 17013996 15653997
41702 15653997 14026500 12950150 13784765 16021449 17714064 18293784 18991086 20488978
41694 20488978 22125731 23418966 24398293 24463691 23058827 21547686 22107993 24451880 26022770
41685 26022770 25952159 26262071 28199430 29970950 29674569 28234384 27463852 27034014 25651987
41676 25651987 24011630 24122663 26149252 27973982 27855074 25951083 23315545 20872378
41668 20872378 19434649 19402972 20258043 21387389 23370401 27188448 31974879 34844166
41660 34844166 33615834 29004910 23727869 20075109 18576897 18261790 17815374 16999659
41652 16999659 16989798 18591974 20410121 20318122 18855885 18835723 20364079 18869670 10988398
41643 10988398 771750 -3896419 -860591 4449221 7477825 10144025 15293124 19910542
41635 19910542 18803972 12800320 7813061 6275167 4883600 1661521 -19436 3090201
41627 3090201 8811803 12950101 14961632 16741583 18081422 17231159 14726269 12790468
41619 12790468 11244388 7652076 2189631 -764205 2355097 9334182 14001859 12721552
41611 12721552 8054689 5602314 7616206 10881418 11692760 11366147 14157561 20269205
41603 20269205 24704273 24042950 20440753 16873437 12601068 6924201 3658989 6664729
41595 6664729 13124718 16785810 16734248 17388253 20255592 21673125 19441298 15958736 13214200
41586 13214200 10128924 7121189 7984068 13851849 19659908 20347045 17061148 13655000
41578 13655000 10622796 6845633 4345606 6115738 10633707 13241399 12489284 11199664
41570 11199664 11574153 12957789 14584942 17226186 21388969 26093330 29770650 30861699
41562 30861699 28156326 22487511 17328964 15547813 16240517 16762878 16713329 17449458 18966105
41553 18966105 20346666 22316311 25833874 28690642 27332684 22276926 18203141 18231086
41545 18231086 21466804 26569771 33729562 41673651 46367762 45014610 38997829 31231276
41537 31231276 23077200 15560640 10890562 10207734 11521674 12112238 11725734 11713165 12503687
41528 12503687 13685010 15105314 16118021 15316950 13064213 12666044 16349876 21108646
41520 21108646 21651992 17486793 14160205 16492289 22767826 27244838 27102633 24815537
41512 24815537 23687479 23202309 20609259 16304986 14804916 19005186 25623363 28918231
41504 28918231 27833976 26380291 27175383 28105314 26416224 23062862 21074993 21632595
41496 21632595 23567418 25291488 25815641 25190951 24889917 26160457 27482952 26139195
41488 26139195 23079927 22758701 26248983 28448468 25614414 22248240 25507732 34794857
41480 34794857 42570177 45155581 47091233 53448883 62581848 69008999 70268355 68379378
41472 68379378 66718733 67691228 71835377 77040537 79454864 76765627 70350745 63708690
41464 63708690 59456053 57917224 57376355 55468071 51635010 48340178 48364048 50884508
41456 50884508 52021921 49359349 44003641 38324731 34313093 34312104 39764370 47673391 51591935
41447 51591935 48656280 43255205 41118935 41898249 40630661 34928022 27262760 20892202
41439 20892202 16902402 15268620 15736494 17021376 17637956 18307235 21346907 26738504
41431 26738504 30921595 31060361 29037144 29233861 32763138 35696028 33641340 27108552
41423 27108552 21181486 19829522 21629972 21945675 18477715 13155227 9020231 7487786
41415 7487786 8985558 13540879 19124060 21787648 20008208 17399094 18385738 22248827
41407 22248827 24535802 23903182 24054056 28108320 33943897 36593301 33386668 25553813
41399 25553813 16456558 9606090 7194348 9113583 13563842 18748811 23413814 26445494
41391 26445494 27663193 28513546 29676879 28440282 21851589 12888683 9222524 13713486
41383 13713486 20056869 21256392 19106697 20663312 27476092 33820027 35165752 32992221
41375 32992221 30258744 27124669 23376368 20946310 20901521 20794562 18117568 14265199
41367 14265199 12138979 11765872 11538131 12180366 15612464 20486076 22763859 21119313
41359 21119313 18354060 16702268 15055340 12243165 9974731 10253421 12035527 12850986
41351 12850986 12287668 11707660 11776140 12477775 14474029 18009742 21247939 22289589 22453570
41342 22453570 24819911 29475971 33049357 33539702 32755712 32739219 32542206 30682069 28713579
41333 28713579 29632066 33681757 38229210 41440739 43888676 46527086 49178704 51576327
41325 51576327 54238453 57388509 59982348 60632525 59038753 56116660 53180149 51221045
41317 51221045 50375673 49594581 47101112 41721978 34165391 27162479 23932758 25569811
41309 25569811 29630615 32105223 31261086 28820448 27064619 26184760 25482655 25600192 27500821
41300 27500821 30040089 30916508 30033275 29736846 31296708 33187691 33696754 33402928 33762832
41291 33762832 34510135 33913041 31010984 26559530 22262130 19886901 20514078 23546853
41283 23546853 26610726 27352000 25581305 23196732 21750667 20393793 16886748 11081163
41275 11081163 6616087 7449997 12460315 15726409 13733778 10270919 11511603 17598348
41267 17598348 22564437 22240461 18488130 15017425 12834561 11525052 11741901 13900981
41259 13900981 16571459 18335166 19412373 19733944 17761216 13429294 9903557 9695207
41251 9695207 11103594 11437449 11615057 13881542 16701519 16476816 13800326 13328567 16726900
41242 16726900 19881245 18739616 14673817 11931206 11940284 12305670 10521653 7253218 5946753
41233 5946753 9047196 14250126 15896159 11645867 6093533 5102697 8173604 10260263
41225 10260263 10049139 11289642 15465653 18644235 17785467 15400152 14792026 14731368 12779684
41216 12779684 10736293 12215882 16622684 19907811 20456290 20260436 20512477 19764640 17096101
41207 17096101 14215524 13312190 14530164 16325573 17296178 17374914 17758816 19295069 20678111
41198 20678111 19588169 16302589 14223739 15437702 17855660 18666880 18301331 18257398 17264219
41189 17264219 13370837 8404863 6092519 6261277 5248609 2332783 1401997 4983643
41181 4983643 10436404 13925264 14983314 14972463 13802759 10989602 8331326 8767977 12884256
41172 12884256 18079217 20937226 19708629 15252071 10375420 7735278 7956568 10103158
41164 10103158 13291855 16489704 17560155 14991627 10561799 7694922 6830979 5191093
41156 5191093 1785880 -480522 880699 4441584 7528041 9770126 11878269 13357585
41148 13357585 13902800 14875268 16734978 17038992 13960015 9996854 8866324 10123224
41140 10123224 10476888 9469460 9877084 12651266 15369454 16258564 16204794 15812796 13871873
41131 13871873 10394397 8341476 10104833 14017586 16330769 15618685 13788327 13461832
41123 13461832 15266701 17040220 15394228 9111541 1061818 -4712977 -7756148 -10960686
41115 -10960686 -15410705 -18256993 -16885286 -12505236 -7726155 -2912019 2635152 7656339
41107 7656339 9846122 8855731 6191117 3096689 603430 350882 2714317 5158879
41099 5158879 5398889 5349264 8513512 13849923 16202134 13330554 8502632 4912970 1810430
41090 1810430 -1457134 -1716992 3642256 11230352 15163914 14657011 13585886 13110557 9885202
41081 9885202 2859152 -2726634 -1134967 6663240 14447607 17849473 17407168 15618123
41073 15618123 13795024 12017768 10132693 8043117 6009688 5044352 6235870 9298540
41065 9298540 12172717 12361717 8899845 3515106 -202701 94142 2582579 2520240 -2352997
41056 -2352997 -8387366 -9606886 -4641948 1506106 3158973 154254 -2638567 -1201055
41048 -1201055 3644759 8202636 10409989 11185341 12030001 13307155 15371149 19141258
41040 19141258 23624496 24606288 19043813 10435598 6285391 9250344 13919488 13925061 9237538
41031 9237538 4189907 1203112 -244497 -517537 487138 1570757 1606345 1980874 4424774
41022 4424774 7248278 7437609 5948997 6742912 10443074 13245394 12808109 10958409 9481005
41013 9481005 7609106 5246054 4137111 3672530 170903 -6694024 -11278553 -9540212
41005 -9540212 -5018226 -2846527 -1888873 1639265 6220264 7445718 6221729 7370836
40997 7370836 10981713 12585261 12060866 14453341 20175009 22259448 16995440 10376742
40989 10376742 9094686 11022303 10540493 8399256 9169455 12121356 12439692 10385930
40981 10385930 11691940 18104116 24110468 24894634 22003996 18857272 15740165 12328085
40973 12328085 10706016 11938314 12949376 10980121 8661171 10273631 14688349 16694512
40965 16694512 14604468 11816448 10598810 9045545 5716496 3194930 4418444 8234777
40957 8234777 11173325 11569903 9646767 5657856 800647 -1715861 233120 4429591
40949 4429591 7157327 8407414 10764572 13654169 13085121 8086407 3289852 2963571
40941 2963571 5735980 7803899 8513170 9485792 10353991 9347509 7389816 7841080 11723128
40932 11723128 16073270 17813374 17009618 15483393 14198972 13245687 13070813 14355383
40924 14355383 16910463 19195884 18980577 15003613 8529427 2520630 -1536460 -4874013
40916 -4874013 -8250951 -9106577 -4489450 3955018 11026989 14135591 15419587 17166800
40908 17166800 18409668 17607473 15728281 14286415 12558372 9497507 6823561 7146009
40900 7146009 9757455 11323207 10782632 10749542 13267389 16536844 17299214 14922922 11515266
40891 11515266 8911264 7317185 6685714 7508383 9341110 9814424 6768810 1235365
40883 1235365 -3218273 -4481372 -3682829 -2090268 1858698 9937678 19255205 23243882
40875 23243882 18860173 10761078 6441713 8222116 11807579 12281369 9576309 7429197
40867 7429197 8187735 9997280 9319381 5464214 1707702 1753388 5852666 10936234 13882010
40858 13882010 13898569 12376111 11482707 12494225 14470042 15015299 13301903 11440491 11438840
40849 11438840 11960307 10403867 7408360 6317229 8226589 10696696 11810202 12158256
40841 12158256 11828734 9115830 4260315 1131822 2365886 5477708 6810780 6829513
40833 6829513 7849094 8665506 6112148 1190087 -1142722 1041840 3951101 3822195
40825 3822195 2046922 2557761 6510145 11724915 15829569 17869254 17710918 15824263
40817 15824263 13623112 12756632 13726235 15689010 17761599 20169857 23629672 27346413
40809 27346413 28362105 24333326 17022970 11079501 8427933 6054463 1245064 -3173037
40801 -3173037 -2129605 4170001 9841781 10766076 8943866 8277888 9166505 9361576 7971571
40792 7971571 6176428 5052004 4632565 4563142 4381783 3827985 3860163 6275014 10954237
40783 10954237 14525467 13608335 9027419 5168863 5277033 8862747 13585922 17691903
40775 17691903 19914974 18973841 15113236 11379206 11172852 14118587 16094934 14342092
40767 14342092 11058379 10338255 12676756 14849047 14908948 14507380 15413756 16295897 14758850
40758 14758850 10864144 6680371 3580216 1910271 2258667 4804482 7855345 9025006
40750 9025006 7814471 5690595 4074221 3555690 4296793 5649344 6241697 6072361 7322998
40741 7322998 11031872 14316665 13636890 9729249 6158911 3908593 1248972 -1400319
40733 -1400319 -1039314 2566094 5337099 4472187 2070175 1187714 1463630 902912 -797175
40724 -797175 -3037428 -5882604 -8485163 -8416704 -5157883 -2030592 -1938215 -3173212 -2221306
40715 -2221306 1179313 4712958 7356233 9232536 9096634 5696227 968424 -1531698
40707 -1531698 -1038801 591719 2753345 6237834 9864837 11047910 10358939 11513961
40699 11513961 15224511 16721299 12103124 4636897 1533920 5542736 12602910 17631914
40691 17631914 19975162 22102360 24707448 25298526 21964845 16968765 14950137 17759390
40683 17759390 22701120 26239988 27567085 27456545 25690326 21917787 17833152 15742852
40675 15742852 15283471 14168969 12309332 12454004 15847288 19685321 20545334 18696913
40667 18696913 17118427 17174836 17316059 16086922 14674435 15369428 18063981 19560883 17027484
40658 17027484 11547202 7142439 6272918 7529048 8163012 7447985 6496554 6032415 5921082
40649 5921082 6178055 6839091 7232562 6873812 6786418 8407022 11230654 12933632 11964632
40640 11964632 8989819 5911399 4516005 5761549 8995094 11843754 12096270 9883694
40632 9883694 7252601 5838467 5756685 6216338 6198138 5219297 4588109 6919095 12776896
40623 12776896 18737072 20777706 18852805 15988942 13793812 11663580 9756527 9136014
40615 9136014 8680873 5663135 707137 -1335111 2384056 8399389 11358233 10528134
40607 10528134 9163152 9169045 9574665 9441347 9132474 8623236 7197045 5392513 5074209
40598 5074209 6629756 7845630 6915689 5400149 6462467 10419673 13802584 13628291
40590 13628291 11330656 10786132 12789049 13594696 9814450 2999017 -2283593 -3780413
40582 -3780413 -3031848 -2214669 -1686019 -673290 1469229 4984195 9242110 12464359 13309067
40573 13309067 12642172 12294898 12461358 12185490 11953652 13272596 15622614 16587107 15627177
40564 15627177 15113132 16735629 19439040 21914362 24384660 26430720 25810086 21649581
40556 21649581 16683836 14000980 13287985 12633168 12481525 14991671 20043663 24279983
40548 24279983 24344916 19993489 14307579 11391226 12798626 15609738 15464326 12034176
40540 12034176 9317117 9596599 10091262 7708785 4191654 3219394 4487068 4597890 2819215
40531 2819215 1949180 3433706 5149120 4791796 2809510 1181868 1365054 3943206 8303858
40522 8303858 12079249 12705509 10233832 7301545 5976922 5843879 5347746 3826426 2061399
40513 2061399 1669924 3642093 6697531 8059671 7124339 7077512 10904588 16886477 20483137
40504 20483137 19951647 17497938 15443960 14290254 14527118 17033754 20673392 22117644
40496 22117644 19448058 14290648 9612272 7000954 6565605 7661202 9069979 10078395
40488 10078395 11767926 15578499 20477661 23635052 24182600 23976811 24086500 23084938
40480 23084938 20002359 16727584 15830956 17375056 19089417 18694994 15583619 11593463
40472 11593463 10366010 14098633 20546738 25149089 26317932 26309386 26753688 26494829 24687512
40463 24687512 22602138 20835197 18187557 15396783 16306111 22063827 27251939 25971066
40455 25971066 19856778 15743034 16481489 18566689 18756839 18535340 20504675 23520800
40447 23520800 23551803 18126136 8943220 898726 -1530814 1670073 5657196 5773664
40439 5773664 2691903 837710 2264487 4712882 5988061 7292339 10614654 14857667
40431 14857667 16728126 14765466 10846899 7769696 6330372 4963000 1905619 -2428533
40423 -2428533 -5542493 -5696440 -4208479 -4027942 -6198431 -8748418 -9064338 -6290082 -1297235
40414 -1297235 4493790 9805045 14002398 17501158 21104545 24739571 27536088 29099243
40406 29099243 29563776 28317117 24339494 18593770 14387666 13733814 14387837 12408814
40398 12408814 7203110 2056060 -294373 -436765 -69184 750495 2652245 5007588
40390 5007588 6966580 9229745 12460473 14834744 14079396 11655629 11452838 13694821
40382 13694821 13987560 10302489 7083811 9054744 13998533 16152127 14823475 14487218
40374 14487218 16971978 18939639 17805531 15104377 12428048 8814999 4579190 3309162
40366 3309162 6705084 10928862 11743588 10472957 11114669 13978149 16271135 17152433 17906422
40357 17906422 18232323 16595589 13778075 12144105 11494422 9336164 5462981 2847982
40349 2847982 3513088 6421630 9706062 12127401 12298477 9694543 6861076 7488617 11619231
40340 11619231 15530058 16718230 15993929 14416689 11815745 9174617 8689112 9981009
40332 9981009 9755632 6929807 4664440 5249533 6302080 4591775 819314 -1964384
40324 -1964384 -2147679 535227 5970245 11831401 13794258 10892068 7937268 8970980
40316 8970980 10990781 8518149 2032985 -3281430 -5573126 -7291446 -8649709 -6377592
40308 -6377592 -236427 4745754 4901894 2514199 1454035 2138491 3427719 5887099
40300 5887099 9859526 13009603 13139761 11598783 11144465 12281457 14218278 17151054
40292 17151054 20579606 21722979 19378963 17352534 19616811 23576409 23359360 19161104
40284 19161104 17287533 20030853 21818185 18232401 13157363 12435626 14837907 15061212
40276 15061212 12948852 13297038 17167584 19535122 16736713 11361147 7855052 7159252
40268 7159252 7764684 8684046 8907776 6671069 2012760 -1831086 -2045895 186907 1743168
40259 1743168 1700052 1543764 2833104 6561105 12991430 19783687 22095583 17510381 9738448
40250 9738448 4679676 3909039 4827076 5804430 7378217 8927832 8270977 5211135 2303066
40241 2303066 1439123 2312008 4306269 6792377 7467948 4122316 -1209542 -3507791 -1242997
40232 -1242997 1977362 3302597 4088901 5720643 6329974 4543254 2777544 3498390 5368744
40223 5368744 6472445 8165628 11815187 14713528 13934373 11981328 13474389 17659569
40215 17659569 19515980 17703415 16141667 17500249 20132965 22302376 24729685 27497057
40207 27497057 28600148 27408275 26052458 25725543 25062285 23945495 25245019 30159377
40199 30159377 34819376 34529341 29412521 23376409 19344449 17859704 18490589 19872204
40191 19872204 19700934 17349470 15569718 17202446 20980072 22987055 21836905 20123122
40183 20123122 20753983 23734482 26794296 27781512 26160956 23101683 20352104 18785865
40175 18785865 18338234 19117814 21164270 22938247 22290295 20104416 20590917 25658884 30826219
40166 30826219 29853984 22799237 16375604 15938810 19551098 20881610 16400560 8837814
40158 8837814 4342055 6551318 12977614 17570294 17354936 15440141 16363624 20083278
40150 20083278 22863178 22917654 22017133 21732060 21491607 21087904 21866604 23939203 25061400
40141 25061400 24284282 24148246 26565760 28620398 26032692 19918244 16207348 17743274
40133 17743274 20418275 19018933 14352040 11727896 13509744 16383444 16586469 15140441
40125 15140441 15835947 19345870 22063280 21223434 18935899 19384918 23013207 25551479
40117 25551479 23083243 16562342 10522686 8270195 9336322 11149482 11997679 12118034
40109 12118034 12769221 14923092 18450726 21702149 21911092 17299411 9818735 4986385
40101 4986385 7113685 14221736 19154544 16762705 9124747 2815217 2057004 5794594
40093 5794594 10420700 13260466 13497748 11899197 10627330 11987433 16101363 20231654
40085 20231654 21195973 18440539 14598527 13204700 15649129 19837354 21992812 20321781
40077 20321781 16592497 13539338 11606414 9677388 8223324 9256693 12806728 15873582
40069 15873582 16133289 14801247 14276570 14545335 13903796 12234396 11406250 12678735 15421579
40060 15421579 18304225 20230595 20126351 17368388 12868942 8725273 6462249 6239580
40052 6239580 7606950 10072636 12969984 15685265 17979644 19347649 18589391 15332230
40044 15332230 11565501 9869992 10073422 9627323 7769607 7112403 9779309 13793128
40036 13793128 15279132 13253422 10213554 8424016 7617539 6571394 5256465 4642750
40028 4642750 5275374 6679545 7769734 7671360 6564018 5645742 5719097 6054625 5437731
40019 5437731 3998758 2777149 1633466 -639551 -3600005 -4475332 -1687426 2317930
40011 2317930 3832252 2894195 3320135 7511739 13257362 16598271 16366593 14688379 14001111
40002 14001111 14835325 15983264 15777490 13538462 10508863 8780276 8525524 7255727
39994 7255727 3178740 -1579518 -3128595 -940993 1440584 1272013 -22451 609097
39986 609097 3925909 8524891 13091597 16382212 16274809 11658154 5139435 1322282
39978 1322282 1771628 3664999 4142116 3912444 5088941 7048683 6658181 2345655 -3772499
39969 -3772499 -8164513 -9183079 -7710389 -5476927 -3614930 -2599174 -2673327 -3771759
39961 -3771759 -5288223 -6545451 -7564590 -8737744 -9488185 -8133943 -3971424 1056888
39953 1056888 4013564 4285051 4145542 5766452 8664083 10582924 10145532 8125024 6634982
39944 6634982 7411317 10385929 13673951 15325374 14992936 13371474 10664680 7069681
39936 7069681 4377794 4760874 7354788 8437812 6444545 4648953 6770683 11733063
39928 11733063 15514157 16898744 18023419 19655771 19773376 17744768 16348626 17446531
39920 17446531 18277661 15002430 8534967 3770100 3280625 4598456 4380650 2847210
39912 2847210 2506996 4026481 5560186 5914041 6288605 8081142 10510875 11943876 12662798
39903 12662798 14234531 16154880 15479001 10902884 5326169 2622245 3182060 4579602
39895 4579602 5489013 6472943 7524691 7686105 7259629 7620539 8135255 5964506 261579
39886 261579 -5694107 -8167576 -6978308 -4376138 -1842189 113679 727211 -44512 -364872
39877 -364872 1415594 4200363 5568781 4979272 3591832 1801891 -601318 -2291130
39869 -2291130 -1107167 2775437 6496593 7742508 6631115 4268276 1302294 -1748307
39861 -1748307 -4332591 -6249004 -6911535 -4873117 -168217 3672060 3196816 647824
39853 647824 2164141 9241555 15852798 16323662 12577362 10325015 10888208 10929783 8690697
39844 8690697 6068774 4747467 4152083 3705500 3764856 3584074 1495581 -1732257 -2640569
39835 -2640569 202429 3779498 4902006 4663401 6087537 8982548 10169808 8193285
39827 8193285 4834952 1835282 -1038219 -3766465 -4559924 -2437626 449608 1376905
39819 1376905 915566 1660282 3398973 2640329 -1928094 -6270222 -5728463 -1285604 1887474
39810 1887474 1586951 1057544 3682239 8099592 10263623 8335532 3690701 -1370132
39802 -1370132 -4965589 -6017734 -5470572 -6122142 -8920371 -10294966 -6031435 2445619
39794 2445619 8812615 9487910 7493851 7294316 8603190 7790639 3652132 -1131043 -3824577
39785 -3824577 -4555619 -5149659 -6722930 -8975272 -10981044 -12256553 -13191753 -14111868 -13944331
39776 -13944331 -11145134 -6680326 -4339950 -6167147 -8769910 -6812956 62843 6463259
39768 6463259 7809467 5148159 2418753 1401372 1249265 1218318 1405582 1478562 835318
39759 835318 -7411 257908 2000107 4425625 6843367 8889789 9814048 9110506 7845932
39750 7845932 7741868 8697544 8828542 7431089 6277015 7119631 9328313 11080664 11760109
39741 11760109 11966002 11984574 11429704 9852810 6849706 2272583 -2839508 -6450455 -7628076
39732 -7628076 -7482351 -6989127 -5283874 -1792851 1372877 1719748 326925 596993 3147468
39723 3147468 5065943 4908641 5215100 8288315 12052752 12569896 9173379 4821298 2297064
39714 2297064 2063356 3084218 3715094 2196987 -1786671 -6077270 -8129231 -8162150 -8900925
39705 -8900925 -12071331 -16147855 -17583579 -13727055 -5243720 3469654 7403412 6026732
39697 6026732 4308335 6770556 11534868 12925219 9413247 5500040 5037948 6213452
39689 6213452 5186271 1919566 -565935 -1112465 -1291623 -1750890 -906819 1817560 3955363
39680 3955363 3089669 738334 979330 5182709 9947421 11197767 9031073 6934198
39672 6934198 6901054 7540422 7301095 7071356 7991441 8634220 6763338 2799137 -1032021
39663 -1032021 -4322775 -8316791 -12165630 -12628965 -8589108 -3113821 583936 2998667
39655 2998667 6274839 10156897 12270095 11461391 8897758 6323037 4621390 3625680
39647 3625680 2336216 473 -2303596 -2315502 300387 2941958 3350333 2395643 2215242
39638 2215242 3249550 4856064 7088122 9569994 10161473 7515945 3940088 2886584
39630 2886584 4284414 5042906 3450787 196428 -4176228 -9370305 -13255545 -13407360
39622 -13407360 -10892273 -8915753 -7648088 -4690823 -1128221 -1706577 -6863126 -9924385
39614 -9924385 -6036000 466115 2236057 -991729 -3785431 -3918215 -3816637 -4246362 -2896138
39605 -2896138 133426 1079305 -1578882 -4671110 -5777068 -6752949 -9268999 -10868630
39597 -10868630 -9000787 -5945882 -5691863 -7699447 -7715096 -4026228 539235 2676091
39589 2676091 1743271 -1231354 -5072091 -8549036 -10994199 -13169032 -15826583 -17495254
39581 -17495254 -15792677 -11101223 -6642535 -4296022 -2562016 359038 3611374 5306944
39573 5306944 5426658 5334722 5467171 5148386 4032841 2395570 619953 -511579 24316
39564 24316 1672574 1714144 -1584898 -6004953 -7854468 -7034240 -6810300 -8135291 -7485320
39555 -7485320 -2392822 3462245 4145483 -343572 -3383113 -80727 6702977 10723476
39547 10723476 10524264 10027147 11693738 12956721 10877721 7211653 5821291 6699170
39539 6699170 6194700 3022941 419111 1163699 3533055 4181101 2715102 1117867 496207
39530 496207 901257 2730543 5386612 5821717 1805912 -3987533 -6677715 -5782715 -5407146
39521 -5407146 -7477479 -8844936 -6492394 -1861031 2078239 4742442 6448415 6055764
39513 6055764 3186060 457213 285243 1274194 903502 18202 1093796 3395948 3802379
39504 3802379 1862336 190465 -191204 -1254894 -4148113 -7155186 -8343617 -7723760
39496 -7723760 -6212960 -4827455 -5094721 -7494800 -9187222 -6473706 -394717 3302694
39488 3302694 1241068 -3280375 -4679813 -1375875 4014463 8533245 11013862 12011539
39480 12011539 13223923 15647478 17387955 15178540 8988485 2785438 -509041 -2193150
39472 -2193150 -4237222 -5420524 -3709930 -451055 805658 -1283156 -4730440 -6528936
39464 -6528936 -4597717 919731 6559617 7603912 3251774 -2070721 -4379458 -4658809
39456 -4658809 -5408731 -5739040 -3682232 -1036110 -1273698 -3749765 -4464183 -2199165 216296
39447 216296 685816 49241 -582316 -1099043 -884109 569610 1641827 672360 -362674
39438 -362674 1660997 5226246 5718932 2940376 1678473 3858330 5995878 6403816 8656495
39429 8656495 14288613 17837644 14358481 7580614 4844852 6912238 8624176 7633985
39421 7633985 6425188 6406067 5731657 3448176 1085144 -606885 -2415332 -3468474 -1316528
39412 -1316528 3649644 7595818 8587248 9121502 11383758 13062109 10551120 4252251
39404 4252251 -1991205 -5439540 -5987934 -4131495 -218716 4034050 5623862 3169386
39396 3169386 -1207682 -3934887 -3442245 -729874 2902616 7031033 10681591 11679157
39388 11679157 9110876 5291915 3166034 2452273 856217 -1349258 -1233616 1862082
39380 1862082 4875449 5892495 6976160 9997187 13020925 13770880 13631731 14617293 15043897
39371 15043897 12495866 8956215 8034579 8342853 4988651 -2407084 -8264167 -8348524 -4084847
39362 -4084847 1218139 5956584 8809424 8190774 5128415 3064760 3081264 2921302 2208300
39353 2208300 4187457 9792842 14358465 13778004 10396540 8976667 9923830 10686857 11169381
39344 11169381 12936544 14772505 13940909 11092377 9324636 8599533 5626133 -107537
39336 -107537 -4304096 -3277005 1676000 6761222 10061839 11898583 12697645 12161284 9898982
39327 9898982 6259191 2927461 2140632 4113020 5994958 5170610 2950310 2792881 5283241
39318 5283241 7467077 7260533 5849079 5109529 5184380 5664211 6952780 9026129 10470953
39309 10470953 10172819 8839345 7795861 7353190 7336771 8178988 10346502 13238173 15416356
39300 15416356 15578075 13127071 8609111 3899330 1091317 695554 1406536 1710709 1108554
39291 1108554 -81731 -1196417 -1492290 -775144 231266 705215 530575 -230241 -1671006
39282 -1671006 -2931400 -2164012 815077 3324220 3391719 3011984 5047439 8323777 9428373
39273 9428373 8403871 8360067 9826278 10417536 10459143 13283417 18238804 19274268 13803941
39264 13803941 7723600 7073522 9081175 6970781 472521 -4471578 -4551542 -1640558
39256 -1640558 2485997 7938062 13118889 15038298 14253144 14546245 16427629 15841766 11273648
39247 11273648 7446117 8924198 13692861 16550035 16259977 15719363 16564111 17151680 15724644
39238 15724644 13005583 10988578 10245427 9058425 5612827 1339368 677208 5524593
39230 5524593 11160656 11170306 6145828 3056544 4966459 6457421 2216075 -4504673 -6849868
39221 -6849868 -4743274 -4568996 -9427670 -14977137 -15455158 -9722850 -702062 7381549
39213 7381549 10256947 5865724 -2725696 -9144566 -9926591 -6966734 -3260756 660845
39205 660845 4595244 6294384 4138137 311601 -1380289 229920 3533562 6687564
39197 6687564 8044284 5838464 683263 -2617689 554936 8309338 13602178 12500735
39189 12500735 7850616 3794990 510611 -3044923 -4517557 -713090 6349381 10347094
39181 10347094 8283664 3771517 1421621 1073406 -138002 -2416249 -3349165 -2479276
39173 -2479276 -2483360 -5153179 -8656330 -9982009 -8418977 -5385798 -2229367 357615 1838810
39164 1838810 2433234 3486912 5505394 6412187 3988060 9271 -698662 3591100 8678753
39155 8678753 9725113 7555648 6946780 9569959 11969114 10913460 7500999 4431348
39147 4431348 2093575 15647 73870 4451708 10821317 13408961 10053687 5299649
39139 5299649 4708425 8396419 12317146 13870536 13295732 10883538 6684388 3210612
39131 3210612 4540002 10714589 15706601 13776284 6543550 965897 865917 3459901
39123 3459901 4697818 4855466 6643904 9775545 10720387 7969562 4755031 5029679 8256695
39114 8256695 9961187 6939364 581337 -4609800 -4595171 1507884 10449546 16523329
$$ [...]
##END NTUPLES=NMR SPECTRUM
##END=
