##TITLE=31Pdec_DE-135m_TFA
 CCl4,64 sc
 8.4.2026
##JCAMPDX= 6.0         $$ Bruker NMR JCAMP-DX V2.0
##DATA TYPE= NMR SPECTRUM
##DATA CLASS= NTUPLES
##ORIGIN= UXNMR, Bruker Analytische Messtechnik GmbH
##OWNER= root
$$ XWIN-NMR		Version 3.5
$$ Wed Apr  8 15:26:34 2026 Russian Standard Time (UT+4h)  she@DPX200
##.OBSERVE FREQUENCY= 81.013821
##.OBSERVE NUCLEUS= ^31P
##.ACQUISITION MODE= SIMULTANEOUS
##.ACQUISITION SCHEME= undefined
##.AVERAGES= 64
##.DIGITISER RES= 17
##SPECTROMETER/DATA SYSTEM= spect
##.PULSE SEQUENCE= zgpg30
##.SOLVENT NAME= DMSO
##.SHIFT REFERENCE= (INTERNAL, DMSO, 0, 197.392)
##AUDIT TRAIL= $$ (NUMBER, WHEN, WHO, WHERE, WHAT)
$$ ##TITLE= Audit trail, XWIN-NMR		Version 3.5
$$ ##JCAMPDX= 5.01
$$ ##ORIGIN= Bruker BioSpin GmbH
$$ ##OWNER= she
$$ F:/spectra/data/she/nmr/P31/2/pdata/1/auditp.txt
$$ ##AUDIT TRAIL=  $$ (NUMBER, WHEN, WHO, WHERE, WHAT)
(   1,<2026-04-08 15:25:18.28 +0400>,<she>,<DPX200>,
      <continue with go, POWCHK disabled, PULCHK disabled
       configuration hash MD5:
       00 E9 B6 7A A2 85 ED C7 34 08 36 98 17 FE 4E 26
       data hash MD5: 32K
       1B 65 4E 2C 82 95 4A CD 8B 65 C4 6E 61 FF BF C6>)
(   2,<2026-04-08 15:25:29.43 +0400>,<she>,<DPX200>,
      <Start of raw data processing
       efp BC_mod = 2 LB = 1.5 FT_mod = 6 PKNL = 1 PHC0 = 1126.599 PHC1 = 849.7007 SI = 64K 
       data hash MD5: 64K
       FE 47 71 CD BE 80 0F BD 1F 3B 53 83 E6 CD 91 80>)
(   3,<2026-04-08 15:25:52.34 +0400>,<she>,<DPX200>,
      <pk PHC0 = -8.177921 PHC1 = 0 
       data hash MD5: 64K
       6F 7D D2 32 81 7B 5D AB 69 CE 79 E8 49 5B A0 A0>)
(   4,<2026-04-08 15:26:00.31 +0400>,<she>,<DPX200>,
      <abs ABSG = 5 
       data hash MD5: 64K
       8A 2C 7B 0C 79 66 A5 44 AA B3 AD 0C 91 70 C1 BB>)
$$ ##END=
$$ 
$$ hash MD5
$$ 09 59 75 30 B9 7A 14 B4 86 A3 25 75 7A 6F 6F B2
##$RELAX= 
##$RELAX= 
##$RELAX= 
##$RELAX= 
##$RELAX= 
##$RELAX= 
##$RELAX= 
##$RELAX= 
$$ Bruker specific parameters
$$ --------------------------
##$DU= <F:/spectra>
##$EXPNO= 2
##$NAME= <P31>
##$PROCNO= 1
##$TYPE= <nmr>
##$USER= <she>
##$AMP= (0..31)
100 100 100 100 100 100 100 100 100 100 100 100 100 100 100 100 100 100 
100 100 100 100 100 100 100 100 100 100 100 100 100 100 
##$AQSEQ= 0
##$AQ_mod= 1
##$AUNM= <au_zg>
##$AUTOPOS= <>
##$BF1= 81.014009
##$BF2= 200.13
##$BF3= 200.13
##$BF4= 200.13
##$BF5= 200.13
##$BF6= 200.13
##$BF7= 200.13
##$BF8= 200.13
##$BYTORDA= 1
##$CFDGTYP= 0
##$CFRGTYP= 5
##$CHEMSTR= <none>
##$CNST= (0..31)
1 1 145 1 1 1 1 1 1 1 1 1 1 1 1 1 1 1 1 1 1 1 1 1 1 1 1 1 1 1 1 1 
##$CPDPRG= <waltz16>
##$CPDPRG1= <>
##$CPDPRG2= <waltz16>
##$CPDPRG3= <>
##$CPDPRG4= <mlev>
##$CPDPRG5= <mlev>
##$CPDPRG6= <mlev>
##$CPDPRG7= <mlev>
##$CPDPRG8= <mlev>
##$CPDPRGB= <>
##$CPDPRGT= <>
##$D= (0..31)
0 1 0 0 0 0 0 0 0 0.06 0 0.03 2e-05 3e-06 0 0 0.0002 0 0 0 0 0 0 0 0 0 
0 0 0 0 0 0 
##$DATE= 1775647438
##$DBL= (0..7)
120 120 120 11 120 120 24 19 
##$DBP= (0..7)
150 150 150 150 150 150 150 150 
##$DBP07= 0
##$DBPNAM0= <>
##$DBPNAM1= <>
$$ [...]
##$SUBNAM3= <"">
##$SUBNAM4= <"">
##$SUBNAM5= <"">
##$SUBNAM6= <"">
##$SUBNAM7= <"">
##$SUBNAM8= <"">
##$SUBNAM9= <"">
##$SW= 400.765351723535
##$SWIBOX= (0..15)
0 1 3 0 0 0 0 0 0 0 0 0 0 0 0 0 
##$SW_h= 32467.5324675325
##$TD= 32768
##$TD0= 1
##$TE= 0
##$TE2= 300
##$TE3= 300
##$TEG= 300
##$TL= (0..7)
0 120 53 12 22 120 120 120 
##$TP= (0..7)
150 150 150 150 150 150 150 150 
##$TP07= 0
##$TPNAME0= <>
##$TPNAME1= <>
##$TPNAME2= <>
##$TPNAME3= <>
##$TPNAME4= <>
##$TPNAME5= <>
##$TPNAME6= <>
##$TPNAME7= <>
##$TPOAL= (0..7)
0.5 0.5 0.5 0.5 0.5 0.5 0.5 0.5 
##$TPOFFS= (0..7)
0 0 0 0 0 0 0 0 
##$TUNHIN= 0
##$TUNHOUT= 0
##$TUNXOUT= 0
##$USERA1= <user>
##$USERA2= <user>
##$USERA3= <user>
##$USERA4= <user>
##$USERA5= <user>
##$V9= 5
##$VALIST= <valist>
##$VCLIST= <CCCCCCCCCCCCCCC>
##$VD= 0
##$VDLIST= <DDDDDDDDDDDDDDD>
##$VPLIST= <PPPPPPPPPPPPPPP>
##$VTLIST= <TTTTTTTTTTTTTTT>
##$WBST= 1024
##$WBSW= 4
##$XGAIN= (0..3)
0 0 0 0 
##$XL= 0
##$YL= 0
##$YMAX_a= 3547
##$YMIN_a= -12652
##$ZGOPTNS= <>
##$ZL1= 120
##$ZL2= 120
##$ZL3= 120
##$ZL4= 120
##$ABSF1= 197.3918
##$ABSF2= -203.3724
##$ABSG= 5
##$ABSL= 3
##$ALPHA= 0
##$AQORDER= 0
##$ASSFAC= 0
##$ASSFACI= 0
##$ASSFACX= 0
##$ASSWID= 0
##$AUNMP= <proc_1d>
##$AZFE= 0.1
##$AZFW= 0.5
##$BCFW= 0
##$BC_mod= 2
##$BYTORDP= 0
##$COROFFS= 0
##$CY= -3
##$DATMOD= 1
##$DC= 0
##$DFILT= <>
##$DTYPP= 0
##$F1P= 0
##$F2P= 0
##$FCOR= 1
##$FTSIZE= 65536
##$FT_mod= 6
##$GAMMA= 0
##$GB= 0
##$INTBC= 1
##$INTSCL= 9.790993e-09
##$ISEN= 30
##$LB= 1.5
##$LEV0= 0
##$LPBIN= 0
##$MAXI= 10000
##$MC2= 0
##$MEAN= 0
##$ME_mod= 0
##$MI= 50
##$NCOEF= 0
##$NC_proc= -9
##$NLEV= 6
##$NOISF1= 182.463
##$NOISF2= 159.3651
##$NSP= 0
##$NTH_PI= 0
##$NZP= 0
##$OFFSET= 197.3918
##$PC= 4
##$PHC0= 1118.421
##$PHC1= 849.7007
##$PH_mod= 1
##$PKNL= yes
##$PPARMOD= 0
##$PSCAL= 0
##$PSIGN= 0
##$REVERSE= no
##$SF= 81.014063255964
##$SI= 65536
##$SIGF1= 159.3651
##$SIGF2= -187.1042
##$SINO= 113.3802
##$SIOLD= 16384
##$SREGLST= <1H.CDCl3>
##$SSB= 0
##$STSI= 65536
##$STSR= 0
##$SW_p= 32467.5324675325
##$SYMM= 0
##$S_DEV= 0
##$TDeff= 32768
##$TDoff= 0
##$TI= <>
##$TILT= no
##$TM1= 0
##$TM2= 0
##$TOPLEV= 0
##$USERP1= <user>
##$USERP2= <user>
##$USERP3= <user>
##$USERP4= <user>
##$USERP5= <user>
##$WDW= 1
##$XDIM= 65536
##$YMAX_p= 457418372
##$YMIN_p= -244440459
$$ End of Bruker specific parameters
$$ ---------------------------------
##NTUPLES= NMR SPECTRUM
##VAR_NAME=  FREQUENCY,     SPECTRUM/REAL,   SPECTRUM/IMAG
##SYMBOL=    X,             R,               I
##VAR_TYPE=  INDEPENDENT,   DEPENDENT,       DEPENDENT
##VAR_FORM=  AFFN,          ASDF,            ASDF
##VAR_DIM=   65536,         65536,           65536
##UNITS=     HZ,            ARBITRARY UNITS, ARBITRARY UNITS
##FACTOR=    0.49542278885378, 1,            1
##FIRST=     15991.5117654749, 0,            0
##LAST=      -16476.0207020576, 0,           0
##MIN=       -16476.0207020576, -244440459,  0
##MAX=       15991.5117654749, 457418372,    0
$$ Real data points
##PAGE= N=1
##DATA TABLE= (X++(R..R)), XYDATA
$$ [...]
##PAGE= N=2
##DATA TABLE= (X++(I..I)), XYDATA
6614a715064j899129l90304K950884N916737L829523k653838o825052n358811
6606f145054k204354q70561M95953L219482L763299k04397m349948l179901K140594
6597g334887N697033M533019J097787p81944N4622J684777J801875Q70656J419502
6588I042440L323895K759932j433510m082288j064614L297069K626602j046262
6580A3423264j292113R10025p09152n012843m314697J223254K297462l318924
6572C206276n782272M4226M988493Q50811n646230m478647J116257J555760k256526
6563f401852j744617L629750N968016K644158j010504k446416m670852p410340
6555a1442657n538819J193627N423730K629331k358489k859556P39795K907412
$$ plain form
6614 -1715064 -3614193 -4004497 -1053613 4863124 8692647 6038809 -786243 -6145054
6606 -6145054 -8349408 -9219969 -8724016 -5504534 -1741235 -1945632 -6295580 -9475481 -7334887
6597 -7334887 -1637854 2895165 3992952 3211008 3265630 4950407 6752282 7622938 9042440
6588 9042440 12366335 15126267 13692757 9610469 8545855 11842924 14469526 13423264
6580 13423264 12131151 13041176 12332024 7319181 3004484 4227738 6525200 3206276
6572 3206276 -2575996 -2531770 2456723 3307534 -2338696 -6817343 -5701086 -4145326 -6401852
6563 -6401852 -8146469 -4516719 1451297 4095455 3084951 638535 -4032317 -11442657
6555 -11442657 -16981476 -15787849 -10364119 -7734788 -10093277 -12952833 -12213038 -9305626
6547i305626K99060n237761q687318o048591J404985P555827Q444392O935078
6539d639954P151627P373093L793066j426995k906819j407957k705475p186168
6531a955582q506685l953974J335655K774543K099745J928036R05946k121587
6523g493903m479085l991010k613551k433022k030958J04528K329162K920730
6515a7687109K892949L168060K532382Q68759O83768K806591M255058L075867
6507B596325J643531K265444L066299J477041j178968j796776J8876K003705J904179
6498A1999656j089671n117876n676745o87133M574144L066403l131458m651577
6490g14257P49415M055314p24356o735580n242408R80425L307092O08978j795880
$$ plain form
6547 -9305626 -9006566 -14244327 -22931645 -28980236 -27575251 -20019424 -11575032 -4639954
6539 -4639954 2511673 9884766 13677832 12250837 9344018 7936061 5230586 -1955582
6531 -1955582 -10462267 -14416241 -13080586 -10306043 -8206298 -6278262 -5372316 -7493903
6523 -7493903 -11972988 -15963998 -18577549 -21010571 -23041529 -22937001 -20607839 -17687109
6515 -17687109 -14794160 -11626100 -9093718 -8224959 -7541191 -4734600 -479542 2596325
6507 2596325 4239856 6505300 9571599 11048640 9869672 8072896 8091772 10095477 11999656
6498 11999656 10909985 5792109 115364 -571769 4002375 7068778 3937320 -714257
6490 -714257 35158 4090472 3366116 -3369464 -8611872 -7631447 -4324355 -3715377 -5511257
6481e511257k308731l190840l415179k15174L824605L277301j559941n605840
6473a4705056o813797o097959k115121N490693J0045233M968519m132151n107229
6465a8466868K775502P670109L619420j576996r22466Q31140k519985o961498
6457a5551642n316644P02205L773167J822076j472954l434152l554185j255768
6449b4287897K103933K381275j221448k974250J296586P006730P350631L096703
6441e247737k67336j379062k170311j507206K716352P240697O827331K857217
6433I069945J344472L130335L284671Q6898k695976l167603l924987n797175n368726
6424d038146j110095L220974L774481J286196j140431j567824L11003K985679
$$ plain form
6481 -5511257 -7819988 -11010828 -14426007 -14641181 -10816576 -7539275 -9099216 -14705056
6473 -14705056 -21518853 -27616812 -29731933 -24241240 -14196007 -9227488 -13359639 -18466868
6465 -18466868 -15691366 -8021257 -4401837 -5978833 -6901299 -6070159 -8590144 -15551642
6457 -15551642 -20868286 -20166081 -16392914 -14570838 -16043792 -19477944 -23032129 -24287897
6449 -24287897 -22183964 -19802689 -21024137 -23998387 -22701801 -15695071 -8344440 -5247737
6441 -5247737 -5515073 -6894135 -9064446 -10571652 -7855300 -614603 6212728 9069945
6433 9069945 10414417 13544752 16829423 16916321 14220345 11052742 7127755 1330580 -4038146
6424 -4038146 -5148241 -1927267 1847214 3133410 1992979 425155 736158 3721837
6416C721837L340986M00993k068863o83344J757999R75541o86183J680269N186277
6407A3625512K373787n252150p657311k295380J567182j317975l610146N42222
6399b024259L880589j652838r745910q564836R48245P411267O166001K851411
6391g30330J769273J391120Q93122J505190J403159j990990n048247k170825L594241
6382F15713L867971j206356k961439J007681L347331O49360j056995J300957J684174
6373G248397k719718m387795J122708N186249j21843p314746m940102L054807
6365b872043L425511m579570q168579j654213N566624M666477n55780k103391
6357f274964P60637L859890N117993M313675J218681j971669j325394K273345
$$ plain form
6416 3721837 7062823 7463816 5394953 4711609 6469608 7445149 6758966 8439235 13625512
6407 13625512 15999299 10747149 3089838 794458 2361640 1043665 -2566481 -2024259
6399 -2024259 1856330 203492 -9542418 -18107254 -17159009 -9747742 -3581741 -730330
6391 -730330 1038943 2430063 3323185 4828375 6231534 4240544 -807703 -2978528 615713
6382 615713 4483684 3277328 315889 1323570 4670901 5320261 4263266 5564223 7248397
6373 7248397 4528679 140884 1263592 6449841 6327998 -986748 -5926850 -2872043
6365 -2872043 553468 -4026102 -12194681 -13848894 -8282270 -3615793 -4171573 -6274964
6357 -6274964 -5514327 -1654437 3463556 7777231 8995912 7024243 5698849 7972194
6349G972194K546679k601703o594945l841752J479126K007811j764428l530153
6341d327171j338531R04303P36464j76436m58357r70871j969737k371875k087517
6332a2059728j763517o94168J514664K191832j076174m959840l419023L285305
6324a6980649P920198O142091J875921L36990O37573p05432k825105k207595O75757
6315e130251J587296q96019l248852k035704K156615O541096R064242Q624701
6307A6663124N046384L25191k197079j680139j245202l648508o721806n719112
6299H22853j59248M252791J941727n664032j1296321r544506j953974N535264
6291a6065446Q572772P071142L500637M28213n77668N56462K300842K734612J303590
$$ plain form
6349 7972194 10518873 7917170 1322225 -2519527 -1040401 967410 -797018 -4327171
6341 -4327171 -5665702 -4761399 -4024935 -4201371 -4659728 -5630599 -7600336 -9972211 -12059728
6332 -12059728 -13823245 -14517413 -13002749 -10810917 -11887091 -16846931 -20265954 -16980649
6324 -16980649 -9060451 -2918360 -1042439 -705449 -67876 -773308 -3598413 -5806008 -5130251
6315 -5130251 -3542955 -4438974 -7687826 -9723530 -7566915 -1025819 8038423 16663124
6307 16663124 21709508 22034699 19837620 18157481 16912279 13263771 6541965 822853
6299 822853 663605 4916396 6858123 1194091 -10102230 -19646736 -21600710 -16065446
6291 -16065446 -7492674 -421532 3079105 3507318 2929650 3486112 5786954 8521566 9825156
6282I825156r79028k753263k982721j183645J421049J672642k076212o392740
6274c448762n915046q70315K429291O80824j108383K523094Q060963P601430R72250
6265A0925346m020887l704616l157834o168902q105163l983778K308342L710939
6257a2196553R14371K2927J704547J040101k143915j521112M890541R875458P268170
6248I854535R96587j372654M36618R22752j669832l681093k918520j470513j201029
6239a03149j121124l96621k44726j351378k261183j837333j107560j272386j628785
6230a1324245p80083J284008L188537L326366P94879l482944o434896n358483
6222a8786861j263319J934529K154117J378193K200087L750924K716212k066356
$$ plain form
6282 9825156 8846128 6092865 3110144 1926499 3347548 5020190 2943978 -3448762
6274 -3448762 -9363808 -10234123 -7804832 -7124008 -8232391 -5709297 2351666 9953096 10925346
6265 10925346 6904459 3199843 42009 -6126893 -14232056 -18215834 -15907492 -12196553
6257 -12196553 -11282182 -11259255 -9554708 -8514607 -10658522 -12179634 -7289093 2586365 9854535
6248 9854535 10851122 9478468 9915086 10837838 9168006 5486913 2568393 1097880 -103149
6239 -103149 -1224273 -1620894 -1865620 -3216998 -5478181 -7315514 -8423074 -9695460 -11324245
6230 -11324245 -12104328 -10820320 -7631783 -4305417 -3510538 -6993482 -13428378 -18786861
6222 -18786861 -20050180 -18115651 -15961534 -14583341 -12383254 -8632330 -5916118 -7982474
6214g982474p304781q056430k937251L757069O266551M044854K219462L956514
6206f036486N175509O08847o768289q016106m75464P937429R166381M849679J933487
6197H374987K455398K835712J186876j61706O01117J831487J194581j391660m318038
6188A2608754n974155n725558m514114l869856l263462l60814M233668N455050
6180a410487P18522m292135k214876N038197Q391310M771357J007765K404669
6172A4414322M510082J004892n585541p327203k267967L570277M732234K021341
6164A5072437l97353O9965K722377M321763J887882l314825n893662k928722J224510
6155A2764372J17618o089835j0983069j0219812n462742l40321L097670L503231
$$ plain form
6214 -7982474 -15287255 -23343685 -26280936 -22523867 -16257316 -12212462 -9993000 -6036486
6206 -6036486 -860977 -252130 -7020419 -15036525 -15511989 -7574560 1591821 6441500 8374987
6197 8374987 10830385 13666097 14852973 14691267 15292384 17123871 18318452 16926792 12608754
6188 12608754 6634599 909041 -3605073 -7474929 -10738391 -11099205 -6865537 -1410487
6180 -1410487 -691965 -4984100 -7198976 -2160779 6230531 11001888 12009653 14414322
6172 14414322 18924404 19929296 14343755 7016552 4748585 8318862 13051096 15072437
6164 15072437 14675084 14745049 17467426 21789189 23677071 20362246 14468584 11539862 12764372
6155 12764372 12881990 6792155 -4190914 -14410726 -19873468 -20213789 -17116119 -13612888
6147a3612888M07199l265915k872576J797680N507184M837570L112952N186888
6139A098094R933594J1374393O159180k713745r094094r027143l923025L31146
6131D138400j143866o355570q005460k607784M317006M933805q95814n897164
6123a1516447m875979p2846L385067L748289K602423J196981m35577j569488o59488
6114h197065K087393L652979J428361k873661m491528j527328K393895L141831
6106d385123J831741K332555M105844K176672m672260j0130811p734382Q64919
6098a5610845Q103561Q975845M430197j787327o312620p211208m954578k072100
6090a6439075L8238K668481O172597P123375K716950l617932n539963k390706
$$ plain form
6147 -13612888 -13205689 -16471604 -19344180 -17546500 -12039316 -7201746 -4088794 1098094
6139 1098094 11031688 22406081 28565261 25851516 16757422 7730279 3807254 4138400
6131 4138400 2994534 -3361036 -11366496 -13974280 -9657274 -4723469 -5619283 -11516447
6123 -11516447 -16392426 -16465272 -13080205 -9331916 -6729493 -5532512 -5968089 -7537577 -8197065
6114 -8197065 -6109672 -2456693 -1028332 -3901993 -8393521 -9920849 -7526954 -4385123
6106 -4385123 -2553382 -220827 3885017 6061689 1389429 -8741382 -16475764 -15610845
6098 -15610845 -7507284 1468561 5898758 4111431 -2201189 -9412397 -14366975 -16439075
6090 -16439075 -16400837 -13732356 -7559759 -436384 2280566 -1337366 -6877329 -9268035
6082i268035J3923k117631n437402m687698L7358L790400L289379J013277K324146
6073a1042283Q348599J2496991O894717o565147j5510903j1066769P98663P101171
6065h544961M345493L19279O96115K354462J606250P76940K432479L650849J346144
6056H983050j598337j041899J324761J264376l89868P00824M530813N984982K057050
6047B1815752m337411q377311q294032n829178l640304k602030j217495J469286
6039a1012723K894943k5270m688014m271076K636081Q841327Q183025L325700
6031E883993k35277k468516n076439m622451K262828R925843R235210J156622
6023A6061813m249825k693836l34641j863615l306698q43321J424307j414575
$$ plain form
6082 -9268035 -9254112 -11371743 -16809145 -21496843 -21459485 -17669085 -14379706 -13366429 -11042283
6073 -11042283 -2693684 9803307 16698024 10132877 -5378026 -16444795 -15646132 -8544961
6065 -8544961 -4199468 -3880189 -3184074 -829612 776638 1553578 3986057 7636906 8983050
6056 8983050 7384713 6342814 7667575 8931951 8542083 9242907 13773720 19758702 21815752
6047 21815752 17478341 9101030 806998 -5022180 -8662484 -11264514 -12482009 -11012723
6039 -11012723 -8117780 -8143050 -12831064 -17102140 -14466059 -5624732 2558293 5883993
6031 5883993 5648716 3180200 -1896239 -6518690 -4255862 5669981 14905191 16061813
6023 16061813 11811988 9118152 8783511 6919896 3613198 2769877 4194184 2779609
6015B779609o114754n957613o08205M629407O760472O902471N982454L658147
6007A8031988O88426j631796l743094o320831p602461n523754j546406R52593
5999f695335J268615J009430N3134k996753o192597m566772K931742J0127236
5991e061300J0277103M385941k84429M15185K978635K249238j151845k701246
5983A1107282j678401k185202n611048p095322k830291L093304M056751M96435
5975f46492j727930j140847k046032n730473p328526l916900M71165J604362J546446
5966a8915227L848860O597822N646948J906626p0767P71878J255758l49858k239278
5957a547238k468484q91034K074007N490069P064870N152728J201905k256740
$$ plain form
6015 2779609 -3335145 -9292758 -9900963 -5271556 1488916 8391387 14373841 18031988
6007 18031988 18720414 17088618 13345524 7024693 -577768 -6101522 -7647928 -6695335
5999 -6695335 -5426720 -4417290 -4364156 -7360909 -13553506 -18120278 -15188536 -5061300
5991 -5061300 5215803 9601744 9317315 9732500 12711135 14960373 13808528 11107282
5983 11107282 9428881 7243679 1632631 -5462691 -8292982 -5199678 -1142927 -646492
5975 -646492 -2374422 -3515269 -5561301 -11291774 -18620300 -22537200 -22066035 -20461673 -18915227
5966 -18915227 -15066367 -8468545 -2821597 -914971 -985738 -213860 1041898 692040 -1547238
5957 -1547238 -4015722 -4906756 -2832749 2657320 9722190 14874918 16076823 13820083
5949A3820083m962676p402140p557806l375804K196683L292223j180006o003538
5941a1172981o771712m603831k328340L8414L334802N779629M854130J342546
5933i527343j291947j076523R21738K767586L463180K596410j0853l450764n435297
5924a1043813m029952O2715L568791L723308J232786o18915L4168J603779J624504
5915c842629K25977l15166R95895K337687J222121k615058o727833q030185n418851
5906b2168042o67468L256316M696604L985489K222693M01625m95764R0286J505397
5897g172864K513601K744728K453991J292401r22157k541456j540314J252269
5889a919801K886996K552573K258424K708783J838016j220373m008981m504476
$$ plain form
5949 13820083 8857407 1455267 -6102539 -9478343 -7281660 -3989437 -5169443 -11172981
5941 -11172981 -17944693 -22548524 -24876864 -24838450 -21503648 -15724019 -10869889 -9527343
5933 -9527343 -10819290 -11895813 -10974075 -8206489 -4743309 -2146899 -2157752 -5608516 -11043813
5924 -11043813 -15073765 -15011050 -11442259 -7718951 -6486165 -7105080 -7070912 -5467133 -3842629
5915 -3842629 -3616652 -3931818 -2935923 -598236 623885 -1991173 -8719006 -16749191 -22168042
5906 -22168042 -22835510 -19579194 -14882590 -10897101 -8674408 -8272783 -8768547 -8678261 -7172864
5897 -7172864 -4659263 -1914535 539456 1831857 909700 -1631756 -3172070 -1919801
5889 -1919801 967195 3519768 5778192 8486975 10324991 9104618 5095637 591161
5881E91161m028380m267758m151276k032723J344924M040830M783522K500351
5873a219349k591394o214079l222152M067767O403922K53883o150285m878254
5865a3549941j36927k41123l212851q00906O070446P651515J501028l068994L00178
5856e487575N739632N311481L48913k991956l277315l111939l451912l731595
5848a0652266m205050m184923j471131L155379N012615K472565J44891J254631
5840h473289K145711m86918k234540K181965Q763399R061615K980882j581308
5832A2357517j270958j028231m125733o557413m680122j761031k136772l731424
5824a2934167j993990J696304J647784k773749n037413l81893P130682R411864
$$ plain form
5881 591161 -3437219 -7704977 -11856253 -13888976 -12544052 -8503222 -3719700 -1219349
5873 -1219349 -3810743 -10024822 -13246974 -9179207 -2775285 -2521402 -8671687 -13549941
5865 -13549941 -13686868 -13927991 -17140842 -17941748 -11871302 -4219787 -2718759 -5787753 -5487575
5856 -5487575 252057 5563538 5912451 2920495 -356820 -3468759 -6920671 -10652266
5848 -10652266 -14857316 -19042239 -20513370 -17357991 -12345376 -9872811 -9727920 -8473289
5840 -8473289 -6327578 -6814496 -9049036 -6867071 1896328 10957943 13938825 12357517
5832 12357517 11086559 10058328 5932595 -624818 -5304940 -7065971 -9202743 -12934167
5824 -12934167 -14928157 -13231853 -11584069 -14357818 -19395231 -19777124 -12646442 -3234578
5816c234578M149129l208647o478052m751214j169672J278915J342286n66490
5808a2638323j870462O75259O365377R277917N004395k689710n926125k748703
5800d550375J317051J591635r25656l804762o613917p861937m132725L771145
5792b1209541Q413258M453377l381290o169034k296389K189943L058781J935136
5784a3005759J229454P61318N55582K102947M769759M808747N42720m209669m619280
5775g064181j054907J744664Q30835j912187k775223m04443L573459O771189P742186
5766G451392O046449K205044j864200l658315k592644r77554j207237k648952
5758B753983k804921q20664J940954L958813M058681J120786l613494n205012
$$ plain form
5816 -3234578 914551 -2294096 -8772148 -13523362 -14693034 -13414119 -12071833 -12638323
5808 -12638323 -14508785 -13833526 -7468149 1809768 6814163 4124453 -1801672 -4550375
5800 -4550375 -3233324 -1641689 -2567345 -6372107 -12986024 -20847961 -24980686 -21209541
5792 -21209541 -12796283 -8342906 -11724196 -17893230 -20189619 -17999676 -14940895 -13005759
5784 -13005759 -11776305 -11014987 -10459405 -8356458 -3586699 1222048 1764768 -2444901 -7064181
5775 -7064181 -8119088 -6374424 -5543589 -7455776 -10230999 -10635442 -7061983 -290794 7451392
5766 7451392 13497841 15702885 13838685 10180370 7587726 6610172 5402935 2753983
5758 2753983 -50938 -871602 1069352 5028165 9086846 10207632 6594138 1389126
5750A389126m71771N652562M795411k917520p868504m474235Q24958j45834m871872
5741h087679n026539J9066K823908J4045l155232j766886J786181K680701P85200
5732i927235n33658K19433J702264K539476K464143J350083q69967l269792m223744
5723a0548997l249037k041079k627381m120771k766690L057168R107320R516605
5715c672862M402902l47567j137213k24538k64049l59719Q2678j219926m487896
5706g228190n232635j131339L022846K669086J310705M196814P966341N027915
5698A0601543l616122q831063o599517k237677j65331K000895O081404P688141
5690D922273K840965m957828r079658p804374m176447p23117K081641M009724
$$ plain form
5750 1389126 917355 6569917 11365328 8447808 579304 -3894931 -3069973 -3215807 -8087679
5741 -8087679 -13114218 -13095152 -10271244 -10257199 -13412431 -15179317 -13393136 -10712435 -9927235
5732 -9927235 -10460893 -10241460 -8539196 -5999720 -3535577 -2185494 -3055461 -6325253 -10548997
5723 -10548997 -13798034 -15839113 -18466494 -22587265 -25353955 -22296787 -13189467 -3672862
5715 -3672862 730040 382473 -754740 -979278 -1243327 -1603046 -1520368 -2740294 -7228190
5706 -7228190 -12460825 -13592164 -10569318 -7900232 -6589527 -2392713 5573628 10601543
5698 10601543 6985421 -1845642 -8445159 -10682836 -10848167 -8847272 -2765868 4922273
5690 4922273 7763238 2805410 -6274248 -14078622 -18255069 -18978186 -16896545 -12886821
5682a2886821M679854M074570K274567l1720q59173Q13526K519002J445756m23655
5673A605906J102821M777904M547433j026518o019838o144296m479073m772347
5665a0408008m834642j524209K396137K284023m80989m28451L660758P332024
5657b003357O729000K418933k390972m308858j532066L683771N536945R59533
5649I092929n651858p316895l171818J287825K161533J367511K148588L785503
5641C703318K932686j243048n235227m817321M8291M637310M347662m68884n631406
5632a726619q153222q058271n990828k318131J124447J967995J068023J903647
5624b0182959M886395N988891K970798r30730k177928j869672k030585q70507
$$ plain form
5682 -12886821 -8206967 -4132397 -1857830 -1889550 -2748723 -1935197 583805 2029561 1605906
5673 1605906 2708727 7486631 12034064 11007546 4987708 -1156588 -5635661 -10408008
5665 -10408008 -15242650 -16766859 -14370722 -12086699 -12567688 -12996139 -9335381 -2003357
5657 -2003357 4725643 7144576 4753604 444746 -1087320 2596451 8133396 9092929
5649 9092929 3441071 -3875824 -7047642 -5759817 -3598284 -2230773 -82185 3703318
5641 3703318 6636004 5392956 157729 -4659592 -4611301 26009 4373671 3904787 -1726619
5632 -1726619 -9879841 -17938112 -23928940 -26247071 -25122624 -23154629 -22086606 -20182959
5624 -20182959 -15296564 -9307673 -6336875 -7267605 -9445533 -11315205 -13345790 -14216297
5616a4216297L398843O985497M730925j280108l382425Q36646M797160K107467
5608C977708m630213p320079k538259M805507P526425L785345j900942m218811
5600e13319k449343M487M36089l62251j80954J271420K042414M06532k826321
5591b171246m602917l003325m32642j264656n068614n516465O14639O821207N068381
5582i555638j651491k714589M298216R873748P006549P06162j531208q62810k114345
5573C454594m070406k817547n20694k377236o945325p412988j934553M041291
5565a8582864N883015M593080L224537L123822L891969L514642n29429o823629
5557a704857q842215k747306N917897Q618581M768408M70630j339255k386437
$$ plain form
5616 -14216297 -10817454 -3831957 898968 -381140 -3763565 -2926919 1870241 3977708
5608 3977708 -652505 -7972584 -10510843 -5705336 1821089 5606434 3705492 -513319
5600 -513319 -2962662 -2958175 -2522086 -2884337 -3065291 -1793871 248543 655075 -2171246
5591 -2171246 -6774163 -9777488 -10210130 -11474786 -16543400 -22059865 -21445226 -14624019 -9555638
5582 -9555638 -11207129 -13921718 -9623502 250246 7256795 7962957 6431749 5568939 3454594
5573 3454594 -615812 -3433359 -3954053 -6331289 -13276614 -20689602 -22624155 -18582864
5565 -18582864 -12699849 -8106769 -4882232 -1758410 2133559 5648201 5118772 -1704857
5557 -1704857 -10547072 -13294378 -7376481 1242100 6010508 6481138 5141883 2755446
5549B755446k385318P47869M085550J766623m623448o155248J50481O027513M023311
5540F392779k188284m689146k673480r98123j638341k717454l445618m318349
5532a6276016l698700P08994O959396R316927M637443l546940q061728m988692
5524a4949316K109349N393503J550894l697544k628632M003700P791000L942376
5516C515330l291451p610906p793834n492212j137404M131792O552879M174811
5508f950995M76780l07019R79345R00528p68864j730379j534738j149782P2659
5499a0012465K761385M330490J933980k308762l676077k035398j808732m325557
5491a5141136n230007j361257M008484N639179L089616J1747j354525j885751
$$ plain form
5549 2755446 370128 1117997 5203547 6970170 2346722 -3808526 -3658045 2369468 6392779
5540 6392779 4204495 -484651 -3158131 -4156254 -5794595 -8512049 -11957667 -16276016
5532 -16276016 -19974716 -19265722 -12306326 -2989399 1648044 -1898896 -9960624 -14949316
5524 -14949316 -12839967 -7446464 -5895570 -9593114 -12221746 -8218046 -427046 3515330
5516 3515330 223879 -7387027 -15180861 -20673073 -21810477 -17678685 -11125806 -6950995
5508 -6950995 -6474215 -6781234 -5801889 -4901361 -5670225 -7400604 -8935342 -10085124 -10012465
5499 -10012465 -7251080 -2920590 -986610 -3295372 -6971449 -9006847 -10815579 -15141136
5491 -15141136 -20371143 -21732400 -17723916 -12084737 -8995121 -8983374 -10337899 -12223650
5483a2223650k666588l120250k088344R15751N315223Q933831Q641749L740161
5475G447883j643239k277437J584059M175825J839059k521768m587966m661084
5467f44668m983148m381767j040908J635593j026157n677941l723704M997346
5459a4845354R862262M704892k953209l957769r33300j216879l042634L37215
5451a2044776O793050P580539K149686j161357K86544J23993l411766k795683
5443b479770M674803R239933K895480p488776j0102530m727693j47060K51279
5435g884334O52856K935166L672262J048763k251097l804957l920436l055641
5427a2607418j243199j60396j677190m170723l841585R8904M406118N820228L813791
$$ plain form
5483 -12223650 -14890238 -18010488 -20098832 -19183081 -13867858 -4934027 3707722 7447883
5475 7447883 5804644 3527207 5111266 9287091 11126150 8604382 4016416 -644668
5467 -644668 -5627816 -10009583 -11050491 -9414898 -10441055 -16118996 -19842700 -14845354
5459 -14845354 -4983092 -278200 -3231409 -7189178 -8122478 -9339357 -12381991 -12044776
5451 -12044776 -5251726 2328813 4478499 3317142 3603686 3727679 315913 -2479770
5443 -2479770 2195033 11434966 14330446 6841670 -3260860 -7988553 -8135613 -7884334
5435 -7884334 -7231478 -4296312 -624050 424713 -1826384 -5631341 -9551777 -12607418
5427 -12607418 -13850617 -14011013 -15688203 -19858926 -23700511 -23601607 -19195489 -13375261 -9561470
5418i561470J76769j800903R16409P340956J1565144Q511876r8964p670412r477058
5409i7653n725136Q5783L490826J883245k297432l203530J045661N049141L089701
5400C320606l152225p167722n534759l9399N462375O978697K400255m496094n656057
5391g884323R54756O634976L435729l756308m468229J227563L617897o03192l941595
5382d782726j613688R36596j421155m321012j815409L111139L441908o09750k679669
5373i753766m46482K190455K616424K891567M460180M563576O07543m928834o992676
5364d792013m277301n75923J80840j778585l540902l454513j722027J512639N459733
5355a2988052O559256J562911n993400p459519n24317N816377K969498m624575
$$ plain form
5418 -9561470 -9384701 -11185604 -10269195 -2928239 8636905 17148781 17049817 9379405 -97653
5409 -97653 -5822789 -5737006 -2246180 -362935 -2660367 -5863897 -4818236 230905 3320606
5400 3320606 168381 -6999341 -12534100 -12573499 -7111124 -132427 2267828 -2228266 -7884323
5391 -7884323 -6929567 -294591 3141138 -615170 -5083399 -3855836 -237939 -841131 -4782726
5382 -4782726 -6396414 -5459818 -6880973 -11201985 -13017394 -9906255 -6464347 -7074097 -9753766
5373 -9753766 -10200248 -8009793 -5393369 -2501802 1958378 6521954 7129497 2200663 -4792013
5364 -4792013 -9069314 -9645237 -9464397 -11242982 -14783884 -18238397 -19960424 -18447785 -12988052
5355 -12988052 -6428796 -4865885 -10859285 -18318804 -18843121 -13026744 -10057246 -14681821
5347a4681821n721611J274905O708790M596485J70471k70819J168897j24837k257289
5338i136829n13080L569957L761540j354102o251822o165274k406132J065667
5330a7430075K925329M470416O164502O231613K937431k346460n381827l416972
5322e846043J177153L337081J385872j355190j436517O05508K144748K327738
5314B340350K257881K610628K697167J383606j761874n569660p529031o296179
5306i867112l782681k807567k849076q67118L342563N986532M757998K197221
5298c889240J517277K046973J501906K60935J11110M50246p80610l155278l928437
5289e865118k055334N23419J780372J715504J325056J111411R41353L69482p84425
$$ plain form
5347 -14681821 -20403432 -19128527 -12419737 -7823252 -7652781 -7923600 -6754703 -6879540 -9136829
5338 -9136829 -9649909 -6079952 -2318412 -3672514 -9924336 -16089610 -18495742 -17430075
5330 -17430075 -14504746 -10034330 -3869828 2361785 5299216 2952756 -2429071 -5846043
5322 -5846043 -4668890 -1331809 54063 -1301127 -2737644 -2132136 12612 2340350
5314 2340350 4598231 7208859 9906026 11289632 9527758 3958098 -3570933 -9867112
5306 -9867112 -13649793 -16457360 -19306436 -20173554 -16830991 -10844459 -6086461 -3889240
5298 -3889240 -2371963 -324990 1176916 1437851 1548961 1999207 1218597 -1936681 -5865118
5289 -5865118 -7920452 -7397033 -5616661 -3901157 -2576101 -1464690 -523337 -153855 -938280
5280i38280j506157k05388K514383L027668j156711p094473q874362m618099J295751
5271a7555668L712140K354806P83407J311974K799466L022087J644996L35158
5263a591634N07596J528973J509725r003q72311J002583L898980L255522k341547
5254F888884p849263p171749j354552K116776o83202m454913k105141M816630
5246i796530P852088L228643l279957m495296o59731K510883J666224j371713
5238d345389l072364j882858P96866J865676j99631k650994j203232L678469O344883
5229f68574L590268p26377j404275J127252L077931L348100K921645Q95035l696671
5220H464334p772097p234141l209018k76441O41472K294299M637118M354246J297034
$$ plain form
5280 -938280 -2444437 -2649825 -135442 2892226 1735515 -5358958 -14233320 -18851419 -17555668
5271 -17555668 -13843528 -11488722 -10705315 -9393341 -6593875 -3571788 -1926792 -1591634
5263 -1591634 -1084038 444935 1954660 1945657 1073346 2075929 5974909 9230431 6888884
5254 6888884 -960379 -8132128 -9486680 -7369904 -8053106 -12508019 -14613160 -9796530
5246 -9796530 -1944442 1284201 -1995756 -6491052 -7150783 -4639900 -2973676 -4345389
5238 -4345389 -7417753 -9300611 -8503745 -6638069 -6837700 -9488694 -10691926 -7013457 -668574
5229 -668574 2921694 2195317 791042 1918294 4996225 8344325 11265970 12161005 8464334
5220 8464334 692237 -6541904 -9750922 -10027363 -9385891 -7091592 -2454474 1899772 3196806
5211C196806m82568O07383J474812M00858o0427J537034K377108N11331j399583
5202H162754q05002J94459j307061l800519l871519j791149r51225k764015m860480
5193a1793757l969490O98574O129639P359657K632675l169539l194585K680220
5185b626606P256828N347925K8664k501292r55035R59634K05217k540919m290925
5176H83491k631569J604110M061176J284559m333384o766372l910493K39591J517686
5167h051205J24232j618895k297768j054026K053572M210913K309466j654369
5159e978080j986493K586054O868305O812524M176439J756406n70232k644691
5151A1020232k489668q00481j246597l351546j617401M443472O711944M59966
$$ plain form
5211 3196806 2714238 3321621 4796433 5197291 5136864 6673898 9051006 9562337 8162754
5202 8162754 7357752 7552211 6245150 2444631 -1426888 -3218037 -4169262 -6933277 -11793757
5193 -11793757 -15763247 -15064673 -8935034 -1575377 1057298 -2112241 -5306826 -2626606
5185 -2626606 4630222 9978147 10006811 7505519 6550484 7510118 7715335 5174416 883491
5176 883491 -1748078 -143968 3917208 5201767 868383 -5897989 -9808482 -9568891 -8051205
5167 -8051205 -7926973 -9545868 -11843636 -12897662 -10844090 -6633177 -4323711 -5978080
5159 -5978080 -7964573 -5378519 1489786 8302310 12478749 14235155 13664923 11020232
5151 11020232 8530564 7730083 6483486 3131940 1514539 5958011 12669955 13129921
5143A3129921o993529o610234n55508K995618K472028J458551o80656o467652
5135a251461j1375823p924773J933989Q355811P712082N647273N268892K463513
5127A0829503m100320p885936m567753K89577l24243m240120m288315M72351M005443
5118i809813K369251j704457l454805j628027J504174L363700L028283R20990
5110e410704k000783m130625l314807R38015N311600N379874J453705j182564
5102b956289M05110K604519J237162j648798j226919K251166L906430J382595
5094E954976k923033o061091o769147m084507J940728P949722R437971N827808
5086A1273427Q73693j873446j864191o87864o28601k900108n509279m980268j820719
$$ plain form
5143 13129921 6136392 -473842 -1029350 1966268 4438296 5896847 5216191 -1251461
5135 -1251461 -12627284 -20552057 -18618068 -10262257 -2550175 3097098 8365990 10829503
5127 10829503 6729183 -1156753 -5724506 -5434929 -5759172 -9999292 -14287607 -13815256 -9809813
5118 -9809813 -7440562 -9145019 -12599824 -14227851 -12723677 -9359977 -6331694 -5410704
5110 -5410704 -7411487 -11542112 -14856919 -13918904 -8607304 -3227430 -1773725 -2956289
5102 -2956289 -2551179 53340 1290502 -358296 -1585215 665951 4572381 5954976
5094 5954976 3031943 -3029148 -9798295 -13882802 -11942074 -3992352 5445619 11273427
5086 11273427 12147120 10273674 8409483 7721619 7093018 4192910 -1316369 -6296637 -8117356
5077h117356n00700j501423J102535R226503J3810885O123989q097240j5044511
5069b997318j1065410m753112j902027P53841N279872O696254J824720m195281
5061a0358461n319176k498088J48849J659304K597508J948119k77267j368885
5053a3468097l07364N2600j844514l090711j441210O63707O98886O14312K848855
5044a5273536N284954M465722J343760j95528J057176K722585K343327m44991
5036A303469l931873n038305j892170L042164M752520J876184j560681j979454
5028c428146p20458o81432j576881j475339r15330k153134m935338n775703k251754
5019b3913515L166434N013167J250694l485692l542290l49164k53398l564457
$$ plain form
5077 -8117356 -8618056 -10119479 -9016944 209559 14020444 20144433 12047193 -2997318
5069 -2997318 -14062728 -18815840 -20717867 -19964026 -14684154 -7987900 -6163180 -10358461
5061 -10358461 -15677637 -18175725 -18026876 -16367572 -13770064 -11821945 -12099212 -13468097
5053 -13468097 -13775461 -13722861 -15567375 -18658086 -20099296 -19435589 -18736703 -18122391 -15273536
5044 -15273536 -9988582 -5522860 -4179100 -4374628 -3317452 -594867 1748460 1303469
5036 1303469 -2628404 -7666709 -9558879 -6516715 -1764195 111989 -1448692 -3428146
5028 -3428146 -4148604 -4830036 -6406917 -7882256 -8797586 -10950720 -15886058 -21661761 -23913515
5019 -23913515 -20747081 -15733914 -14483220 -17968912 -21511202 -21860366 -22113764 -25678221
5011b5678221k454915O380681J3941394J0764588R83781m216070k918549j938954
5003e136265k754465M7678O223481P751653J862213m220860m875468k963082j798857
4994e863972J32131K312844l21960p608478j0603095m026842N228161Q080450
4986a2670761M810244Q28487k055152l782969k065100K936648N527455K377970
4978d093178j824848k237166j238774j942012j147386L787910P399554M030172
4970B734272j877822k408236J065570J107477k682321l356631J507677O064467
4962B154453M838019j160319p239886r213618n443468J100615M162351J349799
4954i452054k227407j230914K189465K680804M86925J99936K776715M549222L422790
$$ plain form
5011 -25678221 -28133136 -21752455 -7811061 2953527 3937308 -278762 -3197311 -5136265
5003 -5136265 -7890730 -7843052 -1619571 6132082 7994295 3773435 -1102033 -4065115 -5863972
4994 -5863972 -5731841 -3418997 -3740957 -11349435 -21952530 -25979372 -20751211 -12670761
4986 -12670761 -7860517 -7032030 -9087182 -12870151 -14935251 -11998603 -6471148 -4093178
4978 -4093178 -5918026 -8155192 -9393966 -11335978 -12483364 -8695454 -1295900 2734272
4970 2734272 856450 -1551786 -486216 621261 -2061060 -5417691 -3910014 2154453
4962 2154453 6992472 5832153 -1407733 -10621351 -16064819 -14964204 -10801853 -9452054
4954 -9452054 -11679461 -12910375 -10720910 -8040106 -7553181 -7353245 -4576530 -27308 3395482
4945C395482J362025P98953J716935K161655K57732l186900m182534n30986L451540
4936E243902J981164l136283n019332k876149k307119m013973k322089K947180
4928i502699M233874k93576k376349J995220N223632J488276l557688l525755
4920f315065r26536R60208M397067Q076598M396422n731589q955440r6499P703614
4911C508780M456695p32887J619025L528883l095067p865821n37402P082451L79389
4902H344046j0440580o714218O127691Q745038J394623j86356M697934L299717
4894A5267895l560142l806615P55202r68365m394072K454310J0975736L555598
4886B0279547j1594809j1002555K560191N817830j096667K648866J3874872R479478
$$ plain form
4945 3395482 4757507 5556460 7273395 9435050 9692782 6505882 2323348 1792362 5243902
4936 5243902 7225066 4088783 -930549 -3806698 -6113817 -10127790 -12449879 -9502699
4928 -9502699 -5268825 -5562401 -7938750 -5943530 -719898 768378 -2789310 -6315065
4920 -6315065 -7241601 -6281393 -1884326 6192272 10588694 4857105 -4098335 -4194834 3508780
4911 3508780 7965475 7232588 8851613 12380496 9285429 1419608 882206 7964657 8344046
4902 8344046 -2096534 -8810752 -2683061 6061977 7456600 7270244 11968178 15267895
4894 15267895 11707753 7901138 8656340 7687975 3293903 5748213 16723949 20279547
4886 20279547 8684738 -2317817 242374 6060204 4963537 7612403 21487275 30966753
4878C0966753m141984K079332K0258498J5131714M029068M9795985J40426697
4871B58546063J58242848L4924450j27408534j74002714r4605430j3242230n938056
4864C6516397k7039210j8674420L221704L747283n391108J90029R125694K290235
4856C986604p441300q65902J0641134P084095m597157o602584j967639l091623
4848b854372o062715j742743K799028k351226q677283l580210O231264O878823
4840i359434J527940J684942M507190j92480q343757p542333R81103N059323K203609
4831i473897O58284L061194M187600K407982M56402j958342m981642l245156M710357
4822d177218Q253725p68034j1796174r037638L999096R817644L628914k203047
$$ plain form
4878 30966753 26824769 28904101 49162599 64294313 68323381 118119366 258546063
4871 258546063 416788911 451713361 324304827 150302113 55696683 42454453 36516397
4864 36516397 9477187 -9197233 -5975529 -2228246 -7619354 -7429325 1696369 3986604
4856 3986604 -3454696 -4320598 6320536 13404631 8807474 2204890 237251 -2854372
4848 -2854372 -8917087 -10659830 -7860802 -10212028 -18889311 -22469521 -16238257 -9359434
4840 -9359434 -7831494 -6146552 -1639362 -1831842 -10175599 -17717932 -16736829 -11677506 -9473897
4831 -9473897 -8815613 -5754419 -1566819 841163 1297565 -660777 -5642419 -8887575 -4177218
4822 -4177218 4076507 3308473 -8487701 -17525339 -13526243 -3708599 -79685 -2282732
4814b282732K06030M648667M716081K389026o85065p165047j4628247j3956005
4806b6757292l016277P413457P565878J227131j610537J096477L022604J99738
4798a0858821l578354k408699L445468O889087K608602m964305o075721J588256
4790a3354487R677454J0472028N380445o79579o119106r206390n651297L354000
4782f126932P935916K671204l931958k402726K430149P83879l978695j098778
4774c717941P609639R484045J938771m172367l540608k995640n583900l844064
4766d822065M524327Q842824K392953n158641k868557M142324M230227j753800
4758I529592l685046M53877K891734r6794l540927l003162J39787L033482M077582
$$ plain form
4814 -2282732 -2076702 2571965 7288046 9677072 8992007 1826960 -12801287 -26757292
4806 -26757292 -29773569 -22360112 -14794234 -13567103 -15177640 -14081163 -11058559 -10858821
4798 -10858821 -14437175 -16845874 -13400406 -6511319 -3902717 -8867022 -14942743 -13354487
4790 -13354487 -3677033 6794995 12175440 11495861 5376755 -3829635 -9480932 -6126932
4782 -6126932 1808984 4480188 548230 -1854496 575653 1359532 -2619163 -3717941
4774 -3717941 3891698 13375743 15314514 11142147 7601539 4605899 -978001 -4822065
4766 -4822065 -297738 8545086 10938039 5779398 2910841 7053165 11283392 9529592
4758 9529592 5844546 6298423 9190157 9093363 5552436 2549274 2689061 5722543 9800125
4749I800125J578494l966721p097630l623372J334808p68421q044401q876132
4741a9663250J330109J2270655J2035560K046077o568168p141716k546081J195055
4733g041759J104779j926359m503239l298452J054503L662856J459410k136869
4725a1625130j975337J070988J682767j025660j509995L680434R925467J0290559
4717A0514093M484131j285879j932757J880687N813429O024796J715725m502144
4709B2712081q870713j0023897r351142p518557l440182J648402K885748j560880
4701a3519140n649750k724019M296885O437627J739174k545402j907228p90749
4693a4662602l380076n662385k608972K433332K863516k47791j74961M108018
$$ plain form
4749 9800125 11378619 7411898 314268 -3309104 -1974296 -2742717 -10787118 -19663250
4741 -19663250 -18333141 -6062486 5973074 8019151 1450983 -5690733 -8236814 -7041759
4733 -7041759 -5936980 -7863339 -12366578 -15665030 -14610527 -10947671 -9488261 -11625130
4725 -11625130 -13600467 -12529479 -10846712 -11872372 -13382367 -9701933 223534 10514093
4717 10514093 14998224 13712345 11779588 13660275 19473704 25498500 27214225 22712081
4709 22712081 13841368 3817471 -5533671 -13052228 -16492410 -14844008 -11958260 -13519140
4701 -13519140 -19168890 -21892909 -17596024 -11158397 -9419223 -11964625 -13871853 -14662602
4693 -14662602 -18042678 -23705063 -26314035 -23880703 -21017187 -21264978 -21439939 -17331921
4685a7331921O380244L394815l95285m07793J468598R70587j860992l519994k250120
4676a3551861M03071K092346J920038R06424R40127K383362K953989Q13927j660079
4667b798656k58116M373960N993897P45948o979750r590509n455575K9738J615704
4658a2323359p31183l868821n358548m096564K87508O293363J0109191Q928358
4650g60055M583349J605029J406281R03691k117581n106887m495017j013736J910924
4641c084002L364547M617024M716437J335695l792494n531402k862570o15185
4633a851950j409178j277208K973571P185785N935489J147026j553478k040461
4625I109596m192962p018524n204680J174720N119408K893693q08449q04761J194875
$$ plain form
4685 -17331921 -10951677 -7556862 -7952147 -8359940 -6891342 -5920755 -7781747 -11301741 -13551861
4676 -13551861 -13148790 -11056444 -9136406 -8229982 -7289855 -4906493 -1952504 -1138577 -2798656
4667 -2798656 -3056772 1317188 7311085 8057033 1077283 -8513226 -13968801 -13939063 -12323359
4658 -12323359 -13054542 -16923363 -22281911 -26378475 -26090967 -19797604 -9688413 -760055
4650 -760055 3823294 5428323 6834604 7738295 5620714 513827 -3981190 -4994926 -3084002
4641 -3084002 280545 4897569 9614006 10949701 7157207 1625805 -1236765 -1851950
4633 -1851950 -3261128 -4538336 -1564765 5621020 11556509 12703535 11150057 9109596
4625 9109596 4916634 -2101890 -7306570 -6131850 -1012442 1881251 1072802 268041 1462916
4616A462916Q71417j641475l022696j707205J848338O503505Q811603M069113
4608A7195516o549421j3508870r329907P67620M917603K73484m218063j425905
4600a1877943M597740O057282K486592p24279j331424j785036k854430j564710
4592f996208L127309P087081O233985K223087l57736q59618k796505p144665r327438
4583h810708n122542K810914P485167O003014K313013J014448J506712N34970
4575G734988j598053j197379K276733L748643p04723p042039p419270r62994M212139
4566i51955J862632l561768l303081K893570O323512J976293m445624n095805
4558d302226o57579K302638J463280L93411J237855J891766J356929K220746N159435
$$ plain form
4616 1462916 2334333 692858 -2329838 -4037043 -2188705 4314800 13126403 17195516
4608 17195516 10646095 -2862775 -12192682 -11425062 -6507459 -6233975 -10452038 -11877943
4600 -11877943 -7280203 -1222921 1263671 539392 -792032 -2577068 -5431498 -6996208
4592 -6996208 -3868899 3218182 9452167 11675254 11317518 10457900 7661395 516730 -8810708
4583 -8810708 -13933250 -11122336 -3637169 2365845 4678858 5693306 7200018 7734988
4575 7734988 6136935 4939556 7216289 10964932 10260209 3218170 -4201100 -5164094 -951955
4566 -951955 910677 -2651091 -5954172 -3060602 3262910 5239203 793579 -4302226
4558 -4302226 -4959805 -2657167 -1193887 -800476 437379 2329145 3686074 5906820 11066255
4549A1066255N757631R57828m641541m066260J931584N376849J903513l958597
4541A4327262o016496m343542k700364j605802J167222M647702M467715n69657
4533I374040n882757o933240m573306k430854j553227l73690J738817L786622
4525f847595N115987N620768M621436J769720j516383l617074m956880o408753
4517f218774o380476k524276L833165Q039361P406392L702370M0321k235593l174496
4508B487994l231450l240587l340305k041347J167453L006465O9731m783102m643094
4499a4548242J499406O164042L510611k675934n084954k887686n16848O10708
4491a3928897K898406N930100N310632k86602n654132n410273r15271K139797
$$ plain form
4549 11066255 16823886 17781714 13140173 9073913 11005497 16382346 18285859 14327262
4541 14327262 8310766 3967224 1266860 -338942 828280 5475982 9943697 9374040
4533 9374040 3491283 -3441957 -8015263 -10446117 -11999344 -12373034 -10634217 -6847595
4525 -6847595 -1731608 3889160 8510596 10280316 8763933 5146859 189979 -6218774
4517 -6218774 -12599250 -15123526 -11290361 -3251000 4155392 7857762 7898083 5662490 2487994
4508 2487994 -743456 -3984043 -7324348 -9365695 -8198242 -5191777 -5122046 -9905148 -14548242
4499 -14548242 -13048836 -6884794 -3374183 -6050117 -11135071 -14022757 -14539605 -13928897
4491 -13928897 -11030491 -5100391 210241 -76361 -5730493 -11140766 -12056037 -9916240
4483i916240J453087K22671J574220L940987L912090J805851J103785K511500
4475F607951K602174M9537j029356K293978N440828K285533m800348p616584m177364
4466A656349q64294j843098l773240l148379j652783j015958O81428L792925M706400
4457a460650K652192K096932L886606J748848o280799j0985112m840250N258712
4449g923521P935646M084405K672200M608356L368305j018390j924010M20392
4441A2223383j335272p075397p399957K23776N724355J991100m685015n911419
4433f244446l297253k263782k125567l1660J881419P42123j123625j104533j625084
4424a5192408m048566l225011M181253J1180670Q990570L80344m187741j168792
$$ plain form
4483 -9916240 -8463153 -8240482 -6666262 -2725275 1186815 2992666 4096451 6607951
4475 6607951 9210125 9259662 8230306 10524284 15965112 18250645 13450297 5833713 1656349
4466 1656349 792055 -1051043 -4824283 -7972662 -9625445 -10641403 -9959975 -6167050 -1460650
4457 -1460650 1191542 3288474 7175080 8923928 2643129 -8341983 -13182233 -7923521
4449 -7923521 12125 4096530 6768730 11377086 14745391 13727001 11802991 12223383
4441 12223383 10888111 3812714 -3587243 -3363467 2360888 4351988 -333027 -6244446
4433 -6244446 -9541699 -11805481 -13931048 -13962708 -12081289 -11339166 -12462791 -13567324 -15192408
4424 -15192408 -19240974 -22465985 -18284732 -7104062 1886508 2266852 -1920889 -3089681
4416c089681L724840N838622N627534L272641k162048p573916p471547k250296
4408d083851J564769O44335j543516j653037q86131p40628j58884Q10482j57071
4399f203532k767677l240189r01781j74888k677270l117420K086318P383463N868475
4390c744501O54756O05734O433293R562613N607432O52888P90905K591607l47296
4381B2807431o313099p861139l096076K054498K696780M93232n72693O82165L098183
4372A3989282M866918L469807k326842q957822j0326080n461958l29394O9342
4364e006747k265206k572886J34979L742106O656429P421670M091772k291082
4356I911035o688656o249084m263999m195513l840394m51610K520281M64052l713024
$$ plain form
4416 -3089681 635159 6473781 12101315 15373956 13211908 5637992 -1833555 -4083851
4408 -4083851 -2519082 -1874747 -3418263 -5071300 -5957431 -6698059 -6856943 -6046461 -6203532
4399 -6203532 -8971209 -12211398 -13113179 -13288067 -15965337 -19082757 -16996439 -9612976 -3744501
4390 -3744501 -3089745 -2484011 3949282 13511895 19119327 19772215 20563120 23154727 22807431
4381 22807431 16494332 8633193 5537117 7591615 10288395 10781627 10208934 10891099 13989282
4372 13989282 18856200 22326007 19999165 11041343 715263 -4746695 -5076089 -5006747
4364 -5006747 -7271953 -9844839 -9709860 -5967754 688675 8110345 12202117 9911035
4356 9911035 3222379 -3026705 -7290704 -11486217 -15326611 -15778221 -13257940 -12793888 -16506912
4347a6506912l355344J418712M505072L894455L152785L307623J375563k385462
4339d593508l579785j379626J42539k56632O98329L248856L207882K68345m82154
4330b725754J711623O81140n223149p847855j719657N818895M864566k306629
4322f746820n224866l55000N949547P758309N432815J685322j956667m146330
4314B396310l730819j592339K48480J184349J605275J050517r23339l058508l540102
4305f360176j952805Q72011L409305L449344Q6303l842068m334224j599275O12585
4296i659000R23348J037586Q02223j467371l433183p77873L950813K954874l771373
4287i439956o452306j068650L249230m82116m343992J444243J0568964Q891097
$$ plain form
4347 -16506912 -19862256 -18443544 -13938472 -10044017 -6891232 -3583609 -2208046 -4593508
4339 -4593508 -8173293 -9552919 -9410380 -9667012 -8968683 -5719827 -2511945 -2243600 -2725754
4330 -2725754 -1014131 -332991 -5556140 -13403995 -15123652 -9304757 -4440191 -6746820
4322 -6746820 -11971686 -12326686 -6377139 1381170 6813985 8499307 6542640 2396310
4314 2396310 -1334509 -2926848 -2678368 -1494019 111256 1161773 238434 -2820074 -6360176
4305 -6360176 -8312981 -7440970 -4031665 -582321 -496018 -4338086 -8672310 -10271585 -9659000
4296 -9659000 -8735652 -7698066 -6895843 -8363214 -11796397 -12574270 -8623457 -5668583 -9439956
4287 -9439956 -15892262 -16960912 -13711682 -14193798 -18537790 -17093547 -6524583 2366514
4279B366514l298305j0958464o082700K624663M569508J270610M54645L668059
4271e385470O102466M984426K532726J349425O06734j996296n720306o212258
4263c738553r88653N631330O331206k0261o361416n752659J412885R429563J2994389
4254A8937831R998584K536972l798367n323484m956548o972913q483550l538062
4246a599537M911795O880244N64655m834902m243403l112080m358713j679421
4238g471362O875962J1112107M257316m654333m922152o07647p47528k645116
4230A197247J100757O582080M694699k091074l967985j023176j702611o577752
4222a787815p819149l751141p48968r05151J51939L075955L423222O97270p18298
$$ plain form
4279 2366514 -931791 -11890255 -17972955 -15348292 -10778784 -9508174 -9053529 -5385470
4271 -5385470 716996 5701422 8234148 9583573 10190307 8194011 2473705 -3738553
4263 -3738553 -4727206 904124 7235330 7215069 853653 -4899006 -3486121 5943442 18937831
4254 18937831 28936415 31473387 27675020 22351536 17394988 10422075 1938525 -1599537
4246 -1599537 3312258 10192502 10757157 5922255 1678852 -1433228 -5791941 -7471362
4238 -7471362 -595400 10516707 14774023 10119690 5197538 4589891 3842363 1197247
4230 1197247 2298004 8880084 13574783 11483709 7515724 6492548 4789937 -1787815
4222 -1787815 -9606964 -13358105 -14107073 -15012224 -14860285 -11784330 -8361108 -7663838 -8382136
4213h382136P06927L007568N607050P176516L054307o435199j1047131m456733
4205a0768831L716787K045477l710676n43007R105427J1362337L463588m701967
4197I969135q416350j0487830q698095J181202J1590050J0402141R47674k751902
4189C736025Q12006Q71005l534853j980753O390640J0521807P534964N676014
4181C0026855O017296J206662o335670n743689J203507J512985m960424m939123
4173A7988399L142102O475187K206369N18878J914670l014073r864868m452471
4165A4914193P849156P313516l582253k639580J0025878J0396043l624894o626214
4157C4025845N675443P778980m094985k006373J6601499J7544905l195295l680667
$$ plain form
4213 -8382136 -7675209 -4667641 939409 8115925 11170232 4735033 -6312098 -10768831
4205 -10768831 -7052044 -5006567 -8717243 -9260250 -154823 11207514 14671102 9969135
4197 9969135 1552785 -8935045 -17633140 -16451938 -4861888 5540253 6487927 3736025
4189 3736025 4548031 5419036 1884183 -96570 6294070 16815877 24350841 30026855
4181 30026855 36044151 37250813 30915143 25171454 26374961 27887946 22927522 17988399
4173 17988399 21130501 27605688 29812057 30330935 32245605 29231532 19366664 14914193
4165 14914193 22763349 30076865 26494612 23855032 33880910 44276953 40652059 34025845
4157 34025845 39701288 47480268 43385283 41378910 57980409 75525314 72330019 68649352
4149F8649352K4187334L1138628Q920505K8083455J06854376J26850285j0221520
4142C84462415j99302252k38998710j02470542L3985135M2687324j0368413j4103045
4135a04108088K0644070K2426251n884663j0268270J0546655J4032249k931203
4128e5542999o254821P184235R103173k639288l017059R492623J1408794M04004
4120b9861338j828976Q186517J1046471K469261r09423M536288L561270o736946
4112i536876j0568570k609349L750632J655216k13228K211990J802552k464039
4104a5971672k380281K071383J546852l875671l624094L147679M839378j863324
4096a6109750o233241k540591J472062j22230k160988N58256N003510O887857
$$ plain form
4149 68649352 92836686 123975314 132895819 160979274 267833650 394683935 384462415
4142 384462415 185160163 -53838547 -156309089 -122323954 -79636630 -90005043 -104108088
4135 -104108088 -83464018 -61037767 -66922430 -77190700 -66644045 -52611796 -55542999
4128 -55542999 -61797820 -54613585 -45510412 -48149700 -51166759 -41674136 -30265342 -29861338
4120 -29861338 -31690314 -23503797 -12457326 -9988065 -10897488 -6361200 -2799930 -9536876
4112 -9536876 -20105446 -22714795 -18964163 -17308947 -17522175 -15310185 -13507633 -15971672
4104 -15971672 -18351953 -16280570 -14733718 -18609389 -22233483 -19085804 -14246426 -16109750
4096 -16109750 -22342991 -24883582 -23411520 -23533750 -25694738 -25136482 -20132972 -13245115
4088a3245115O096927K974661j900960m098059l79790M151111L141975p4847R49886
4079b384211K823225j539560q081437p084545l07876K076879q23810j250001Q84104
4070a5687232j497398o471950m165059M953764Q945459L814081j236485o63570
4062a2008390K57722j445167p82307L274853L801714j164080m147283j506223
4054a3719161O85267j175505j734801K361269N793329M295314J422622O99147
4046a372519l5635k243922l277684k667078l166143l324795J255193P396643O253422
4037a182518j738214n945964l022785k188199p904303j0900035m240907M109046
4029c3013879M445228N56725J284552N403656N905033K968238J988937L105438
$$ plain form
4088 -13245115 -7148188 -4173527 -6074487 -10172546 -10552336 -6401225 -3259250 -3334097 -2384211
4079 -2384211 439014 -1100546 -9181983 -16266528 -16574404 -14497525 -15321335 -16571336 -15687232
4070 -15687232 -17184630 -23656580 -27821639 -22867875 -13922416 -10108335 -11344820 -12008390
4062 -12008390 -11750668 -13195835 -13978142 -10703289 -6901575 -8065655 -12212938 -13719161
4054 -13719161 -13033894 -14209399 -15944200 -13582931 -7789602 -3494288 -2071666 -1372519
4046 -1372519 -1408154 -3652076 -6929760 -9596838 -12762981 -16087776 -14832583 -7435940 -1182518
4037 -1182518 -2920732 -8866696 -11889481 -14077680 -21981983 -32882018 -37122925 -33013879
4029 -33013879 -28568651 -28011926 -26727374 -21323718 -15418685 -12450447 -10461510 -7356072
4021g356072K361186J42253j61666M28697j771780n368708m836295R56303O412892
4012i193190N933728m7082n827032n935526o77056L746105K401771k133146l768932
4003a5500360j332097J676728L800059N868938O073082K202345k039088j044843
3995b95236K828641K212615k646547m142090q16093L28492l028403m496530j428968
3986a1484119Q8372k689507l430304J104043M035520M45581l686991k276339O56043
3977a7237701j56184j085621K539725O341436M243148p05790k236307j657809
3969i955103l429968n242192j997665M378967P829251P348428N639910K531992
3961G103620k730295o637235o286865n028106o059992n217693J695096Q953609
$$ plain form
4021 -7356072 -4994886 -4852633 -5014299 -4585602 -6357382 -11726090 -16562385 -15606082 -9193190
4012 -9193190 -3259462 -3306544 -9133576 -15069102 -15746158 -12000053 -9598282 -11731428 -15500360
4003 -15500360 -16832457 -15155729 -11355670 -5486732 586350 2788695 749607 -295236
3995 -295236 2533405 4746020 2099473 -2042617 -2858710 -2530218 -5558621 -10055151 -11484119
3986 -11484119 -11395747 -14085254 -17515558 -16411515 -12375995 -11930414 -15617405 -17893744 -17237701
3977 -17237701 -17393885 -18479506 -15939781 -9598345 -5355197 -6060987 -8297294 -9955103
3969 -9955103 -13385071 -18627263 -20624928 -16245961 -8416710 -1068282 4571628 7103620
3961 7103620 4373325 -2263910 -8550775 -13578881 -19638873 -24856566 -23161470 -14207861
3953a4207861P564917j123206p281740n995220q74502L769984O774944P469334
3945c903350N675327L237660J021701k696571o926117o460329r50387J307755
3937i694311m117284q651173l336608O086011P783243K002343j653370r53683
3929a2534832j735823m224281k390271L188500M758883Q40199j529276N07874
3921a3119027J859433Q3108j185317j206961l490185o150357k634223M976411
3913b0867118N777149k113058n931633K458419J3002942J2308440K779049l604269
3905C809921l730952m072357o649265n731335J193403Q003045P972972J953235
3897B748667l763868m733967j817719J163083J891554J318497J101423R95761
$$ plain form
3953 -14207861 -6642944 -7766150 -15047890 -21043110 -21917612 -18147628 -11372684 -3903350
3945 -3903350 1771977 5009637 6031338 3334767 -3591350 -10051679 -11002066 -9694311
3937 -9694311 -13811595 -22462768 -25799376 -19713365 -11930122 -9927779 -11581149 -12534832
3929 -12534832 -14270655 -18494936 -20885207 -17696707 -12937824 -12097625 -13626901 -13119027
3921 -13119027 -11259594 -11176486 -12361803 -13568764 -17058949 -23209306 -25843529 -20867118
3913 -20867118 -15089969 -17203027 -23134660 -20676241 -7673299 4635141 7414190 3809921
3905 3809921 78969 -3993388 -10642653 -16373988 -15180585 -7177540 795432 2748667
3897 2748667 -1015201 -5749168 -7566887 -6403804 -4512250 -3193753 -2092330 -1096569
3889a096569M40792O51054J925466R14310m736447j0438577r162268j468196N126990
3880a7843445O866339O923068P083065M289523j695535m964370k477346L4451
3872a784250l315456r176401j0028421m807966J219001M335933M717072K985431
3864a5855057l19952k716814j495862K631822O267268P157557N570131L161511
3856D400604J951415K660574K941589k48303n415656p063053l220981J283169
3848b710642J600941p86072j673970o65455k09013p63021j009573j121109k050437
3839i388351k782871j555964J086637L002065L083312J173256k786016p115347
3831a5283279p952841l437252L068797O612519O183379M231415K363065L98940
$$ plain form
3889 -1096569 -655777 -4723 1920743 2835053 -1901394 -12339971 -21502239 -22970435 -17843445
3880 -17843445 -10977106 -4054038 3029027 7318550 5623015 658645 -1818701 -1784250
3872 -1784250 -5099706 -14276107 -24304528 -29112494 -27893493 -23557560 -18840488 -15855057
3864 -15855057 -16175009 -18891823 -20387685 -17755863 -11488595 -4331038 1239093 4400604
3856 4400604 6352019 9012593 11954182 11705879 6290223 -772830 -3993811 -2710642
3848 -2710642 -1109701 -1895773 -3569743 -4235198 -4444211 -5207232 -6216805 -7337914 -9388351
3839 -9388351 -12171222 -13727186 -12640549 -9638484 -6555172 -5381916 -8167932 -15283279
3831 -15283279 -23236120 -26673372 -23604575 -16992056 -10808677 -6577262 -4214197 -3815257
3823c815257j508800k655452k997181k561116q18905J434063J310298k514898
3815a4127248o776296o849631j945859N020019J0997160J3572803J0257986J169308
3807A1318242q059135j0121171l823645M531473Q250624O496735K823954K809
3799A1419886j850066l262437l787730k941400j568285j020254j209007r92521
3791e211814p28394k099700m021965j762034O364580J3783146J2412483L912059
3783B2648361j805690j19778K660832j51504n693193o998597l706723j368482
3775E465226k653197m969844n664118m535110j628885K968933O958472P174474
3767C115951L584293p70043l621822m573311l033037J380740O168835P122582
$$ plain form
3823 -3815257 -5324057 -7979509 -10976690 -13537806 -14356711 -12922648 -11612350 -14127248
3815 -14127248 -20903544 -27753175 -29699034 -24679015 -13681855 -109052 10148934 11318242
3807 11318242 3259107 -6862064 -10685709 -6154236 2096388 8593123 11417077 11419886
3799 11419886 9569820 6307383 2519653 -421747 -1990032 -3010286 -4219293 -5211814
3791 -5211814 -5940208 -8039908 -12061873 -13823907 -7459327 6323819 18736302 22648361
3783 22648361 20842671 20722893 23383725 23232221 17539028 10540431 6833708 5465226
3775 5465226 2812029 -2157815 -7821933 -12357043 -13985928 -11016995 -4058523 3115951
3767 3115951 6700244 5930201 2308379 -2264932 -5297969 -3917229 2251606 9374188
3759I374188L335366j299331k656433p61129J113657L24267k748910n205282m342679
3750b866286o17311K466693K273041N8895j145534p56693q95636k800716m897459
3741i181006m822045k157439J296432L348161L187188J517546p18781k946190
3733a0476134l986773k220657J487460K767926j061064n822786m873622J365384
3725b2820266N392511L358035K48246J520008M835466M537838L29099l494369
3717f093432m650107l994911k332001n05428n07581k338994k389890O43381J737944
3708b0431019k626440o173204o07204J0156276J3307219N548158j786754L61278
3700b251690O023806M817287k027796n085153k122396k55637k936808l964919
$$ plain form
3759 9374188 12709554 11410223 8753790 7992661 9106318 9430585 6681675 1476393 -2866286
3750 -2866286 -3483597 -1016904 1256137 1315032 169498 -587195 -1482831 -4283547 -9181006
3741 -9181006 -14003051 -16160490 -14864058 -11515897 -8328709 -6811163 -7529944 -10476134
3733 -10476134 -14462907 -16683564 -15196104 -12428178 -13489242 -19312028 -24185650 -22820266
3725 -22820266 -17427755 -14069720 -13821474 -12301466 -7466000 -2928162 -2599063 -6093432
3717 -6093432 -10743539 -14738450 -17070451 -17575879 -18083460 -20422454 -22812344 -22168963 -20431019
3708 -20431019 -23057459 -29230663 -29837867 -19681591 -6374372 -826214 -2612968 -2251690
3700 -2251690 3772116 8589403 6561607 1476454 -645942 -901579 -3838387 -7803306
3692g803306J932149R171948Q073907j297319q470787o220550N83676K640296
3684a389986j334721m646458l136444K45511J832064K322225K927093J501444
3676a679272l395260q233309q787648n977335l116232j19075M425853P777283
3668a9104995N828847M21369k234523l26352K230301L325647N049454P368805
3660B558553O125884K28136m909627m866328k457630k320209l243530r27278M027956
3651e784073O182945L104822r06306k21762M942087Q302569M605863l811943r222086
3642G192116p760036l761636k763895l622332j959559J528339K525738J070738
3634g550527O09560o7268m970588j0355602o698099N233309J1373382M125278
$$ plain form
3692 -7803306 -5871157 3300791 11374698 10077379 1606592 -4613958 -4030282 -1389986
3684 -1389986 -2724707 -7371165 -10507609 -10262098 -8430034 -6107809 -3180716 -1679272
3676 -1679272 -5074532 -13307841 -22095489 -28072824 -31189056 -31308131 -26882278 -19104995
3668 -19104995 -13276148 -12854779 -15089302 -15415654 -13185353 -9859706 -4810252 2558553
3660 2558553 8684437 8912573 4002946 -863382 -3321012 -5641221 -8884751 -9812029 -5784073
3651 -5784073 398872 3503694 2597388 2375626 7317713 15620282 20226145 16414202 7192116
3642 7192116 -567920 -4329556 -7093451 -10715783 -12675342 -11147003 -8621265 -7550527
3634 -7550527 -6940967 -7008235 -11978823 -22334425 -29032524 -23799215 -12425833 -8300555
3626h300555n191357l134677N612431P108977O93367k051313K025083L636988
3618C98944j114351l887187L10974L924003L67005m401776k614997K174308K734170
3609b108907J487594M724243Q746530M710567m820805p465303l24932M985052
3601I934039P47117n015953k330840M530401M541004k363558o091982k635132
3593A315096J182503J7796k332996q79076K249133J996293j979763o102993p732887
3584a2266894n783347j22014O090857P138988J914245l081902k318705Q36652
3576g592120K21335k770876k229949J406171K366954P63887K847144Q264818P576048
3567A0853412k434648j0558015o441983L250342M292826l865432p940252j179698
$$ plain form
3626 -8300555 -13491912 -16626589 -11014158 -3905181 -3211814 -5263127 -3238044 398944
3618 398944 -715407 -4602594 -4291620 -367617 -612 -4402388 -7017385 -4843077 -2108907
3609 -2108907 -621313 4102930 12849460 17560027 12739222 5273919 4948987 9934039
3601 9934039 10681156 5665203 3334363 7864764 12405768 10042210 3950228 1315096
3593 1315096 2497599 2515395 182399 -696677 1552456 3548749 1568986 -4534007 -12266894
3584 -12266894 -18050241 -18172255 -12081398 -4942410 -3028165 -6110067 -8428772 -7592120
3576 -7592120 -7370785 -10141661 -12371610 -10965439 -8598485 -7834598 -4987454 3277364 10853412
3567 10853412 8418764 -2139251 -8581234 -5330892 -1038066 -4903498 -12843750 -14023448
3559a4023448P527321P761814J156133m326519o170272o557114n030957J54719
3551a9508323N621192N525664P79529j191897K438731N264006J544230m564781
3543d091649n091763j37376L018534J556426M79778K843298L869909p63420o449615
3534d765878n919341o72520J039570l441906p862229o656740j557116K959104
3526b6877056N144764M802098J875328j228260o97740K752405L825709R70966
3518i431786q99303P72856J276386k416783m520475M00452O789436N860902J80707
3509a987608l0252O320482R138238L057989m875138o720211l944324j745152o74441
3500a460417O58709N74019k225292m640553l793814j855278j609701j108605K269370
$$ plain form
3559 -14023448 -6496127 1265687 2421820 -1904699 -8074971 -14632085 -19663042 -19508323
3551 -19508323 -13887131 -8361467 -7581938 -8773835 -6335104 -1071098 473132 -4091649
3543 -4091649 -9183412 -9320788 -6302254 -4745828 -4266050 -1422752 2447157 1683737 -4765878
3534 -4765878 -10685219 -11357739 -10318169 -13760075 -21622304 -28279044 -29836160 -26877056
3526 -26877056 -21732292 -16930194 -15054866 -16283126 -16980866 -14228461 -10402752 -9431786
3518 -9431786 -10331089 -9558233 -8281847 -10698630 -15219105 -14818653 -8029217 -2168315 -1987608
3509 -1987608 -2017860 4302622 13440860 16498849 11623711 4903500 959176 -785976 -1460417
3500 -1460417 -801708 -227689 -2452981 -7093534 -10887348 -12742626 -14352327 -15460932 -13191562
3491a3191562O082338O623791N311372N362204M714939q81315q865944j1169089
3483f013266n439109J313663K556166M64498Q07787L497536L279735j124585l630824
3474d288399J025159Q573955R217135P03685p498734o480844o2384J522642k650840
3465F1375l798059Q92093K758657l517096r464998n486039L602957O178196J938303
3456f834611N15341M234758N006519n00752m718458k118382K131213J971579O2243
3447b50550R07297J779244j626319n831191m207256K108485N601359L176784r76833
3438F81020k519828j288415J094606L045661K736973R3613j617341J9421K216411
3429D462121J170913j153564N3767L844216M257775j3460l278422j923037K53674
$$ plain form
3491 -13191562 -7109224 -485433 4825939 10188143 14903082 14021767 5155823 -6013266
3483 -6013266 -11452375 -10138712 -7582546 -7118048 -6310261 -2812725 467010 -657575 -4288399
3474 -4288399 -3263240 5310715 14527850 15231535 7732801 1251957 1189573 2712215 61375
3465 61375 -3736684 -2844591 -85934 -3603030 -13068028 -18554067 -14951110 -8772914 -6834611
3456 -6834611 -6319270 -2084512 2922007 2421255 -2297203 -4415585 -2284372 -312793 -250550
3447 -250550 656747 2435991 809672 -5021519 -9228775 -7120290 -1518931 1657853 681020
3438 681020 -1838808 -3127223 -2032617 1013044 3750017 3843630 2226289 2245710 4462121
3429 4462121 5633034 4479470 4533237 8377453 12635228 12621768 9343346 7420309 7673983
3420G673983j230332m636116n662993m006706k061087l0178L191591N939952M877891
3411D056005o8411m918170n868371k461555K810356O154831M691279o05764m743338
3402i53138l865435j20246J294732k70716J47021N262477J0111122P872763o13882
3393A8864698p341490p315861m103307l376755m831789m386891j755486l69786
3385a4616667m61303J629944N895687O674132J719388k368810P31018O691356
3377E894745O107869j860208q673105q634848m850219k299440j748871k335508
3369a8399585l990144m819917j793682L185091L588001j962425n949981k419630
3361c2562272M181124O117349L698526K927655N129045O079648L916033J187455
$$ plain form
3420 7673983 6443651 1807535 -3855458 -7862164 -9923251 -9953429 -6761838 -821886 4056005
3411 4056005 3987594 -930576 -6798947 -9260502 -6450146 -295315 4395964 3790200 -953138
3402 -953138 -4818573 -4938819 -3644087 -3914803 -3767782 1494695 11605817 19478580 18864698
3393 18864698 11523208 4207347 104040 -3272715 -8104504 -12491395 -14246881 -14616667
3385 -14616667 -15077970 -13448026 -7552339 -878207 841181 -1527629 -796611 5894745
3377 5894745 12002614 10142406 1469301 -7165547 -12015766 -14315206 -16064077 -18399585
3369 -18399585 -22389729 -27209646 -29003328 -25818237 -22230236 -24192661 -30142642 -32562272
3361 -32562272 -28381148 -22263799 -18565273 -15637618 -10508573 -4428925 -512892 674563
3353F74563n23794k075361k918530j313524J347823J632645q5182N2308K563232
3344f45820L306605K87558l072845l296990j294298L34981O17019o97175l418044
3335g879009m825774j600655M324322O479642K903116m06370J443730M568498
3327E007500K689164k684181m686885j706440Q69089o70524l708205m474550l124073
3318a2489105j720484q19335l37690j130259l264314m444762k440809J709178
3310b4937580M552948L886351O29045k374743k704962k51043K528874L007670
3302a5663440J674737J823902M798180O907041L425966m602598j0211318q162342
3294b0009872p55757N453552O976699N395713L526285K554216K725600L898405
$$ plain form
3353 674563 150769 -1924592 -4843122 -6156646 -4808823 -3176178 -3261360 -3209052 -645820
3344 -645820 2660785 2948343 -124502 -3421492 -4715790 -4380809 -3763790 -4460965 -7879009
3335 -7879009 -12704783 -14305438 -9981116 -3501474 -598358 -1004728 439002 5007500
3327 5007500 7696664 5012483 325598 -1380842 -511753 -1182277 -4890482 -9365032 -12489105
3318 -12489105 -14209589 -15028924 -15366614 -16496873 -19761187 -24205949 -26646758 -24937580
3310 -24937580 -20384632 -16498281 -15869236 -18243979 -20948941 -21199984 -18671110 -15663440
3302 -15663440 -13988703 -12164801 -7366621 -459580 2966386 -1636212 -11847530 -20009872
3294 -20009872 -20765629 -15312077 -8335378 -2939665 586620 3140836 5866436 9764841
3286I764841M658622L189201j18975k834174l761838l865712l605444k327688
3278A098833j019125j915193l786377j966274L998920P242560K761488m079682
3270B335150m331231J693863N380221K819331o31059n9476J706082k43654n087251
3261C581976p892516n774069L90045P432372J0705566O597925k808532r890901
3253B341866q999009k339798L277453L767003N70677j814441k2379M522607N949829
3244G253808P52025o095893o260397L85416N028448K448643k134047k319968k94899
3235a236864j550253m707228l867556J254043M574300K631152j423055l330473
3227g655934k698319j481469p07737K18490K431833N734319P310760M292905j496919
$$ plain form
3286 9764841 14423463 17612664 17493689 14659515 10897677 7031965 3426521 1098833
3278 1098833 79708 -1835485 -5621862 -7588136 -3589216 3653344 6414832 2335150
3270 2335150 -1996081 -302218 5078003 7897334 7266275 7206799 8912881 8669227 3581976
3261 3581976 -4310540 -10084609 -9694564 -2262192 8443374 15041299 12232767 2341866
3253 2341866 -6657143 -8996941 -5719488 -1952485 -1381808 -3196249 -3218628 1303979 7253808
3244 7253808 8005833 1909940 -4350457 -3965041 1063407 3512050 1378003 -941965 -1236864
3235 -1236864 -2787117 -7494345 -11361901 -10107858 -5533558 -2902406 -4325461 -7655934
3227 -7655934 -10354253 -11835722 -12543459 -12324969 -9893136 -4158817 3151943 7444848 5947929
3218E947929m627165l537452k662608m381441m198992J152255N942165K905564
3210c459745m940070p967918l722062J135591K207163K318603L890609M280803
3202f257026J662700q85907p08461P8931r38093j862547n093L102824L701904
3193b110768R87283k224409k900424o04956K034744J620957j693244l112904Q57587
3184g146134O488714O665361K03241o658569p857154k691003N802777J2802373
3176G609606J2762661M627265l703462k692563N767707R463377K277661p687219
3168B8425033j0176694o042180k846681k846720k417918l15676N26220j196309
3160C109075k885449k098122L17059J438751r00136n712896q536785n605731Q50420
$$ plain form
3218 5947929 1320764 -2216688 -4879296 -9260737 -13459729 -12307474 -6365309 -3459745
3210 -3459745 -8399815 -16367733 -20089795 -18954204 -16747041 -14428438 -10537829 -6257026
3202 -6257026 -4594326 -5480233 -6188694 -6109763 -7047856 -8910403 -8915496 -5812672 -2110768
3193 -2110768 -1123485 -3347894 -6248318 -6853274 -4818530 -3197573 -4890817 -8003721 -7146134
3184 -7146134 -657420 6007941 6211182 -447387 -8304541 -10995544 -5192767 7609606
3176 7609606 20372267 24999532 21296070 18603507 24371214 33834591 36112252 28425033
3168 28425033 18248339 12206159 9359478 6512758 4094840 3779164 4305384 3109075
3160 3109075 223626 -1874496 -1557437 -118686 -1018822 -6731718 -15268503 -20874234 -20023814
3151b0023814M515239L266600J596533L010738M774515L370842N35422m86484
3143E59591o84793k184978k744495P07153N082465L989564k733080p857747o020161
3134a1886481P1516L891716K498636j515932l462994j045701L598193O211138
3126a639909N024191J991073p23751l121786n279964n744323l900588j532478
3118a4927535k04803N08018Q30218Q2355l10269K564726P013071O321907j507775
3109C69913q556990p133686j041128J05465m936316q141111m613334J565441M761714
3100b7620032M621085L409438J590712j112145l346145l306566j003930J616144
3092b5151439K219676L78750r61312J726379O999291Q786810M671368J03223O15963
$$ plain form
3151 -20023814 -15508575 -12241975 -10645442 -7634704 -2860189 510653 1046075 559591
3143 559591 -125202 -2310180 -5054675 -4347522 734943 4724507 1991427 -5866320 -11886481
3134 -11886481 -11814965 -7923249 -5424613 -6940545 -10403539 -11449240 -7851047 -1639909
3126 -1639909 3384282 5375355 4651604 1529818 -3750146 -9494469 -13395057 -14927535
3118 -14927535 -15132338 -14624320 -13794102 -13711747 -14022016 -11457290 -4444219 1877688 369913
3109 369913 -8187077 -15320763 -16361891 -16256426 -21192742 -29333853 -33947187 -32381746 -27620032
3100 -27620032 -22998947 -19589509 -17998797 -19110942 -22457087 -25763653 -26767583 -25151439
3092 -25151439 -22931763 -22553013 -23514325 -21787946 -14788655 -6001845 -1330477 -1227254 -611291
3083f11291L624032L082733r14036l350623k854551k448548k996131k432939r46805
3074i848159o28804l36651K743892O588142O034135J384659j320774N15065L080056
3065H211561L396854K863407K079012r77251n252497n667067r18104L531960L351750
3056A0619625Q78948j98603l60364j186645j752785j466773k059659l787052m071359
3047c384667k425685j763405k347103k29479N110350P784626M326986m59057j281913
3038E330653j98091j220486k746191j785687p68597l007869n465670l474468O98723
3029a2637683J679653N76438K593313O937621P607554L643636L29143j19969r76999
3020I632707l032781k346308J550709K771561j765683o663792o094482k240843
$$ plain form
3083 -611291 3012741 6095474 5181438 1830815 -1023736 -3472284 -6468415 -8901354 -9848159
3074 -9848159 -10476963 -10813614 -8069722 -1481580 4552555 5937214 4616440 5131505 8211561
3065 8211561 11608415 14471822 16550834 15573583 10321086 4654019 3735915 7267875 10619625
3056 10619625 11498573 11299970 10939606 9752961 8000176 6533403 4473744 686692 -3384667
3047 -3384667 -5810352 -7573757 -9920860 -10150339 -5039989 2744637 7071623 6612566 5330653
3038 5330653 5132562 3912076 1165885 -619802 -1388399 -4396268 -9861938 -13336406 -12637683
3029 -12637683 -10958030 -10381592 -7788279 -850658 6756896 10400532 10729675 10609706 9632707
3020 9632707 6599926 4253618 5804327 8575888 6810205 146413 -5948069 -8188912
3012h188912n51607q34699Q90768M210091M401967M30768k748793j333454K050990
3003a672881K572130j61076k596596k791949k154879j838499p63455J468204K485954
2994e453047L97591k720229l438512j936990j258588k265308k674698j032784
2986b0382565J592481L937232N358571M585377J439053n74236J814806N183652
2978B954371K923630l861834o136205l49520N448341L704408j487555k025987
2970A169649J286784J678583j719953l661873k384612j177470j297524r56063
2962g062479q92427l494408o389590m428550J291894L793292Q41775k118756j490956
2953a9950205n11078j822724k348951K13202K260339Q82596J59939M723965J1017819
$$ plain form
3012 -8188912 -8740519 -9575218 -8684450 -4474359 -72392 358376 -2390417 -3723871 -1672881
3003 -1672881 899249 738173 -1858423 -4650372 -6805251 -8643750 -9407205 -7939001 -5453047
2994 -5453047 -5055456 -7775685 -11214197 -13151187 -14409775 -16675083 -19349781 -20382565
2986 -20382565 -18790084 -14852852 -9494281 -4908904 -3469851 -4044087 -2229281 2954371
2978 2954371 5878001 2016167 -4120038 -4469558 978783 4683191 3195636 1169649
2970 1169649 2456433 4135016 2415063 -1246810 -3631422 -4808892 -6106416 -7062479
2962 -7062479 -7954906 -11449314 -17838904 -22267454 -20975560 -17182268 -16340493 -18459249 -19950205
2953 -19950205 -20461283 -22284007 -24632958 -24419756 -22159417 -21276821 -21116882 -16392917 -5375098
2944e375098J1652369O262640J535368J188688K103611J110372j67268J63441
2936A8474123n73513n493052j1228305j0322708j449374P145380P473740J976816
2928F003107p38510J492752K411890j474218m872041k437060K563701L688408
2920F638029P88144j990368l879261o440417p715177m605548P41576L755116M644069
2911h063837N652883L908576l749171j0769530p120198M075917Q269924N81431
2903g214005p102892n074102L62958k45620l789259k124119L057718M385414K047235
2894a5696672J437736J724066j681669n831678l234206M420712O843400P65787
2886a1252524n197599l780062J929852N886928P110512O241378J764713m998384
$$ plain form
2944 -5375098 6277271 12539911 14075279 15263967 17367578 18477950 18310682 18474123
2936 18474123 17900610 12407558 1179253 -9143455 -10592829 -3447449 4026291 6003107
2928 6003107 5264597 6757349 9169239 7695021 2822980 385920 2949621 6638029
2920 6638029 7426173 5435805 1556544 -4883873 -12599050 -17204598 -16463022 -12707906 -8063837
2911 -8063837 -2410954 1497622 -2251549 -13021079 -20141277 -16065360 -7795436 -7214005
2903 -7214005 -14316897 -19390999 -19028041 -19273661 -23062920 -25187039 -22129321 -17743907 -15696672
2894 -15696672 -14258936 -12534870 -14216539 -20048217 -23282423 -18861711 -12018311 -11252524
2886 -11252524 -16450123 -20230185 -18300333 -12413405 -5302893 938485 2703198 -2295186
2878b295186p424866k312920L497892J682842n439949q015045k603482L652078
2870a9258636L851475N39024N69054M244003M779034j214763p461138n740369
2862a9692316K478436P235961L285391l235902m131782l81712J057936j351224
2854a4735212k197686J284915M560702K983359j078414j716100K498569P134143
2846a265724P519534L496833j230294l243295k684824k406011l786185m515793
2838h115759j816607L172464O328298N479779K320085m39998j607564j045614
2830D275084R97798L215336L547122J267532j914922l339605j730423J621886
2822G939808L612528K065154j655241l851942k975821j314196j311982k389321
$$ plain form
2878 -2295186 -9720052 -12032972 -8535080 -6852238 -12292187 -20307232 -22910714 -19258636
2870 -19258636 -15407161 -14868137 -14299083 -10055080 -5276046 -6490809 -13951947 -19692316
2862 -19692316 -17213880 -9977919 -6692528 -9928430 -14060212 -14441924 -13383988 -14735212
2854 -14735212 -16932898 -15647983 -11087281 -8103922 -9182336 -10898436 -8399867 -1265724
2846 -1265724 6253810 9750643 8520349 5277054 2592230 186219 -3599966 -8115759
2838 -8115759 -9932366 -6759902 -431604 5048175 7368260 6928262 5320698 4275084
2830 4275084 5272882 8488218 12035340 13302872 11387950 8048345 6317922 7939808
2822 7939808 11552336 13617490 11962249 8110307 5134486 3820290 2508308 118987
2814A18987l001346l464833m374695m331505j992201J342801L688099M862009
2806g152684M577095J130008m397535o043031k98811P039262P426267J229791
2798C510362l695035l849166l058652l727979l241363o59170Q02652O29303K808203
2789a0480845P223387O845376j215729q531907o001240L141775Q040990M698169
2781C719976j129136l419390j720968J513747L598027J985767l002572o185145
2773d639694k993493L365018N072115J95786m845130m286676K2205K551352J345268
2764d213249j262400l038056m296913o267622q371469p838312k750481M500287
2756c3538215Q536412O907193K932698J084170J538637J592325N03771j57790
$$ plain form
2814 118987 -2882359 -6347192 -10721887 -15053392 -17045593 -15702792 -12014693 -7152684
2806 -7152684 -2575589 -1445581 -5843116 -11886147 -12184958 -5145696 2280571 3510362
2798 3510362 -184673 -4033839 -7092491 -10820470 -14061833 -14721003 -13918351 -13289048 -10480845
2789 -10480845 -3257458 3587918 2372189 -6159718 -12160958 -9019183 -978193 3719976
2781 3719976 2590840 -828550 -2549518 -1035771 2562256 4548023 1545451 -4639694
2773 -4639694 -7633187 -4268169 803946 999732 -3845398 -8132074 -8109869 -5558517 -4213249
2764 -4213249 -5475649 -8513705 -12810618 -19078240 -27449709 -35288021 -38038502 -33538215
2756 -33538215 -25001803 -18094610 -15161912 -14077742 -12539105 -10946780 -10443009 -10600799
2748a0600799K99378J262720K555517L546935J722263m136548r992020r831765
2740b5174319l153599M385507Q057348Q132181O444565L167702j206575m182061
2732c529251m015416j916706L37187K706316M885494M427519j86018n776090o748293
2723i815258j399853N873272R180038O900604K368396n26220j447324k837496
2715H296159n660797p569357o068721j984675J849807M256169N850364O083570
2707E052519K982567l263751q593522q726608l886777J451469L568684L196776
2699h218643L315838L901940J405867m949901r205022n479641K366476M163287
2691a2699799k212187p035091l294641K182271m19428p537522p084579K520823
$$ plain form
2748 -10600799 -10301421 -9038701 -6483184 -2936249 -1213986 -5350534 -15342554 -25174319
2740 -25174319 -28327918 -23942411 -15885063 -7752882 -1308317 1859385 652810 -3529251
2732 -3529251 -7544667 -9461373 -9124186 -6417870 -1532376 2895143 2709125 -3066965 -9815258
2723 -9815258 -11215111 -5341839 3838199 10738803 13107199 12580979 11133655 8296159
2715 8296159 2635362 -4933995 -11002716 -12987391 -11137584 -6881415 -1031051 5052519
2707 5052519 8035086 4771335 -3822187 -12548795 -16435572 -14984103 -11415419 -8218643
2699 -8218643 -4902805 -1000865 405002 -4544899 -13749921 -19229562 -16863086 -12699799
2691 -12699799 -14911986 -21947077 -25241718 -23059447 -23478875 -31016397 -38100976 -35580153
2683c5580153R540235O517052r774j494108M06901Q1211j104833J583412O262710
2674a3797347O551738J823611k009570j516204P00237J751752K192364K820324
2666a483095K404723N26054o65502L66048J721711L48331l810778p247185o458181
2657a4297874j839784K336010K588476M15952m0712J717527J838327j301455l669408
2648a2252941j420389L154652N232584M492172M220979M991050L927420M0828
2640A2386355l795729m745242k974849n23370M48895j301438m444315n343864
2632a0293557k547744M10077j18730k015216p35071K904745L789200J015851p80776
2623h371221L54420M24039k923014n163805j449705N581136Q998264O153153L31268
$$ plain form
2683 -35580153 -26039918 -19522866 -19532640 -21026748 -20619847 -20538636 -21643469 -20060057 -13797347
2674 -13797347 -7245609 -5421998 -7431568 -8947772 -8247535 -6495783 -4303419 -1483095
2666 -1483095 921628 1447682 782180 1148228 2869939 3218270 -592508 -7839693 -14297874
2657 -14297874 -16137658 -13801648 -11213172 -10797220 -10837932 -9120405 -7282078 -8583533 -12252941
2648 -12252941 -13673330 -10518678 -5286094 -793922 3427057 8418107 12345527 12386355
2640 12386355 8590626 3845384 870535 347165 796060 -505378 -4949693 -10293557
2632 -10293557 -12841301 -12431224 -12549954 -14565170 -15300241 -12395496 -8606296 -7590445 -8371221
2623 -8371221 -8016801 -7592762 -10515776 -15679581 -17129286 -11548150 -2549886 3603267 3934535
2614C934535m120219m861137j612434L241694N279482K548101j355406j539134
2606A515482J779530M083503K948080K36556j967334m013535o132799o226544
2598g777061k589775K478118M315541J556869j568105j43822M786924O805052
2590G863741K348503m040287n435199j868776K02749k309623m748475k133269
2582a0120636L318170N711767L695167R77514Q5961k24976j504543l133299m003989
2573e198864m057496l314257j353847J371341L123532K615646M32619j606179
2565g987505k004274o28360J236428K029405J370371p1190j937018l980706m487102
2556a6459951j321818M271195P339082M730098r14257m748073n322206m105482
$$ plain form
2614 3934535 -185684 -5046821 -6659255 -3417561 1861921 4410022 3054616 1515482
2606 1515482 3295012 7378515 10326595 10563151 8595817 4582282 -1550517 -7777061
2598 -7777061 -10366836 -7888718 -3573177 -2016308 -3584413 -3728235 1058689 7863741
2590 7863741 10212244 6171957 736758 -1132018 -929269 -3238892 -7987367 -10120636
2582 -10120636 -6802466 -1090699 2604468 3581982 3667943 3442967 1938424 -1194875 -5198864
2573 -5198864 -9256360 -12570617 -13924464 -12553123 -9429591 -6813945 -6381326 -7987505
2565 -7987505 -9991779 -10620139 -9383711 -7354306 -5983935 -6055125 -7992143 -11972849 -16459951
2556 -16459951 -17781769 -13510574 -6171492 -1441394 -2355651 -7103724 -12425930 -16531412
2548a6531412j637227K110610M861875L902180P98087J28287K707612L971542
2540C11554P98307l471388l483458Q96800M761995M557822J510296j331910k888382
2531A661636l515153k391205J760981O880655P442349J008829o607648o926002
2523f85558K29394N964537M269688k26535j99074L176621K929897k300890o415189
2514F742891n245667j607715K38140o4255r19072j611405j198020J535485M975428
2505B845810N064141Q21899l706252m813412l166857q46725J766603L775106K394518
2496D134831k734297o850707n352878K51505M728808N468463L561870O36449k129045
2487A714999l322226k596552j531854j020324M58737L718075O224027N298586
$$ plain form
2548 -16531412 -18168639 -16058029 -11196154 -7293974 -6495887 -6367600 -3659988 311554
2540 311554 1109861 -2361527 -5844985 -4948185 -186190 4371632 5881928 4550018 1661636
2531 1661636 -1853517 -4244722 -2483741 4396914 11839263 12848092 6240444 -685558
2523 -685558 -456164 5508373 9778061 9551526 9352452 12529073 15458970 13158080 6742891
2514 6742891 1497224 -110491 127649 63394 -855678 -2467083 -3665103 -2129618 2845810
2505 2845810 7909951 8731850 5025598 212186 -2954671 -3801396 -2034793 1740313 4134831
2496 4134831 1400534 -5450173 -10803051 -10551546 -5822738 -354275 3207595 3844044 1714999
2487 1714999 -1607227 -4203779 -5735633 -6755957 -6297220 -2579145 3644882 8943468
2479H943468J882692j613882m828580p739128q157099m886202j097075k10615
2471a7706421m30499J920930N556861O258655M430539M294875N715813L600472
2463A3641225l081472q051647o455503j751988k86137k771308m844344l493183
2455a7094357K73371L341873K760468k003111p152349p077148p69030O332536
2447b1387747Q685466O563145L856048K679756K615756K850963K253424o04461
2439G512350m686509n878870k285892J972674K078711j77417Q06979N115185O350583
2430A0807794J241921m841608m940927M82420N215047N675185L508949P36582
2422A7885363l128579p868956j0197185p624256k855705q64477j954197j403143
$$ plain form
2479 8943468 10826160 9212278 4383698 -3355430 -11512529 -16398731 -17495806 -17706421
2471 -17706421 -18136920 -16215990 -10659129 -4400474 30065 4324940 10040753 13641225
2463 13641225 10559753 2508106 -3947397 -5699385 -5985522 -8756830 -13601174 -17094357
2455 -17094357 -16820986 -13479113 -10718645 -12721756 -19874105 -26951253 -27720283 -21387747
2447 -21387747 -12702281 -6139136 -2283088 396668 3012424 5863387 8116811 7512350
2439 7512350 2825841 -3053029 -5338921 -3366247 -1287536 -1464953 -657974 4457211 10807794
2430 10807794 12049715 7208107 2267180 2749600 7964647 13639832 17148781 17885363
2422 17885363 14756784 6887828 -3309357 -10933613 -13789318 -14653795 -16607992 -18011135
2414a8011135K878626O040171K824217l951164o012555n33601O129628P098208
2406c537605L314135K71161m25757j793429m973343o782141m720687p68775J694429
2397a7722012K063374J411827l83018l288907m416081p23768N473290P783156
2389i802139L979631q33844j821628j294157l566833o081560k472958N962016
2381a5931472R467067L158131n348075o184514m9321M810043M529535J979402
2373c569204l75641k736365l701706q18444L637200L743544j322156n210278l505807
2364a3858857K06462N74187j587843j570941J893148N438239N837704L228002
2356A60101K06995j015338j230804l537174q138972r543647l271852N836406Q356071
$$ plain form
2414 -18011135 -15132509 -9092338 -6268121 -10219285 -16231840 -16765441 -10635813 -3537605
2406 -3537605 -223470 47691 -378066 -2171495 -7144838 -13926979 -18647666 -19416441 -17722012
2397 -17722012 -15658638 -14246811 -14629829 -17918736 -22334817 -23058585 -17585295 -9802139
2389 -9802139 -5822508 -6656352 -8477980 -9772137 -13338970 -19420530 -21893488 -15931472
2381 -15931472 -6464405 -3306274 -8654349 -14838863 -14888184 -10078141 -5548606 -3569204
2373 -3569204 -3944845 -6681210 -10382916 -11201360 -7564160 -3820616 -5142772 -10353050 -13858857
2364 -13858857 -13652395 -13078208 -14666051 -16236992 -14343844 -8905605 -3067901 160101
2356 160101 367096 -648242 -1879046 -5416220 -13555192 -23098839 -26370691 -20534285 -12178214
2347a2178214L589595N73984L748907O203059J974435l260996j481744M080035
2339C249061M027710k297631o718000n440765l006672k725687j748892K274365
2331a2386511O484162P472225N727358L356990J352241L54304M19029n37801m210277
2322H031720p777129o662002j495351K272732J813673p70006l398774n772999
2314a3758136o011020j726441M425556O340839L150476M02997J051608J771187
2306d352934M43084K99116L097705M725614J972243k050133l636408l985727m405260
2297g892700k123137L368220N673342L83384o123561m796939K499640N916106
2289c095645K283919j550342Q0189M687680O962119N032733J36824n030774o707790
$$ plain form
2347 -12178214 -8588619 -8014635 -4265728 1937331 3911766 650770 -830974 3249061
2339 3249061 7276771 4979140 -1738860 -7179625 -10186297 -12911984 -14660876 -12386511
2331 -12386511 -5902349 1569876 7297234 10654224 12006465 12360769 12779798 12241997 8031720
2322 8031720 254591 -6407411 -7902762 -5630030 -3816357 -4586363 -7985137 -13758136
2314 -13758136 -19769156 -21495597 -17070041 -10729202 -7578726 -7175729 -6124121 -4352934
2306 -4352934 -3909850 -3610734 -513029 4212585 6184828 4134695 498287 -3487440 -7892700
2297 -7892700 -10015837 -6647617 -974275 -590891 -6714452 -11511391 -9011751 -3095645
2289 -3095645 -811726 -2362068 -2281879 2405801 9367920 14400653 14537477 9506703 2798913
2280B798913l183897J829554K887030k6631k001542o04130J672236K362383J894138
2271G628054J073830j51175r64808l23531P93233J196732K339141N072036N492881
2262B2156393M9319o604460o286736L13855M054071J207410j898163p75458j8913
2253A2197318l573177o277407k478831L325061K742205l792130q444514p194721
2245a3496196k286439L828078R197336R017883K18088j0756572j3083219n800503
2237b3161544O79313o39383m555722l248521K310985N992796O396512O511997
2229i713567O425610L307650j782230l351598N68611M575257K904629k585981
2221C48381m886544j136951M016504M935488J915363n23477m71496m37463k186551
$$ plain form
2280 2798913 -384984 1444570 4331600 4304969 2303427 1699297 3371533 5733916 7628054
2271 7628054 8701884 8550709 7585901 7262370 8055603 9252335 11591476 16663512 22156393
2262 22156393 22205712 15601252 9314516 9628371 13682442 14889852 12991689 12216231 12197318
2253 12197318 8624141 2346734 -132097 3192964 5935169 2143039 -6301475 -13496196
2245 -13496196 -15782635 -11954557 -2757221 6260662 6478750 -4277822 -17361041 -23161544
2237 -23161544 -22482231 -23121614 -27677336 -30925857 -28614872 -22622076 -16225564 -9713567
2229 -9713567 -3287957 19693 -1762537 -5114135 -4545524 29733 2934362 348381
2221 348381 -4538163 -5675114 -1658610 3276878 5192241 4668764 4197268 3759805 1573254
2212A573254l199188n14070L935623M957912Q07278m413408n770258k991248J99159
2203e414946R46053m3138l50737R33272K441891K461763Q27799j203784k231109
2194a632936j528982M28327J578346k01876l706677m216042N38201N552471L894283
2185G05115l232257o827316k102509M928017N987079J141470l323602l804982
2177f528985j259460K531433N029801K145082o192308j1842727p186770L123136
2169b0180798P114715J942074l472318l200288j585027k291320o05263O447287
2161a5830938J1241257O278602k395377k943499M651511R155748M767951k783816
2153A2141439o938726p586175o116157k026279K616178K940111r85706k737708
$$ plain form
2212 1573254 -1625934 -2140004 1795619 6753531 7560809 3147401 -2622857 -5614105 -5414946
2203 -5414946 -4468893 -4512031 -4862768 -3929496 -1487605 974158 1801957 598173 -1632936
2194 -1632936 -3161918 -2733591 -1155245 -1357121 -5063798 -9279840 -8741639 -3189168 705115
2185 705115 -2527142 -9354458 -11456967 -6528950 -541871 599599 -2724003 -6528985
2177 -6528985 -7788445 -5257012 -227211 1917871 -4274437 -16117164 -23303934 -20180798
2169 -20180798 -13066083 -11124009 -14596327 -17796615 -19381642 -21672962 -22278225 -15830938
2161 -15830938 -4589681 1688921 -706456 -3649955 1001556 10157304 14925255 12141439
2153 12141439 5202713 -2383462 -8499619 -10525898 -7909720 -4969609 -5955315 -8693023
2145h693023O10569L542264J033776l578449m488644j927228M45579K015905L491236
2136g548015K785792j246901m167838j330187M451138O645217M268263J211939
2128E069408j501564n531573q476893n382293K339424O965281N085120J329785
2120a03305l91191k111863n104861n148891L68285O139930N566635k8582m117457
2111d931300l894092j505590R79929K814179K819656J041225K92272J847223K038649
2102A502151k083960o408423n015633K38373K131172r51030l607325k988721k227912
2093a9411308k921289j650006L026144O621876N599071K734682J635156R03021
2085c462653j751022m028226k736086L96748J463942K32757j109958k189468k912303
$$ plain form
2145 -8693023 -8082454 -4540190 -3506414 -7084863 -11573507 -13500735 -13055156 -11039251 -7548015
2136 -7548015 -4762223 -6009124 -10176962 -11507149 -7056011 -410794 3857469 5069408
2128 5069408 3567844 -1963729 -10440622 -15822915 -13483491 -6518210 -1433090 -103305
2120 -103305 -494496 -2606359 -7711220 -12860111 -12491826 -6351896 -785261 -813843 -4931300
2111 -4931300 -8825392 -10330982 -9351053 -6536874 -3717218 -2675993 -2383721 -536498 1502151
2102 1502151 -581809 -6990232 -12005865 -11767492 -9636320 -10587350 -14194675 -17183396 -19411308
2093 -19411308 -22332597 -23982603 -20956459 -14334583 -8735512 -6000830 -4365674 -3462653
2085 -3462653 -5213675 -9241901 -11977987 -11581239 -10117297 -9884540 -10994498 -13183966 -16096269
2076a6096269p85020M906031Q781068N189773l158991q147735o739518k814682
2068a8865343M09426L263246M946860K855062j759180l342521L47725M883753
2060g260972N551209K847703k84287k497641l308942k283392q29723j062774j627810
2051a0756629Q49529M953345M806737n55560m354943k114247J707082J856827
2043c607859R53691L683611P499887O659776J912525j573678l119421n217703
2035G190829n598972n1306P255845O272912m011406j2275004j0284267l572306
2027a5073675j518162l677584k975860J971844N419892L905591N48239o64126
2019a2063841j91953r47449l662958n932740n074670j172580K909118M718642
$$ plain form
2076 -16096269 -16881289 -11975258 -3194190 1995583 -1163408 -9311143 -16050661 -18865343
2068 -18865343 -18455917 -15192671 -10245811 -7390749 -9149929 -12492450 -12144725 -7260972
2060 -7260972 -1709763 1137940 853653 -1643988 -4952930 -7236322 -8066045 -9128819 -10756629
2051 -10756629 -9907100 -4953755 -147018 -702578 -5057521 -7171768 -5464686 -3607859
2043 -3607859 -2654168 1029443 8529330 15189106 17101631 15527953 12408532 7190829
2035 7190829 1591857 1540551 8796396 15069308 11057902 -1217102 -11501369 -15073675
2027 -15073675 -16591837 -20269421 -23245281 -21273437 -15853545 -11947954 -11399715 -12063841
2019 -12063841 -12255794 -13203243 -16866201 -22798941 -27873611 -29046191 -26137073 -21418431
2011b1418431M728171M605433M100809K028151l36456j32594K515527M078335
2003A68945K523579m38414k689374l916623l749783j586570N19938r07483m792612
1994a4868397n201980M33693P177174R728046R189079Q766549P186590J742725
1986B4153479n271911q822758p824849m618462k8196N509940P885596L052293
1978A4035132n425454q857941m465861J324245J886890k099174n881949p056289
1970a6540401o222311m204806j306886J785697L797338L508107J190995k85894
1962a8278161J897379N464187M346748j971325n068336Q61771Q282966N419773
1954I55002o079851j2372380o800791J968723M131217J493049O19097J328535
$$ plain form
2011 -21418431 -16690260 -12084827 -7984018 -5955867 -6292323 -6424917 -3909390 168945
2003 168945 2692524 2254110 -435264 -4351887 -8101670 -9688240 -9168302 -10075785 -14868397
1994 -14868397 -20070377 -19636684 -12459510 -2731464 6457615 15224164 22410754 24153479
1986 24153479 18881568 10058810 2233961 -2384501 -2412697 3097243 10982839 14035132
1978 14035132 8609678 -248263 -4714124 -3389879 -1502989 -3602163 -9484112 -16540401
1970 -16540401 -22762712 -26967518 -28274404 -26488707 -22691369 -19183262 -17992267 -18278161
1962 -18278161 -16380782 -10916595 -6569847 -8541172 -13609508 -12747737 -4464771 955002
1954 955002 -5124849 -17497229 -24298020 -22329297 -18198080 -16705031 -16085934 -14757399
1946a4757399m32577l487091l074174R19153L967098L956192K986034K766704
1938g156060K360680K61517l894225q721514j0499442n646567L860306J0344846
1930a9090459Q648252J998660k967505l956631k709815m75442J988953K639760
1922a3924227P93852n04485J310012M000695M310252L408112M051030M880616
1914H325857K802357q10767j722639M76476K296169J998303O19837j474699m235985
1905H274909n363150l063768n5467K58362k89365J508235K719235j530475p567742
1896e109226o302162K184112P014555K763141k171291Q69746P080406O084034
1888A2413315j895268o808433l653454J652755J845621k579115n986522n321018
$$ plain form
1946 -14757399 -15189976 -18677067 -21751241 -20832088 -16864990 -12908798 -9922764 -7156060
1938 -7156060 -4795380 -4533863 -8428088 -17149602 -27649044 -33295611 -29435305 -19090459
1930 -19090459 -10442207 -8443547 -11411052 -15367683 -18077498 -18552940 -16563987 -13924227
1922 -13924227 -13130375 -13634860 -12324848 -8324153 -4013901 -605789 3445241 8325857
1914 8325857 11128214 10317447 8594808 9071284 11367453 13365756 13985593 12510894 8274909
1905 8274909 2911759 -152009 -207476 50886 -238479 1269756 3988991 2458516 -5109226
1896 -5109226 -11411388 -9227276 -2212721 550420 -1620871 -751125 6329281 12413315
1888 12413315 10518047 3709614 56160 1708915 3554536 975421 -5011101 -10332119
1880a0332119k495281o77167m13349O0030J340273J302229j642934m985079m402905
1871b2246302O41161O138687Q238064O173309J092961m635947p261403m724792
1863a6584262r6624J903576J571425K720099M881801L312435k186245n305630
1855i783425k549767K070603M689879O889928R174343O682525k128953r002911
1847F042222o153893J648919L834788n05974l038933k61249K339631O40295k200615
1838B345191k307661p08188K48243P60446J445742J558943J069374P96783k99813
1829D909060l694361o622354m117755K739443O081483J668224m606738m450061
1821h093059J937371O894840N486073P76558j081055J396263L351777k07963p062044
$$ plain form
1880 -10332119 -12827400 -13504567 -13917916 -13857886 -12517613 -11215384 -12858318 -17843397 -22246302
1871 -22246302 -21605141 -15466454 -7228390 -1055081 37880 -4598067 -11859470 -16584262
1863 -16584262 -16680886 -14777310 -13205885 -10485786 -5603985 -2291550 -4477795 -9783425
1855 -9783425 -12333192 -10262589 -5572710 1317218 10491561 17174086 15045133 6042222
1847 6042222 -111671 1537248 5372036 4866062 1827129 1565880 3905511 4545806 2345191
1838 2345191 37530 -670658 -422415 338031 1783773 3342716 4412090 5208873 4909060
1829 4909060 1214699 -5407655 -9525410 -6785967 -704484 963740 -3642998 -8093059
1821 -8093059 -6155688 739152 6225225 7001783 5920728 7316991 10668768 10460805 3398761
1812C398761q956598j967252O997217Q156739J608568l524583k476445o05818
1804B630589l527814p934091p121815j452502K433499J050677k286512k868136
1796a9076105K58742M697323P185790N319023n69739o430232p328397k363893
1788a8307488M171317P182153N619458K457531O07891R3471m58993r65238l69956
1779C0146M54780r25210m233794n519740k814511m4123j607454n037660l975658
1770b3673224K111781O641690N416743K140856J804480L122566J722092k087289
1762b800305l661451j302051J314919Q40038j147615j360061l48827j552340n063214
1753a5080907o046264j594027L707163L298881j558753l111876J219001N059035
$$ plain form
1812 3398761 -5557837 -7525089 -527872 7628867 9237435 5712852 3236407 2630589
1804 2630589 -897225 -8831316 -15953131 -17405633 -14972134 -13921457 -16207969 -19076105
1796 -19076105 -18817363 -14120040 -6934250 -1615227 -2184966 -8615198 -15943595 -18307488
1788 -18307488 -14136171 -6954018 -1334560 1122971 1730862 1824333 1365340 400102 30146
1779 30146 484926 -440284 -4674078 -10193818 -13008329 -13052452 -14659906 -19697566 -23673224
1770 -23673224 -21561443 -14919753 -9503010 -7362154 -5557674 -2435108 -713016 -2800305
1762 -2800305 -6461756 -7763807 -6448888 -5608850 -6756465 -8116526 -8465353 -10017693 -15080907
1753 -15080907 -21127171 -22721198 -19014035 -15715154 -17273907 -20385783 -19166782 -14107747
1745a4107747L809718K226272N635445R618645O517691j796355o801383o613044
1737a510758o593920p698070n005274J054855L100996m17225j533661L305953
1729a5297104O056372P20870n320824k702415M700695O257037J172586k047073
1721f459856J35406K804935K490658J351555R48287l47911k353526j750105K563540
1712f17017P254456Q585722N446889r60699p127782q579113m987210j768998k618454
1703e372206l667024j30649N002200N594748K410985Q41670J201257j83205k145064
1694C552712l99915K739267M15102o455639q969084m041930J326430J992792J100612
1685h739653J380616l8400l628757l787200J254924M572245J687040j791211l61393
$$ plain form
1745 -14107747 -10298029 -8071757 -2436312 7182333 13700024 11903669 5102286 -1510758
1737 -1510758 -8104678 -15802748 -20808022 -19753167 -16652171 -17069396 -18603057 -15297104
1729 -15297104 -9240732 -8519862 -13840686 -16543101 -11842406 -5585369 -4412783 -6459856
1721 -6459856 -6324450 -3519515 -1028857 322698 1270985 923074 -1430452 -3180557 -617017
1712 -617017 6637439 15223161 20670050 19709351 12581569 4002456 -984754 -2753752 -5372206
1703 -5372206 -9039230 -9169879 -4167679 1427069 3838054 4679724 5880981 5697776 3552712
1694 3552712 3152797 5892064 6307166 -148473 -9117557 -13159487 -11833057 -9840265 -8739653
1685 -8739653 -7359037 -7397437 -11026194 -14813394 -13558470 -8986225 -7299185 -9090396 -9451789
1676i451789J767911r30212m954516m645234k574668l384655l343659K952612
1668b4564210J0136753Q457762J39652k961216K314759O463293L349541j093394
1660B242940m1588L886593M666009J935476j252324m057209o219070n494146j681255
$$ plain form
1676 -9451789 -7683878 -8614090 -13568606 -18213840 -20788508 -24173163 -27516822 -24564210
1668 -24564210 -14427457 -5969695 -5830043 -8791259 -6476500 -13207 3336334 2242940
1660 2242940 2201352 6087945 10753954 12689430 11437106 7379897 1160827 -4333319 -6014574
$$ [...]
##END NTUPLES=NMR SPECTRUM
##END=
