##TITLE=31Pdec_DE-133rm_3h
, 24 sc
 10.3.2026
##JCAMPDX= 6.0         $$ Bruker NMR JCAMP-DX V2.0
##DATA TYPE= NMR SPECTRUM
##DATA CLASS= NTUPLES
##ORIGIN= UXNMR, Bruker Analytische Messtechnik GmbH
##OWNER= root
$$ XWIN-NMR		Version 3.5
$$ Tue Mar 10 13:37:58 2026 Russian Standard Time (UT+4h)  she@DPX200
##.OBSERVE FREQUENCY= 81.013821
##.OBSERVE NUCLEUS= ^31P
##.ACQUISITION MODE= SIMULTANEOUS
##.ACQUISITION SCHEME= undefined
##.AVERAGES= 24
##.DIGITISER RES= 17
##SPECTROMETER/DATA SYSTEM= spect
##.PULSE SEQUENCE= zgpg30
##.SOLVENT NAME= CDCl3
##.SHIFT REFERENCE= (INTERNAL, CDCl3, 0, 197.392)
##AUDIT TRAIL= $$ (NUMBER, WHEN, WHO, WHERE, WHAT)
$$ ##TITLE= Audit trail, XWIN-NMR		Version 3.5
$$ ##JCAMPDX= 5.01
$$ ##ORIGIN= Bruker BioSpin GmbH
$$ ##OWNER= she
$$ F:/spectra/data/she/nmr/P31/2/pdata/1/auditp.txt
$$ ##AUDIT TRAIL=  $$ (NUMBER, WHEN, WHO, WHERE, WHAT)
(   1,<2026-03-10 13:36:35.20 +0400>,<she>,<DPX200>,
      <created by zg, POWCHK disabled, PULCHK disabled
       configuration hash MD5:
       00 E9 B6 7A A2 85 ED C7 34 08 36 98 17 FE 4E 26
       data hash MD5: 32K
       5C AA 2E 53 F7 8B B7 DD C2 4D D8 F2 BD CA C4 AC>)
(   2,<2026-03-10 13:36:44.10 +0400>,<she>,<DPX200>,
      <Start of raw data processing
       efp BC_mod = 2 LB = 1.5 FT_mod = 6 PKNL = 1 PHC0 = 1393.078 PHC1 = 70.10066 SI = 64K 
       data hash MD5: 64K
       12 FD FB 2A 50 35 1D 97 4C FC D0 8D 85 7D B2 27>)
(   3,<2026-03-10 13:37:09.92 +0400>,<she>,<DPX200>,
      <pk PHC0 = -1.955185 PHC1 = 0 
       data hash MD5: 64K
       E8 D2 86 95 12 56 BE C2 2D BF 3A BF 8E 48 C7 4B>)
(   4,<2026-03-10 13:37:23.76 +0400>,<she>,<DPX200>,
      <abs ABSG = 5 
       data hash MD5: 64K
       DE 5B 8C 23 90 FE A8 24 2B BF D3 72 3F 99 1E F9>)
$$ ##END=
$$ 
$$ hash MD5
$$ 01 B0 F6 31 56 B6 0E B5 4F 7E 34 92 0A 28 C5 B5
##$RELAX= 
##$RELAX= 
##$RELAX= 
##$RELAX= 
##$RELAX= 
##$RELAX= 
##$RELAX= 
##$RELAX= 
$$ Bruker specific parameters
$$ --------------------------
##$DU= <F:/spectra>
##$EXPNO= 2
##$NAME= <P31>
##$PROCNO= 1
##$TYPE= <nmr>
##$USER= <she>
##$AMP= (0..31)
100 100 100 100 100 100 100 100 100 100 100 100 100 100 100 100 100 100 
100 100 100 100 100 100 100 100 100 100 100 100 100 100 
##$AQSEQ= 0
##$AQ_mod= 1
##$AUNM= <au_zg>
##$AUTOPOS= <>
##$BF1= 81.014009
##$BF2= 200.13
##$BF3= 200.13
##$BF4= 200.13
##$BF5= 200.13
##$BF6= 200.13
##$BF7= 200.13
##$BF8= 200.13
##$BYTORDA= 1
##$CFDGTYP= 0
##$CFRGTYP= 5
##$CHEMSTR= <none>
##$CNST= (0..31)
1 1 145 1 1 1 1 1 1 1 1 1 1 1 1 1 1 1 1 1 1 1 1 1 1 1 1 1 1 1 1 1 
##$CPDPRG= <waltz16>
##$CPDPRG1= <>
##$CPDPRG2= <waltz16>
##$CPDPRG3= <>
##$CPDPRG4= <mlev>
##$CPDPRG5= <mlev>
##$CPDPRG6= <mlev>
##$CPDPRG7= <mlev>
##$CPDPRG8= <mlev>
##$CPDPRGB= <>
##$CPDPRGT= <>
##$D= (0..31)
0 1 0 0 0 0 0 0 0 0.06 0 0.03 2e-05 3e-06 0 0 0.0002 0 0 0 0 0 0 0 0 0 
0 0 0 0 0 0 
##$DATE= 1773135394
##$DBL= (0..7)
120 120 120 11 120 120 24 19 
##$DBP= (0..7)
150 150 150 150 150 150 150 150 
##$DBP07= 0
##$DBPNAM0= <>
##$DBPNAM1= <>
##$DBPNAM2= <>
$$ [...]
##$SUBNAM3= <"">
##$SUBNAM4= <"">
##$SUBNAM5= <"">
##$SUBNAM6= <"">
##$SUBNAM7= <"">
##$SUBNAM8= <"">
##$SUBNAM9= <"">
##$SW= 400.765351723535
##$SWIBOX= (0..15)
0 1 3 0 0 0 0 0 0 0 0 0 0 0 0 0 
##$SW_h= 32467.5324675325
##$TD= 32768
##$TD0= 1
##$TE= 0
##$TE2= 300
##$TE3= 300
##$TEG= 300
##$TL= (0..7)
0 120 53 12 22 120 120 120 
##$TP= (0..7)
150 150 150 150 150 150 150 150 
##$TP07= 0
##$TPNAME0= <>
##$TPNAME1= <>
##$TPNAME2= <>
##$TPNAME3= <>
##$TPNAME4= <>
##$TPNAME5= <>
##$TPNAME6= <>
##$TPNAME7= <>
##$TPOAL= (0..7)
0.5 0.5 0.5 0.5 0.5 0.5 0.5 0.5 
##$TPOFFS= (0..7)
0 0 0 0 0 0 0 0 
##$TUNHIN= 0
##$TUNHOUT= 0
##$TUNXOUT= 0
##$USERA1= <user>
##$USERA2= <user>
##$USERA3= <user>
##$USERA4= <user>
##$USERA5= <user>
##$V9= 5
##$VALIST= <valist>
##$VCLIST= <CCCCCCCCCCCCCCC>
##$VD= 0
##$VDLIST= <DDDDDDDDDDDDDDD>
##$VPLIST= <PPPPPPPPPPPPPPP>
##$VTLIST= <TTTTTTTTTTTTTTT>
##$WBST= 1024
##$WBSW= 4
##$XGAIN= (0..3)
0 0 0 0 
##$XL= 0
##$YL= 0
##$YMAX_a= 11817
##$YMIN_a= -15971
##$ZGOPTNS= <>
##$ZL1= 120
##$ZL2= 120
##$ZL3= 120
##$ZL4= 120
##$ABSF1= 197.3918
##$ABSF2= -203.3724
##$ABSG= 5
##$ABSL= 3
##$ALPHA= 0
##$AQORDER= 0
##$ASSFAC= 0
##$ASSFACI= 0
##$ASSFACX= 0
##$ASSWID= 0
##$AUNMP= <proc_1d>
##$AZFE= 0.1
##$AZFW= 0.5
##$BCFW= 0
##$BC_mod= 2
##$BYTORDP= 0
##$COROFFS= 0
##$CY= -3
##$DATMOD= 1
##$DC= 0
##$DFILT= <>
##$DTYPP= 0
##$F1P= 0
##$F2P= 0
##$FCOR= 1
##$FTSIZE= 65536
##$FT_mod= 6
##$GAMMA= 0
##$GB= 0
##$INTBC= 1
##$INTSCL= 9.790993e-09
##$ISEN= 30
##$LB= 1.5
##$LEV0= 0
##$LPBIN= 0
##$MAXI= 10000
##$MC2= 0
##$MEAN= 0
##$ME_mod= 0
##$MI= 50
##$NCOEF= 0
##$NC_proc= -9
##$NLEV= 6
##$NOISF1= 182.463
##$NOISF2= 159.3651
##$NSP= 0
##$NTH_PI= 0
##$NZP= 0
##$OFFSET= 197.3918
##$PC= 4
##$PHC0= 1391.123
##$PHC1= 70.10066
##$PH_mod= 1
##$PKNL= yes
##$PPARMOD= 0
##$PSCAL= 0
##$PSIGN= 0
##$REVERSE= no
##$SF= 81.014063255964
##$SI= 65536
##$SIGF1= 159.3651
##$SIGF2= -187.1042
##$SINO= 113.3802
##$SIOLD= 16384
##$SREGLST= <1H.CDCl3>
##$SSB= 0
##$STSI= 65536
##$STSR= 0
##$SW_p= 32467.5324675325
##$SYMM= 0
##$S_DEV= 0
##$TDeff= 32768
##$TDoff= 0
##$TI= <>
##$TILT= no
##$TM1= 0
##$TM2= 0
##$TOPLEV= 0
##$USERP1= <user>
##$USERP2= <user>
##$USERP3= <user>
##$USERP4= <user>
##$USERP5= <user>
##$WDW= 1
##$XDIM= 65536
##$YMAX_p= 379005309
##$YMIN_p= -107167415
$$ End of Bruker specific parameters
$$ ---------------------------------
##NTUPLES= NMR SPECTRUM
##VAR_NAME=  FREQUENCY,     SPECTRUM/REAL,   SPECTRUM/IMAG
##SYMBOL=    X,             R,               I
##VAR_TYPE=  INDEPENDENT,   DEPENDENT,       DEPENDENT
##VAR_FORM=  AFFN,          ASDF,            ASDF
##VAR_DIM=   65536,         65536,           65536
##UNITS=     HZ,            ARBITRARY UNITS, ARBITRARY UNITS
##FACTOR=    0.49542278885378, 1,            1
##FIRST=     15991.5117654749, 0,            0
##LAST=      -16476.0207020576, 0,           0
##MIN=       -16476.0207020576, -107167415,  0
##MAX=       15991.5117654749, 379005309,    0
$$ Real data points
##PAGE= N=1
##DATA TABLE= (X++(R..R)), XYDATA
$$ [...]
45878B819075k219921j03089J873750M88869j844129k247767k451435l974849
45870g659496l287929K066252O838188M876403o24298j719921J509505J642962
45862C641666k992934n191757q61101M172077L268622j596721m188956k987700
45854f736804r12714O01478K308263L525760K138911j717733m681145l553746
45846i027730J184971N370294M794639m21885n488380o052576k880795J05773
45838a2415689J188859J596762J817673P42009j210661j399570J485075N451450
45830b744092P579390O559874K747721k204439n681519o158505m856944l568087
45822h326601j843632J113795L260183K174152l30012m96541J049686L66804k384488
$$ plain form
45878 2819075 599154 496065 2369815 2858684 1014555 -1233212 -3684647 -7659496
45870 -7659496 -10947425 -8881173 -2042985 2833418 2209120 489199 1998704 3641666
45862 3641666 648732 -4543025 -5404126 -1232049 2036573 439852 -3749104 -6736804
45854 -6736804 -7649518 -7048040 -4739777 -1214017 924894 -792839 -5473984 -9027730
45846 -9027730 -7842759 -2472465 2322174 1900289 -3588091 -9640667 -12521462 -12415689
45838 -12415689 -11226830 -9630068 -7812395 -7070386 -8281047 -9680617 -8195542 -2744092
45830 -2744092 4835298 11395172 14142893 11938454 6256935 98430 -4758514 -8326601
45822 -8326601 -10170233 -9056438 -5796255 -3622103 -3952115 -4448656 -3398970 -3032166 -5416654
45813e416654k383858J747021N113684M136433J513299N97484P0877j882033k878167
45804F18086o30722J894582Q60110j840883j798756L14486J97462k143194j912607
45795d441436K557665O672367N968906J694821j932645l056162k676771j888926
45787B897819q31049L73642J172108J121551L60066n41989j248481k062938l185591
45778a944862l802682l019736j587294j038306j001943L50554K594441K641728
45770f808100m09208k887972j512947J681556K504811Q39904N9597J238545J872730
45761c421084M88276j005306n76834R60175J550436O81267o06505j282625r65115
45752d177315J85078J450476J830969P99424j155515k631105k173010K46243K679653
$$ plain form
45813 -5416654 -7800512 -6053491 -939807 3196626 4709925 5307409 5378286 3496253 618086
45804 618086 -12636 1881946 2742056 901173 -897583 -583097 -385635 -2528829 -4441436
45795 -4441436 -1883771 4788596 10757502 12452323 10519678 7463516 4786745 2897819
45787 2897819 2066770 2440412 3612520 4734071 5094137 4552148 3303667 1240729 -1944862
45778 -1944862 -5747544 -8767280 -10354574 -11392880 -12394823 -12044269 -9449828 -6808100
45770 -6808100 -7217308 -10105280 -11618227 -9936671 -7431860 -6591956 -6532359 -5293814 -3421084
45761 -3421084 -2932808 -3938114 -4514948 -3554773 -2004337 -1323070 -1929575 -3212200 -4177315
45752 -4177315 -3992237 -2541761 -710792 88632 -1066883 -3697988 -5870998 -5624755 -2945102
45743b945102L169821K185087J665663J809167J045856n10741m99719J649447
45735G569479L109947J926909j1786n93512j102189l164508m819257l460535o07581
45726a153033M08313q5522O51616K244149J741317o80407j403136P91182K985696
45717E500175L031521K049454J045296q78217l491967m404216k769900p19043
45709f36897M41699K026276M320918M803783K269706o57548j730931k588443n028616
45700C219947o748089m538959L33761L777135M511610M338881L759475J426922
45692A0080683j884535k680097L40799L411151J901219l661110p647124n589643
45684e728657P16951N339900N133149K806112K045382J744828j676573p147184
$$ plain form
45743 -2945102 224719 2409806 4075469 5884636 6930492 6419751 5920032 7569479
45735 7569479 10679426 12606335 12594549 12001037 10898848 7734340 2915083 -545452 -1153033
45726 -1153033 -744720 -830242 -178626 2065523 3806840 3126433 1723297 2514479 5500175
45717 5500175 8531696 10581150 11626446 10748229 7256262 2852046 82146 -636897
45709 -636897 -195198 1831078 6151996 10955779 13225485 12567937 10837006 8248563 3219947
45700 3219947 -3528142 -8067101 -7733340 -3956205 555405 4894286 8653761 10080683
45692 10080683 8196148 5516051 5856850 9268001 11169220 7508110 -139014 -5728657
45684 -5728657 -5011706 328194 5461343 8267455 10312837 12057665 10381092 3233908
45676C233908q764344m018834K134153M134737L010397K917727L593423J430071
45668G671238l270409n627686l295564L88448J762448J452110J643609K011218
45660B735412J016229q92355k039940k205003k231805j883005l03586J825273
45652c978780K678539J877104R68096J043287J370762R28570K3429m49691m16575
45643D044741k56628L40209J819994L121491K010818k149479o767638q176463
45635f012955n271536m15485L004263L331999J433229k96486J00689K192465L292010
45626A358193J548458j365938k120497k58617J068744l98864k769801k785507
45618e723829m44489J217826M09319j379244j799008m88576J184113K190753K712303
$$ plain form
45676 3233908 -5530436 -9549270 -7415117 -3280380 -269983 2647744 6241167 7671238
45668 7671238 4400829 -1226857 -4522421 -4133973 -2371525 -919415 724194 2735412
45660 2735412 3751641 2859286 819346 -1385657 -3617462 -5500467 -5804053 -3978780
45652 -3978780 -1300241 576863 1544959 2588246 3959008 4887578 4911007 4461316 4044741
45643 4044741 3788113 4128322 5948316 9069807 11080625 8931146 2163508 -6012955
45635 -6012955 -11284491 -11699976 -8695713 -5363714 -3930485 -4226971 -4126282 -1933817 1358193
45626 1358193 2906651 1540713 -579784 -838401 230343 -168521 -2938322 -5723829
45618 -5723829 -6168318 -4950492 -4541173 -5920417 -7719425 -8208001 -7023888 -4833135 -2120832
45609b120832L196421L317150K344874M40097j119487j519828j555624k128900
45601H53871k129190L88330M662037O803338M021031k025691p135744q687146
45593c249164o951453l748200j190254o08568j202777o43634J709223L407803
45585a2477024K307761j1205l92649J380590K755178K419194J302880k27512k970199
45576e912986n958058n993191j873757L041626M529227K480216L34019L91786
45568h961118J582333J699627K07876j667844k650656k440085j313561N59386
45560a2984042L018599N458471P048283P297465N861888K288513k755668o395791
45552H837718n925443k677867r01769j721275j396408K258917N277628L210263
$$ plain form
45609 -2120832 1075589 4392739 6737613 7177710 6058223 4538395 2982771 853871
45601 853871 -1275319 -886989 3775048 10578386 14599417 12573726 5437982 -3249164
45593 -3249164 -10200617 -13948817 -15139071 -15747639 -16950416 -17594050 -15884827 -12477024
45585 -12477024 -10169263 -10180468 -10573117 -9192527 -6437349 -4018155 -2715275 -2942787 -5912986
45576 -5912986 -11871044 -17864235 -19737992 -16696366 -12167139 -9686923 -9352904 -8961118
45568 -8961118 -7378785 -5679158 -5471282 -7139126 -9789782 -12229867 -13543428 -12984042
45560 -12984042 -9965443 -4506972 2541311 9838776 15700664 17989177 15233509 8837718
45552 8837718 2912275 234408 -667361 -2388636 -3785044 -1526127 3751501 6961764
45544F961764j457929k666148J75411K279909J867646J974021L366399K608054
45536A5109127p10655j692014J370761K785740j236693n085114k209786L648037
45528A1979403L644821k610499p089612n806409k876439j754783o21332J527405
45520c607445J704085r07823k072878L56850K153525o797k233930J68840M251027
45511a94546L718005j009965l647071j826147L51227j32047r39461N81490K727063
45502c71452K501067L93915n92901Q29304K992980L507985J574024j395214k904033
45493F535675j704139Q23390K163464J252396j168707l976145n994251n641286
45485g709603k386428J436624K374356p966k358395j549201J871556M809714N017362
$$ plain form
45544 6961764 5503835 2837687 3013098 5293007 7160653 9134674 12501073 15109127
45536 15109127 14398472 12706458 14077219 16862959 15626266 10541152 8331366 11979403
45528 11979403 15624224 13013725 5924113 117704 -2758735 -4513518 -5134850 -3607445
45520 -3607445 -1903360 -2811183 -4884061 -4527211 -2373686 -2380483 -4614413 -4445573 -194546
45511 -194546 3523459 2513494 -1133577 -2959724 -2608497 -2740544 -3680005 -3098515 -371452
45502 -371452 2129615 2523530 1930629 2759933 5752913 9260898 10834922 9439708 6535675
45493 6535675 4831536 5654926 7818390 9070786 7902079 3925934 -2068317 -7709603
45485 -7709603 -10096031 -8659407 -6285051 -6293017 -8651412 -10200613 -8329057 -3519343 1498019
45476A498019K786171K50398m83387P46690J878445R73674j236658k140366n59959
45467C713027J774926K212786j41369l651462n418458l828987n95035O75642j005588
45458f264518k334340k99791L197766M101121K316402J410698K574693L005237
45450G707268J006333j292529j822995j560115j647992r54206R68632J568156
45442C972552q63784l415785k188614J814369L965263K413369r8370p04554K17714
45433E112160O85421m5486j126460j510758j186183j260317k461526l562498k572206
45424g927853K15388K204479K183035J757548K028851J570968l81999j494961
45416A55456K09093K754198L144583J937332J564777J767011L65445k486445m365748
$$ plain form
45476 1498019 4284190 4534588 4051201 4797891 6676336 7650010 6413352 4272986 3713027
45467 3713027 5487953 7700739 7559370 3907908 -1510550 -5339537 -5934572 -5258930 -6264518
45458 -6264518 -8598858 -8898649 -5700883 -1599762 716640 2127338 4702031 7707268
45450 7707268 8713601 7421072 5598077 4037962 2389970 1435764 2404396 3972552
45442 3972552 3108768 -307017 -2495631 -681262 3284001 5697370 5599000 4894446 5112160
45433 5112160 5797581 5752095 4625635 3114877 1928694 668377 -1793149 -5355647 -7927853
45424 -7927853 -7712465 -5507986 -3324951 -1567403 461448 2032416 1650417 155456
45416 155456 364549 3118747 6263330 8200662 9765439 11532450 11897895 9411450 5045702
45407E045702m167061k532756K02485L201960L632276p5981m487890m837824j588684
45398e607773J029490K001492L762844N933282M974796R74060j323029j00162
45390A1645000O69563j576834l594094k498592j068609k552021m572323l137246
45382f685156N93279K562423K376805K653206L521857K680089J62482j326859
45374F538126p73609n456m09710j360391j901097j615568p1291K462001M158230
45365G021235L495880J513358N38842J408918L386963N576214O749575N308463
45357C4999448J433233k106472l193644k847063k641491j804178O83653L324321
45349B7847807M462466N383474P628975R022850O381762J147442j693088N7253
$$ plain form
45407 5045702 878641 -1654115 -1451630 1750330 5382606 5306625 818735 -4019089 -5607773
45398 -5607773 -4578283 -2576791 1186053 7119335 12094131 13068191 11745162 11645000
45390 11645000 12314563 10737729 7143635 4645043 3576434 1024413 -3547910 -6685156
45382 -6685156 -6091877 -3529454 -1152649 1500557 5022414 7702503 7864985 6538126
45374 6538126 5764517 5759061 5349351 3988960 2087863 472295 401004 2863005 7021235
45365 7021235 10517115 12030473 12569315 13978233 17365196 22941410 29690985 34999448
45357 34999448 36432681 34326209 31132565 28285502 25644011 23839833 24523486 27847807
45349 27847807 32310273 37693747 45322722 54345572 60727334 61874776 60181688 60238941
45341F0238941M045431P528648R745480J0233991Q275808M571639R36509j843669
45333A03732778l838801m380326l134597j960134k957553n358174o902875p246291
45325F7954027p287008o605205m770762l569742m221855m048669j97225M822255
45317D2075816O098911L575996J237766K56553j241293k457216o57462K341429
45309E1230500J486630k781822m340173j641381o53845m620140q279205o626981
45301B3773583k851619k231231l556619k400910J211914L915521M487390L396563
45293B5744592J27928m349088n699866j707327L225668L717843O91516j522624
45285B0228642k107526k675738k412184m5927J854797L77300k170418k015824
$$ plain form
45341 60238941 64284372 71813020 81558500 91792491 100068299 104639938 105576447 103732778
45333 103732778 99893977 95513651 92379054 90418920 87461367 82103193 75200318 67954027
45325 67954027 60667019 54061814 49291052 45721310 41499455 37450786 37253561 42075816
45317 42075816 48174727 51750723 52988489 53245042 52003749 49546533 48889071 51230500
45309 51230500 52717130 49935308 45595135 43953754 43299909 38679769 30400564 23773583
45301 23773583 20921964 18690733 15134114 12733204 13945118 17860639 22348029 25744592
45293 25744592 25872520 21523432 15823566 14116239 17341907 21059750 21751266 20228642
45285 20228642 18121116 15445378 13033194 12987267 14842064 15219364 13048946 11033122
45277A1033122q80362k684377n390675l610513J654329L763980J154181n80004
45269D459681J289099K224429j072020m561041l336787R75524L511089L032362
45261F522336J659550O80627O1561n312K63912j86294j329361j725272j228596
45252D713151j419681k353180k113495q49904j470577m373055n389468j794078
45244a5050287L064396M380474K269540J65409n70153p42641j42384J726016L072136
45235a827494J893092j42121L39274K836805L158422k70150l727488l279544M7542
45226i71662K158146J395167o6098j152P41732k2463k007387k345062K57152L155105
45216B293478L209360J155118P4676M19074j61535k008969k305201o0453J415389
$$ plain form
45277 11033122 10152760 7468383 2077708 -1532805 121524 3885504 5039685 4459681
45269 4459681 5748780 7973209 6901189 2340148 -996639 -21115 3489974 6522336
45261 6522336 8181886 8862513 8924074 8918762 9182674 8996380 7667019 5941747 4713151
45252 4713151 3293470 940290 -1173205 -2023109 -3493686 -7866741 -13256209 -15050287
45244 -15050287 -11985891 -7605417 -5335877 -5170468 -5740621 -6483262 -6625646 -4899630 -1827494
45235 -1827494 65598 -76523 262751 3099556 6257978 5987828 2260340 -1019204 -971662
45226 -971662 1186484 2581651 2515553 2514401 3256133 3233670 1226283 -1118779 -861627 2293478
45216 2293478 5502838 6657956 6732632 7151706 6990171 4981202 2676001 2615548 4030937
45207D030937m19826k773477j467898K446446L941665J280234j749982j513044
45199C775055O82275J106002j013247k691515j297058K117199M106142K807776
45191I592629k19977k280538k711689k745183k761416j503970J388085L634672
45183B392613K611928j013545l310341j354603K973006M506216Q58641l929300
45175C734615l876693Q60153L607737M38456l872159k865800J648011K390655
45167B064975j814150m051008j70097M786054M312005m64413l664238k959065
45159a959937n16209J699904L052500K392035o03882l210044k547102j5846N85635
45150a122946j228937k237545o12171J817183K657296J634189j83855j706505
$$ plain form
45207 4030937 3611111 837634 -630264 1816182 5757847 7038081 5288099 3775055
45199 3775055 4457330 5563332 4550085 1858570 561512 2678711 6784853 9592629
45191 9592629 9372652 7092114 4380425 1635242 -1126174 -2630144 -1242059 2392613
45183 2392613 5004541 3990996 680655 -673948 2299058 6805274 7663915 3734615
45175 3734615 -142078 718075 4325812 4764268 892109 -1973691 -325680 2064975
45167 2064975 250825 -3800183 -3970280 815774 5127779 4663366 999128 -1959937
45159 -1959937 -2476146 -776242 2276258 4668293 4064411 854367 -1692735 -1708581 -1122946
45150 -1122946 -2351883 -4589428 -5201599 -3384416 -727120 907069 723214 -983291
45142i83291k104262j401522p01509o29020m02719K62301p090j522891j695011
45133i185014J134543L860602K494610j254333j734337K402888O219108N694814
45125I632881K779556J401936J840891J644303K9939j215269n00178J491428K363335
45116A9468822L82998l173885m526388j504480L361118N514020L586888L8033
45108B3147126k618804l560445k160205J777881N687723N443188M24439m988990
45100B3151913o450854m234445j551333l06908k07301o37977j534921k696287
45092E531887l237541j913032J683044N778779P230806M903888J294383p21337
45084B0550877j420014k408177k954100j436829O54029J42797k681436m314161
$$ plain form
45142 -983291 -3087553 -4489075 -5190584 -5819604 -6222323 -5960022 -5967112 -7490003 -9185014
45133 -9185014 -8050471 -4189869 -1695259 -2949592 -4683929 -2281041 3938067 9632881
45125 9632881 12412437 13814373 15655264 17299567 17329506 16114237 15614059 17105487 19468822
45116 19468822 19851820 16677935 12151547 10647067 14008185 19522205 23109093 23147126
45108 23147126 20528322 16967877 14807672 16585553 22273276 27716464 28140903 23151913
45100 23151913 16701059 12466614 10915281 10608373 10401072 9763095 8228174 5531887
45092 5531887 2294346 381314 2064358 7843137 15073943 19977831 21272214 20550877
45084 20550877 19130863 16722686 13768586 12331757 12985786 13128583 10447147 6132986
45076F132986l477366k157662r66326J790606N362636N815653K091354j607504
45068A2984377j841503j98767Q59709J937205L381751K515871j745619n338915
45060A2554109m581981j902457j305388j415141J260430M716441L857898m44891
45052A2739020j668781K170238N034409J986048l428916m571562j055752J466727
45044A2671431m44749l709686l332229R60531M557534M096497J606518R21681
45036A7327528J613947o8428m382519o602251m066992n36528m45756k395770k293087
45027a849856n1453J354406J354611J569599J705107M42956p11878P49229L520919
45018H083640M154544K616047J284761m01584m406742p888389n412929J933389
$$ plain form
45076 6132986 2655620 497958 -468368 1322238 6684874 12500527 14591881 12984377
45068 12984377 11142874 10944107 11803816 13741021 17122772 19638643 17893024 12554109
45060 12554109 7972128 6069671 4764283 3349142 4609572 9326013 13183911 12739020
45052 12739020 11070239 13240477 18274886 20260934 16832018 12260456 11204704 12671431
45044 12671431 12226682 8516996 5184767 6145298 10702832 14799329 16405847 17327528
45036 17327528 18941475 18873047 14490528 7888277 3821285 3284757 2839001 443231 -1849856
45027 -1849856 -1901309 -546903 807708 2377307 4082414 4525370 3813492 4562721 8083640
45018 8083640 12238184 14854231 16138992 15737408 11330666 3442277 -1970652 -37263
45010c7263O517636M895196J891142J706999J921070j06919j552634J96604J805481
45001A7237312l65317l362004k409162R33029J606894m87769j142264N87876J486717
44992A4085312K38780j109706j716605l003643m778670m758015k648378q45953
44984d536878l94167K02998J460973J678322K43550q59206j04447J379249J730937
44975H01331N89196j288413k948025l360983k154588m04593N78365R30261J436016
44966e821433J954781K209258K825254L622552K596013q02845l329775k299030
44958I54775l08429j253313l296585j393276L744466N497791J161489m075088
44950A031830n002726k739743n62549J277468K987375K242853j780068n028945
$$ plain form
45010 -37263 6480373 11375569 13266711 14973710 16894780 16787861 15235227 15431831 17237312
45001 17237312 16871995 13509991 11100829 12033858 13640752 13152983 12010719 12598595 14085312
44992 14085312 14324092 13214386 11497781 8494138 3715468 -1042547 -3690925 -4536878
44984 -4536878 -4931045 -4728047 -3267074 -1588752 -1345202 -2204408 -2308855 -929606 801331
44975 801331 1390527 102114 -2845911 -6206894 -8361482 -8766075 -8187710 -7257449 -5821433
44966 -5821433 -3866652 -1657394 1167860 4790412 7386425 6583580 3253805 954775
44958 954775 646346 -606967 -3903552 -5296828 -1552362 3945429 5106918 1031830
44950 1031830 -3970896 -6710639 -7273188 -5995720 -3008345 -765492 -2545560 -7574505
44942g574505l819850o24691j34908j960141j918309J143745M430538N972767
44934d485354O061952M783141K195668L02062Q59426J769347l64894m499336o115322
44925E06690l799851o20614J216751K575049L574752K331371q31427k232602j98792
44916B521327K141353J906982P65226J220469J882892J85529k591237l116001
44908D916540j378024k02051j10129J234317M195825N593874L292188m70626k089476
44899A4982438j069653K17710Q7806p69735p31849P50435K548423K786824N74903
44890A9377302k938683n510900n871814m446014k152095N61207L076043L964475
44882F059521K120567j558150m544591n095241l726681j878568J77337K931686
$$ plain form
44942 -7574505 -11394355 -12019046 -12153954 -14114095 -16032404 -14888659 -10458121 -4485354
44934 -4485354 1576598 6359739 8555407 8857469 9716895 11486242 11121348 6622012 506690
44925 506690 -3293161 -3913775 -2697024 -121975 3452777 5784148 4952721 2720119 2521327
44916 2521327 4662680 6569662 7334888 8555357 10438249 10623778 8032541 4916540
44908 4916540 3538516 3336465 3226336 4460653 8656478 14250352 17542540 17071914 14982438
44899 14982438 13912785 14130495 14218301 13448566 12716717 13467152 16015575 18802399 19377302
44890 19377302 16438619 10927719 5055905 609891 -1542204 -980997 2095046 6059521
44882 6059521 8180088 6621938 2077347 -3017894 -6744575 -8623143 -8445806 -5514120
44874e514120N311905M610916N5871m756857n164946j089896K734101K667748
44866a145278J13096j563879j717730j749060j487490M44838L045855L204503
44858h55145N01638j330745K82869K390655L50140n130915q048659m552509K265039
44849a4127632O192457M706583N22459k332315k121482M05026L415846N012888
44841A673830M113846J356785j179737j776541o07498O68272O76282m16110j229611
44832C279518p04879N94418R57120l53463j896140j810320m68122j6167j091567
44823a509602j656648n2244K277235K674879Q81716j056794j855586j926907j505411
44814c729362j18245J680190K209451J195664N36785J387468K168264R50550j555264
$$ plain form
44874 -5514120 -202215 4408701 4464572 -292285 -5457231 -6547127 -3813026 -1145278
44866 -1145278 -1032182 -2596061 -4313791 -6062851 -7550341 -7105503 -4059648 -855145
44858 -855145 -353507 -1684252 -1401383 989272 1339412 -3791503 -11840162 -16392671 -14127632
44849 -14127632 -7935175 -3228592 -2706133 -5038448 -7159930 -6754904 -3339058 1673830
44841 1673830 5787676 7144461 5964724 4188183 3580685 4248957 4925239 4509129 3279518
44832 3279518 2574639 3169057 4126177 3772714 1876574 66254 -401868 -418035 -1509602
44823 -1509602 -3166250 -3218494 -941259 1733620 2615336 1558542 -297044 -2223951 -3729362
44814 -3729362 -3847607 -2167417 42034 1237698 1774483 3161951 5330215 6280765 4725501
44805D725501l041243k556401p62466J724059M235526N021635K700446j206749
44797A0840308l306454k320432k40170R07993J393342J916324J473929r91235
44789I673605l967635m591127k319352L99820J379636J035793Q16227O99594l48311
44780B778250j995089k217175J53546L473939M715135K693081o32865k179703
44772F789119q74798J334541J704892j21032j743259j279037o2560n18746j930708
44763C298412j073009K226080L426218l51726n054714m701587j3145K712145R46231
44754A414905j112877N5464K276230K532017J956797K354524J893139j224420
44746A0145779m098898l193610n40470m80697k115231r98386K644807L864034
$$ plain form
44805 4725501 1684258 -872143 -1634609 89450 4324976 9346611 12047057 10840308
44797 10840308 7533854 5213422 4973252 5881245 7274587 9190911 10664840 9673605
44789 9673605 5705970 1114843 -1204509 -804689 574947 1610740 2426967 3126561 2778250
44780 2778250 783161 -1434014 -1280468 2193471 6908606 9601687 8968822 6789119
44772 6789119 5914321 7248862 8953754 8832722 7089463 5810426 5747866 5229120 3298412
44763 3298412 2225403 4451483 7877701 7525975 2471261 -2230326 -2243471 468674 1414905
44754 1414905 302028 357492 2633722 5165739 7122536 9477060 11370199 10145779
44746 10145779 6046881 2853271 2312801 1832104 -283127 -1281513 1363294 5227328
44738E227328J358191n80786J32138p3484l455504o178843m189814N45526L608075
44729c607173M381206M714457M207028J149955l379232n993350m885409j118935
44721d531453K716044L751540J008575k201875j027682M011434O612471L594992
44713A3934046l18942l15436Q02557j757227n633680m976418p35218N35231k616527
44704a081614m655246k350200J236772L277314M722708N389322K483789k857355
44696F165490m132257J091671N938069L579546k758520n001873k058788L0704
44688B854042j771209l592468j460168K903296M875827K661403j374267l670742
44680A425714k866098p24132L04503L29237J501121M022485N012251K653867q38121
$$ plain form
44738 5227328 6585519 6004733 6136871 6063387 2607883 -3570960 -7760774 -7215248 -3607173
44729 -3607173 774033 5488490 9695518 10845473 7466241 1472891 -3412518 -4531453
44721 -4531453 -1815409 1936131 2944706 742831 -284851 3726583 10339054 13934046
44713 13934046 13615104 13299668 14102225 12344998 6711318 1734900 999682 1534913 -1081614
44704 -1081614 -5736860 -8087060 -6850288 -3572974 1149734 6539056 9022845 6165490
44696 6165490 2033233 3124904 9062973 12642519 9883999 4882126 2823338 2854042
44688 2854042 1082833 -2509635 -3969803 -1066507 3809320 6470723 5096456 1425714
44680 1425714 -1440384 -2164516 -1860013 -1530776 -29655 3992830 9005081 11658948 10820827
44671A0820827k357684k003344j761438j857312j035543O98991K065506K422555
44663F992558J804124J69758j602527j576273K36651N58644k661222o063182m659767
44654f801236J035574N234679M209252K69896j980456p79603J959016L012110
44646F159232P73985k779550l583355m97641K451589J245069k144772k390230
44638g65673J378365M513554L813310J299364k22266j371094l524964m990724
44630A29872l106728J181469L756862K304421j010125k332862o95613J020498
44622A247794o2031k792182l469056j395699k11418k075704l546138o43064M250042
44613h697456N206348J539607j340999k13541J901374J492925k89374p62065k32698
$$ plain form
44671 10820827 8463143 6459799 4698361 2841049 1805506 2504497 4570003 6992558
44663 6992558 8796682 8966440 7363913 5787640 6024291 6582935 3921713 -2141469 -6801236
44654 -6801236 -5765662 -530983 3678269 3948165 1967709 1188106 3147122 6159232
44646 6159232 6933217 4153667 570312 72671 2524260 3769329 1624557 -765673
44638 -765673 612692 5126246 8939556 10238920 10016654 8645560 5120596 129872
44630 129872 -2976856 -1795387 1961475 4265896 3255771 922909 227296 1247794
44622 1247794 1185763 -1606419 -5075475 -6471174 -6682592 -8758296 -12304434 -12947498 -8697456
44613 -8697456 -3491108 -1951501 -3292500 -3506041 -1604667 -111742 -401116 -1163181 -1395879
44604a395879m37261j199055j398012j134282o63698P02706K609840K906174J035381
44595A025914k24423J210867L333629L274004J597913M73455k14262j531361k157820
44586F787916k37163K528524K488782n67391l045692k631015p66370K17043j00340
44577D674294p11875n76788N75129J472370J30192k910218l678997K92051N530230
44568D796388O450911K720661r19184j639478j031421m22038J477760M536444
44560A5970043N189223J454517l113961l807173j132864L85605j366914l898540
44552I679936m058074j706901R11964J832801Q51361q18623j961262k464507k791371
44543e24676k694705j564471O81N91937L48593J009439K752863L199135J243527
$$ plain form
44604 -1395879 -1833140 -3032195 -4430207 -5564489 -6228187 -5525481 -2915641 -9467 1025914
44595 1025914 801491 2012358 5345987 8619991 10217904 10691359 10477097 8945736 6787916
44586 6787916 6550753 9079277 11568059 11000668 7954976 5323961 4557591 4774634 4674294
44577 4674294 3962419 3385631 3960760 5433130 5563322 2653104 -1025893 -733842 4796388
44568 4796388 11247299 13967960 13048776 11409298 10377877 9955839 11433599 15970043
44560 15970043 21159266 22613783 19499822 15692649 14559785 14945390 13578476 9679936
44552 9679936 5621862 3914961 4826925 6659726 7511087 6692464 4731202 2266695 -524676
44543 -524676 -3219381 -4783852 -4783171 -4191234 -3842641 -2833202 -80339 3118796 4362323
44534D362323l09297J285541L627857J825299l804904o677146k343948N110597
44526C076322P987786M528617J42012m94696J062670P17496j832124l115920j149059
44517A0923104J925324K674262K20706l173532m440121k566520J42111J28164
44509E833498l089957n560742l619237R36370L019175J198837q96393n65207M55887
44500b287769J16681k04180R45898J293780j541056m830447l754973J291408M924416
44491d046242M288486K093656J391869J321634j91547k549449l510414k332012
44483c534019j65327J599253K355269K517083L071964L954478L306063M3617l429328
44474I719053l589909p58256J118874m4996k172048k918590k768053k852278k493323
$$ plain form
44534 4362323 4053026 5338567 8966424 10791723 6986819 309673 -2034275 3076322
44526 3076322 11064108 15592725 15734737 15240041 16302711 17020207 15188083 12072163 10923104
44517 10923104 12848428 15522690 15743396 12569864 8129743 5563223 5705334 5833498
44509 5833498 2743541 -2817201 -6436438 -5500068 -2480893 -1282056 -2178449 -2743656 -2287769
44500 -2287769 -2171088 -2375268 -1429370 -135590 -1676646 -6507093 -10262066 -8970658 -4046242
44491 -4046242 242244 2335900 3727769 5049403 4857856 2308407 -1202007 -3534019
44483 -3534019 -3699346 -2100093 255176 2772259 5844223 9798701 13104764 13148381 9719053
44474 9719053 6129144 5370888 6489762 6444766 4272718 1354128 -1413925 -4266203 -6759526
44465f759526p98145J387406K795611L257834K708782P35612j629123j960844
44457b62393J68523K095047J979119J403158K083068K531866P57900j720585j791798
44448G243905M38465J891343J185601K39430Q89312K101682J484515j400853m042041
44439A0031359l533741k20356K127749R76176j259051n54008K569795L828484
44431A3966407J948851J72865J48065n82473k902747l322640l60600J433022j329211
44422I171539m242830j750329L215316L344628j442790m043326j250319K454346
44414E456235K819304R35958q69620k223173k083445J391351O218635P037633
44406A8682878K589247j952903k404781n74585N47562J487661K969331K860231
$$ plain form
44465 -6759526 -7557671 -6170265 -3374654 -116820 2591962 3327574 1698451 -262393
44457 -262393 -93870 2001177 3980296 5383454 7466522 9998388 10756288 9035703 7243905
44448 7243905 7682370 9573713 10759314 10998744 11888056 13989738 15474253 14073400 10031359
44439 10031359 6497618 6277262 8405011 9381187 8122136 7568128 10137923 13966407
44431 13966407 15915258 16088123 16236188 15653715 12750968 9428328 9067728 10500750 9171539
44422 9171539 4928709 3178380 6393696 9738324 8295534 4252208 3001889 5456235
44414 5456235 8275539 9211497 8341877 6118704 4035259 5426610 11645245 18682878
44406 18682878 21272125 19319222 16914441 16339856 16887418 18375079 21344410 24204641
44398B4204641N53437J00486M230652Q670552P497522J739483k306405j697777
44390D2992591Q37349K121692J754106N99820l24055K20260K017101K479417J11098
44381E2809379k466154k036808J45563L80158j725871l470583l962699m487823
44373C5185162m614836k601147L34421R24093m15234L40171L760914M966820J008942
44364C8889306m219995n568834l399658j234687K00778K367681M451712M015597
44356C5501900J386599m76996m12172r5260o40343j286178j817925l198907m874519
44347B4086199m284325o03450L213538L895307J811792j78003n52400j05988r3966
44338B7188704j117111l162961n135182m978353k037557J164596J445731q88330
$$ plain form
44398 24204641 24758078 24858564 29089216 37759768 45257290 46996773 44690368 42992591
44390 42992591 43829940 45951632 47705738 48305558 47981503 48201763 50218864 52698281 52809379
44381 52809379 50343225 48306417 48451980 48832138 47106267 43635684 39672985 35185162
44373 35185162 30570326 27969179 28303600 29227693 28812459 29152630 32913544 37880364 38889306
44364 38889306 34669311 29100477 25700819 24466132 24666910 27034591 31486303 35501900
44356 35501900 36888499 36411503 35999331 35904071 35263728 33977550 32159625 28960718 24086199
44347 24086199 19801874 19198424 22411962 26307269 28119061 27941058 27388658 27282670 27188704
44338 27188704 26071593 22908632 17773450 12795097 10757540 11922136 13367867 12479537
44330A2479537k372239r02733K121795M373319M933594L465574k31345m367468
44322A9500034n360380k068245K015678K990396J256656k71026o66041o87463
44314A6709609J78860K452846L593085P60215l573361l657065J090498M551303
44306B2105990K582087j526905l008167k565039l364517m567561k843286J381086
44298H193688L945893K873181M40917p59388p45089p72630j368858k022741j451499
44289H333474J163643L895962K795981k790183p539559o071417j19522L929546
44281C597925L530977J660563N45561j177940m117978n725813m371753k159195
44273h217653j409045j313895k00219J594156L117235M416127M780725K323829
$$ plain form
44330 12479537 10107298 9204565 11326360 15699679 20633273 24098847 23867502 19500034
44322 19500034 14139654 12071409 14087087 17077483 18334139 18063113 17397072 16709609
44314 16709609 16888469 19341315 22934400 23694615 20121254 16464189 17554687 22105990
44306 22105990 24688077 23161172 20153005 17587966 14223449 9655888 6812602 8193688
44298 8193688 12139581 15012762 15453679 14694291 13949202 13176572 11807714 9784973 8333474
44289 8333474 9497117 13393079 16189060 13398877 5859318 -212099 -331621 3597925
44281 3597925 7128902 8789465 9335026 8157086 4039108 -1686705 -6058458 -8217653
44273 -8217653 -9626698 -10940593 -11140812 -9546656 -6429421 -2013294 2767431 5091260
44265E091260k183799m018363l97547M621249M926775N26962k974690k224801
44257C367046N82460K189440K062847Q01742j656277m389740m698361j309145
44249c049988L022463M188097J435207k038430k854496p53211J670077J776148
44241C395867m61808k316503j222659K045561L976251K461082q08271k856327
44233D213193l000613k422341j325558J071897L942933M934026L574066K106983
44225A3094586J634470L0985m029217p319078n790911p92807K346162J660780
44217H34970M61586J414610K890630K706493J572740N58864j325863m233682n362580
44208d82232k950226M34007J914527K654947M299102M321326K21762m189250l163086
$$ plain form
44265 5091260 2907461 -1110902 -1508449 3112800 8039575 8566537 5591847 3367046
44257 3367046 3949506 6138946 8201793 9003535 7347258 2957518 -1740843 -3049988
44249 -3049988 -27525 4160572 5595779 3557349 702853 -50358 1619719 3395867
44241 3395867 2934059 617556 -605103 1440458 5416709 7877791 7069520 4213193
44233 4213193 1212580 -1209761 -2535319 -1463422 2479511 7413537 10987603 13094586
44225 13094586 14729056 14760041 10730824 3411746 -2379165 -3171972 -825810 834970
44217 834970 1296556 2711166 5601796 8308289 9881029 10439893 9114030 4880348 -482232
44208 -482232 -3432458 -2998451 -1083924 1571023 5870125 10191451 10413213 6223963 3060877
44199C060877J610353L066733J97274k70389M491368P735598L373674m216008
44191A9049480o364426k247594J106869q53791n160943o435979l212690J416633
44183b702441L338943J326485j735216k097879K82235K216083K296516K326292
44175E251018L003270K056288j401616m356812m244200k450392r63113P90970
44167b314587K871857K720457j12493j304368J538063L660162M43229l843556
44159C658764j838127M776656P075240K264188k826978k666908M2168O56563o40743
44150A0500823j461475j448213q12749J144587L447068L299025P80255l48088
44142A5101233J277038K060225m45954l285227l176833j736389j826733k267012
$$ plain form
44199 3060877 4671230 7737963 7935237 7664848 12156216 19891814 23265488 19049480
44191 19049480 12685054 10437460 11544329 10690538 5529595 -906384 -4119074 -2702441
44183 -2702441 636502 1962987 227771 -1870108 -1587873 628210 2924726 5251018
44175 5251018 8254288 10310576 8908960 4552148 307948 -2142444 -3105557 -2314587
44167 -2314587 557270 3277727 3165234 1860866 3398929 7059091 7502320 3658764
44159 3658764 1820637 6597293 13672533 15936721 13109743 10442835 10485003 11141566 10500823
44150 10500823 9039348 7591135 6778386 7922973 11370041 14669066 15449321 15101233
44142 15101233 16378271 18438496 17992542 14707315 11530482 9794093 7967360 5700348
44134E700348m39826K512377L314385J520636p51437k311922k869684j435542
44126E239335J783171L550476J195289l135386m911742k743472J244715M877878
44118G100264O686546N003534P6398m053872l550470k0840J643542o0015k306601
44109A0518486l082749l230672l094477j039490L296589P006997O794832K568357
44101A9737873k538284n002849l999492k186971k305352k753589M86676O240294
44093G678306P067759k75882p726047n620622L333865P561147K992679k658646
44085A2352559k947611j070930j771255l006658j255786J165063N62277r45580
44077C082079O45460L464311K679734j094952l006704k161274j892888k434795
$$ plain form
44134 5700348 5260522 7772899 11087284 12607920 11856483 9544561 6674877 5239335
44126 5239335 7022506 10572982 11768271 8632885 3721143 977671 2222386 7100264
44118 7100264 13786810 18790344 18866742 14812870 11262400 11241560 12885102 12825087 10518486
44109 10518486 7435737 4205065 1110588 71098 3367687 10374684 17169516 19737873
44101 19737873 17199589 12196740 8197248 6010277 3704925 951336 1438012 7678306
44093 7678306 14746065 14470183 6744136 1123514 4457379 12018526 15011205 12352559
44085 12352559 9404948 8334018 6562763 3556105 2300319 3465382 4027659 3082079
44077 3082079 3727539 7191850 9871584 8776632 5769928 3608654 1715766 -719029
44069g19029l24547M101728N406732J489596k518532j946017P25394P01488j476318
44060E440495j610120J268790M145540M967546M355089K745944m97423m492220
44052A6323641o202941l798237Q00831L763315L046199j83016l161232m106789
44044F481771l356874k118982n62843J882858M355663M431286J374044j819113
44036A0667810j506705J972691M585137L506567J52334j985352j215001J073314
44028A7250795K033539j4511l725300n435213k817167K077811M742910L442614
44020A7555478R37646L04947Q54047j40273k875014m513931l213159o18714M75661
44011H766688l62410j211124p21721K07877m0946j370980j887022l65119J916153
$$ plain form
44069 -719029 -1043576 3058152 8464884 9954480 7435948 5489931 6215325 6916813 5440495
44060 5440495 3830375 5099165 9244705 14212251 18567340 21313284 20815861 16323641
44052 16323641 10120700 6322463 7123294 10886609 13932808 13749792 10588560 6481771
44044 6481771 3124897 1005915 443072 2325930 6681593 11112879 12486923 10667810
44036 10667810 9161105 11133796 15718933 19225500 19377834 17392482 16177481 17250795
44028 17250795 19284334 19269823 15544523 10109310 7292143 9369954 14112864 17555478
44020 17555478 18493124 18798071 19652118 19511845 16636831 12122900 8909741 8291027 8766688
44011 8766688 8404278 7193154 6471433 6679310 6638364 5267384 3380362 3015243 4931396
44002D931396K622574J428421M91393J429318K929514K446077l64552l210793
43994A2703348l987050k769591r32146M25541P57256J5213q99514n66111J167598
43985E914544K567399K180826R41676P92776J621726J287769j006737l089502
43977A1210477k641494m51181O26859o47272k819839m111372m143642l067309
43969f044773q23276J797566K986696K251653J646628K952415M733050M386557
43961A3886516K305299J196883J456807N42712k202528l537226j184859K147099
43953A4610703K494911L54010o15888O49272J647837P19355q96634j691390j687619
43944A5584557j058707M47363J969172J780840n2768j336511q22161L43210Q22550
$$ plain form
44002 4931396 7553970 8982391 9473784 10903102 13832616 16278693 15914141 12703348
43994 12703348 8716298 5946707 5014561 5440102 6197358 6212571 5313057 4746946 5914544
43985 5914544 8481943 10662769 11604445 12397221 14018947 15306716 14299979 11210477
43977 11210477 8568983 8117802 8744661 8097389 5277550 1166178 -2977464 -6044773
43969 -6044773 -6868049 -5070483 -2083787 167866 1814494 4766909 9499959 13886516
43961 13886516 16191815 17388698 18845505 19388217 17185689 13648463 12463604 14610703
43953 14610703 17105614 17459624 16843736 17493008 19140845 19860200 18963566 17272176 15584557
43944 15584557 14525850 14973213 16942385 18723225 18670457 17333946 16511785 16854995 17677545
43935A7677545N95567k82629j963249l103752j647869J574862K960986J357040
43927A7168501j74J087392J800066r12421m425485l796545M41614K589807j00186
43918A3852569l812076l723182M6472L549062L878827J476014j102231j653820
43910A2511635k62778R09195K53777j340516k031348j608097j165263j103665
43902F162940j108172j241495j311868k26091K006389K973008J200096n66215
43894G888592J111519M437187M156390o47827m800519m099959k65717K683436
43886A0463102L442983K856425J432999k46195q86505j73246O84130J130094J633356
43877B0337143J252975j690312n271563m522760J209361N633997L698914j376322
$$ plain form
43935 17677545 18273112 17990483 16027234 12923482 11275613 12850475 15811461 17168501
43927 17168501 17168327 18255719 20055785 19143364 14717879 10921334 11362948 13952755 13852569
43918 13852569 10040493 6317311 6363783 9912845 13791672 15267686 14165455 12511635
43910 12511635 12248857 13158052 13411829 12071313 10039965 8431868 7266605 6162940
43902 6162940 5054768 3813273 2501405 2275314 4281703 7254711 8454807 7888592
43894 7888592 9000111 13437298 17593688 16945861 12145342 8045383 7779666 10463102
43886 10463102 13906085 16762510 18195509 17949314 17062809 16889563 17573693 18703787 20337143
43877 20337143 21590118 19899806 14628243 10105483 11314844 16948841 20647755 19271433
43869A9271433l428380k230179j869151k979022k720145j174419j350410k759316
43861G60411j222727L592492O179452L197991j299704j836859R90420K513345
43853A2874821Q79846j607867k520500j559444M12071K102031J998266k21603
43845A2357621k766324l558044k509426r59401K96057J190232J464344R78466
43837F493525M21931M89525P64767M77184m1205L17049J859093L572247M001258
43828A8355374K339482p85430l315246l371258j284631P98596J531920J338366
43820A5607173N82129j190625l199024k934286J69325K404492P3290m830428o530465
43811A51581l121972J013018J486562n17790j098312L55097J169858L60487J15405
$$ plain form
43869 19271433 15843053 13612874 11743723 8764701 6044556 4870137 3519727 760411
43861 760411 -462316 3130176 9309628 12507619 11207915 9371056 10361476 12874821
43853 12874821 13754667 12146800 9626300 8066856 8478927 10580958 12579224 12357621
43845 12357621 9591297 6033253 3523827 2564426 2860483 4050715 5515059 6493525
43837 6493525 6915456 7404981 8169748 8646932 8605727 8922776 10781869 14354116 18355374
43828 18355374 20694856 19909426 16594180 13222922 11938291 12736887 14268807 15607173
43820 15607173 16189302 14998677 11799653 8865367 9034692 11439184 11512474 6682046 151581
43811 151581 -2970391 -1957373 -470811 -988601 -2086913 -1731816 -561958 -201471 -86066
43802h6066J835976L649101L375027J755882O46793l30769k554494m730159l911555
43793c50264n39243J165176n22643j628958J431467N463098M661189l08251k724878
43784F646693L67364M090988L426966J17865j469916j366177k280761l500977
43776F032045j813747K335828M620705L154133P38984j26372n41848j948517l040436
43767I410775k094198J78057K141322L439683L858051K259168j151174l504489
43759A4537195k637629j59358J154023J282307J636746J599146j87227k210268
43751A5014935j616036R55230J851656q010j789279j728980j621538k808681l334640
43742D914657j424250J196214K062745J548359J022348j03630k369977l496700
$$ plain form
43802 -86066 1749910 5399011 8774038 10529920 11176713 10845944 8291450 3561291 -350264
43793 -350264 -889507 275669 -246974 -1875932 -444465 5018633 9679822 9371571 6646693
43784 6646693 7014057 11105045 14532011 14649876 13179960 11813783 9533022 6032045
43776 6032045 4218298 6554126 11174831 14328964 15067948 14941576 14399728 12451211 9410775
43767 9410775 7316577 7494634 9635956 13075639 16933690 19192858 18041684 14537195
43759 14537195 11899566 11740208 12894231 14176538 15813284 17412430 17225203 15014935
43751 15014935 13398899 14354129 16205785 16197775 14408496 12679516 11057978 8249297 4914657
43742 4914657 3490407 4686621 6749366 8297725 9320073 9216443 6846466 3349766
43734C349766j298611K170866L228756K136021J921911K503672Q70071k674993
43726A2207459l644024k95849L263079L315848J691462J599926K052021M35616
43718B0625538k059168k029089O32373K913238L428324L145958K135699l17128
43710B8475745k525590j531120J955558L598853J504132j312165j856411j023468
43702B7285534o46375r7477J473314K299838O36990j669583j551822N48280J507800
43693B9786499L93386o07119N827J124798J211529M0313j984247m010055m036095
43684B1924836n43244M509479O762820M638340J318948L54545J444510K174858
43676D2585092J818704J145442R0965j625414k435076l47894L612307N937367
$$ plain form
43734 3349766 2051155 4222021 7450777 9586798 11508709 14012381 14882452 12207459
43726 12207459 8563435 8267586 11530665 14846513 16537975 18137901 20189922 20625538
43718 20625538 18566370 16537281 17169654 20082892 23511216 26657174 28792873 28475745
43710 28475745 25950155 24419035 26374593 29973446 31477578 30165413 28309002 27285534
43702 27285534 26639159 26541682 28014996 30314834 30951824 29282241 27730419 28278699 29786499
43693 29786499 30179885 29572766 29578593 30703391 31914920 31955233 29970986 25960931 21924836
43684 21924836 21381592 25891071 32653891 37292231 38611179 38965724 40410234 42585092
43676 42585092 44403796 45549238 45640203 44014789 41579713 41231819 44844126 50781493
43668E0781493M997129K790909J938629K898998M603028N781001N086446K117147
43660H0994780q77204o95165K301108M035778K677780J642730L928075O530749
43652A00538631M769176J62906j216545K211019N485057M963786L190625L918564
43644A24023219O642727Q763324R580474R274810P138446L867857K637482M652645
43636A76580984O492546N327401L764379N415369Q666239R903756J0273368J3051355
43628B39475397J6079524J4060482Q219685O131683J0354896J4311523J2297095
43621C20930285P160998M232143L318078J425108j279111l368757o294102j1406784
43613C14717858j5861215j6603604j5766604j6825366j7950061j5202023j0478773
$$ plain form
43668 50781493 55778622 58569531 60508160 63407158 68010186 73791187 78877633 80994780
43660 80994780 80117576 79422411 81723519 85759297 88437077 90079807 94007882 100538631
43652 100538631 105307807 105470713 104254168 106465187 111950244 116914030 120104655 124023219
43644 124023219 130665946 139429270 149009744 158284554 165423000 169290857 171928339 176580984
43636 176580984 183073530 188400931 192165310 197580679 206246918 216150674 226424042 239475397
43628 239475397 255554921 269615403 277835088 283966771 294321667 308633190 320930285
43621 320930285 328091283 332323426 335641504 337066612 335787501 332418744 326124642 314717858
43613 314717858 298856643 282253039 266486435 249661069 231711008 216508985 206030212
43606B06030212r529497j2595998j3845442j0860302q162219r349836j1642974
43599A30043944j1253978r272296q518909q300456o282932l116312j502849k130991
43591G9665221l450492m284053m284272l124851j579306k089909n698954r332584
43583D5820800q749835l839144J295176L358770K794196J552651K25612j460396
43575D0997830k734046k122618K65528K075889J325050p44398q93278J624904
43567C9794861L543646J949055j463465k867788j894446j518519k628879k495147
43559C2419318K53310K600511J259130k690890n587220n719944l907859j264494
43551A7361862J249121K335545J735328J180694K027145K961974K046682o2392
$$ plain form
43606 206030212 196500715 183904717 170059275 159198973 151036754 141686918 130043944
43599 130043944 118789966 109517670 100998761 92698305 86415373 83299061 81796212 79665221
43591 79665221 76214729 71930676 67646404 64521553 62942247 60852338 55153384 45820800
43583 45820800 37070965 33231821 34526997 37885767 40679963 42232614 42458226 40997830
43575 40997830 38263784 36141166 36406694 38482583 39807633 39063235 38169957 39794861
43567 39794861 43338507 45287562 43824097 40956309 39061863 37543344 34914465 32419318
43559 32419318 32672628 35273139 36532269 33841379 28254159 22534215 18626356 17361862
43551 17361862 18610983 20946528 22681856 23862550 25889695 28851669 30898351 30835959
43543C0835959j194172j134750j640910l337580m703589m111072j439089J902430
43535A5177227L422658J279909k785786l886406J97603N149409N209049R56079
43527B4719742j862242p81999O35961o92142k688700k227011l06523N7298j192613
43518A5661771j564238j87266J372789K017801K355194K969108L395303L203272
43510B9223734K739370K325476J590070N2509k019198l611607l816030k726559
43502B3757765j381097o08770k41545J75928N30297P56377J496778K865921L367194
43493C0718848J876001O4488M67836K426643K844392J187448L11516J267410J039025
43484D2203607k231894n156431l692202N08487K231477j00923l128614l821169
$$ plain form
43543 30835959 29641787 28507037 26866127 23528547 18824958 14713886 13274797 15177227
43535 15177227 18599885 19879794 17094008 13207602 13405205 18554614 23763663 24719742
43527 24719742 22857500 22075501 22711462 22019320 19330620 17103609 16797086 16854384 15661771
43518 15661771 14097533 13910267 15283056 17300857 19656051 22625159 26020462 29223734
43510 29223734 31963104 34288580 35878650 35931159 33911961 30300354 26484324 23757765
43502 23757765 22376668 21767898 21526353 21702281 22232578 22988955 24485733 27351654 30718848
43493 30718848 32594849 32659337 33127173 35553816 38398208 39585656 39897172 41164582 42203607
43484 42203607 39971713 34815282 31123080 31631567 33863044 33762121 30633507 26812338
43476B6812338k455853m84523J156812J360387l48859j845094k52531L626139
43468B7568816N712350M227204J774004Q60646P05711J53337M06315K334045L827678
43459D7570106K783454N92397l06589m36971j611046k899583j963712O33823K289758
43450D6651637K903597M415201N917805L970179j050071l556119k52716M740676
43442F3740189N570508K632658J092610L174697N879218N935692L720100J929061
43434I3674733K553947N206552O903458M398987j342243m517725j299002M171403
43426A09750110M743690M86693j330892K743285P180064O168564K208027J320985
43418A33270526L542555M017853J530188k57854K28112J99168j623421k152441
$$ plain form
43476 26812338 24356485 23871962 25028774 26389161 26040302 24195208 23942677 27568816
43468 27568816 33281166 37508370 39282374 40143020 40848731 41002068 41408383 43742428 47570106
43459 47570106 50353560 50945957 50639368 50202397 48591351 45691768 43728056 44361879 46651637
43450 46651637 49555234 53970435 59888240 63858419 62808348 59252229 58999513 63740189
43442 63740189 69310697 71943355 73035965 76210662 82089880 88025572 91745672 93674733
43434 93674733 96228680 101435232 108338690 112737677 111395434 106877709 105578707 109750110
43426 109750110 114493800 114980493 113649601 116392886 123572950 129741514 131949541 133270526
43418 133270526 136813081 140830934 142361122 142103268 142331380 142530548 140907127 138754686
43410A38754686N97022L435042K694699Q766k97542K132659L396836J450701o27276
43401A51545593J446655P577542J2904078J2898315Q300069M320851M769243Q210120
43393B11972466J1106147J3057673J5984887J8976424J8268642J3416905R336548
43386C12119692R766303J2137334J2026140R683260Q245749P769619N617818J639394
43378C79005309j591158l410449n695678q722439j0520376j0920960j2205829
43371C25938420j4741053j5896892j4640485j3289675j3009478j1670898q634888
43364B34055051p565815j0928727j5093031j5188181j2270269j0958676j1780877
43357A50269475j1159938q329136o644337p183608o329755k023445J905947R88843
$$ plain form
43410 138754686 139351708 142786750 145481449 145490215 145192673 147325332 150722168 152172869 151545593
43401 151545593 152992248 160569790 173473868 186372183 194672252 198993103 203762346 211972466
43393 211972466 223078613 236136286 252121173 271097597 289366239 302783144 312119692
43386 312119692 321885995 334023329 346049469 355732729 363978478 371748097 377365915 379005309
43378 379005309 377414151 374003702 368308024 359585585 349065209 338144249 325938420
43371 325938420 311197367 295300475 280659990 267370315 254360837 242689939 234055051
43364 234055051 226489236 215560509 200467478 185279297 173009028 162050352 150269475
43357 150269475 139109537 130780401 124136064 116952456 110622701 108599256 110505203 111494046
43349A11494046l277237n769829m968218m091034n525139p576073p451517m939878
43341F7895121j927774P6073O93088Q8873j056655j567806r07825p0278m15326
43332F2807491j754999k507205j750616k06385R15526J022181q1670k127134l474977
43323E2842212j974477J779744L579277M09948m699884n657933j245169L198195
43315D8231913L142231O05435J25695J774850J895978n23077k385452j714261
43307E1153312o12383j418147k786634k083288K6387L06538k055619l924916k597741
43298C6007509L74720J550345N58342J98910J676632K601807J050686j031231
43290D2987720j036764k29928j411581l270431j812986K287568L063399j869480
$$ plain form
43349 111494046 108216809 102446980 97478762 93387728 87862589 80286516 72834999 67895121
43341 67895121 65967347 66043420 66736508 66825381 65768726 64200920 63293095 63222817 62807491
43332 62807491 61052492 58545287 56794671 56588286 57503812 58525993 58444323 56317189 52842212
43323 52842212 50867735 52647479 56226756 56636704 51936820 46278887 45033718 48231913
43315 48231913 51374144 51979579 52105274 53880124 55776102 55253025 52867573 51153312
43307 51153312 50540929 49122782 46336148 44252860 44279247 44585785 42530166 38605250 36007509
43298 36007509 36382229 37932574 38490916 38689826 40366458 42968265 44018951 42987720
43290 42987720 41950956 41721028 40309447 37039016 35226030 37513598 40576997 38707517
43282C8707517o711810n492527o77606J131888p19931r97497K373420N215024
43274C2828478L825584J7857k139124j166969J571054L744792L392820Q73477
43266D2947969m26931J813387M541994L021694j526866l116640m59016P77657
43258D7573248k569075n583894l343166O84186R210m595750o406450k677688K492583
43249B5583204M794380M203574K555559Q51076j69778R0641Q63996Q30390J37037
43240C9740079l04329p06357j315283o94085K013236M348596L464652P78797M4298
43231D7369604J642385K788023K656652K737617K488263j03599l209023k108023
43223E4261899L001387N795534L059649k15322J326451N245675N818764L070110
$$ plain form
43282 38707517 31995707 26503180 25825574 26957462 26237531 25240034 27613454 32828478
43274 32828478 36654062 36671919 34532795 33365826 34936880 38681672 42074492 42947969
43266 42947969 42521038 44334425 48876419 51898113 50371247 47254607 46795591 47573248
43258 47573248 45004173 39420279 36077113 36761299 36770509 32174759 25768309 23090621 25583204
43249 25583204 30377584 34581158 37136717 37987793 37818015 37908656 38772652 39603042 39740079
43240 39740079 39435750 38729393 37414110 36720025 38733261 43081857 46546509 47325306 47369604
43231 47369604 49011989 51800012 54456664 57194281 59682544 59578945 56369922 54261899
43223 54261899 57263286 63058820 66118469 65903147 67229598 72475273 78294037 81364147
43215H1364147J731348L277254M557782L638662J961676N11824j683723m334388
43207I1024582m973253k693668J52139J452423K019142L154599L751004K007856
43199I5894824j206955k931863j830083K81651Q72422m22342j882257k049892
43191H6725505j258189q10888j265220k016160k345069k297839k453935l189429
43183G1088776m176999m406615l058485q10524K83250r03417k843142l080988
43175E2091856j409604n1541q26324l436772o329260p669171n718644m29640M990779
43166C1211679O376282L393916R2634l69504M91500m80959l070261l968088j429932
43157C2247267K281663L416845R06148k336309k543414K80793J968654l52542
$$ plain form
43215 81364147 83095495 86372749 90930531 94569193 96530869 97042693 95358970 91024582
43207 91024582 86051329 83357661 83509800 84962223 86981365 90135964 93886968 95894824
43199 95894824 94687869 91756006 89925923 90207574 91079996 90657654 88775397 86725505
43191 86725505 85467316 84656428 83391208 81375048 79029979 76732140 74278205 71088776
43183 71088776 66911777 62505162 59446677 58636153 58919403 58015986 55172844 52091856
43175 52091856 50682252 50630711 49804387 46367615 40038355 32369184 26650540 26220900 31211679
43166 31211679 37587961 40981877 41074511 40705007 41196507 40715548 37645287 33677199 32247267
43157 32247267 34528930 37945775 38851923 36515614 33972200 34252993 36221647 35869105
43149C5869105l864752l697692Q5093K812036K324869J369254J946525K047517
43141C8891955K89838p05516J007736K444898K24516l584554m494978k205063
43133C1868832J72032J560315L096435M332007L824934K511289K177905J674395
43125E1218144q34182l061197j370580K259403J964790k832358n926379l580428
43117C7837213K29260L04953k710126m729215m032153j823954J68197L62543j836011
43108B3770707m169767l285700L24234K437436J443099N55029J819780K401652
43100B5296470j57860l072443k517393M38722J900603O71331j588618l265527
43092A7705285k898889P26831N520643O426648K275671j445919p27999M47192
$$ plain form
43149 35869105 32004353 28306661 28391754 31203790 33528659 34897913 36844438 38891955
43141 38891955 39181793 38476277 39484013 41928911 42153427 38568873 34073895 31868832
43133 31868832 32040864 33601179 36697614 41029621 44854555 47365844 49543749 51218144
43125 51218144 50383962 47322765 45952185 48211588 50176378 47344020 41417641 37837213
43117 37837213 38066473 38371426 35661300 30932085 26899932 25075978 25244175 25606718 23770707
43108 23770707 19600940 16315240 16639474 19076910 20520009 21075038 22894818 25296470
43100 25296470 25138610 22066167 19548774 19987496 21888099 22559430 20970812 17705285
43092 17705285 14806396 15533227 21053870 27480518 29756189 28310270 27582271 28029463
43084B8029463k758093o768763n014608M37483J616470k059777k749927K452412
43076A3184660O463491L743216j394126k694412j181189p75193m42580K703012
43068A9606879O456006O339627K912042K40063j008549l022850m837490l186528
43060B3499200Q87002K452209N88596J19235L612152O891835N490650J368042
43052D4908921m97948P10659J789558J089027J63479M51032J499932K551344L342760
43043E6008764L105360J026601j810734l012380k180143j782768l535809n447699
43035D2371192m155514O14215N616404P816259O975290M588920K072740O37373
43027F6536879J236086L158854L705820J060525k823486l969039j204666K389688
$$ plain form
43084 28029463 25271370 18502607 13487999 13925482 15541952 13482175 10732248 13184660
43076 13184660 19648151 23391367 21997241 19302829 18121640 17346447 16903867 19606879
43068 19606879 26062885 32402512 35314554 35554617 34546068 31523218 26685728 23499200
43060 23499200 24386202 26838411 27427007 27546242 31158394 38050229 43540879 44908921
43052 44908921 44410973 45121632 46911190 48000217 48163696 48614728 50114660 52666004 56008764
43043 56008764 59114124 60140725 58329991 55317611 53137468 51354700 47818891 42371192
43035 42371192 38215678 38829893 44446297 52262556 59237846 63826766 65899506 66536879
43027 66536879 67772965 70931819 74637639 75698164 72874678 68905639 67700973 70090661
43019G0090661L405282J816501k97313k143817m338102o345766o189225l279975
43011E2718246J71631J665977J343333J304692K587822L973046L736023J681028
43003F9181798q07968k174482j859082m35142J029360J767192J723964J389302
42995F9814942J242145J179936M42502j475676l466281k989539J187324O439243
42987G2374596Q023508M326695p23087j852796J565703N229561N354207K726499
42979I7024886R51943K082404M795750O111861M251807K63218k845014k901265
42971A09735590l78203K982190O391630R410657J0115519O700196J164327j625586
42963A44496320J87293L214726M056970L838175N024131O511725N549855K774929
$$ plain form
43019 70090661 73495943 75312444 75015131 72871314 68533212 62187446 55998221 52718246
43011 52718246 52889877 54555854 55899187 57203879 59791701 63764747 67500770 69181798
43003 69181798 68373830 66199348 64340266 63905124 64934484 66701676 68425640 69814942
42995 69814942 71057087 72237023 72679525 71203849 67737568 64748029 65935353 72374596
42987 72374596 80398104 84724799 84001712 82148916 83714619 88944180 94298387 97024886
42979 97024886 97976829 100059233 104854983 110966844 115218651 115481869 112636855 109735590
42971 109735590 109357387 112339577 118731207 128141864 138257383 144957579 146121906 144496320
42963 144496320 144683613 147898339 151955309 155793484 160817615 167329340 172879195 175654124
42955A75654124J325178J835462K216798J887853K144100K423923O02419k409664
42947A85680193k879937m32692M07051l006474p237619q169217o866527o575067
42939A50919711p116492o479951n608085o909190r244093r055030o284738m842628
42931I5379504o469871p905553n734004j358722P94627j304553n098757o209781
42923F2092890k898273K004185L901901J478206k064514l421284l073470l193237
42915E4826404l610159k689826j135350j527985l956937n109683k632824J745236
42907C5908876M432480L845206J346710n91135o51888L36340P43611N88287J338397
42898D7296884K678452J872995j749402m317229k657857K62820m49282l510066
$$ plain form
42955 175654124 176979302 178814764 181031562 182919415 185063515 187487438 188089857 185680193
42947 185680193 182800256 182367564 182774615 179768141 172530522 164361305 157494778 150919711
42939 150919711 143803219 137323268 131715183 124805993 115561900 106506870 100222132 95379504
42931 95379504 88909633 81004080 75270076 73911354 74705981 73401428 68302671 62092890
42923 62092890 59194617 61198802 65100703 66578909 64514395 61093111 58019641 54826404
42915 54826404 51216245 48526419 47391069 45863084 41906147 36796464 34163640 35908876
42907 35908876 40341356 44186562 45533272 44942137 44290249 44626589 45370200 45958487 47296884
42898 47296884 49975336 51848331 50098929 45781700 43123843 43386663 42937381 39427315
42890C9427315l076746J662475M556275J816454k330958k495351l6945J35707
42882C9658226k371613l276818l71896L444348L956599J33771n095957p215008
42874B8861652l998944J728800M255151J110331m111708o143323l762209J23926
42866A8063676K445218K412379J310794J259734K990385M087077J424527l752601
42858C0241189o042090k961837J260100J699308m30982p61250P57100K12798l203609
42849B0770727n345199l076258J641896M816660M779814K472735k02922j339028
42841B4518425l44286R10751M0102k411154l509175k214374o37780l02531J10874
42832A6160852J762433K868697J267161j820120l197174k178655j119285j397520
$$ plain form
42890 39427315 36350569 38013044 42569319 44385773 42054815 39559464 39522519 39658226
42882 39658226 37286613 34009795 33637899 37082247 41038846 41172617 36076660 28861652
42874 28861652 24862708 26591508 30846659 31956990 27845282 21701959 17939750 18063676
42866 18063676 20508894 22921273 24232067 25491801 28482186 32569263 33993790 30241189
42858 30241189 24199099 21237262 22497362 24196670 23765688 23004438 23761538 23974336 20770727
42849 20770727 15425528 12349270 13991166 18807826 23587640 26060375 25857453 24518425
42841 24518425 24174139 25084890 25124992 22713838 19204663 16990289 16352509 16049978 16160852
42832 16160852 17923285 20791982 22059143 20239023 17041849 14863194 13743909 12346389
42824A2346389j355735O36868K982511K796354L02801j128882K02370J791030
42816A8573706P14070j955081k954645j802363q41115p85208J42288K082794K366117
42807A5540563Q2316j649823l01710K257078L232310L145036L321151K152797
42799B7779718j743263m880593k674650L023954N421068J982825k745328m308008
42791B1855723l529655k854541j876969P31823L862935N298140M580600K705191
42783C0773247O30119o21242l19180L97717n12240k448680k290789N40170K246255
42774B8395377J86514k635183j795729J954139M001399K632706O71237M18622
42766C3829082N33789r54205l224075m047198l082852j964138j675883j481538
$$ plain form
42824 12346389 10990654 11627522 14610033 17406387 17709188 16580306 16782676 18573706
42816 18573706 19287776 17332695 14378050 12575687 11734572 10949364 11091652 13174446 15540563
42807 15540563 15622879 13973056 13671346 15928424 19160734 22305770 25626921 27779718
42799 27779718 26036455 21155862 18481212 21505166 26926234 28909059 26163731 21855723
42791 21855723 18326068 15471527 13594558 14326381 18189316 23487456 28068056 30773247
42783 30773247 31403366 30782124 30462944 30860661 30348421 27899741 25608952 26149122 28395377
42774 28395377 28581891 25946708 24150979 26105118 30106517 32739223 33410460 33829082
42766 33829082 34362871 33408666 30184591 26137393 23054541 21090403 19414520 17932982
42758A7932982o05399M08089Q10638J037303J553882J085650j729887m954731
42750A5538527m644817o98698J888261L4541k448887o88935L296438L725974L97236
42741A6399640j335532L72241J466749k01945j352049N9908J053840n2724K71410
42732A6681538L819219N644250J867528k623747j320302L132544L394224p8694
42724C0516560j24385M279925N828078J304177k668906k67260M421513M333818
42716D7623520J58155j985244l14855J308334N42652m87865J75202R49384n42460
42707D7426823l812989o133261n710228l239113p61304L02765j02456j326439
42699B6643798k468641k081416R45666M947382N586808Q21865n194961o172963
$$ plain form
42758 17932982 17327583 17735672 18546310 19583613 21137495 22223145 20493258 15538527
42750 15538527 10893710 10195012 12083273 12117814 9668927 8979992 12276430 16002404 16399640
42741 16399640 15064108 15436349 16903098 16701153 15349104 15409012 16462852 16410128 16681538
42732 16681538 20500757 26145007 28012535 25388788 24068486 27201030 30595254 30516560
42724 30516560 30392175 34672100 40500178 41804355 39135449 38868189 43289702 47623520
42716 47623520 47781675 45796431 45481576 46789910 47332562 46844697 47019899 47969283 47426823
42707 47426823 43613834 37480573 31770345 28531232 27769928 28072693 27970237 26643798
42699 26643798 24175157 22093741 23039407 27986789 33573597 34395462 29200501 23027538
42691B3027538j487036L092568K801838j012553l923574l535790l76003L487390
42683B2074378N151475K677224k154644m951448l834484j181076P24919K570595
42675B1076939M743406M742355J021051l237659l774397r35930J588523K135150
42667B7359438J783685J093310j77947q81373L96735K407836K768843J996869
42659C6747396K491535L707898K298817k290477o068700n617066j935899K061679
42651C1395183M989026O428865N678267L076129P23936J74072P91966J447182
42643E4704626K076129K572089K152960J071302R48062K091112K560117J301247
42635F9477644j07333n38031j465369l508422l470039J362505P500799Q280705
$$ plain form
42691 23027538 21540502 24633070 27434908 26422355 22498781 18962991 18586988 22074378
42683 22074378 27225853 29903077 27748433 22796985 18962501 17781425 18506344 21076939
42675 21076939 25820345 30562700 31583751 28346092 24571695 23635765 25224288 27359438
42667 27359438 29143123 30236433 30058486 29177113 29573848 31981684 34750527 36747396
42659 36747396 39238931 42946829 45245646 42955169 36886469 31269403 29333504 31395183
42651 31395183 36384209 42813074 48491341 51567470 52291406 52465478 53257444 54704626
42643 54704626 56780755 59352844 61505804 62577106 63525168 65616280 68176397 69477644
42635 69477644 69370311 68832280 67366911 63858489 60388450 61750955 69251754 77532459
42627G7532459K674080k900496k693318J702908M574263L438173O89078p73727
42619H4243420q30838q04629q34412l1941J243737R18885j973740m912399m188258
42610G2829825K36484M123602M180867K086714J675005L571629M843345L240253
42602I6787724m51369m063826o013171n567904l030061O873J963619K933062L812946
42593H6377893M181738K829132K78738j214138n02326J296898K720227L380221
42585I9348383L305900K626824K191912K865169M098275M842714N548428P089844
42577A31917449Q233408P215752N646913O948757J0264036J0361333N460687P61796
42569A86810131J197690M593445N820690M332605K976047K025329k52968k684817
$$ plain form
42627 77532459 80206539 77306043 74612725 76315633 80889896 84328069 85017147 84243420
42619 84243420 83412582 82607953 81773541 81741600 82985337 83904222 81930482 77018083 72829825
42610 72829825 73066309 77189911 81370778 83457492 85132497 88704126 93547471 96787724
42602 96787724 96336355 92272529 86259358 80691454 77661393 77668266 79631885 82564947 86377893
42593 86377893 90559631 93388763 93667501 92453363 91951037 93247935 95968162 99348383
42585 99348383 102654283 105281107 107473019 110338188 114436463 119279177 124827605 131917449
42577 131917449 140150857 147366609 153013522 159962279 170226315 180587648 186048335 186810131
42569 186810131 188007821 192601266 198421956 202754561 205730608 207755937 207502969 204818152
42561B04818152k456060q42209k222409o916192j0150066r339571p549007p816715
42553A57525923q549321p318204n500669n738263p332855p550807n924650m295243
42545A05315911l603213l203113k731388k494184k335379j783708j085560r52965
42537H7126401j712111l448381o051888q200175p525700l302528J730747L713784
42529F2330149J716585j420502k199250n704K276700J314229k514393m711904
42521E6785910j827397L630836N698899K286545k587546m287832k505897J22490
42513E7316008J389208J18792l658327p197982o375519p93004M746545O018834
42505E1564555M165884K456437J278857m34095j672813j405265j924204n394723
$$ plain form
42561 204818152 202362092 201519883 199297474 192381282 182231216 172891645 165342638 157525923
42553 157525923 148976602 141658398 136157729 130419466 123086611 115535804 109611154 105315911
42545 105315911 101712698 98509585 95778197 93284013 90948634 89164926 88079366 87126401
42537 87126401 85414290 81965909 75914021 67713846 60188146 56885618 58616365 62330149
42529 62330149 64046734 62626232 60426982 60421278 62697978 64012207 61497814 56785910
42521 56785910 54958513 58589349 64288248 66574793 63987247 59699415 57193518 57316008
42513 57316008 58705216 58824008 55165681 47967699 41592180 40799176 45545721 51564555
42505 51564555 55730439 58186876 59465733 59031638 57358825 55953560 54029356 48634633
42497D8634633q601161o437317j13595L589493J786087j114433r08863O05784
42489C7440628n6593k264497l242297k807644k520858k123718l38090J939781
42481B6026712K480477J332279P88641J612082J655814r79627m969938o993533
42473B0952907n361498j688165J009739J355180K98113q92313j998751k621955
42465A1053257j251256K498418N733404N021427J234355j057402L50302K527459
42457B6109964K035586j85065q12896O02442J153290r30321l630440l759389r71710
42448A9611461J890676K256123Q15804M28594K225664L916314K665609j219284
42440C2590961m519139m414036o90335M359703P049500M707932j023006m514250
$$ plain form
42497 48634633 40033472 33596155 33482560 37072053 38858140 37743707 36834844 37440628
42489 37440628 37384035 35119538 31877241 29069597 26548739 24425021 24086931 26026712
42481 26026712 28507189 29839468 30628109 32240191 33896005 32916378 27946440 20952907
42473 20952907 15591409 13903244 14912983 16268163 16566276 15673963 13675212 11053257
42465 11053257 9802001 12300419 18033823 23055250 24289605 23232203 23582505 26109964
42457 26109964 28145550 27960485 27147589 27750031 28903321 27973000 24342560 20583171 19611461
42448 19611461 21502137 23758260 24574064 25002658 27228322 31144636 33810245 32590961
42440 32590961 28071822 23657786 22967451 27327154 34376654 39084586 38061580 33547330
42432C3547330k310190K028856K249621k275601o305017o451152m599678k935958
42424A2948211n78694K662613L836367J550536n83836Q86149L600859L116627
42416B7438832l5009j609031m70237N63979O9472l50071J42146L86685L27701
42407B6464467J432479L137688K640340m00758k466447j359236L33228o39190
42399B9142571l121919l482575j036816J365024J616611P46147P97010J980423
42391B8006476K579548J142891j510817k759728j300172O22234k21810l128790
42383B3429832l560322N36020M954734M353971m85473l804797k664798k8458M15815
42374B3146524j046725k237924k760978l036425j991136J104573L896078L468551
$$ plain form
42432 33547330 31237140 33265996 35515617 33240016 26934999 20483847 15884169 12948211
42424 12948211 12369517 15032130 18868497 20419033 19835197 20721346 24322205 27438832
42416 27438832 27403823 25794792 25324555 25888534 25958006 25607935 25750081 26136766 26464467
42407 26464467 27896946 31034634 33674974 33274216 30807769 29448533 29781761 29142571
42399 29142571 26020652 22538077 21501261 22866285 24482896 25229043 26026053 28006476
42391 28006476 30586024 31728915 30218098 27458370 26158198 26780432 26558622 23429832
42383 23429832 19869510 20405530 25360264 29714235 29228762 25423965 22759167 22730709 23146524
42374 23146524 22099799 19861875 17100897 14064472 12073336 13177909 17073987 20542538
42366B0542538R96410L71186K182583K749108j9012l397530m117214k645600j160273
42357A5502196k61108j46207k058820n418109o253395k338880K385559K861752
42349D272988M42422K98137K646029K597330j195857m013641k730479k97825j01645
42340A917459q76302k83209Q18666R88339J249308K227095J927930k15832q50306
42331F903148J889258M197146K289702j255940k018198j356119l371789o593901
42323F83307n656352m52151L287628K928398J939086K791203L150909J416078
42315A0088106L61444J995790L357357J131130k988119n144724m785226l743846
42307B71912k135779R85467M114284M216658J167194j692079k077440j629228
$$ plain form
42366 20542538 21538948 21910134 24092717 26841825 26822813 23425283 19308069 16662469 15502196
42357 15502196 15241088 15094881 13036061 7617952 1364557 -974323 1411236 4272988
42349 4272988 4715410 5013547 7659576 10256906 9061049 5047408 2316929 2019104 1917459
42340 1917459 1041157 757948 1576614 2564953 3814261 6041356 7969286 7753454 6903148
42331 6903148 8792406 12989552 15279254 14023314 12005116 10648997 7277208 683307
42323 683307 -4973045 -5425196 -2137568 790830 2729916 5521119 8672028 10088106
42315 10088106 10449550 12445340 15802697 16933827 13945708 8800984 4015758 271912
42307 271912 -1863867 -878400 3235884 7452542 8619736 6927657 4850217 3220989
42299C220989k983930n300153m721176K26530N415388N518269J241997r77361
42291A640553K314670O615399N999124J497480j403926j464637k339057n184157
42283G675449o580655m796341k576088j715891K3107L728950N636689K394570
42275C789790l327740o354283n641866l810186k189353j17987K182075L550291
42267a1919259M038588M390518M114501K441913K85984j034051j981890l387083
42259c050779l967560j919059J767414M174934M193291L045144J634534q2134
42251E795785j344400r00411N71570P00301j151733k550073j102510K303719M426503
42242F748751L320757L54767j406310o00200R49325N74664j643230k651443j51369
$$ plain form
42299 3220989 237059 -5063094 -9784270 -9557740 -4142352 1375917 2617914 1640553
42291 1640553 3955223 10570622 16569746 18067226 16663300 15198663 12859606 7675449
42283 7675449 1094794 -3701547 -6277635 -7993526 -7970419 -4241469 1395220 3789790
42275 3789790 462050 -5892233 -11534099 -15344285 -17533638 -17651625 -15469550 -11919259
42267 -11919259 -7880671 -3490153 624348 3066261 3352245 2318194 336304 -3050779
42259 -3050779 -7018339 -8937398 -7169984 -2995050 1198241 4243385 5877919 5795785
42251 5795785 4451385 3550974 4122544 4822845 3671112 1121039 18529 2322248 6748751
42242 6748751 10069508 10424275 9017965 8417765 9367090 9941754 8298524 5647081 5495712
42233E495712M349628O858059M881779j27449m026295l936652j315983j87286
42225A1991513j689171k334212M26169L312008J637867k982166m411438j226576
42217D723994J450286M39465j003890L33189K186470J582495K81028R74044J964402
42208A2931483M91834j800054j654621K38105J390556K577989N341243O811023
42200B6327558L274362k447897l737161o6872K220243k46804l321725k433394
42192A9568310R82865K649190J162437j742442l709268k962858K98312K722037
42184A8968583R39510l350919m706761j256198K829697L514741K022233J770866
42176B0731752L107911L530608J448720k081305m416304l560385n62234O69372
$$ plain form
42233 5495712 9845340 16703399 21585178 21457729 17431434 13494782 12178799 11991513
42225 11991513 10302342 7968130 8394299 11706307 13344174 10362008 5950570 4723994
42217 4723994 6174280 6613745 5609855 5943044 8129514 9712009 9993037 10967081 12931483
42208 12931483 13423317 11623263 9968642 10206747 11597303 14175292 19516535 26327558
42200 26327558 29601920 27154023 23416862 23349990 25570233 25323429 22001704 19568310
42192 19568310 20551175 23200365 24362802 22620360 18911092 15948234 16246546 18968583
42184 18968583 19908093 16557174 11850413 10594215 13423912 16938653 18960886 20731752
42176 20731752 23839663 27370271 28818991 26737686 22321382 18760997 18198763 18868135
42168A8868135k056159n483515m546159Q20310N779698P070142N627791L084451
42160B9164694J11528j496246Q2991K610023J613412k495805m227313j561099
42152B3802185Q30241n33691k422980r83198J658828J426772j082553k700162
42144A9995442l037858l071814j486235K519246N262334K711733k965227n846533
42136A4081088m075079p61182J688858L368995L722114J510265j814203k954952
42128A4765904j645048j112395k938509m563803k934975J587114N718757O244532
42120A5121577K599164k260408m185027k180966P85039K265311L191039M582385
42112A9918114M650676K210960q7141J72731O39931j745487m663324l691368J49355
$$ plain form
42168 18868135 16811976 11328461 6782302 7602612 13382310 20452452 26080243 29164694
42160 29164694 29276222 27779976 27862967 30472990 32086402 29590597 25363284 23802185
42152 23802185 24632426 24098735 21675755 20692557 22351385 23778157 22695604 19995442
42144 19995442 16957584 13885770 12399535 14918781 20181115 22892848 19927621 14081088
42136 14081088 10006009 9244827 10933685 14302680 18024794 19535059 17720856 14765904
42128 14765904 13120856 12008461 9069952 4506149 1571174 3158288 8877045 15121577
42120 15121577 17720741 15460333 11275306 9094340 9879379 12144690 15335729 19918114
42112 19918114 24568790 26779750 26692609 26865340 27505271 25759784 21096460 17405092 17554447
42103A7554447J840076K01814j520796k062581k929605l199279k63289L794919
42095A3415706L514140r50587l076642j99106K578968J569217L81619K381074
42087A9614389L990140J168527k877118k759154L82861J413090p59149l483063
42079A6690523n714031p168726n089938J594958P272720N885166M80557j028357
42071A2922872J456739M93502n361427p751005j710636N706415N624475j39678
42063A1241257l338897j672524J80195m64069j212094j39651J356769J983621
42055G934607K362429K506222J188084j216029k445066j748261n84822O36934
42047H634098L024873N379855L940344j659753n724908l325124K590540M835703
$$ plain form
42103 17554447 19394523 19596337 18075541 16012960 13083355 9884076 9620787 13415706
42095 13415706 16929846 15979259 12902617 12703511 15282479 16851696 17233315 19614389
42087 19614389 23604529 24773056 21895938 19136784 19519645 20932735 20173586 16690523
42079 16690523 10976492 3807766 -1282172 312786 7585506 13470672 13951229 12922872
42071 12922872 14379611 14873113 9511686 1760681 50045 5756460 11380935 11241257
42063 11241257 7902360 6229836 6410031 5945962 4733868 4594217 5950986 7934607
42055 7934607 10297036 12803258 13991342 12775313 10330247 8581986 7997164 8634098
42047 8634098 11658971 17038826 20979170 19319417 13594509 10269385 12859925 17695628
42039A7695628J408975k753028l085413n25804J348632R87755o90020k146113
42031A2240612k245349j185793j008872l095524m851497k002198M621182Q144492
42023A0617053M102907l110592n738933k508547J065184J064716o40957q91812
42015C959019J92288P02430J14534q53586j716844k080594j367751J98931J414115
42006E62542J589974J164344M47770q50433k371584k844757j790722l73812j6116
41997d482794j019762k584900l162670j239487K657524N333671M458106K169564
41989B129252K374621M780619N163370J947935j448840k061212j143488o31813
41981A1110444P9315J223918O06234k093752k855901M89389L205498K21635n176149
$$ plain form
42039 17695628 19104603 16351575 13266162 12740358 14088990 15076745 14386725 12240612
42031 12240612 9995263 8809470 7800598 4705074 -146423 -2148621 2472561 10617053
42023 10617053 14719960 11609368 5870435 3361888 4427072 5491788 4850831 3959019
42015 3959019 4151307 4853737 4968271 4114685 2397841 317247 -1050504 -851573 562542
42006 562542 2152516 3316860 3764630 2914197 542613 -2302144 -4092866 -4466678 -4482794
41997 -4482794 -5502556 -8087456 -11250126 -12489613 -9832089 -4498418 -40312 2129252
41989 2129252 4503873 9284492 14447862 16395797 14946957 12885745 11742257 11110444
41981 11110444 11189759 12413677 13019911 10926159 8070258 8559647 11765145 11986780 6810631
41972F810631n799155j911318n61815l644375m774623l44089M008064K483495
41964c733185j525898j239880K566651L273493q45896m212512k359545K701036
41956e375736O566779P406367N329633P83931m084701n459376k067679K296383
41948E395601K899685k94673l150461k717846l9352K064925K122674P15939n46563
41939F449929l88190R66716J907641J388534L71665K67850M80462p16676k888324
41930G839607l241720n87236K507262L002477J221388l96671r92867j482129j980209
41921E889902j629912o86407k12876K83409K167605M302445L508727l36924k673837
41912A0612132L9568N208981P272004M533541L15427j746318j094263N52868J186761
$$ plain form
41972 6810631 1011476 -899842 -1461657 -5106032 -9880655 -10224744 -6216680 -3733185
41964 -3733185 -5259083 -6498963 -3932312 -658819 -1504715 -5717227 -8076772 -5375736
41956 -5375736 1191043 8597410 13927043 14710974 10626273 5166897 3099218 5395601
41948 5395601 8295286 8000613 4850152 2132306 2092954 4157879 6280553 6996492 6449929
41939 6449929 6061739 7028455 8936096 10324630 10696295 10964145 11444607 10727931 7839607
41930 7839607 4597887 4010651 6517913 9520390 10741778 10345107 9352240 7870111 5889902
41921 5889902 4259990 3573583 3360707 3644116 5811721 10114166 13622893 13285969 10612132
41912 10612132 10651700 15860681 23132685 27666226 27981653 26235335 25141072 25693940 26880701
41903B6880701j81300k562701l619614k486686j111257j349112k040041j064128
41895A2465862R60654J756006J309089J639514K928461L041410J165724j019750
41887B4246970k244479k867293k748011r98127J341118J593320l38769j257556
41879A6727173K04867J045537j170401l835523k891175J200062M249779L736898
41871A9267217O09802l031958n279245m559678j317214J240444P51681p78249
41863F902800J35996K947172L800400J420728j315574k058530j731326j614993
41855H486673r99606N38141J267172m2430j521419o26773J968683L129218J454093
41846A3653752j144426k198371j697955j722334l433093n026560l381571J916376
$$ plain form
41903 26880701 26699401 24136700 20517086 18030400 16919143 15570031 13529990 12465862
41895 12465862 13426516 15182522 16491611 18131125 21059586 24100996 25266720 24246970
41887 24246970 22002491 19135198 16387187 15389060 16730178 18323498 17984729 16727173
41879 16727173 16932040 17977577 16807176 12971653 10080478 11280540 15530319 19267217
41871 19267217 19877019 16845061 11565816 7006138 5688924 6929368 7681049 6902800
41863 6902800 7038796 9985968 13786368 15207096 13891522 11832992 10101666 8486673
41855 8486673 7487067 8025208 9292380 9249950 7728531 7101758 9070441 12199659 13653752
41846 13653752 12509326 10310955 8613000 6890666 3457573 -1568987 -4950558 -3034182
41838c034182P097921P926993M374916J85172j739915j643712q76874o8528Q6950
41829A2308741j252412l049434k505334R73304L834241K764035l59920p34119
41821A1979102K651594N517842M073663k45761l184574k983029j400806m13033
41813A5994998j04194K4864l06189j098215j118475K01605P27058k110554o814420
41804E396478q227798l801523K689484N601040L770122J85054k714447m143090
41796a244680k916702J281085M799937K954064k870427n582460j827280L320259
41788b086204L990266J620555J177049K613455J632370k432315n029463l070114
41780a584401J214561M101797M561594L435369J362765j007227k713723l450011
$$ plain form
41838 -3034182 4063739 11990732 16365648 16550820 14810905 13167193 12290319 12221791 12308741
41829 12308741 11056329 8006895 5501561 6474865 10309106 13073141 12713221 11979102
41821 11979102 14630696 20148538 24222201 23976440 20791866 17808837 16408031 15994998
41813 15994998 15890804 15915668 15609479 14511264 13392789 13594394 14321452 12210898 5396478
41804 5396478 -2831320 -6632843 -3943359 1657681 5427803 5612857 2898410 -1244680
41796 -1244680 -4161382 -2880297 1919640 4873704 2003277 -3579183 -5406463 -2086204
41788 -2086204 1904062 3524617 4701666 7315121 8947491 6515176 1485713 -1584401
41780 -1584401 -369840 3731957 8293551 11728920 13091685 12084458 9370735 5920724
41772E920724l480419k503527l58740J404870J048681l03873K20669K851086M635504
41763I434975L729912J381921r39198l272909n040730m451178j649547M72055
41755c34699M35874L36929J847942L031192J794002j39805L6957J532194J490881
41746A0031467j78453j045194m15666O6633k56615l56176j20060n54255j061860
41737F109821L97034L523753M855023K280379j656569k800141n36237J792954
41729A3966017J139502j977067m582480m758000l383894k388425j986567o36213
41721d607127K302268N087805N354973K515949j950078n618025o343816l856402
41713g114453n59634Q87258J086846K713406N379913N144435Q59699k714703j286829
$$ plain form
41772 5920724 2440305 -63222 -421962 982908 2031589 1727716 1948385 4799471 9434975
41763 9434975 13164887 14546808 13607610 10334701 5293971 842793 -806754 -334699
41755 -334699 101175 438104 2286046 5317238 7111240 6971435 7008392 8540586 10031467
41746 10031467 9853014 8807820 8392154 8458787 8202172 7845996 7725936 7171681 6109821
41737 6109821 6506855 10030608 14885631 17166010 15509441 12709300 12173063 13966017
41729 13966017 15105519 13128452 8545972 3787972 404078 -1984347 -3970914 -4607127
41721 -4607127 -2304859 2782946 8137919 10653868 8703790 3085765 -3258051 -7114453
41713 -7114453 -7674087 -6786829 -5699983 -2986577 2393336 7537771 8397470 5682767 4395938
41704D395938K644174L756574J545450n17524j197002j604925p84264K724715
41696A0963136N583351K587384m457444p473474l482414J291018J400577k93211
41688F118923P32635K473603O80131k956318l307107m781K797655L303961L184879
41679A3023581K787167N94275k684181m216940l416950k117617n63173K385421
41671E791583M951418L167058k944252q121931q384298n212978j788818J198382
41663a1343836L869107M695335K688852m0067o02738R47287K084615J038537j647552
41654A689540l655031k333249K662080P499014P206487J692215l638725m567847
41646F554484k601283r87458N39761L638926O375420M835674p94424n656790o119503
$$ plain form
41704 4395938 7040112 10796686 12342136 11824612 10627610 9022685 8238421 10963136
41696 10963136 16546487 19133871 14676427 7202953 3720539 5011557 6412134 6118923
41688 6118923 6851558 9325161 10005292 7048974 3741867 3737086 6534741 9838702 13023581
41679 13023581 15810748 16405023 13720842 9503902 6086952 3969335 3406162 5791583
41671 5791583 10743001 13910059 10965807 2843876 -5540422 -10753400 -12542218 -11343836
41663 -11343836 -7474729 -2779394 -90542 -130609 -733347 213940 2298555 3337092 1689540
41654 1689540 -1965491 -4298740 -1636660 5862354 13068841 14761056 11122331 6554484
41646 6554484 3953201 2965743 3505504 7144430 13519850 18355524 17561100 11904310 5784807
41637E784807l236420K7941K063684K411174J125571m43033n06734L87939l43323
41628G271606l062138m454892k256105R02990J100702j095288j781944J01278
41620c273791J430074J96280j333665m05623J986513K991826K243385J697733
41612E532732K060690J976189O44643r99746j995146k328934j841960n5081K218202
41603E211589K895818J380421j80018K91533J906716K246086Q07965p18229j239047
41594A2602834j478382k099543k144843l14747K917494N463414N840136M540993
41586B5327356K914463J237984j266966m535267o902597o978641n410385l726696
41578F59251k203094l36038J181181R87350m35412q99110K98037J305094P77514
$$ plain form
41637 5784807 2548387 2576328 4640012 7051186 8176757 7733724 7226990 7614929 7271606
41628 7271606 4209468 -245424 -2501529 -1598539 -497837 -1593125 -3375069 -3273791
41620 -3273791 -1843717 -1647437 -2981102 -3386725 -1400212 1591614 3834999 5532732
41612 5532732 7593422 9569611 10214254 9214508 7219362 4890428 3048468 2993387 5211589
41603 5211589 8107407 9487828 9307810 9599343 11506059 13752145 14560110 13841881 12602834
41594 12602834 11124452 9024909 6880066 6565319 9482813 14946227 20786363 25327356
41586 25327356 28241819 29479803 28212837 23677570 16774973 9796332 4385947 659251
41578 659251 -1543843 -1879881 -698700 288650 -146762 -1045872 -747835 557259 1334773
41569A334773K13704J854844N354878P758207O319804J027937m935098p522225
41561A1406824n919468l674548l802619m045505n91626M396329M460405j025176
41553A204616m587652j463134L270024K959273n69054j332428P02888J094384
41545A278917l12098J53000K193811K020886J88341J148850M495146M479986k70159
41536A5376680m198686m116254l445030m296528l161258J271739L576391N40188
41528A547242k082973J396947O464797N153337j167397m205776j685020M89670
41520E910827j478471m378422m316427j796082R81568L073398L721510K277657
41512C995558K43858J07412J649390K447569J920927J498092J057765r05518l374905
$$ plain form
41569 1334773 1548477 3403321 8758199 16516406 22836210 23864147 18929049 11406824
41561 11406824 5487356 1812808 -1989811 -6035316 -6626942 -2230613 2229792 1204616
41553 1204616 -3383036 -4846170 -1576146 1383127 814073 -518355 184533 1278917
41545 1278917 966819 1119819 3313630 5334516 5522857 6671707 11166853 15646839 15376680
41536 15376680 11177994 7061740 3616710 -679818 -3841076 -2569337 1007054 1547242
41528 1547242 -535731 861216 7326013 12479350 11311953 7106177 5421157 5910827
41520 5910827 4432356 53934 -4262493 -6058575 -5077007 -2003609 1717901 3995558
41512 3995558 4239416 4346828 5996218 8443787 10364714 11862806 12920571 12015053 8640148
41503H640148k980963J058508N278849N994689K609965k951107p511785p951786
41495B186518m299712q34267r25959j993006M24579M911345N726083J695760k127170
41486D764171k285783p64066K34903J677874L689882L404703k02315l604716l763468
41477C151185k173933j318206q34698R9580K45689r60360j490881k52123P81212
41468b752535M66918Q70796K989595L987009J929188n13428n94192O7497o72059
41459E778789j147856K90140J079210r02609k243085O07516M111268K466289k662226
41450G377436m275185o09253L397232M548443M265836L067334n39810m649943
41442A2582090m496600k85364K031813R6628j184758J659014M564830K731211
$$ plain form
41503 8640148 5659185 6717693 11996542 17991231 20601196 17650089 10138304 2186518
41495 2186518 -2113194 -2947461 -3873420 -5866426 -5441847 -530502 5195581 6891341 4764171
41486 4764171 2478388 1714322 1949225 3627099 7316981 10721684 10519369 6914653 3151185
41477 3151185 977252 -340954 -1175652 -1076072 -830383 -1790743 -3281624 -3533747 -2752535
41468 -2752535 -2285617 -1414821 1574774 5561783 7490971 6977543 6383351 6450848 5778789
41459 5778789 4630933 4921073 6000283 5097674 2854589 3462105 7573373 10039662 7377436
41450 7377436 3102251 2492998 5890230 10438673 14704509 17771843 17232033 12582090
41442 12582090 8085490 7800126 9831939 9928567 8743809 10402823 14967653 17698864
41434A7698864j768028l934202l212207k127112j104602M23553O28170j946205
41426D658231m325067k749946J116093K422267N82762l15655J627512L426342
41418F442539K151628j094472l372356l470869k217721j015303o45528l28166
41410c550248J671827N105967O550885L474781j500673l382649j385273N32811
41402G517428k18740j690829j282442L43186Q98174k54555k102587l507368l370544
41393c668277j001473K246641L319575J101498j541092j078442K185722M619922
41385F184074L801377R94658r20805q47024l60720j541958m182722n605983l774829
41376f253932m6274K328210K138279J088686Q11169J027906J168227J573074J957840
$$ plain form
41434 17698864 15930836 11996634 8784427 6657315 5552713 5976266 6604436 4658231
41426 4658231 333164 -2416782 -1300689 1121578 1704340 1388685 3016197 6442539
41418 6442539 8594167 7499695 4127339 656470 -1561251 -2576554 -3222082 -3550248
41410 -3550248 -1878421 3227546 9778431 13253212 11752539 8369890 6984617 7517428
41402 7517428 7298688 5607859 4325417 4668603 5566777 5312222 3209635 -297733 -3668277
41393 -3668277 -4669750 -2423109 896466 1997964 456872 -621570 1564152 6184074
41385 6184074 9985451 10980109 10059304 9212280 8851560 7309602 3126880 -2479103 -6253932
41376 -6253932 -6300206 -3971996 -1833717 -745031 66138 1094044 2262271 3835345 5793185
41367E793185Q52864j703157k890206q43501J902595J556266j284036k384439
41359I99571k16412J885615R84296j123285j058828P11919N63003k714503n795537
41350e764161n127226j503855J232796J285524P99653K207687M343184L953446
41342A427048N56343k387581j832013J118294L089559K603847P00986j394061
41334C882422l033165l220957j401938P67793P63317j237175k334670j195821
41326g010194m6748j005212k499850j528462J659351L537483J981506q32170j000413
41317f744709K346481N732243N185060J086847k023443j104367J562545K003313
41309H043970L55895k39758L28614j151582m709954n499231j351103K532642P25065
$$ plain form
41367 5793185 6646049 4942892 2052686 1209185 3111780 4668046 3384010 999571
41359 999571 783159 2668774 3653070 2529785 1470957 2182876 2745879 31376 -5764161
41350 -5764161 -10891387 -12395242 -11162446 -9876922 -9077269 -6869582 -2526398 1427048
41342 1427048 1983391 -404190 -2236203 -1117909 1971650 4575497 5276483 3882422
41334 3882422 849257 -2371700 -3773638 -3005845 -2242528 -3479703 -5814373 -7010194
41326 -7010194 -7056942 -8062154 -10562004 -12090466 -10431115 -6893632 -4912126 -5744296 -6744709
41317 -6744709 -4398228 1334015 6519075 7605922 5582479 4478112 6040657 8043970
41309 8043970 8399865 8160107 8488721 7337139 2627185 -2872046 -4223149 -1690507 -965442
41300i65442m027418m786315o74982K565405J565410p75052r49961O64019K384411
41291d999925L945597M794380L273379m72904l554508l843365j997253O84530
41283b170069L286250L685210J40352m324388l864256J747278N574105L373894
41275G448376k69633P1394J913111L10688k332090m2286N328595N460253j274929
41266A6613479o528822m348533O68012J608125o99517j269606J26066M8250j230268
41257D987186p7048L214448L534782j196285o005022n345182n48114K288495K71664
41248A124924l502230m795263l006346k59594J930412L117564K450972n15470
41240c455031l599245l343766L68728L442587K931538J031951J344699L172131
$$ plain form
41300 -965442 -4992860 -9779175 -10454157 -7888752 -6323342 -7098394 -8048355 -7384336 -4999925
41291 -4999925 -1054328 3740052 7013431 6540527 2986019 -857346 -2854599 -2170069
41283 -2170069 1116181 4801391 4941743 617355 -3246901 -1499623 4074482 7448376
41275 7448376 7178743 7250137 9163248 9473936 7141846 7099560 12428155 17888408 16613479
41266 16613479 10084657 5736124 6404136 8012261 7312744 6043138 6169204 6217454 4987186
41257 4987186 4910138 8124586 11659368 10463083 4458061 -887121 -1435235 853260 1124924
41248 1124924 -2377306 -7172569 -10178915 -10438509 -8508097 -5390533 -2939561 -3455031
41240 -3455031 -7054276 -10398042 -10029314 -6586727 -3655189 -2623238 -1278539 1893592
41232A893592L025530P89073J87989K588682M316450K106001j744715k427937
41224A0734665O91974L139508R07856m749032q533268o629266q95260K837867
41216b494956J295963k165416j729418L015050O021284K555110m343232p187778
41208e033393k723973M598130P598958L612003l356924p148950n751250k545176
41200a0750575j229660j212238L20218L337426M956593L915030J744016n43088
41192E37722l304171n212217l408610J601922M964307L723087P55408n0358Q25982
41183D33072J010356P03350Q14111l67207l973415o337353l242576K876463N392671
41174b690528K751088o4382L83892J853297J649648Q61211J061160J084865m5616
$$ plain form
41232 1893592 4919122 5708195 5896184 8484866 12801316 14907317 13162602 10734665
41224 10734665 11426639 14566147 15474003 10724971 2191703 -4437563 -5332823 -2494956
41216 -2494956 -1198993 -3364409 -5093827 -2078777 3942507 6497617 2154385 -5033393
41208 -5033393 -7757366 -3159236 4439722 8051725 4694801 -2454149 -8205399 -10750575
41200 -10750575 -11980235 -13192473 -12872255 -9534829 -4578236 -663206 1080810 537722
41192 537722 -2766449 -7978666 -11387276 -9785354 -4821047 -1097960 -342552 -392910 433072
41183 433072 1443428 2146778 2960889 2593682 -1379733 -7717086 -10959662 -8083199 -2690528
41174 -2690528 60560 -3822 380070 2233367 3883015 4744226 5805386 6890251 6844635
41165F844635m16527J484540L406541K348217r23338l124592k833800j246153
41157E539523K10660P96143p444j842179l033898k319832k59459K041619M093963
41148E219096M697903J683251m620281r399704q053503k247827J803260J164822
41140i752983p11553M09999L525106M041984K43868m144452m308597j05580L690377
41131g111831L032922o21861k453080o79844J301736o8918l475703m665183k228659
41122a6970421R78040K035972J318078R43727J571322K014059J332365R8966n44006
41113g221898m63452o75597j821789k894540k123491P41047L634595M123433J943121
41104d758571o19239q16127J832332M570301L788634p47197m815146m467100j188796
$$ plain form
41165 6844635 6428108 7912648 11319189 13667406 12744068 9619476 6785676 5539523
41157 5539523 5750183 6546326 6538882 4696703 1662805 -657027 -916486 1125133 5219096
41148 5219096 9916999 11600250 6979969 -2419735 -10473238 -12721065 -10917805 -9752983
41140 -9752983 -10464536 -10054537 -6529431 -2487447 -2243579 -6388031 -10696628 -10802208 -7111831
41131 -7111831 -4078909 -4700770 -7153850 -7833694 -6531958 -6600876 -10076579 -14741762 -16970421
41122 -16970421 -15992381 -13956409 -12638331 -11694604 -10123282 -8109223 -6776858 -6677892 -7221898
41113 -7221898 -7685350 -8360947 -10182736 -13077276 -15200767 -14459720 -10825125 -6701692 -4758571
41104 -4758571 -5377810 -6193937 -4361605 208696 3997330 3250133 -1565013 -6032113 -7220909
41095g220909J31175j701045k492510O59438M529474M481356J345791k72077R64411
41086D25104K067306J339183O09138R36334J49772l171083o292706n634335j659417
41077a1230704K050977L407177L144235K362339J200895K8724Q627J796923M565558
41068G334751O613551O512163L912596j54808m048418o985688r095053r641031
41060e551937o748233m37441N346927O239248K703348p29602j602840j952438
41052b732968l567524m174138j155718L200956M017860P17259k123603j152042
41044f969918J969829M099906M514639L553615P19311l106775m344272j201721
41036g65386K476680J868190j620434k300938J122361L788892K313622p24619
$$ plain form
41095 -7220909 -7089734 -8790779 -11283289 -10623851 -6094377 -1613021 -267230 -539307 425104
41086 425104 2492410 3831593 4440731 5377065 5526837 2355754 -3936952 -9571287 -11230704
41077 -11230704 -9179727 -5772550 -2628315 -265976 934919 963643 972270 2769193 7334751
41068 7334751 13948302 20460465 24373061 24218253 20169835 13184147 4089094 -5551937
41060 -5551937 -12300170 -12737611 -7390684 -1151436 1551912 822310 -780530 -2732968
41052 -2732968 -6300492 -10474630 -11630348 -8429392 -4411532 -3694273 -5817876 -6969918
41044 -6969918 -5000089 -900183 3614456 7168071 7887382 4780607 436335 -765386
41036 -765386 1711294 3579484 1959050 -341888 780473 4569365 6882987 6158368
41028F158368j773651j325418j260150j039646J83448Q46117j47172n92185J308983
41019B358694K971233J216647k185157l223334k052795j820436k461387j049637
41011f246172K198971L741611K649828J407627M74752k145318n020084l408957
41003f347742K513260N875996K952142j107493p02620J586181L78375l080562
40995B067537l547215q68782M52150o79355q42921J283573L036656K823989K030907
40986E756539J377645j49697k263523l299584l304352l362825k474971L48100
40978g372668J875977j502149o075594m096080M166295R341683O561960K249211
40970E148635K862872M546750Q03563n618684o952269k800401L52753J61785M57534
$$ plain form
41028 6158368 4384717 3059299 1799149 759503 942951 1789068 1641896 1049711 2358694
41019 2358694 5329927 6546574 4361417 1138083 -914712 -2735148 -5196535 -6246172
41011 -6246172 -4047201 -305590 2344238 3751865 4226617 2081299 -2938785 -6347742
41003 -6347742 -3834482 2041514 4993656 3886163 3183543 4769724 5148099 2067537
40995 2067537 -1479678 -2348460 -1896310 -2575665 -3418586 -2135013 901643 3725632 5756539
40986 5756539 7134184 6984487 4720964 1421380 -1882972 -5245797 -7720768 -7372668
40978 -7372668 -5496691 -6998840 -13074434 -17170514 -13004219 -3662536 2899424 5148635
40970 5148635 8011507 12558257 13361820 7743136 790867 -2009534 -1656781 -1494996 -1037462
40961a037462K572967K859364K76681q20891J826500M025935J535274l693612
40953G544756o837653o204557l170382O76470L681190M128897K426767R75199
40945C220687M60893o88699k002235m65779L440998M143648p67943n307482l396092
40936a362004J429034J272267l531191m805642O15016O090003N304813O81845
40928E694141j780533r13077N69138J522914K223861J283026k575545o853653
40920h29728p566893m737210j958992o85685J286802M970380P368088N387632
40912C234394L21484l591823l816230j125852K312572M543877M011426L75367
40904F265215m049155n229171j482000L740771M876142O16263m272757m699343
$$ plain form
40961 -1037462 1535505 4394869 4671550 3850659 5677159 9703094 11238368 7544756
40953 7544756 707103 -5497454 -8667836 -7991366 -4310176 -181279 2245488 3220687
40945 3220687 3681580 2992881 990646 524867 3965865 8109513 7341570 2034088 -1362004
40936 -1362004 67030 1339297 -2191894 -6997536 -6382520 -292517 5012296 5694141
40928 5694141 3913608 3000531 3569669 5092583 7316444 8599470 6023925 -829728
40920 -829728 -8396621 -13133831 -15092823 -15778508 -14491706 -9521326 -2153238 3234394
40912 3234394 3555878 -35945 -3852175 -4978027 -2665455 1878422 5889848 6265215
40904 6265215 2216060 -3013111 -4495111 -754340 4121802 4738065 465308 -4234035
40896d234035j408247O87191n77892k388257j941795m25221l06972j243150j127764
40887a2966142M41304K182384L380161L796723K549849l62990k488877j703524
$$ plain form
40896 -4234035 -5642282 -4955091 -5532983 -7921240 -9863035 -10288256 -10595228 -11838378 -12966142
40887 -12966142 -12524838 -10342454 -6962293 -3165570 -615721 -978711 -3467588 -5171112
$$ [...]
##END NTUPLES=NMR SPECTRUM
##END=
