##TITLE=31Pdec_DE-132rm_3h
, 24 sc
 4.3.2026
##JCAMPDX= 6.0         $$ Bruker NMR JCAMP-DX V2.0
##DATA TYPE= NMR SPECTRUM
##DATA CLASS= NTUPLES
##ORIGIN= UXNMR, Bruker Analytische Messtechnik GmbH
##OWNER= root
$$ XWIN-NMR		Version 3.5
$$ Wed Mar  4 13:41:05 2026 Russian Standard Time (UT+4h)  she@DPX200
##.OBSERVE FREQUENCY= 81.013821
##.OBSERVE NUCLEUS= ^31P
##.ACQUISITION MODE= SIMULTANEOUS
##.ACQUISITION SCHEME= undefined
##.AVERAGES= 24
##.DIGITISER RES= 17
##SPECTROMETER/DATA SYSTEM= spect
##.PULSE SEQUENCE= zgpg30
##.SOLVENT NAME= CDCl3
##.SHIFT REFERENCE= (INTERNAL, CDCl3, 0, 197.392)
##AUDIT TRAIL= $$ (NUMBER, WHEN, WHO, WHERE, WHAT)
$$ ##TITLE= Audit trail, XWIN-NMR		Version 3.5
$$ ##JCAMPDX= 5.01
$$ ##ORIGIN= Bruker BioSpin GmbH
$$ ##OWNER= she
$$ F:/spectra/data/she/nmr/P31/2/pdata/1/auditp.txt
$$ ##AUDIT TRAIL=  $$ (NUMBER, WHEN, WHO, WHERE, WHAT)
(   1,<2026-03-04 13:39:21.53 +0400>,<she>,<DPX200>,
      <created by zg, POWCHK disabled, PULCHK disabled
       configuration hash MD5:
       00 E9 B6 7A A2 85 ED C7 34 08 36 98 17 FE 4E 26
       data hash MD5: 32K
       F2 D3 00 CD EC FE E2 96 6E 09 16 9C E4 48 1C 6D>)
(   2,<2026-03-04 13:39:37.68 +0400>,<she>,<DPX200>,
      <Start of raw data processing
       efp BC_mod = 2 LB = 1.5 FT_mod = 6 PKNL = 1 PHC0 = 1390.942 PHC1 = 72.30066 SI = 64K 
       data hash MD5: 64K
       C6 33 AA F1 9E 47 BF EE FD 5D 6D 61 FA FF 17 85>)
(   3,<2026-03-04 13:40:19.85 +0400>,<she>,<DPX200>,
      <pk PHC0 = 2.135557 PHC1 = -2.2 
       data hash MD5: 64K
       9D 27 64 A7 47 B8 95 51 B2 5E 7F 16 BD 60 44 90>)
(   4,<2026-03-04 13:40:30.82 +0400>,<she>,<DPX200>,
      <abs ABSG = 5 
       data hash MD5: 64K
       A9 D0 EE 75 00 4B 9F 58 35 D8 EE 29 61 7F 3F FA>)
$$ ##END=
$$ 
$$ hash MD5
$$ E2 67 69 25 DF A1 BF CE AF 79 AB 89 C9 A7 6A E5
##$RELAX= 
##$RELAX= 
##$RELAX= 
##$RELAX= 
##$RELAX= 
##$RELAX= 
##$RELAX= 
##$RELAX= 
$$ Bruker specific parameters
$$ --------------------------
##$DU= <F:/spectra>
##$EXPNO= 2
##$NAME= <P31>
##$PROCNO= 1
##$TYPE= <nmr>
##$USER= <she>
##$AMP= (0..31)
100 100 100 100 100 100 100 100 100 100 100 100 100 100 100 100 100 100 
100 100 100 100 100 100 100 100 100 100 100 100 100 100 
##$AQSEQ= 0
##$AQ_mod= 1
##$AUNM= <au_zg>
##$AUTOPOS= <>
##$BF1= 81.014009
##$BF2= 200.13
##$BF3= 200.13
##$BF4= 200.13
##$BF5= 200.13
##$BF6= 200.13
##$BF7= 200.13
##$BF8= 200.13
##$BYTORDA= 1
##$CFDGTYP= 0
##$CFRGTYP= 5
##$CHEMSTR= <none>
##$CNST= (0..31)
1 1 145 1 1 1 1 1 1 1 1 1 1 1 1 1 1 1 1 1 1 1 1 1 1 1 1 1 1 1 1 1 
##$CPDPRG= <waltz16>
##$CPDPRG1= <>
##$CPDPRG2= <waltz16>
##$CPDPRG3= <>
##$CPDPRG4= <mlev>
##$CPDPRG5= <mlev>
##$CPDPRG6= <mlev>
##$CPDPRG7= <mlev>
##$CPDPRG8= <mlev>
##$CPDPRGB= <>
##$CPDPRGT= <>
##$D= (0..31)
0 1 0 0 0 0 0 0 0 0.06 0 0.03 2e-05 3e-06 0 0 0.0002 0 0 0 0 0 0 0 0 0 
0 0 0 0 0 0 
##$DATE= 1772617161
##$DBL= (0..7)
120 120 120 11 120 120 24 19 
##$DBP= (0..7)
150 150 150 150 150 150 150 150 
##$DBP07= 0
##$DBPNAM0= <>
##$DBPNAM1= <>
##$DBPNAM2= <>
$$ [...]
##$SUBNAM3= <"">
##$SUBNAM4= <"">
##$SUBNAM5= <"">
##$SUBNAM6= <"">
##$SUBNAM7= <"">
##$SUBNAM8= <"">
##$SUBNAM9= <"">
##$SW= 400.765351723535
##$SWIBOX= (0..15)
0 1 3 0 0 0 0 0 0 0 0 0 0 0 0 0 
##$SW_h= 32467.5324675325
##$TD= 32768
##$TD0= 1
##$TE= 0
##$TE2= 300
##$TE3= 300
##$TEG= 300
##$TL= (0..7)
0 120 53 12 22 120 120 120 
##$TP= (0..7)
150 150 150 150 150 150 150 150 
##$TP07= 0
##$TPNAME0= <>
##$TPNAME1= <>
##$TPNAME2= <>
##$TPNAME3= <>
##$TPNAME4= <>
##$TPNAME5= <>
##$TPNAME6= <>
##$TPNAME7= <>
##$TPOAL= (0..7)
0.5 0.5 0.5 0.5 0.5 0.5 0.5 0.5 
##$TPOFFS= (0..7)
0 0 0 0 0 0 0 0 
##$TUNHIN= 0
##$TUNHOUT= 0
##$TUNXOUT= 0
##$USERA1= <user>
##$USERA2= <user>
##$USERA3= <user>
##$USERA4= <user>
##$USERA5= <user>
##$V9= 5
##$VALIST= <valist>
##$VCLIST= <CCCCCCCCCCCCCCC>
##$VD= 0
##$VDLIST= <DDDDDDDDDDDDDDD>
##$VPLIST= <PPPPPPPPPPPPPPP>
##$VTLIST= <TTTTTTTTTTTTTTT>
##$WBST= 1024
##$WBSW= 4
##$XGAIN= (0..3)
0 0 0 0 
##$XL= 0
##$YL= 0
##$YMAX_a= 28962
##$YMIN_a= -32638
##$ZGOPTNS= <>
##$ZL1= 120
##$ZL2= 120
##$ZL3= 120
##$ZL4= 120
##$ABSF1= 197.3918
##$ABSF2= -203.3724
##$ABSG= 5
##$ABSL= 3
##$ALPHA= 0
##$AQORDER= 0
##$ASSFAC= 0
##$ASSFACI= 0
##$ASSFACX= 0
##$ASSWID= 0
##$AUNMP= <proc_1d>
##$AZFE= 0.1
##$AZFW= 0.5
##$BCFW= 0
##$BC_mod= 2
##$BYTORDP= 0
##$COROFFS= 0
##$CY= -3
##$DATMOD= 1
##$DC= 0
##$DFILT= <>
##$DTYPP= 0
##$F1P= 0
##$F2P= 0
##$FCOR= 1
##$FTSIZE= 65536
##$FT_mod= 6
##$GAMMA= 0
##$GB= 0
##$INTBC= 1
##$INTSCL= 9.790993e-09
##$ISEN= 30
##$LB= 1.5
##$LEV0= 0
##$LPBIN= 0
##$MAXI= 10000
##$MC2= 0
##$MEAN= 0
##$ME_mod= 0
##$MI= 50
##$NCOEF= 0
##$NC_proc= -7
##$NLEV= 6
##$NOISF1= 182.463
##$NOISF2= 159.3651
##$NSP= 0
##$NTH_PI= 0
##$NZP= 0
##$OFFSET= 197.3918
##$PC= 4
##$PHC0= 1393.078
##$PHC1= 70.10066
##$PH_mod= 1
##$PKNL= yes
##$PPARMOD= 0
##$PSCAL= 0
##$PSIGN= 0
##$REVERSE= no
##$SF= 81.014063255964
##$SI= 65536
##$SIGF1= 159.3651
##$SIGF2= -187.1042
##$SINO= 113.3802
##$SIOLD= 16384
##$SREGLST= <1H.CDCl3>
##$SSB= 0
##$STSI= 65536
##$STSR= 0
##$SW_p= 32467.5324675325
##$SYMM= 0
##$S_DEV= 0
##$TDeff= 32768
##$TDoff= 0
##$TI= <>
##$TILT= no
##$TM1= 0
##$TM2= 0
##$TOPLEV= 0
##$USERP1= <user>
##$USERP2= <user>
##$USERP3= <user>
##$USERP4= <user>
##$USERP5= <user>
##$WDW= 1
##$XDIM= 65536
##$YMAX_p= 438485166
##$YMIN_p= -10496550
$$ End of Bruker specific parameters
$$ ---------------------------------
##NTUPLES= NMR SPECTRUM
##VAR_NAME=  FREQUENCY,     SPECTRUM/REAL,   SPECTRUM/IMAG
##SYMBOL=    X,             R,               I
##VAR_TYPE=  INDEPENDENT,   DEPENDENT,       DEPENDENT
##VAR_FORM=  AFFN,          ASDF,            ASDF
##VAR_DIM=   65536,         65536,           65536
##UNITS=     HZ,            ARBITRARY UNITS, ARBITRARY UNITS
##FACTOR=    0.49542278885378, 1,            1
##FIRST=     15991.5117654749, 0,            0
##LAST=      -16476.0207020576, 0,           0
##MIN=       -16476.0207020576, -10496550,   0
##MAX=       15991.5117654749, 438485166,    0
$$ Real data points
##PAGE= N=1
##DATA TABLE= (X++(R..R)), XYDATA
$$ [...]
47071f9023L05382O01736O9867p33666q30642P9855J147064J338352P04364J23026
47061B736315m0855j91927m27979k41341L84611N91102p5627q71658r94745o87602
47051A80294m66490j24589N12473O50285l54833j482632j154497L31457J036194
47042h72338K35376n14322K19252J628089J955485R50288j28629m20167k32752
47033B820282j14388j74837l87770p49055r76748p01999j10033K02609J56184
47024c5755L26081Q93339J139838M89853m90842p97595l53428K0104j92633p45053
47014B53909j291665j701390j607411n25582J155614K060153J375612K6710m39568
47005f93618J69947O32324J17189p77813j012448m83267j0793k46981r20634j118964
$$ plain form
47071 -69023 236359 838095 907962 174296 -656346 -576491 570573 1908925 2613289 2736315
47061 2736315 2695460 2503533 2075554 1834213 2218824 2809926 2734299 1862641 867896 180294
47051 180294 -286196 -410785 101688 751973 397140 -1085492 -2239989 -1908532 -872338
47042 -872338 -636962 -1151284 -932032 696057 2651542 3601830 3473201 3053034 2820282
47033 2820282 2705894 2531057 2143287 1394232 417484 -284515 -394548 -191939 -35755
47024 -35755 290326 1183665 2323503 2813356 2322514 1524919 1171491 1191595 998962 253909
47014 253909 -1037756 -2739146 -4346557 -4872139 -3716525 -1656372 -280760 -254050 -693618
47005 -693618 -523671 108653 225842 -551971 -1564419 -2047686 -2058479 -2305460 -3226094 -4345058
46995d345058k63530J126896J783996J017900m67390j382458j259714o34512p4678
46986d498548L16117N07581M10026K74826N51382J120831J300713Q64637M00863
46977A248428L23441K23587k87014p17801l72569N18582J012406N81741m70939
46968B059862j470984j786817j132859l287N12674o0610q46729p03259K49740
46959c182269Q97153O70397O466n70861r11925q00365m7631P67360O39566l39278
46949b871387o92294N19951K159891K263759N19887j337781j610933m40709O78788
46940h10828P23994P0782l07259j52499o4192l86947n38105J08868J071601J233476
46930I48891L70338o04302j003725j081471j075156n41023O31810J385203P41903
$$ plain form
46995 -4345058 -4608588 -3481692 -1697696 -679796 -1147186 -2529644 -3789358 -4423870 -4498548
46986 -4498548 -4182431 -3674850 -3264824 -2989998 -2438616 -1317785 -17072 847565 1248428
46977 1248428 1571869 1795456 1508442 790641 418072 936654 1949060 2530801 2059862
46968 2059862 588878 -1197939 -2330798 -2334085 -1821411 -1882021 -2728750 -3432009 -3182269
46959 -3182269 -2285116 -1614719 -1608253 -2179114 -3091039 -3891404 -3939035 -3171675 -2532109 -2871387
46949 -2871387 -3563681 -3043730 -883839 1379920 1899807 562026 -1048907 -1489616 -810828
46940 -810828 -86834 -16052 -323311 -475810 -540002 -926949 -1465054 -1356186 -284585 948891
46930 948891 1319229 714927 -288798 -1370269 -2445425 -2986448 -2354638 -969435 -227532
46921b27532n90537j044958m29925p4102o04374r11920K5648J384026J580118
46912h93556M78236o07623q31912o11256m78242k67389J50681K83498j17097k87762
46902c182422N30647J674858J675544K88951j057925j145603m23508m1344j33333
46893a814135O8143P40318J065992M77537m22037n97828J21797Q94602R04683
46884A439072K64267j93191Q1699P05875Q60660L51743j83724k48569k01596n92827
46874B283409j166983j188631o17134k21880m29073p39452n66229o8689K33718
46865b480944K23730J35389P7403K7308N3175J60293J32727j09505k07016J84231
46855a803209P81454R24587L82662m17687r17973q88942m30411J79523O29641
$$ plain form
46921 -227532 -818069 -1863027 -2292952 -2367054 -2971428 -3883348 -3857700 -2473674 -893556
46912 -893556 -415320 -1022943 -1854855 -2466111 -2944353 -3211742 -3061061 -2777563 -2894660 -3182422
46902 -3182422 -2651775 -976917 698627 987578 -70347 -1215950 -1639458 -1680802 -1814135
46893 -1814135 -1745992 -1005674 60318 537855 115818 -482010 -360213 534389 1439072
46884 1439072 1703339 1510148 1591847 2297722 3158382 3510125 3326401 3077832 2876236 2283409
46874 2283409 1116426 -72205 -689339 -911219 -1340292 -2079744 -2645973 -2714662 -2480944
46865 -2480944 -2257214 -2121825 -2044422 -2017114 -1963939 -1803646 -1670919 -1780424 -1987440 -1803209
46855 -1803209 -1021755 -97168 285494 -132193 -1050166 -1939108 -2369519 -2189996 -1560355
46846a560355P89383P61550O03075J84110m38026p50020l24877M46813O35116
46837C46769j20074j122401j387407o69106L94241R79443Q15611L24005P8898
46828c60021J28502l252n41420r72357o87815O5442M07990M8300k63127J98884
46818a978874J019585J103723J43009r00936r91119l15487P2441k03776l33107
46809b384541L10110R28124L11846j151406j644532l98347J136557J346854O73492
46800h71843N74442R96862N29651j017894j916861r72053P10646J314672O39619
46791a2759k02941o31072r05623j027400n95604K32061O99416N68935M23204O03158
46781h48625O44250J71218l24390j69635M54118P44812L41531l50902q08718r07081
$$ plain form
46846 -1560355 -770972 -9422 593653 777763 339737 -410283 -735160 -288347 346769
46837 346769 226695 -895706 -2283113 -2952219 -2557978 -1578535 -762924 -438919 -360021
46828 -360021 -231519 -234771 -776191 -1748548 -2436363 -2370921 -1962931 -1914631 -2177758 -1978874
46818 -1978874 -959289 144434 287443 -613493 -1604612 -1920099 -1847658 -2051434 -2384541
46809 -2384541 -2074431 -1146307 -834461 -1985867 -3630399 -4028746 -2892189 -1545335 -871843
46800 -871843 -297401 699461 1229112 211218 -1705643 -2677696 -1967050 -652378 -12759
46791 -12759 -215700 -846772 -1752395 -2779795 -3375399 -3143338 -2443922 -1874987 -1451783 -848625
46781 -848625 -204375 -33157 -357547 -527182 -73064 671748 1013279 662377 -146341 -1053422
46771a053422p63463m51060k8831L67039O28344P61808P64738N26277l291o03211
46761A44928r09330p81405m36020j85445j45699k20762k31562j2231M37199P94977
46751a545350O43680M4693l53540r1136M17648L86251k74040q62029q30596l03564
46741b767983L79992J031395J351496R49303q533p06091o73603l93069m38956
46732a276049n39302j45998N00530O95258L99251J75774J19850j91244o02032
46723h63962k61084R87607J969160J587680K71630o86608p95018n91050m66836
46714A151519j64925M28717P62016L41946m48581p84988m93745k01124l43583
46705B47252n41579k84283J60568J19468l41361m04229J63690M54526k25015j105275
$$ plain form
46771 -1053422 -1816885 -2267945 -2296776 -1929737 -1301393 -539585 225153 751430 748139 144928
46761 144928 -764402 -1545807 -1981827 -2167272 -2312971 -2533733 -2765295 -2777526 -2340327 -1545350
46751 -1545350 -901670 -856977 -1210517 -1301653 -884005 -497754 -771794 -1633823 -2464419 -2767983
46741 -2767983 -2387991 -1356596 -5100 944203 935670 229579 -444024 -837093 -1276049
46732 -1276049 -1815351 -1961349 -1460819 -765561 -366310 -190536 -70686 -261930 -863962
46723 -863962 -1125046 -137439 1831721 3419401 3691031 3004423 2209405 1618355 1151519
46714 1151519 986594 1415311 2177327 2519273 2070692 1285704 791959 590835 247252
46705 247252 -294327 -578610 -418042 -298574 -639935 -1044164 -880474 -425948 -650963 -1756238
46695a756238r62550J7948N08861J20152k7897Q03790J676632J383837K83973
46686B048508l33451j80818r1884m05284m61459P4682M87879J46071m80824o26555
46676A76865m06335l53825k52345N03623J492642J401471m6747j346311j140184
46667B8854p7304K87976j50505j72806M90434O41900k16494q29173k91545K10348
46657g8315p10862k044139j624596M59548J826200J321279M69245O85912J042078
46648A346350J78107j101862r86759M18307J175349L02637j087697j542438q85223
46639b183229J64073R53347J146349P74460L28704K57990L19012Q498m46838l29380
46629I92986L17473N70957q573p28649q50108o01227o24921r59311j089699o93734
$$ plain form
46695 -1756238 -2718788 -2700840 -2191979 -2071827 -2099724 -1295934 380698 1764535 2048508
46686 2048508 1715057 1534239 1442355 1037071 575612 650294 1138173 1284244 803420 176865
46676 176865 -229470 -583295 -835640 -332017 1160625 2562096 2515349 1169038 28854
46667 28854 -48450 239526 89021 -83785 406649 1048549 832055 2882 -288663 -78315
46657 -78315 -789177 -2833316 -4457912 -3998364 -2172164 -850885 -381640 304272 1346350
46648 1346350 1524457 422595 -564164 -145857 1029492 1332129 244432 -1298006 -2183229
46639 -2183229 -2019156 -1065809 80540 855000 1183704 1441694 1760706 1769204 1322366 992986
46629 992986 1310459 1881416 1872843 1144194 294086 -307141 -932062 -1891373 -2981072 -3674806
46619c674806O4689P70778J040321P76259K99887K8258j2427r3639k49409j88384
46609a238473K72892R95976J622548J599265M82195j221852j979005q95411Q58818
46600D96953J375340N24140j69384n3337p9515o96662q66790o2716M66124k70247
46590F63906j165383q26890j5049l49670j412376j303195K14163J293567R19268
46581a981659K30911L63785P43131M53716j07252p0295L89945M71608M8671l63375
46571A79186m77783l08656J97842Q86824J120987M93529m37479p58325l55314
46562E40811R5466J30845m9067o4902J62692M16602L62274k11376j070093j563409
46552a250157j243120l66709M31084Q43731J034226J176693J130765O34171k56745
$$ plain form
46619 -3674806 -3610117 -2839339 -1799018 -1022759 -722872 -694614 -707041 -800680 -1050089 -1238473
46609 -1238473 -965581 30395 1652943 3252208 3734403 2512551 533546 -361865 496953
46600 496953 1872293 2396433 2227049 2173712 2094197 1397535 530745 468029 934153 663906
46590 663906 -501477 -1328367 -1343416 -1693086 -3105462 -4408657 -4194494 -2900927 -1981659
46581 -1981659 -1750748 -1386963 -643832 -190116 -297368 -367663 22282 493890 542561 179186
46571 179186 -298597 -607253 -409411 477413 1598400 2091929 1654450 896125 540811
46562 540811 636277 767122 718055 653153 815845 1232447 1594721 1383345 313252 -1250157
46552 -1250157 -2493277 -2859986 -2428902 -1585171 -550945 625748 1756513 2390684 2133939
46543B133939r73646q46420J01012R29542P43788j80227o82016j67780P20888
46534A779080J013422M86500l55855q95000p64360o9928N28023M24816o0728l0154
46524B055816N71005O87259k19396j144625r40385j8169L59632k7605l40672k74000
46514G08860l86364p87907p43803L4934P58194P68254N24992P17030J080014Q88263
46504C562467J81319l14555l00237j99052l32773m38726k04019J60163J69700
46495B284287l08982r19813j229761j115286p39953k87701J71237N83411Q36118
46486g26443Q73204Q02425P67432P39431N19145o0908r27525j661382j654281
46477a328902o60176P17380J415660J004864R8773n29009q02835r45264p55154
$$ plain form
46543 2133939 1160293 313873 414885 1344427 2088215 1907988 1225972 1058192 1779080
46534 1779080 2792502 3279002 2923147 2028147 1263787 1193859 1721882 2146698 2085970 2055816
46524 2055816 2626821 3314080 3094684 1950059 1009674 991505 1351137 1323532 982860 708860
46514 708860 322496 -465411 -1209214 -1174280 -416086 352168 877160 1594190 2674204 3562467
46504 3562467 3743786 3429231 3128994 2929942 2597169 2158443 1954424 2114587 2284287
46495 2284287 1975305 1055492 -174269 -1289555 -2029508 -2317209 -2145972 -1562561 -726443
46486 -726443 146761 949186 1716618 2456049 2975194 2914286 1986761 325379 -1328902
46477 -1328902 -1989078 -1271698 143962 1148826 1247599 718590 -84245 -1029509 -1784663
46468a784663j4627P23320O83736J36466J36281Q53044J185333M55532m95481
46459A878941o12335j97098k33204p14424p61940j80531K20075l9351m18812l13984
46449a372663Q2322K83895K49079J48975r2416m98962o65310k55796L47050M65127
46439a308699R7630q2779K68327O92246O20344J21258k91269k96208L2850M10068
46429B63768M71373j9616p78034j034544l89588N05564O32927m0504m85683o2184
46419i36521N74234M60192k69971o30321j97891M51741P35965P75281Q55892P91168
46409B609769K96796l59726o18649m08447k07066l29936n55857n53808l45151
46400d72075j55161m7368N5330J44960K06417M26717R48737J365781R29135m05790
$$ plain form
46468 -1784663 -1799290 -1075970 -392234 -255768 -119487 733557 1918890 2374422 1878941
46459 1878941 1266606 1069508 836304 121880 -640060 -820591 -600516 -639867 -1058679 -1372663
46449 -1372663 -1290341 -1006446 -757367 -608392 -700808 -1199770 -1865080 -2120876 -1773826 -1308699
46439 -1308699 -1211069 -1293848 -1025521 -333275 287069 408327 117058 -179150 -146300 263768
46429 263768 735141 715525 -62509 -1097053 -1486641 -981077 -348150 -388654 -874337 -936521
46419 -936521 -362287 97905 -172066 -802387 -1000278 -548537 187428 962709 1818601 2609769
46409 2609769 2906565 2546839 1928190 1519743 1312677 982741 426884 -126924 -472075
46400 -472075 -627236 -674604 -619274 -474314 -267897 158820 1107557 2473338 3402473 2996683
46390B996683j512643j253567K1597P96223K90971o50661q81218m54116k28767
46381h75498n07848q32452q53426o40212k40825L46240P92482P00512K48125m2126
46371a905028j09009k36572k46640K89729J008834R62868J20751l85040P3773
46362d26334P39091P93885N09176L37891n8080q76533j245052m74495N21593M71111
46352B92253j55220J37088J326115J747556O35599q00587j272169r82684o89365
46343B38586m32722k4047J73207j29464l99687k3189O49325P35226K8519p98502
46333A7252j025328n45316J17479K68273k17241n97489j62878O43869P30887p692
46323g78184n10807k18702J49176n3109l49479j56057J30375o9580m45064m24014
$$ plain form
46390 2996683 1484040 230473 252070 1048293 1339264 688603 -192615 -646731 -875498
46381 -875498 -1383346 -2215798 -3069224 -3709436 -3950261 -3604021 -2811539 -2111027 -1862902 -1905028
46371 -1905028 -2014037 -2250609 -2497249 -2207520 -1198686 -235818 -115067 -500107 -426334
46362 -426334 312757 1106642 1615818 1953709 1895629 1019096 -225956 -700451 -178858 292253
46352 292253 137033 274121 1600236 3347792 3983391 3182804 1910635 927951 238586
46343 238586 -194136 -218183 -44976 -174440 -574127 -597316 52009 787235 815754 17252
46333 17252 -1008076 -1553392 -1435913 -1167640 -1384881 -1982370 -2145248 -1501379 -770492 -778184
46323 -778184 -1288991 -1507693 -1358517 -1411626 -1761105 -1917162 -1786787 -1856367 -2301431 -2725445
46313b725445j48384O3839M53276J031606Q98097m17952j648639j264916K24254
46304c534264R58736M00832k43810j37882K90362O62256J241198J853187J688749
46295C179364O82774j94037m77564p58117j235713j150273l17194J93568j93621
46286b70813m67439K29613R91045N86149m72749p34713K151O92571P42214M07505
46276A705534j02382o75867p90818j71831L70396K297n66226P659J416376J893907
46266C089045P86297o10336j094850r37954o86216q1313R33055J363728M83806
46257C245262q11397j081744k61906M72238L59140l42821j102606j552743j318780
46248b395357k84796R05353J298600P26637l4537k60459K0095L71456N26423M41338
$$ plain form
46313 -2725445 -2873829 -2809990 -2356714 -1325108 -427011 -844963 -2493602 -3758518 -3534264
46304 -3534264 -2575528 -2174696 -2418506 -2556388 -2266026 -1603770 -362572 1490615 3179364
46295 3179364 3862138 3668101 3190537 2432420 1196707 46434 -270760 -77192 -270813
46286 -270813 -738252 -508639 482406 1068555 595806 -138907 -136756 555815 1298029 1705534
46276 1705534 1603152 927285 136467 -35364 335032 337329 -228897 -221238 1195138 3089045
46266 3089045 3875342 3265006 2170156 1232202 545986 464673 1397728 2761456 3245262
46257 3245262 2433865 1352121 1090215 1562453 1921593 1578772 476166 -1076577 -2395357
46248 -2395357 -2680153 -1774800 -476200 250437 215900 -44559 -24464 346992 873415 1314753
46238A314753J25474l47646p91745r83274p52516q4728P36978J219283J109646
46229A546225O68794K77625p7150n87760j014529q11443l263N59521K14537n58459
46219B14098p21380r4551M43408L14758J13352N90199J302797J147686N8878q38590
46209B530655r33222r14540j333942j441135m43953Q70921J093770L67348J72017
46200c2081R74617J555930J006460Q758m96376o77213r63992r01451J0141J055993
46190A540786J103541K56273l99580m46065m61614q17111j180331j265986j155550
46181b825637p65540J23377J124434J378224P34481P4632J12149N24967O56633
46172A137720M52072K11010o3219m82337p82401o13528j80794p9406m75800q32669
$$ plain form
46238 1314753 1440227 1092581 300836 -682438 -1434954 -1519682 -782704 436579 1546225
46229 1546225 2215019 2492644 2415494 1827734 813205 1762 -1501 558020 772557 214098
46219 214098 -507282 -601833 -158425 156333 269685 859884 2162681 3310367 3369245 2530655
46209 2530655 1597433 682893 -651049 -2092184 -2536137 -1665216 -571446 -204098 -32081
46200 -32081 942536 2498466 3504926 3513684 3017308 2340095 1376103 474652 484793 1540786
46190 1540786 2644327 2900600 2501020 2054955 1593341 776230 -404101 -1670087 -2825637
46181 -2825637 -3591177 -3467800 -2343366 -965142 -230661 -156029 -43880 481087 1137720
46172 1137720 1589792 1800802 1737583 1255246 472845 -140683 -321477 -400883 -876683 -1709352
46162a709352n55051L06689J113982J313799R59942N39920L61790K82111O5641
46153B679471k48647m98873o31874n35146K0771Q69011J227106N92504l98468
46144C075855p45973n56341q14977j658433j957585j027269K59289P57449O19844
46135b048141O93967R90593Q22859J55579k67231j20157J22160J10588P3713J33500
46125F67430l0819m87272p10476l76472P0445J23946o402J35369M25284M43931
46115B54964L07119N02806R85891J132642O95476J93662J31064L26677L17231
46106D847532K0549l43930o84230j010514j174376r74838m33095K35220P47310
46097A229628P11741j61131j462360k083558j360560K4311Q64646R29120R24004
$$ plain form
46162 -1709352 -2264403 -1957714 -843732 470067 1430009 1969929 2331719 2613830 2679471
46153 2679471 2430824 1931951 1300077 764931 785702 1654713 2881819 3474323 3075855
46144 3075855 2329882 1773541 958564 -699869 -2657454 -3684723 -3425434 -2667985 -2048141
46135 -2048141 -1354174 -363581 459278 614857 347626 227469 349629 460217 533930 667430
46125 667430 636611 149339 -561137 -937609 -867164 -743218 -749620 -614251 -188967 254964
46115 254964 562083 1064889 2050780 3183422 3878898 4072560 4203624 4530301 4847532
46106 4847532 4868081 4524151 3839921 2829407 1655031 680193 247098 482318 1229628
46097 1229628 1941369 1780238 317878 -1765680 -3126240 -3101929 -2237283 -1308163 -384159
46088c84159J122325R79781K64078l88529m70852l55462n08880o55328l57354
46079g54380J54885M03697M10660L69881J05489m05990n13827K07521R92443Q32380
46069A802759L2424l02690p4172j83733p69651q67925j29163M75440K27827k40746
46059b9630j55824J17890j32669o94574q51881n01191j8852M91594J026486J180833
46049D32182O12125k73520p52355o43119k40182K07721M38633J14285n74303p95210
46039a473743k51829J83690j23969k76126P94456K208636K013798J17159j333683
46030A858389r40923J09704P8578p17820o28413O61774J603014R61138n71989
46021B413452j402980j014701k88609r0376k33735q7155L37102N10302L62807
$$ plain form
46088 -384159 738166 1717947 1982025 1593496 1122644 767182 258302 -397026 -754380
46079 -754380 -599495 -195798 214862 584743 690232 284242 -229585 -22064 970379 1802759
46069 1802759 1835183 1532493 1458321 1274588 504937 -362988 -492151 -16711 211116 -29630
46059 -29630 -185454 -67564 -200233 -894807 -1746688 -2247879 -2266731 -1775137 -748651 432182
46049 432182 1044307 770787 18432 -624687 -864869 -657148 -218515 -104230 -678533 -1473743
46039 -1473743 -1725572 -1541882 -1665851 -1941977 -1147521 1061115 3074913 3192072 1858389
46030 1858389 917466 1027170 1105748 387928 -240485 421289 2024303 2985441 2413452
46021 2413452 1010472 -4229 -292838 -383214 -616949 -704104 -367002 143300 506107
46012E06107L49003M97349K74031l12567m40374R1413J59956r42348j931747j107971
46002b857148R74555J999862J004081n38996r78626l80939K99663N96785M11359
45993E30596l16602j048736p85124M31382J102173K61258r92419r59289L81431
45984a395330J606071J774002J058331n5917j087112j401396q17132j49258j94020
45975f61761m74309n3707P21130O10180m47067j059108m63406M30837O04000L48392
45965d44819L73441M72919P2280n14438m11487M51639J143098R21422N7479o14346
45955A507188o13303k04114j3438k46474l63544J77398R59960R98333J97385l66825
45945B032566n9636K43616m71491j559095j465567p6012R67986N59993m00042
$$ plain form
46012 506107 855110 1352459 1626490 1313923 873549 964962 1124918 182570 -1749177 -2857148
46002 -2857148 -1882593 117269 1121350 582354 -396272 -777211 -477548 119237 530596
45993 530596 213994 -834742 -1619866 -1188484 -86311 174947 -817472 -1776761 -1395330
45984 -1395330 210741 1984743 3043074 2987157 1900045 498649 -318483 -467741 -661761
45975 -661761 -1136070 -1189777 -468647 141533 -305534 -1364642 -1828048 -1397211 -793211 -444819
45965 -444819 -71378 401541 473821 -40617 -452104 -465 1142633 2064055 2121534 1507188
45955 1507188 893885 689771 676333 429859 66315 243713 1203673 2202006 2399391 2032566
45945 2032566 1972930 2216546 1745055 185960 -1279607 -1355619 -387633 172360 -227682
45936b27682m60429L21124O74989L7403p64777p22771J70629J111086J395870
45927A535442R62451L02176j8626J01625K28897q326l89606m41840j76463j00941
45917A994789n14441j157062j557542j374268m68233Q43640J613548J032900l83181
45908C0150j060455k52311R31726R63444j36546r94711p26064K14827R12733R71509
45898H54302N63994J27435J19753N91474R55276O38576p5977m00220j81939m5580
45888C147094l45995o85996o59015m10316k04050l8582M2284j39868m02036k73553
45878B9967R5012j59458j255685k027301j321882L30433J298799Q67364j35298
45869b278049o43023n03251j66457J36688N17281R93001J283991J108737N80444
$$ plain form
45936 -227682 -688111 -366987 308002 345405 -419372 -1142143 -971514 139572 1535442
45927 1535442 2497893 2800069 2781443 2883068 3111965 3103639 2714033 2272193 2095730 1994789
45917 1994789 1480348 323286 -1234256 -2608524 -3076757 -2233117 -619569 413331 30150
45908 30150 -1030305 -1282616 -350890 612554 476008 -518703 -1244767 -1029940 -117207 854302
45898 854302 1418296 1545731 1665484 2256958 3212234 3850810 3774833 3374613 3192674 3147094
45888 3147094 2801099 2115103 1456088 1045772 841722 803140 845424 705556 303520 29967
45878 29967 124979 -34479 -1290164 -3317465 -4639347 -4308914 -3010115 -2142751 -2278049
45869 -2278049 -2921072 -3424323 -3590780 -3454092 -2936811 -1943810 -659819 448918 1029362
45860A029362J39544L586q9966l39425l89952P9383N45734K33348n70945p93528
45850a52859k88135j23136p65630j213016o47513K35929N23682N67397R37781
45841i25500R51634j65497j429306j246375M439M64099k36034m94071M88317J413843
45831a174451J089431K21510L1562M32160O22383M06969o3568q83150j751537
45822a068691j685238l95110Q88737J007648M78436M17466P03573N28357O6675
45813I41853N9684J77486n25034j624941j529384K7840J264346P97399m76259
45804h87010q38224r4328N83040N21209J50772k7680r4066k07041j69403J85593
45794h77138N57831M69351j05426o16688n13186J25137O45645N60687R0688j72799
$$ plain form
45860 1029362 1168906 1172492 1082526 743101 353149 432532 978266 1211614 640669 -152859
45850 -152859 -440994 -564130 -1329760 -2542776 -3190289 -2954360 -2430678 -1863281 -925500
45841 -925500 26134 -139363 -1568669 -2815044 -2810605 -2346506 -2582540 -3076611 -2588294 -1174451
45831 -1174451 -85020 136490 168052 600212 1222595 1629564 1565996 682846 -1068691
45822 -1068691 -2753929 -3149039 -2260302 -1252654 -774218 -356752 346821 875178 941853
45813 941853 1001537 1179023 653989 -970952 -2500336 -2472496 -1208150 -410751 -887010
45804 -887010 -1725234 -1819562 -1236522 -715313 -564541 -592221 -686287 -893328 -1062731 -877138
45794 -877138 -319307 150044 44618 -572070 -1085256 -960119 -314474 246213 336901 164102
45784A64102j1482K64653L34455K05831q122l16755o77660q38056n82929k1400
45774a487363N52767R81558J242568J219102P26209j58406r45989j080822m67524
45765E82100L87377Q12885N87546J11132o1813J69574L94639K48913j18512k73196
45755B840645q6002J55657K30017K42338K39322p1031q13812j422532j209703
45746A04899m10481m835l64305p41268m09846L29522P44267O86647M52624J53019
45736E40243j24540k5002M61877N97288l1598n61723r5672N86281L6274j334679
45726D8749j516562J5871J313395Q60865k17105j36510P57990Q58748L6745l46496
45716A675690J72095N41636J14379l47030n7616N61074O77306K80047k0935N8036
$$ plain form
45784 164102 152620 417273 751728 957559 949437 632682 -44978 -883034 -1465963 -1487363
45774 -1487363 -934596 46962 1289530 2508632 3234841 3076435 2130446 1049624 582100
45765 582100 969477 1782362 2369908 2481040 2419227 2588801 2983440 3232353 3113841 2840645
45755 2840645 2754643 2910300 3140317 3382655 3621977 3550946 2737134 1314602 104899
45746 104899 -305582 -310417 -674722 -1415990 -1825836 -1496314 -752047 -65400 387224 540243
45736 540243 415703 390701 852578 1449866 1418268 856545 760873 1347154 1383428 48749
45726 48749 -1467813 -1451942 -138547 722318 505213 368703 1126693 1985441 2022186 1675690
45716 1675690 1847785 2389421 2503800 2156770 2099154 2660228 3337534 3617581 3596646 3654682
45706C654682K62079K92734J63529J47074M65580R24643R34302J40184j033218
45697E951589j738281j565549q53202k41238r6553k38189j09039N63982J255864
45688B929384J210257N48667J45168K55668K04051j74661O4057J283011K097824
45679H563426J197753n12713j113518m18163J56325R8246K79567Q99724R23229
45670A0073876P8697l62316L66163J204840R91711K37321O5387L86748L00799
45661A3343226l83935j093356j445214j386823q44943j704N36314M96800L65397
45652I585762N07271N52884K65920J75136N41213O01265j17687o15604J27639
45643A1623799J240567J077400k01465r13740o08114o58953j741292k519051j756287
$$ plain form
45706 3654682 3916761 4209495 4373024 4520098 4985678 5910321 6844623 6984807 5951589
45697 5951589 4213308 2647759 1794557 1553319 1456766 1218577 1109538 1673520 2929384
45688 2929384 4139641 4688308 4833476 5089144 5293195 5118534 5182591 6465602 8563426
45679 8563426 9761179 9248466 8134948 7716785 7873110 7971356 8250923 9150647 10073876
45670 10073876 10152573 9790257 10156420 11361260 12352971 12590292 12655679 13042427 13343226
45661 13343226 12959291 11865935 10420721 9033898 8188955 8187251 8723565 9220365 9585762
45652 9585762 10093033 10645917 10911837 11086973 11628186 12229451 12111764 11496160 11623799
45643 11623799 12864366 13941766 13740301 12826561 12218447 11559494 9818202 7299151 5542864
45634E542864k99405K62789p9390j25604M15168N90156n8567o57982l11055N85370
45624E864344R11850L00803n08624o58153p4934O37820Q65097L92687n62283j452166
45614E716441j662097j005885o301N46112L81867n2256j86211P9861L88249L43385
45604D543165q7079m63193k97089K29217K71058n49429j368261j112030n5857
45595A110502N47113K98688K7420J99051K09873k58577m37865J67481P43329N14050
45585C121065J25912M52397Q81649K78244r29615j246852m53625J45902j53800
45576B221277n94116m51402l9170J65318K07757Q7048l94012q45357m74125N49608
45566D32826J048657O02249J49299K90635L24247k01573l07888Q30355K175581
$$ plain form
45634 5542864 5243459 5506248 5426858 5301254 5716422 6306578 6248011 5590029 5278974 5864344
45624 5864344 6776194 7076997 6568373 5910220 5835286 6473106 7338203 7730890 7168607 5716441
45614 5716441 4054344 3048459 3042158 3588270 3970137 3917881 3731670 3811531 4199780 4543165
45604 4543165 4456086 3992893 3695804 3925021 4196079 3646650 2278389 1166359 1110502
45595 1110502 1657615 1956303 1983723 2182774 2392647 2134070 1696205 1863686 2607015 3121065
45585 3121065 3246977 3699374 4581023 4859267 3929652 2682800 2229175 2375077 2221277
45576 2221277 1627161 1175759 1136589 1301907 1509664 1596712 1202700 357343 -116782 432826
45566 432826 1481483 2083732 2233031 2523666 2847913 2646340 2338452 3168807 5344388
45557E344388K122098P99227l31328o83948q91154j188572r78021j60284M00699
45548D433105J55487l69985n12474l62636k82255k18314o760J27621j15273n56882
45538B291634o89254k83316L38554N80876J37971n85452p45854o172R56015J228424
45528C223426P48077J38404l07791p75410j114226p51868K96177J100248R99458
45519C556495N07608M28314N54417N2678j050843j636018r47868L27651Q44973
45510B637407J51934q97873j162316l56987P97616J360787J024072K61564k76047
45501C540157m23503m69184n43442l41198L48237J069484J072421K69295n78793
45492C943474p94166n36731l55092l46296k35598p5665k47877p21536q89817l99530
$$ plain form
45557 5344388 7466486 8265713 7934385 7250437 6359283 5170711 4192690 4032406 4433105
45548 4433105 4588592 4218607 3706133 3343497 3061242 2842928 2836168 2963789 2848516 2291634
45538 2291634 1602380 1319064 1657618 2238494 2376465 1791013 1045159 1038987 1995002 3223426
45528 3223426 3971503 4109907 3802116 3026706 1912480 1160612 1456789 2557037 3556495
45519 3556495 4064103 4492417 5046834 5099512 4048669 2412651 1464783 1792434 2637407
45510 2637407 2789341 1891468 729152 372165 1169781 2530568 3554640 3816204 3540157
45501 3540157 3116654 2647470 2104028 1762830 2111067 3180551 4252972 4522267 3943474
45492 3943474 3149308 2612577 2257485 1911189 1675591 1599926 1352049 630513 -259304 -658834
45482f58834K70517L90970r7230n31301k77828O29302J489669J511123N59084
45473C285472o40158j251718j217486j040970q17438j33931R53978J612752J310591
45464B061092N66983J15934q0763l76662n96287m48328l03915o23170r25444l61112
45454i71672Q22931J429709R42473J7365o98040j153243j148339k39571J138066
45445A39679J630666P66072k19946j61079M35065N46845L98775O93121Q50784
45436E079982k32215j906846k091729k31816J664326J676913L62212m65732k86482
45427C568613R608q6788j24010K18930N74869O11737N17501N17713N09232M12822
45417F730227L89572M62788L67914M9583j00747J50793L76621L2015o81122r69581
$$ plain form
45482 -658834 -388317 2653 -94577 -625878 -903706 -274404 1215265 2726388 3285472
45473 3285472 2645314 1393596 176110 -864860 -1682298 -1816229 -862251 750501 2061092
45464 2061092 2628075 2744009 2663246 2286584 1690297 1241969 938054 314884 -610560 -971672
45454 -971672 -148741 1280968 2223441 2240806 1542766 389523 -758816 -998387 139679
45445 139679 1770345 2536417 2316471 2155392 2590457 3137302 3536077 4229198 5079982
45436 5079982 4847767 2940921 849192 617376 2281702 3958615 4320827 3855095 3568613
45427 3568613 3578221 3491433 3367423 3586353 4161222 4772959 5290460 5808173 6317405 6730227
45417 6730227 7119799 7582587 7950501 8000084 7899337 8050130 8426751 8458766 7777644 6808063
45407F808063m66863L04280N86633J77420n89878j325916j739052j525545n70246
45398A658896O76426J396235J206556N70994K20086L51794O25454P32054O09295
45389H047790K10612m70517j072391j006209j81788O86539P79699M3712q18961
45380F218486j086327o10203J40911M72889Q0857n78109p25098j93024L63482
45371D083864L52720l3510k56376j74945M8556L79008P02037N55409k50933j021711
45361D384119r59356l56323j14252k12595K24081J219749J576685P26059k12079
45352F276088l2549Q35550J171919P60508K83785M0331p7326K11814J146866J981200
45342A2598186J763770R56393R45304J890658K459374J982919J463674J856358
$$ plain form
45407 6808063 6341200 6645480 7232113 7409533 6819655 5493739 3754687 2229142 1658896
45398 1658896 2335322 3731557 4938113 5509107 5729193 6080987 6706441 7438495 8047790
45389 8047790 8258402 7787885 6715494 5709285 5527497 6214036 6993735 7037447 6218486
45380 6218486 5132159 4521956 4662867 5135756 5216613 4638504 3913406 3720382 4083864
45371 4083864 4436584 4403074 4146698 3971753 4020309 4399317 5101354 5656763 5405830 4384119
45361 4384119 3424763 3068440 2954188 2741593 2965674 4185423 5762108 6488167 6276088
45352 6276088 6243539 7079089 8251008 9011516 9295301 9335632 9258306 9470120 10616986 12598186
45342 12598186 14361956 15318349 16263653 18154311 20613685 22596604 24060278 25916636
45334B5916636K660987L048552L250462L847226M643060N351897O584952Q911602
45326F4215374J1553247J3335484J4472844J5894709J6946304J5404931J0205547
45319A62028440K884803m199143r953880j4246513j6671943j6767179j4964915
45312H8109670j2391631r900531p882667o639986o172387n809705m842740l502540
45304C0967483k660481k567665k573313k184621j701104j518825j431305j082635
45296A5247534o80468p17485j190411j578206j534197j221509r66096q67565p66947
45287E724650m06601L11655J035299J090887K29763q71550j258566q13360l00271
45278D741906k89319n23702m88840j24537K75156M72465L56829k778j61333L59717
$$ plain form
45334 25916636 28577623 31626175 34876637 38723863 43366923 48718820 55303772 64215374
45326 64215374 75768621 89104105 103576949 119471658 136417962 151822893 162028440
45319 162028440 164913243 160714100 150760220 136513707 119841764 103074585 88109670
45312 88109670 75718039 65817508 57934841 51294855 45122468 39312763 34470023 30967483
45304 30967483 28307002 25739337 23166024 20981403 19280299 17761474 16330169 15247534
45296 15247534 14567066 13849581 12659170 11080964 9546767 8325258 7359162 6491597 5724650
45287 5724650 5318049 5629704 6665003 7755890 7985653 7114103 5855537 5042177 4741906
45278 4741906 4452587 3928885 3440045 3315508 3590664 4063129 4419958 4417180 4255847 4615564
45268D615564J237951J422937M87022o79683j107758j052988j235148j373088
45260B314809o74982N04544Q91846K82210q6398M28478Q05607J11556q51964p70583
45250B955123J36240N69408K01013l9583L40294O27744J23047p84141j215384
45241B913761q92821j90650N04817J032343J210720P68523l02477j400230j579837
45232B064149m74194J084497J758229J133192N9756n54356p12082p71365n99551
45223B988275L6693O83408O18560r7804o94269p35837m84916k87839k12650k64658
45213A548963l80912k42355L27400Q20062N39803l35543q45670n06583J33252
45204A058417L38073J1408m78709p41682m57246M13090J282237J332317N22963
$$ plain form
45268 4615564 5853515 7276452 7763474 7083791 5976033 4923045 3687897 2314809
45260 2314809 1639827 2144371 3036217 3318427 3232029 3660507 4466114 4577670 3725706 2955123
45250 2955123 3091363 3660771 3861784 3822201 4162495 4790239 4913286 4129145 2913761
45241 2913761 2020940 1830290 2335107 3367450 4578170 5346693 5044216 3643986 2064149
45232 2064149 1589955 2674452 4432681 5565873 5625629 5071273 4359191 3587826 2988275
45223 2988275 3024968 3708376 4326936 4229132 3534863 2799026 2314110 2026271 1813621 1548963
45213 1548963 1168051 925696 1253096 2073158 2612961 2277418 1431748 925165 1058417
45204 1058417 1396490 1407898 929189 187507 -269739 143351 1425588 2757905 3280868
45195C280868k51899k68598J98431M01424M0945o19595j166645j244707o69667
45186b99443L28935J147853J308732Q23121N8021n32428n89180j18577M03461
45177B530495N30392M04863M41995N80539L97782r2523m16481m62980o25551r52771
45167B335760q66371n0595R56262J403182J107309L66237m11214p67926m28968
45158C643676K53167N34573J59079m32124q16849r33885o93595o996O90239P71473
45148C168758M19925L86482O18633K73141o18234q50324j5537O17496J06439o19275
45138C487504m03190J86689M3380l70642J21102J090379R29087n98852j944817
45129B540640j966963j046367N7555R97573J296931M74657q63269j291420l94533
$$ plain form
45195 3280868 3028969 2760371 2958802 3360226 3401171 2781576 1614931 370224 -299443
45186 -299443 29492 1177345 2486077 3309198 3367219 2834791 2245611 2127034 2530495
45177 2530495 3060887 3465750 3907745 4488284 4886066 4793543 4377062 3914082 3288531 2335760
45167 2335760 1469389 1418794 2375056 3778238 4885547 5251784 4840570 4072644 3643676
45158 3643676 3896843 4431416 4590495 4158371 3341522 2407637 1714042 1707046 2397285 3168758
45148 3168758 3588683 3975165 4593798 4866939 4248705 3398381 3382844 4000340 4106779 3487504
45138 3487504 3084314 3271003 3314383 2943741 3064843 4155222 5084309 4485457 2540640
45129 2540640 573677 -472690 -415135 582438 1879369 2354026 1490757 199337 -195196
45120a95196P02575R84788O61917K67313k23050q01369r55369m69291N9088J01750
45110A33156m7784R5878M62142P65330R77953J034320O63789p5420o79733r54720
45100B374911j231300j487997j033339L94175J862223K199310J286944k0644p99070
45091C545213n67030M73653J311893Q95685n06925j358213p48726M47008Q83567
45082D376125M70365R965k37933o35646j136991j139229l54957Q16769J764784
45073C933252K057374J544852N75654n2308J48023P40374Q98421M02585k44225
45064A0004002n07850k79662J91115N31734N73302O11321J081777J892049K489162
45055A6586950K670498K740898K737051K270759J434778R89297J164610J160770
$$ plain form
45120 -195196 507379 1492167 2154084 2421397 2198347 1396978 441609 -27682 31406 133156
45110 133156 85372 181250 643392 1408722 2386675 3420995 4084784 4009364 3329631 2374911
45100 2374911 1143611 -344386 -1377725 -983550 878673 3077983 4364927 4344283 3545213
45091 3545213 2978183 3451836 4763729 5659414 5152489 3794276 3045550 3492558 4376125
45082 4376125 4846490 4856455 4618522 3982876 2845885 1706656 1351699 2168468 3933252
45073 3933252 5990626 7535478 8111132 8058824 8206847 8947221 9845642 10248227 10004002
45064 10004002 9496152 9216490 9407605 9939339 10512641 11123962 12205739 14097788 16586950
45055 16586950 19257448 21998346 24735397 27006156 28440934 29430231 30594841 31755611
45047C1755611M41700m04560q41962j392530k440967l058640k413399j523500
45039B0121753j906195k985882k763111r86489L19123j26987j177795j380067
45031I114350j113173j410791j926584j577549n24691l4163n48036j127788r34048
45022h2473k80063J01720J15161J65872M08384O28276P10698P59115O99925K02708
45012C429323p25551j397412j180326m19408l3313k13468k43432K50155P11432
45003A78000O82084N16497M83489Q8943q38495j287315m71042O30316N42767m07539
44993A17705o42065J51894P97069Q47247J104879J610086J111688o57470j989056
44984B451977j611181n43911k54946l78963J52716Q81736N90418m12537o94179
$$ plain form
45047 31755611 32197311 31792751 30950789 29558259 27117292 24058652 21645253 20121753
45039 20121753 18215558 15229676 12466565 11480076 11799199 11672212 10494417 9114350
45031 9114350 8001177 6590386 4663802 3086253 2561562 2527399 1979363 851575 -82473
45022 -82473 -362536 -260816 -145655 20217 428601 1056877 1767575 2526690 3226615 3429323
45012 3429323 2703772 1306360 126034 -293374 -326687 -540155 -783587 -533432 178000
45003 178000 860084 1376581 1860070 1949013 1110518 -176797 -647839 -17523 525244 117705
44993 117705 -524360 -372466 424603 1271850 2376729 3986815 5098503 4441033 2451977
44984 2451977 840796 296885 41939 -337024 -184308 697428 1287846 875309 181130
44975A81130r8794Q9291n69034r62236m18913J31736k48951r13803n90375P24140
44965b675809J738721J504595M21862l75532k50734M16944Q08574O15244K41746
44956B445611R4716P5710m195J2897K03528J44606m26929q80989m43793M69160
44946A690322N77771m97820j633888j654134o87272K95078O96862N82968J99734
44937d30379k33588m49626l06044n651J27912P0169J04323M19873Q29225R19863
44927A046077M76033k62315q07937q75693n06051J86915J046724J591440J213407
44918C108600K4789r24700q00495n1728K52342j00419l54468l7792M47308N66345
44908B129782K86080k07191p79135j103487p61029Q8716O52805M72568l799j50189
$$ plain form
44975 181130 82336 171627 -397407 -1359643 -1778556 -1646820 -1895771 -2809574 -3399949 -2675809
44965 -2675809 -937088 567507 989369 613837 363103 780047 1588621 2203865 2445611
44956 2445611 2540327 2616037 2611842 2624739 2828267 2972873 2545944 1664955 1221162 1690322
44946 1690322 2268093 1770273 136385 -1517749 -2205021 -1909943 -1213081 -630113 -430379
44937 -430379 -663967 -1113593 -1419637 -1425288 -1297376 -1227207 -1122884 -703011 126214 1046077
44927 1046077 1522110 1259795 451858 -423835 -929886 -742971 303753 1895193 3108600
44918 3108600 3133389 2208689 1408194 1356466 1608808 1508389 1153921 1116129 1563437 2129782
44908 2129782 2415862 2208671 1429536 326049 -434980 -346264 306541 779109 775310 625121
44898F25121R766J32804K82063P41822J320493J420477Q38582J10753o0032M46605
44888E868454J039848R96990K30307n28880m67443L95612J261181J507235J256731
44879A1560035R30266O75537N05685O38878J276634K158598K662377K364929J390124
44870B4163063K74430m38748o04696n67327p49084j167451j523674j671442j671167
44861A6043904j446555q59327j90277l1238n02454j049042j248411j326311j552287
44852G838002j618977j090322j34211O21191P24955J34114q05139j327121p48903
44843C593589N36729J138970L48385q20684j014751l82828k4102r4613J81824
44834C462519P80767P15987q7557l04506O48450J353161M55553j040713j058740
$$ plain form
44898 625121 634887 767691 1049754 1791576 3112069 4532546 5371128 5481881 5421849 5868454
44888 5868454 6908302 7905292 8135599 7606719 7139276 7534888 8796069 10303304 11560035
44879 11560035 12490301 13165838 13671523 14310401 15587035 17745633 20408010 22772939 24163063
44870 24163063 24437493 23998745 23394049 22826722 22077638 20910187 19386513 17715071 16043904
44861 16043904 14597349 13738022 13547745 13516507 13014053 11965011 10716600 9390289 7838002
44852 7838002 6219025 5128703 4994492 5615683 6340638 6474752 5669613 4342492 3593589
44843 3593589 4130318 5269288 5617673 4796989 3782238 3399410 3375308 3280695 3462519
44834 3462519 4243286 4959273 4871716 4567210 5215660 6568821 7024374 5983661 4924921
44825D924921M85091J507892O95708q50391j399419q51680l69539m75206n31871
44816C135506M0397Q65476J154988P02366L3543k80239k19483j96223m81443r11238
44806C843650j155159j070853o85053n3716O22865R57419Q07820O05638Q09710
44797D682321J138229R36440L21049J98016Q56906J347912Q65377O3431R8988
44788A0508669Q19302J004667K84062l81812l55821l11556r72761j805958j830434
44779F958358j125018o03388o13537o42412k95892K15060N77560O93737M48804
44770E613272k06597q40392q06679j18881M56599L88264p753j84604j48757k72888
44760C871584o11684p70238l76794M96826J327819J508457Q51377k22963j072661
$$ plain form
44825 4924921 5410012 6917904 7613612 6763221 5363802 4512122 4142583 3667377 3135506
44816 3135506 3175903 4041379 5196367 5898733 5932276 5652037 5432554 5236331 4754888 3843650
44806 3843650 2688491 1617638 932585 878869 1501734 2459153 3266973 3872611 4682321
44797 4682321 5820550 6756990 7078039 7276055 8132961 9480873 10346250 10409681 10508669
44788 10508669 11327971 12332638 12616700 12234888 11879067 11567511 10594750 8788792 6958358
44779 6958358 5833340 5229952 4616415 3974003 3678111 3893171 4470731 5164468 5613272
44770 5613272 5406675 4566283 3759604 3640723 4097322 4485586 4477833 4293229 4144472 3871584
44760 3871584 3259900 2489662 2112868 2609694 3937513 5445970 6297347 6074384 5001723
44751E001723j335017r84226j81717O68538J041580Q86978P90233J039844R63217
44742G891153j3071j027960o80293P95343J579487Q34902q4684L11896J540718
44733A1147491K060153J425813M25643l37467q68577j116734r18248m92143k34950
44724A1090981j83523k55604o14516j119061r74341J39430J104425O66398o64345
44715I189844j259704o96217o0437L8997K71504J060890J634489J226944J96803
44706A1603113o59514j036861q82128j50239O64806O79459q0956m21525L04099
44697A0020254J102846P92550k62999q31260n76010j09568K39169O09351Q00143
44688A1784476L47032n40049r40298l14009Q56108J583763J245818P7865r14013
$$ plain form
44751 5001723 3666706 2682480 2500763 3169301 4210881 5097859 5888092 6927936 7891153
44742 7891153 7878082 6850122 6169829 6965172 8544659 9379561 9294877 9606773 11147491
44733 11147491 13207644 14633457 15059100 14721633 13853056 12736322 11818074 11325931 11090981
44724 11090981 10907458 10651854 10037338 8918277 7943936 8083366 9187791 9854189 9189844
44715 9189844 7930140 7233923 7173486 7212483 7483987 8544877 10179366 11406310 11603113
44706 11603113 10943599 9906738 9024610 8874371 9539177 10218636 10137680 9716155 10020254
44697 10020254 11123100 11915650 11652651 10821391 10245381 10135813 10374982 10984333 11784476
44688 11784476 12131508 11591459 10651161 10337152 11193260 12777023 14022841 14100706 13186693
44679A3186693q21274R2591O00469J20582m93220k90318L54575M72039M9163j69911
44669A3101389l0978j6961j69601p9401J20096j42761p20143p80179j84373K14327
44659A1311415o1291m50950m56790m38231p56616r70584n66548J36592M81079
44650H228076L98918K54608J59892N059j42733j74094k21975m10446n68461n19662
44640G009182l68181k12243O6800M25274M77237O1086m08201n35546m83597n02244
44630E529567l81217Q8349N07106L50830k12629n77817n17316j69742M60685J268519
44620F346335J584128Q48326l07062n85211K30027R43222O27351k59344q74742
44611H553030j204365j529226j438855m34969Q51160J187617M86110n3427K16769
$$ plain form
44679 13186693 12365419 12458010 13058479 13179061 12685841 12395523 12750098 13222137 13271300 13101389
44669 13101389 13070411 13053450 12883849 12804448 12924544 12781783 12061640 11281461 11097088 11311415
44659 11311415 11250124 10799174 10342384 9904153 9147537 8176953 7610405 7746997 8228076
44650 8228076 8626994 8881602 9041494 9046553 8903820 8729726 8507751 8097305 7528844 7009182
44640 7009182 6641001 6428758 6495558 6920832 7398069 7459155 7050954 6515408 6031811 5529567
44630 5529567 5148350 5236699 5743805 6094635 5882006 5304189 4786873 4617131 5077816 6346335
44620 6346335 7930463 8778789 8471727 7886516 8116543 9059765 9687116 9427772 8553030
44611 8553030 7348665 5819439 4380584 3945615 4796775 5984392 6470502 6417075 6633844
44602F633844M65997j29050r26584q14640l6677J99487k66013k54127P55934J587687
44592G215858J055105k68077r55963p53591n35573n80646j80678Q99445J723282
44583G619162J430773L90773m13442n70526l35731k1746K21431L48046M95588
44574I164328Q10064R76024M08891p73531j531485j129343j02202N23459N17821
44565H864026L54655K49303K6653k84349m37336m48466n01994n09567l20930j72119
44555F819876k95053l10775K23718Q40510O47683k31618p10740l95888j29445
44546F458268m61159o34833J28930J169128J221183K62898n12564m24408l8529
44537G168914n8702l26247l01885K4261J82519q3954n65879r15086r31219n67533
$$ plain form
44602 6633844 7099841 6970791 6044207 5229567 5192890 5392377 5126364 4872237 5628171 7215858
44592 7215858 8270963 8002886 7046923 6293332 5757759 5177113 4996435 5895880 7619162
44583 7619162 9049935 9440708 9027266 8456740 8121009 8099263 8320694 8668740 9164328
44574 9164328 9974392 10950416 11359307 10585776 9054291 7924948 7822746 8346205 8864026
44565 8864026 9218681 9467984 9494637 9210288 8772952 8324486 7822492 7312925 6991995 6819876
44555 6819876 6524823 6214048 6437766 7278276 7925959 7694341 6983601 6587713 6458268
44546 6458268 5997109 5362276 5491206 6660334 7881517 8144415 7631851 7207443 7168914
44537 7168914 7110212 6783965 6482080 6506341 6688860 6604906 6039027 5123941 4192722 3625189
44527C625189P0519O39428O63301l1367r36180j107803m2020J655436K653268
44518G189771K103756M44182j062017j517774j057989m27233j14050l2684M3750
44509E569712K4464l20360q50619j047867o04338J99430Q02462Q52956L56016
44500D981856l38298n92805J1095R50792J049667m7382j178407j104413j87388
44491C544717K88073J48414M58369J544967K214238J481511j1063j044999j368606
44482G255621j334655q55797J66061R79162P95462J33498J15195O12500M32712
44473H299759n97056j153934m54531N40697O93401L47876M36755P75504M65765
44464I354236m34647q91373n19369j36958m08921p87362l28307R15726J872745
$$ plain form
44527 3625189 3695708 4335136 4998437 4967070 4030890 2923087 2881067 4536503 7189771
44518 7189771 9293527 9737709 8675692 7157918 6099929 5672696 5558646 5525962 5569712
44509 5569712 5594176 5273816 4423197 3375330 2770992 2970422 3772884 4625840 4981856
44500 4981856 4643558 4050753 4061848 5012640 6062307 6014925 4836518 3732105 3544717
44491 3544717 3832790 3981204 4439573 5984540 8198778 9680289 9669226 8624227 7255621
44482 7255621 5920966 5065169 5231230 6210392 7005854 7139352 7254547 7867047 8299759
44473 8299759 7702703 6548769 6094238 6634935 7328336 7676212 8112967 8888471 9354236
44464 9354236 8919589 8028216 7508847 7371889 6962968 6175606 5847299 6763025 8635770
44455H635770J711797P56402K5967j0316K7861o19835j542529j439844K7946J391347
44445H964566J102430l67491j161342n82750J79068Q2348k62201J41273Q98908
44436H994809Q52812l1589o08776k87840K78471M24483M09023O75412R48154P12487
44426A2367446J37168j32710R5727L80165L17982k5757l56565m66936k85457J02819
44416A2133882M27441M51709K86810K93972N87757Q11713N73622L0208j79687
44407A5417427K98255R72239R89616K38030l77279m0284Q69587J251496P17548
44398B0336635n8492m40633n30418m88538L7468J133915J857595J186647m67862
44389B2566317j593742j427621o38297m5604M32716J133825J743788J745023J309539
$$ plain form
44455 8635770 10347567 11103969 11129936 11119620 11147481 10527646 8985117 7545273 7573219 8964566
44445 8964566 10066996 9699505 8538163 7955413 8134481 8216829 7954628 8095901 8994809
44436 8994809 9847621 9816032 9207256 8919416 9197887 9622370 10031393 10706805 11654959 12367446
44426 12367446 12504614 12371904 12467631 12847796 13165778 13140021 12783456 12316520 12031063 12133882
44416 12133882 12561323 13013032 13299842 13593814 14181571 14993284 15566906 15597114 15417427
44407 15417427 15715682 16687921 17677537 17915567 17538288 17498004 18367591 19619087 20336635
44398 20336635 20278143 19837510 19307092 18818554 18856022 19989937 21847532 23034179 22566317
44389 22566317 20972575 19544954 18906657 18861053 19293769 20427594 22171382 23916405 25225944
44380B5225944J027125R87669Q14705M89624M32181O91116P30277K95857n4770
44371C0639728K90914J110760J710792J911715K087866K339036K328711K107308
44363D4526830K390667L530239M705962M808739L875723K972391K787474L106888
44355G2704913L683583M713922O098452P063790P180079P201577Q164273R987717
44347A26798306J1695434J2825711J3900022J5513098J7590655J9656082K1367388
44340B39346696K2667172K3701105K4619499K5256597K5113522K3821278K1321363
44333D05847232J7378062J1479895L779977m356432j1448073j7132092k1594988
44326C83953581k4390307k4981417k4086039k3099491k2234924k0609849j8232642
$$ plain form
44380 25225944 26253069 27240738 28055443 28545067 28977248 29668364 30398641 30694498 30639728
44371 30639728 30930642 32041402 33752194 35663909 37751775 40090811 42419522 44526830
44363 44526830 46917497 50447736 55153698 59962437 63838160 66810551 69598025 72704913
44355 72704913 76388496 81102418 87200870 94264660 101444739 108646316 116810589 126798306
44347 126798306 138493740 151319451 165219473 180732571 198323226 217979308 239346696
44340 239346696 262013868 285714973 310334472 335591069 360704591 384525869 405847232
44333 405847232 423225294 434705189 438485166 434128734 422680661 405548569 383953581
44326 383953581 359563274 334581857 310495818 287396327 265161403 244551554 226318912
44319B26318912j6345894j5428978j4447864j2776603j1343775j0895758j0522981
44312A34557059r180175p506085o664959o281082n155347l487598k714681l267343
44304I0299789l952849l694104k732313j954045j942636k742214l742785l878589
44296F5660254k768089j487498j329350k054660k421185k160533k096931k355578
44288D8986430j957855n58780P59160J022908O08728L31915K84642K78703N95619
44279E0351470J502451K611463L411632L987899M679133N480230O270559P186904
44271H5481741Q288011R201609R448772Q751068O843090L591479l92397l915990
44263A27297383o413578q401058j0297610j1457245j0998693r114379o925897
$$ plain form
44319 226318912 209973018 194544040 180096176 167319573 155975798 145080040 134557059
44312 134557059 125376884 117870799 111205840 104924758 99769411 96281813 93567132 90299789
44304 90299789 86346940 82652836 79920523 77966478 76023842 73281628 69538843 65660254
44296 65660254 62892165 61404667 60075317 58020657 55599472 53438939 51342008 48986430
44288 48986430 47028575 46469795 47228955 48251863 48860591 49192506 49477148 49755851 50351470
44279 50351470 51853921 54465384 57877016 61864915 66544048 72024278 78294837 85481741
44271 85481741 93769752 102971361 112420133 121171201 128014291 131605770 131213373 127297383
44263 127297383 120883805 112482747 102185137 90727892 79729199 70614820 63688923
44256F3688923n369292m711905m778275n082167m983245m201072l054668j998249
44248B9510050j250743j019242j497848k302606k502148j695578n94723j05234
44240A8541928l03593p20512j071393j219297r76408m95167l46583o83744q75108
44231A1850123n06672j18539k99847o94815o67288l46634j78188j8596L97804
44222I417348O47393K99983r3695J57903M95541j32274j375318j772057r50639
44213F694185j45164k70313p74125q18781m36483Q658M63931P13532K39642p46857
44203D928225j007671J41606J582695J615246O6557j591418k021056j240869j66995
44194B306320M49602M92048K36752r6622m53990o00990q888J441337K790274K728355
$$ plain form
44256 63688923 58319631 53607726 48829451 43747284 38764039 34562967 31508299 29510050
44248 29510050 28259307 27240065 25742217 23439611 20937463 19241885 18647162 18541928
44240 18541928 18238335 17517823 16446430 15227133 14250725 13755558 13408975 12725231 11850123
44231 11850123 11343451 11224912 10925065 10230250 9562962 9216328 9038140 9019544 9417348
44222 9417348 10064741 10364724 10271029 10428932 10924473 10792199 9416881 7644824 6694185
44213 6694185 6549021 6278708 5504583 4685802 4249319 4257977 4721908 5435440 5675082 4928225
44203 4928225 3920554 4062160 5644855 7260101 7326658 5735240 3714184 2473315 2306320
44194 2306320 2755922 3247970 3484722 3388100 2934110 2333120 2324232 3765569 6555843 9284198
44184I284198J160056n62865j241853j104227j106691j488294j585122q60411
44176B494791L74120J265599J223617M55982k13044j60171M07793P97027O68963
44167G314677K30750k48132o11231n90322k2684O52883P49568L13757J03067L97199
44157H289532N54808R9228m73964n02800j78328j23115l74586m47905j63664J78790
44147F857996L17786K36176m0328m36141o95884o03010k63453O9795L20846N17051
44137F280834N85329M98446M65004O81405R73833R24471L51450m36624q67041
44128I457107o52934j96987k21355p61419q88653O5065J381587J834936J413242
44119A1430589J122226J190880Q05146j36037m71129L36568J121177Q16333J35567
$$ plain form
44184 9284198 10444254 9881389 8639536 7535309 6428618 4940324 3355202 2494791
44176 2494791 2868911 4134510 5358127 5814109 5601065 5440894 5848687 6645714 7314677
44167 7314677 7545427 7297295 6686064 6095742 6073058 6725941 7475509 7789266 7892333 8289532
44157 8289532 8844340 8943568 8469604 7966804 7788476 7665361 7290775 6842870 6679206 6857996
44147 6857996 7175782 7411958 7371630 6935489 6239605 5636595 5373142 5442937 5763783 6280834
44137 6280834 6866163 7364609 7829613 8511018 9484851 10409322 10760772 10324148 9457107
44128 9457107 8804173 8607186 8385831 7624412 6735759 6800824 8182411 10017347 11430589
44119 11430589 12552815 13743695 14548841 14412804 13941675 14278243 15399420 16215753 16351320
44110A6351320K23179O73140L96701k95284j56616Q44227J509422J436273J458451
44101B2440813J964035K289477K078554J856458J869401J663121J256685J423577
44093C6842121K240685K664807K273841K122300K905818L518531K715711J215701
44085E6499515O37311R99866Q99093j29181j065520j285206j403911j839336j965449
44076E1347182j449551j231233k118042l249356l181874k052384j382171j808824
44068C4873747k291996j912423j300107j494772k205429k259258j407755n82499
44060B1419508l65027k78745P6255J72726m89965j304900j298711n53289p309
44051A7370543l7448j48553q9648l30695j074080j550625r08887N64718J662523
$$ plain form
44110 16351320 16574499 17247639 17644340 17349056 17192440 18036667 19546089 20982362 22440813
44101 22440813 24404848 26694325 28772879 30629337 32498738 34161859 35418544 36842121
44093 36842121 39082806 41747613 44021454 46143754 49049572 52568103 55283814 56499515
44085 56499515 57136826 58136692 59035785 58906604 57841084 56555878 55151967 53312631 51347182
44076 51347182 49897631 48666398 46548356 43299000 40117126 38064742 36682571 34873747
44068 34873747 32581751 30669328 29369221 27874449 25669020 23409762 22002007 21419508
44060 21419508 21054481 20775736 20851991 21024717 20534752 19229852 17931141 17377852 17370543
44051 17370543 17333095 17184542 17094894 16764199 15690119 14139494 13230607 13795325 15457848
44042A5457848J591640P63775K94714Q81321K105727K805998K287629J156717
44034B7345369O91830J396314K549321L262172L505396L824986M438814M993962
44026E2008164M988982M130116K496156O51078o57831j284038j951123l307764
44018E7073740m871806n445658m595255l199869k366212k247412k246386k038928
44010C0062214j895179k019665k026655j347064j8494J201011J589579J206417
44002B6752164P58660P82849J141075J392758J476860J780100K534099L398919
43994D0017484L805408L554567K839184J745881R3723k064959m049875m990762
43986D0950651m642122l565482k537148j958774j789238j797074j828473j961928
$$ plain form
44042 15457848 17049488 17813263 18107977 18989298 21095025 23901023 26188652 27345369
44034 27345369 28037199 29433513 31982834 35245006 38750402 42575388 47014202 52008164
44026 52008164 56997146 61127262 63623418 64274496 63616665 62332627 60381504 57073740
44018 57073740 52201934 46756276 42161021 38961152 36594940 34347528 32101142 30062214
44010 30062214 28167035 26147370 24120715 22773651 22755157 23956168 25545747 26752164
44002 26752164 27510824 28293673 29434748 30827506 32304366 34084466 36618565 40017484
43994 40017484 43822892 47377459 50216643 51962524 52056247 49991288 45941413 40950651
43986 40950651 36308529 32743047 30205899 28247125 26457887 24660813 22832340 20870412
43978B0870412k343676k732718k445896j157775L77365R38594K11381r51379j668145
43969A1098163j804295j494696o96457L35957Q21377L41370n08095r49116j043294
43960F100914j216281j219802m45661R09579J825848J635831O38381m04898q73123
43951F950788n57181J03653K36259m58051j170222j045172l68796O8088K92850
43942D052216P66481J074365L67235r76512j550649r37081j51431J51478M35255
43933C231357Q40692O00854l44824p02384J44866Q52297J74822q94040o01785
43924C301855Q40418J698923J342253P75288Q09631J244094J801484K432505K578082
43915A6824533J452835o60254k468331l233455l306708l004147k085713o76248
$$ plain form
43978 20870412 18526736 15794018 13348122 12190347 12567712 13506306 13717687 12766308 11098163
43969 11098163 9293868 7799172 7102715 7438672 8260049 8601419 8093324 7144208 6100914
43960 6100914 4884633 3664831 3219170 4128749 5954597 7590428 8228809 7823911 6950788
43951 6950788 6393607 6497260 6733519 6275468 5105246 4060074 3691278 3759366 4052216
43942 4052216 4818697 5893062 6260297 5283785 3733136 2796055 2644624 2796102 3231357
43933 3231357 4072049 4672903 4328079 3625695 3770561 4622858 4797680 3903640 3301855
43924 3301855 4142273 5841196 7183449 7958737 8768368 10012462 11813946 14246451 16824533
43915 16824533 18277368 17617114 15148783 11915328 8608620 5604473 3518760 2842512
43907B842512L36713L39565k86641q13297q67602l20677P03539J453698J050389
43898D438199k58339j128328q08386k0683K89162K42500M07503O10553K55703
43889D027884n26126q93200m37650K66463L82998j99497p28386m49001L99572
43880A843057P40415R6876n58942r7970R66171J063694o1303q79748l88638M35816
43870C159428L32053k85277k79713J69846q946p46890p95495K19245J109495Q75314
43860C749060n16n44021o32422o74518o78380m14822o5166K7735K373K30836O01043
43849A601202O75594M93302N65944R88353J164752O91659J9977j56800J67896
43840F211879M42103L95412K71251L10905M72895O56110P51802M72703l28063
$$ plain form
43907 2842512 3179225 3518790 3232149 2418852 1551250 1230573 1934112 3387810 4438199
43898 4438199 4179860 3051532 2243146 2222463 2511625 2754125 3161628 3772181 4027884
43889 4027884 3501758 2608558 2170908 2437371 2820369 2620872 1892486 1443485 1843057
43880 1843057 2583472 2680348 2121406 2023436 2989607 4053301 3991998 3112250 2723612 3159428
43870 3159428 3491481 3206204 2926491 3096337 3087391 2340501 1545006 1764251 2873746 3749060
43860 3749060 3748544 3204523 2572101 1897583 1219203 804381 739215 766950 769323 1000159 1601202
43849 1601202 2276796 2770098 3336042 4324395 5489147 6180806 6200783 6043983 6211879
43840 6211879 6653982 7049394 7320645 7631550 8104445 8760555 9512357 9985060 9656997
43831I656997j066990p90699N69194J887240K216657J905719J785985J833021
43823A7997124J495957J000256J269715K505619L736467L996577L245362J919872
43815C7166949K82777j462489k962328l931375m205580l550363k027748n99390
43807A8710453n07193j710784k709706k376083j276360o72316q84465j264044
43799G309502j228352o78169J68000P86280O44527N1j43279N72052J155052O49005
43789I234669m72266j154236j311691j429067j229798j58097J101109J119479
43781E700102j46336j111652p57892J75969N87416L83149q1921p79323j478211
43772B491301j429089m41907M84335M56235m2436j4883N06326O92300K47715l88615
$$ plain form
43831 9656997 8590007 7799308 8368502 10255742 12472399 14378118 16164103 17997124
43823 17997124 19493081 20493337 21763052 24268671 28005138 32001715 35247077 37166949
43815 37166949 37449726 35987237 33024909 29093534 24887954 21337591 19309843 18710453
43807 18710453 18203260 16492476 13782770 11406687 10130327 9458011 8573546 7309502
43799 7309502 6081150 5402981 5570981 6357261 7001788 7001839 6858560 7430612 8585664 9234669
43789 9234669 8762403 7608167 6296476 4867409 3637611 3479514 4580623 5700102
43781 5700102 5553766 4442114 3684222 3860191 4447607 4830756 4748835 3969512 2491301
43772 2491301 1062212 620305 1104640 1560875 1518439 1503556 2009882 2702182 2949897 2561282
43762B561282q38915r44482m50792N88411J346132J064997J91967k22631q1037
43753C214932j72556o35606o83173p6597L31782M6675j62416M27957J160940R51091
43743D403029k2188o17329m07470k3893Q1024K04320N60874P61421M97120R4643
43733E531551m0461m8277k49790n40728o07466m84259m46857n20841n24310m87754
43723A580808n73512n79840j6483J097512J863166J352648j85206j337579j003880
43714B197634L06754J061188O36726J14221O95788J844014J925757N99306o04055
43705H777333m88320J48584o5459r33810j237484q34557o70662q42603l25972
43696C527050J012779J743106J013276j9951k1084M28754p659j022120j131135
$$ plain form
43762 2561282 1722367 777885 327093 915504 2261636 3326633 3518600 3295969 3214932
43753 3214932 3042376 2406770 1723597 1647000 1978782 2025457 1863041 2290998 3451938 4403029
43743 4403029 4380841 3763512 3356042 3332149 3413173 3617493 4178367 4939788 5436908 5531551
43733 5531551 5491090 5442813 5193023 4652295 4044829 3560570 3113713 2592872 2068562 1580808
43723 1580808 1007296 427456 410973 1508485 3371651 4724299 4539093 3201514 2197634
43714 2197634 2504388 3565576 4202302 4316523 5012311 6856325 8782082 9381388 8777333
43705 8777333 8289013 8437597 8372138 7438328 6200844 5366287 4695625 3853022 3527050
43696 3527050 4539829 6282935 7296211 7276260 7255176 7683930 7676271 6654151 5523016
43687E523016j78128M18499L6665k17430N11714J393993J346046P45725O16417
43678A0196517Q98478P22929m0656o55006p40649n90988l30403K08554O77693
43669A0346469L48887n97052r20773o3353Q52797O22470j56081L7543J226460
43660A1697367J769330Q04648m12513k83411R63586J770591J341773L13049l54714
43651A7609706k76870M18743J264558J610424J290032J029735J510623K247941
43643B6704892K296646J856242J979969K697138K873836K303434K366908L767579
43635D6846644N058330M686319L345202K786023L155721L197863K533291J930157
43627G3539550J514940N52895q26596j416488r16960o23617j476831k698689l093692
$$ plain form
43687 5523016 5344888 5763387 5800052 5582622 6094336 7488329 8834375 9580100 10196517
43678 10196517 11094995 11817924 11777268 11122262 10381613 9790625 9460222 9668776 10346469
43669 10346469 10695356 10098304 9177531 9114178 9966975 10589445 10433364 10470907 11697367
43660 11697367 13466697 14271345 13858832 13575421 14539007 16309598 17651371 17964420 17609706
43651 17609706 17332836 17751579 19016137 20626561 21916593 22946328 24456951 26704892
43643 26704892 29001538 30857780 32837749 35534887 38408723 40712157 43079065 46846644
43635 46846644 51904974 56591293 59936495 62722518 65878239 69076102 71609393 73539550
43627 73539550 75054490 75607385 74780789 73364301 72447341 71823724 70346893 67648204 64554512
43618F4554512k609450j877927j206053p81393r74705j644391j915847j379859
43610E2164887p60303p23027q64630o37064l77456m89805m42448L38137J280953
43601D9489244J520418J310809J377676J429895P23255k56751j95962J034120
43593E6432704K222808K785836L434448M558393N358700N226555M807399M914331
43585H9741174N331070N531240N814819O805447Q315957R566656J0222956J0496601
43577A51825920J0471633J0020675R243998Q372272P296468N719684L733858J760948
43569B08445456p2875k041246m240699o339992q049531r477496j0777856j1684533
43561A55761228j1707818j0762312r384439q276221p748500p631172p560748p242063
$$ plain form
43618 64554512 61945062 60067135 58861082 58079689 57104984 55460593 53544746 52164887
43610 52164887 51404584 50681557 49816927 49179863 48802407 48312602 47870154 48208291 49489244
43601 49489244 51009662 52320471 53698147 55128042 55851297 55594546 55398584 56432704
43593 56432704 58655512 61441348 64875796 69434189 74792889 80019444 84826843 89741174
43585 89741174 95072244 100603484 106418303 113223750 121539707 131106363 141329319 151825920
43577 151825920 162297553 172318228 181562226 189934498 197230966 202950650 206684508 208445456
43569 208445456 208372581 206331335 202090636 195750644 187701113 178223617 167445761 155761228
43561 155761228 144053410 133291098 123906659 115630438 107881938 100250766 92690018 85447955
43553H5447955o589393n839937n451342n612329n865427n509923m410739l110887
43545D3057978k151033j696293j842575k638660l532201l478698k157843n91551
43537B4969124L2910k75375p15344r47099j137493j166328p62597k48645k04172
43528A9544981m87017n18030m30740q63627j590667j557912n60628K56852K5063
43519A3818275p44857j172584j143156q78099l54004J94088J36894m41960m49824
43510H964773N40673J272770N47518q48927j255436n66738j27790n10952q53671
43501G162220m56913K25054M53979J05077n30564j059200r93913j99047O39527
43492E346220P22272K43071k0206l7830l81562q28101m31877P50595J341454O14620
$$ plain form
43553 85447955 78858562 73018625 67567283 61954954 56089527 50579604 46168865 43057978
43545 43057978 40906945 39210652 37368077 34729417 31197216 27718518 25560675 24969124
43537 24969124 25002034 24726659 24011315 23064216 21926723 20760395 19997798 19749153 19544981
43528 19544981 19057964 18539934 18109194 17245567 15654900 14096988 13536360 13793212 13818275
43519 13818275 13073418 11900834 10757678 9879579 9525575 9719663 9856557 9414597 8964773
43510 8964773 9505446 10778216 11325734 10476807 9221371 8654633 8526843 8015891 7162220
43501 7162220 6705307 6930361 7384340 7489417 6958853 5899653 4905740 4706693 5346220
43492 5346220 6068492 6311563 6291357 6253527 5871965 5043864 4611987 5362582 6704036 7318656
43482G318656l91402m74009P1854K96946J98766L76486O97786M89906j93708n54334
43472G836947k85553K6048j39157n23954n36607J3797P69354J177920R75266M52727
43462I766788J41550J58100J37458r4010k47022k02677l46254q22327j006438
43453G485168l67882N53343P85554K91730p9002J11899M33119M56279L29489K67453
43443A0267150J03777l02939o42644m94242J20563P71580J097576J105905J042063
43434A3068789J023881Q74626M55503P9046K18141P63528J094974J075685J314254
43425A9968427K040456K468835J965062J138354Q30418O25628m16238j923517
43417B6697425k504694j796020q11399j60386N72601J333276J102136l28634j509874
$$ plain form
43482 7318656 6927254 6453245 6525099 6822045 7020811 7397297 8095083 8584989 8391281 7836947
43472 7836947 7551394 7577442 7438285 6914331 6377724 6391521 7160875 8338795 9314061 9766788
43462 9766788 9908338 10066438 10203896 10109886 9862864 9660187 9313933 8491606 7485168
43453 7485168 7117286 7670629 8456183 8747913 8668911 8780810 9213929 9670208 9999697 10267150
43443 10267150 10370927 10067988 9425344 8931102 9051665 9823245 10920821 12026726 13068789
43434 13068789 14092670 14967296 15422799 15501845 15719986 16483514 17578488 18654173 19968427
43425 19968427 22008883 24477718 26442780 27581134 28411552 29037180 28620942 26697425
43417 26697425 24192731 22396711 21585312 21424926 21997527 23330803 24432939 24104305 22594431
43408B2594431j298308m63741k12272k63665J99471O56548N8621j047849j034149
43399A9189087K94873J407737J409413J064246J070823R04505J33998m70491j96620
43390B4807571K32958k96370j502979k112254j709756j101743r04081p86830l48506
43381A6278010P4553l8959m85479n33262M5628N68288K63966o97638j340995j099432
43371A3034680n25677m90932r78927j206703q38420m29911n06476p96577p49226
43362F511831l70309q0802j4557O3703K54544L72251L12940K31151K43844J95947
43352G720543j02721n02348n79584j57983L91097N89291N19478O94486J208343
43343I780602J502435J212328O93942K83386l21992j210369j426518j72857J486734
$$ plain form
43408 22594431 21296123 20832382 20620110 20356445 20555916 21212464 21271085 20223236 19189087
43399 19189087 19483960 20891697 22301110 23365356 24436179 25340684 25474682 25004191 24807571
43390 24807571 25040529 24744159 23241180 21128926 19419170 18317427 17413346 16626516 16278010
43381 16278010 16352563 16313604 15828125 15294863 15340491 15908779 16172745 15475107 14134112 13034680
43371 13034680 12509003 12018071 11039144 9832441 8994021 8564110 8057634 7261057 6511831
43362 6511831 6141522 6060720 6046163 6109866 6364410 6736661 7049601 7280752 7524596 7720543
43352 7720543 7617822 7115474 6535890 6377907 6769004 7358295 7877773 8572259 9780602
43343 9780602 11283037 12495365 13189307 13472693 13150701 11940332 10513814 10340957 11827691
43334A1827691J557154j45031j608293j388767l34140J39730O9322J49808J53830
43325A0421304m05997q69058k46753J009377J545264J136554P37903O66938K70492
43316A4266024n13343p83516k30473K91721K31417J31451L80303L73659l18047
43307A3829196r87577q57111k48337J55689M09026P61434P90992J32214n42404
43298A3443122l98925J62514J67936k32521n9831O17872N67648n55615j424878
43289A2287322j003412j46351k26830r63321q89834K94103J155877N88882o18221
43280A0478215r51498k51332K66585j45147q06995p09504J38895R16103J074023
43271A0009345O91356M7884n53603o83726j35193N75275N90137k63705j245270
$$ plain form
43334 11827691 13384845 13239814 11631521 10242754 9908614 10048344 10117666 10267474 10421304
43325 10421304 10015307 9146249 8899496 9908873 11454137 12590691 13328594 13995532 14266024
43316 14266024 13752681 12969165 12738692 13030413 13261830 13393281 13773584 14147243 13829196
43307 13829196 12841619 11984508 11736171 11891860 12300886 13062320 13853312 13985526 13443122
43298 13443122 13044197 13206711 13374647 13142126 13082295 13700167 14267815 13712200 12287322
43289 12287322 11283910 11137559 10910729 9947408 9057574 9351677 10507554 11096436 10478215
43280 10478215 9526717 9275385 9541970 9396823 8589828 7880324 8019219 8935322 10009345
43271 10009345 10700701 10748585 10194982 9511256 9376063 9951338 10541475 10277770 9032500
43262I032500j586527j197587m30360L48971P79839O04490L7285l35342k73941
43253F979328j67726l97855p93424r46277p12431j95569M08306P85050P28822
43244E688224N25367O16671P86516L75301m72041o48457L01670J247307R28192
43235I348750l09142j113381r50483l78013J01991M26176M06394j80864r21008
43226F430420j042624m34190L33598R27966J392228J449758O63150n43411r60995
43217H215900q0507J198091J699879J239444M44254j46679m63011p47139j232607
43208A0127625j726960j594149n86308M90903O07581j10475o07593m37907j67990
43199E994727j91562j53620K01035N65234P66542J002311J090106N19693l76458
$$ plain form
43262 9032500 7445973 6248386 5818026 6166997 6946836 7551326 7588611 7253269 6979328
43253 6979328 6811602 6413747 5620323 4674046 3961615 3766046 4174352 4959402 5688224
43244 5688224 6213591 6830262 7616778 7992079 7520038 6871581 7173251 8420558 9348750
43235 9348750 9039608 7926227 6975744 6597731 6699722 7125898 7532292 7351428 6430420
43226 6430420 5387796 4953606 5287204 6215170 7607398 9057156 9720306 9176895 8215900
43217 8215900 8135393 9333484 11033363 12272807 12717061 12570382 12107371 11360232 10127625
43208 10127625 8400665 6806516 6220208 6711111 7318692 7208217 6600624 6162717 5994727
43199 5994727 5803165 5649545 5850580 6415814 7182356 8184667 9274773 9794466 9418008
43190I418008m74673L48411O97224k65995j430497j474169q59016p62551r74071
43181D222671m62709N70919R28095M50899J74106M26918L64076l55251q83849
43172E435875o41444j73889l083K13890P04963Q31369J71732m83123j70195P81445
43162F667540J244994Q71937K84826r4211n11285j091181j314211o53222N89147
43153E994334J416670J112932j7609r25097q43515O885P66583Q17747J93424o46081
43143G876273j151687r97053m07335p085j754J70344Q57692J297314N84781p05422
43133G516068j028075p5774P66912N53711O1760K13988M80488L3074m99667M0681
43123H063166J210009J411160L77168m13178q2331M06183O301p33090p28978j08349
$$ plain form
43190 9418008 8943335 9291746 9988970 9722975 8292478 6818309 5959293 5196742 4222671
43181 4222671 3759962 4330881 5258976 5709875 5883981 6310899 6674975 6319724 5435875
43172 5435875 4794431 4620542 4617459 4831349 5536312 6367681 6539413 6056290 5886095 6667540
43162 6667540 7912534 8784471 9069297 8975086 8463801 7372620 6058409 5405187 5994334
43153 5994334 7411004 8523936 8506327 7581230 6737715 6744600 7511183 8328930 8522354 7876273
43143 7876273 6724586 5727533 5320198 5313113 5311359 5481703 6339395 7636709 8221490 7516068
43133 7516068 6487993 6412219 7179131 7732842 7794602 8008590 8489078 8522152 8022485 8063166
43123 8063166 9273175 10684335 11061503 10648325 10565994 10972177 10978478 10245388 9516410 9408061
43113I408061K70765L72094P81029J292666J039821P8393m22243N0543N22747
43104A3393876J26679m61338j47531P25854Q87270J80534k49784P6443J84603
43095A4716606o21672j440826j149644k17877N6663m01520m92940J18525M70377
43086A1037692o5005q04767q90833m26057P9123N21391Q06535M28054p25874j709717
43076H250542j514449l58003P35656J249684J324038J029596M11145k8133J45752
43067A1245828M34142L3966p68492q89385j63593L90526K78040K93733J007092
43058A1861857J578350R90394l02118r65044o06301q8679k32574r75585j698193
43049I562107j741197p53479Q18543J712683J033914n22231j270097m58351R56661
$$ plain form
43113 9408061 9678826 10050920 10831949 12124615 13164436 13242829 12820586 12871129 13393876
43104 13393876 13520555 13059217 12911686 13637540 14524810 14705344 14455560 14532003 14716606
43095 14716606 14094934 12654108 11504464 11286587 11343250 10941730 10448790 10567315 11037692
43086 11037692 10972687 10167920 9277087 8851030 8930153 9451544 10258079 10686133 9960259 8250542
43076 8250542 6736093 6378090 7113746 8363430 9687468 10717064 11128209 11100076 11245828
43067 11245828 11679970 11713936 10945444 10056059 9892466 10282992 10561032 10854765 11861857
43058 11861857 13440207 14430601 14128483 13163439 12557138 12468459 12235885 11260300 9562107
43049 9562107 7820910 7067431 7885974 9598657 10632571 10110340 8840243 8381892 9338553
43040I338553J562129R60275j87678j058425j272847r27764l60386J75280O53816
43031H882953J020598R82625M15709j62442o6484N77300Q83723L96686l08587
43022A2622081m63809o7055L16519L07286p2893n89264q82122o98843l15251l30046
43012I826603p54382q39384k51712J97022k67837r73205n77884R15247J991164
43003I265632J605880L92271m22596m55621p9344L42234N18424J13892p37277
42994A0543495j176149n64850N28574R27086L17049m68547o28081k98066j43620
42985I036891m47827q35482p52386j11797N40790O30725L27025L55372Q62719
42976I606030R78339N535j376610j857901j239891n56883m26509k65760M35045
$$ plain form
43040 9338553 10900682 11860957 11673279 10614854 9342007 8414243 8053857 8229137 8882953
43031 8882953 9903551 10886176 11301885 11139443 11072959 11650259 12533982 12930668 12622081
43022 12622081 12158272 12091217 12407736 12715022 12642129 12052865 11170743 10471900 10156649 9826603
43012 9826603 9072221 8232837 7981125 8178147 7910310 6937105 6359221 7274468 9265632
43003 9265632 10871512 11263783 10841187 10385566 10306222 10648456 11166880 11280772 10543495
42994 10543495 9367346 8802496 9331070 10258156 10575205 10106658 9478577 9180511 9036891
42985 9036891 8589064 7753582 7001196 6889399 7430189 8060914 8387939 8743311 9606030
42976 9606030 10584369 10589904 9213294 7355393 6115502 5558619 5132110 4866350 5301395
42967E301395R49950K68993j232777k010549j259206J18266P30786L97516J55900
42958C420274P13209J405747J032048m59018j646284j274550J79821J122769Q30831
42949E324847R9209j69735j55932l84945n37626P8821J170131J579913Q91569
42940G896252K9313r2761K35095K42241k2372N1664L81420J69653p42289j380354
42930F767862r44534M0653M85965J76051k82190o32382j159106j693285j418257
42921A340777j11452J167872J270723L71737m25602n22420j95628J77118M79656
42912C552781N05697R23p88308j167986p66591J42115J073141J592468J237649
42903E381889o8744j399821j439509j01222J171499J206274N38743M05558Q96601
$$ plain form
42967 5301395 6251345 6520338 5287561 3277012 2017806 2136072 2866858 3264374 3420274
42958 3420274 4133483 5539230 6571278 6112260 4465976 3191426 3371247 4494016 5324847
42949 5324847 5424056 5254321 5098389 4713444 4175818 4254639 5424770 7004683 7896252
42940 7896252 7925565 7832804 8067899 8310140 8287768 8339432 8720852 8890505 8148216 6767862
42930 6767862 5823328 5863981 6349946 6525997 6243807 5611425 4452319 2759034 1340777
42921 1340777 1229325 2397197 3667920 4039657 3614055 3091635 2896007 3073125 3552781
42912 3552781 4058478 4059401 3271093 2103107 1336516 1478631 2551772 4144240 5381889
42903 5381889 5313145 3913324 2473815 2372593 3544092 4750366 5289109 5694667 6591268
42894F591268J024694L73263l10775l09203P6182J26333j93200k45864L04646
42885G437344R71599J021050L37408n21964j046532j201566j060943m82895M47869
42876E901370J034534O69044k32873o65241l39437J43643L80521N58598O67736
42867H117895K96981m66904q77909o63509l62905j28306O30123J756695J875990
42858A0178151N12748o05470R1909J395961R59974j069999k189291j193261L70070
42849H450792P34908M2120o78070j030714r85235m12824L13606L56833l00443
42840F490973o77215m13693l30221p76468q19961O8219Q89800P40584K72062L27986
42830E772066L66913l12631q86729k39510R49195J147618M42756K37995Q09934
$$ plain form
42894 6591268 7615962 7989225 7678450 7369247 7445429 7571762 7378562 7132698 7437344
42885 7437344 8408943 9429993 9767401 9245437 8198905 6997339 5936396 5453501 5901370
42876 5901370 6935904 7604948 7372075 6706834 6367397 6511040 6891561 7450159 8117895
42867 8117895 8414876 7947972 7070063 6406554 6043649 5915343 6545466 8302161 10178151
42858 10178151 10690899 10085429 10177338 11573299 12533273 11463274 9273983 8080722 8450792
42849 8450792 9185700 9227820 8549750 7519036 6533801 6120977 6434583 6791416 6490973
42840 6490973 5813758 5400065 5069844 4293376 3473415 3541634 4431434 5172018 5444080 5772066
42830 5772066 6138979 5826348 4939619 4700109 5649304 6796922 7239678 7477673 8287607
42821H287607J026329M46460j03764k32844n46147j131749j092277j76712N38566
42812G015469L16227j02417K17201J004804J420110J204671N27832m63378j277896
42803I862623j122921m6670P51482N10234L1802L81767J214218J411223Q29420
42794A3823178L01867K18089J78236n0640k17123k68847m99042q55451q19898
42785A1810369k20853L72482L31497l01327r38110j061966o33720n7521K53362
42776I554213L53583O22327J042900J044071M04609j29780K71151J304969J876932
42767A6344975J516745P76868K94015J92615M52350J060060J566657J253596J28904
42758B3586785q86445j187631j243829j575698j670508q16855M13174O39370l71952
$$ plain form
42821 8287607 9313936 9760396 9656632 9423788 8877641 7745892 6653615 6476903 7015469
42812 7015469 7331696 7229279 7446480 8451284 9871394 11076065 11603897 11140519 9862623
42803 9862623 8739702 8693032 9444514 9954748 9986550 10368317 11582535 12993758 13823178
42794 13823178 14125045 14343134 14521370 14470730 14253607 13984760 13485718 12630267 11810369
42785 11810369 11589516 11961998 12293495 11992168 11054058 9992092 9358372 9300851 9554213
42776 9554213 9907796 10530123 11573023 12617094 13021703 12891923 13163074 14468043 16344975
42767 16344975 17861720 18638588 18932603 19125218 19577568 20637628 22204285 23457881 23586785
42758 23586785 22700340 21512709 20268880 18693182 17022674 16205819 16618993 17258363 16886411
42749A6886411j289555j057127k14829J54006k0900j02459l7045l23529q80122
42740A3114851r42828k25922O38452J045834J063704Q68309L36368l62166n50668
42731A4985934o9346J84987m49107j174562q11175L58210J013527Q46653Q22569
42722A5707690J282536J232336R7655j072880j077671l11114q338l96503o91540
42713A4762171n34045l28442l07053k68729k53966n57842r59238q01980p0983
42704A0679893M07370J74527j68666P3689O58650R03710P43009O14865N73036
42695A4660083K33218m10883p60778m04834K96480O62345M41688r5634n54074
42686A4067611o59268l49261P6352Q1821m79865j015155q83435l21033j04715
$$ plain form
42749 16886411 15596856 14539729 14324900 14478906 14458006 14355547 14318502 13994973 13114851
42740 13114851 12172023 11946101 12584553 13630387 14694091 15562400 15898768 15536602 14985934
42731 14985934 14916588 15101575 14652468 13477906 12666731 13024941 14038468 14885121 15707690
42722 15707690 16990226 18222562 18320217 17247337 16169666 15858552 15850214 15453711 14762171
42713 14762171 14228126 13899684 13592631 13323902 13069936 12512094 11552856 10750876 10679893
42704 10679893 11087263 11261790 11093124 11166813 11825463 12729173 13472182 14087047 14660083
42695 14660083 14893301 14482418 13721640 13316806 13613286 14275631 14717319 14621685 14067611
42686 14067611 13408343 13059082 13135434 13217255 12737390 11722235 10838800 10517767 10413052
42677A0413052k99682q2834R17717J869665J876697J225688P52670M95225q4656
42668A7083542q76104j193513r81021q65912r42919o00034K17600O83828M52587
42659A2978054K82603P12336J080219O03619l72426r66595r15026m51764K29583
42650A3180603O98383L04785o96152r14217K84386J538011J340266K67894j08591
42641A5895368K08313m3140r41438j246160o89422m16739q06333p62074J70802
42632A1369177P70221J61188o74367n44292R9705K06690m0510K10131Q44135J036212
42622A3438290O57610K59882Q768l30827o40685o13952m11887l29456j19287N29523
42612A2447979J180854J191353P58779N54650O07245M73178K29752K55275K30904
$$ plain form
42677 10413052 10113370 10030536 10948253 12817918 14694615 15920303 16672973 17168198 17083542
42668 17083542 16207438 15013925 14032904 13166992 12224073 11624039 11841639 12525467 12978054
42659 12978054 13260657 13972993 15053212 15656831 15284405 14317810 13402784 12951020 13180603
42650 13180603 13878986 14183771 13487619 12573402 12857788 14395799 15736065 16003959 15895368
42641 15895368 16103681 16060541 15119103 13872943 13183521 12766782 11960449 11198375 11369177
42632 11369177 12139398 12300586 11626219 11081927 11181632 11388322 11347812 11557943 12402078 13438290
42622 13438290 14095900 14355782 14364550 14033723 13393038 12779086 12367199 12037743 11918456 12447979
42612 12447979 13628833 14820186 15578965 16133615 16740860 17214038 17443790 17699065 17929969
42603A7929969m52620j299042r96353N61003J701812J077155n26881j239451m13012
42594A6342580Q86562J403033R72567K94317p447J33704L97046M55039K17054
42585B1094455j22018k27079J5346J94300k88958j332807j956812j538458q51019
42576A4986950r79182j443399p32709J098162J949380O24706j211527j367775
42568A2924606k16683K68608l02839n99383k41641l47530j135176j147643K86691
42559I489010J619413J266588j57402j033861j044665r36470q45731l44227K90757
42550H303412K61584l78437o93740k77089K55466L24356J33576J10550K21443
42541H261121J70648p6748k47073j23588J23930J5116o37460j219486q79722K18286
$$ plain form
42603 17929969 17477349 16178307 15181954 15742957 17444769 18521924 17995043 16755592 16342580
42594 16342580 17229142 18632175 19604742 19899059 19891612 20025316 20422362 20877401 21094455
42585 21094455 20972437 20745358 20760704 20955004 20666046 19333239 17376427 15837969 14986950
42576 14986950 14007768 12564369 11831660 12929822 14879202 15503908 14292381 12924606
42568 12924606 12707923 12976531 12673692 12074309 11832668 11485138 10349962 9202319 9489010
42559 9489010 11108423 12375011 12217609 11183748 10139083 9202613 8356882 8012655 8303412
42550 8303412 8564996 8186559 7492819 7215730 7471196 7795552 7929128 8039678 8261121
42541 8261121 8431769 8355021 8107948 7984360 8108290 8123406 7485946 6266460 5386738 5605024
42531E605024Q19750K02518p25007o65557J99550N45658p9784o71743m29568j0025
42521D790816m64197j521714j776920n14827J305702K135261J533986M38322j15886
42512E810543o9132J0489j05729j79292j30158j60724k09651J02493P63318J158369
42502F990526Q91313L28188l0249k18619m02342l11207K88715R03029P87317l0718
42492I195953q00288r98823o89212q2750O21215J010510P17089j1919n01764m69019
42482G990992k19120o7220p6097l22026q00133j034039m71982N68115J046349
42473F614839N70321n9446n5181K83983K62990m3729q4354R5029n8664n43539
42463F982249o69379j04020O64138J112342J235039J001069M4033j447640k179045
$$ plain form
42531 5605024 6424774 6627292 5902285 5236728 5436278 5981936 5902152 5230409 4800841 4790816
42521 4790816 4326619 2804905 1027985 513158 1818860 3954121 5488107 5926429 5810543
42512 5810543 5741411 5751900 5646171 5466879 5336721 5175997 4966346 5068839 5832157 6990526
42502 6990526 7881839 8210027 8179778 7961159 7558817 7247610 7536325 8439354 9226671 9195953
42492 9195953 8395665 7396842 6707630 6624880 7246095 8256605 8973694 8961775 8460011 7990992
42482 7990992 7771872 7704652 7628555 7306529 6506396 5472357 5000375 5568490 6614839
42473 6614839 7185160 7125714 7070533 7354516 7617506 7573777 7489423 7584452 7525788 6982249
42463 6982249 6312870 6208850 6872988 7985330 9220369 10221438 10265471 8817831 6638786
42454F638786j113767Q37862J604012N49970q00881j025851o00304n97711o99716
42445D792400N9646J182023J096720l08878j254075o57278L76082M97603J61708
42436E945951N00543J208568J055986l9060r17033r64420p11099o59124o55442
42427D764870n38537m40641l22007l0614J55366j19131m53145j65358M35178L44277
42417C630258m85966r63769n76626r5281j35946k13530J36263L98816P7850k67264
42407A504805Q9326Q17530J107879R06694P10360O02357L27594o3612l95301p90643
42397D816989j206313j018597R0835J239269J250440K15730p01219q17568m52445
42388C417121n9303K93862N93325P70093R27117J080071Q16704j21535j108489
$$ plain form
42454 6638786 5525019 6362881 7966893 8516863 7715982 6690131 6089827 5492116 4792400
42445 4792400 4852046 6034069 7130789 6821911 5567836 4910558 5286640 5784243 5945951
42436 5945951 6446494 7655062 8711048 8671988 7754955 6790535 6079436 5420312 4764870
42427 4764870 4226333 3785692 3463685 3433071 3588437 3469306 3016161 2850803 3285981 3630258
42417 3630258 3144292 2180523 1603897 1508616 1372670 1159140 1295403 1694219 1772069 1504805
42407 1504805 1594131 2411661 3519540 4426234 5136594 5738951 6066545 6002933 5607632 4816989
42397 4816989 3610676 2592079 2682914 3922183 5172623 5388353 4687134 3869566 3417121
42388 3417121 3357818 3651680 4245005 5015098 5942215 7022286 7838990 7717455 6608966
42379F608966j257803o59257k05854k87034m79084m54644k92217J07795R20713
42370D001581J591246J175866j80138j075299o41149L31575N97972N8443m63722
42361E396375m47198q922N75528J064488J187698Q54471K93134k35365o19810
42352H060399p11679m09309o6159k39770p90545q58401r0878P44814Q39684M19040
42342F897196J78817K14464J87392J04553J94825L14900J83009r560J31459M93898
42332H890953O17458M01709R5787k35395o52731r25705p92064n21457o22085j059560
42322E196910j316699j138966o96570j54488L52676M95008J24107k95283k75173
42313B291522q0112j60013j49930N11263J197823O87469p80666j510135q12198
$$ plain form
42379 6608966 5351163 4691906 4486052 4199018 3719934 3265290 2973073 3080868 4001581
42370 4001581 5592827 6768693 6588555 5513256 4872107 5203682 5801654 5860097 5396375
42361 5396375 4949177 4940255 5515783 6580271 7767969 8622440 8915574 8680209 8060399
42352 8060399 7348720 6939411 6873252 6633482 5842937 4984536 4893658 5638472 6478156 6897196
42342 6897196 7076013 7290477 7477869 7582422 7777247 8092147 8275156 8265596 8397055 8890953
42332 8890953 9508411 9910120 10005907 9770512 9117781 8192076 7400012 6878555 6256470 5196910
42322 5196910 3880211 2741245 2044675 1890187 2242863 2737871 2861978 2566695 2291522
42313 2291522 2211410 2051397 1901467 2412730 3610553 4298022 3517356 2007221 1195023
42304A195023M3852M5883J4748P87870J326701M06044q78370m86054J136191J396959
42294D988847l97133j707539n21639J546736J614094l29722j659141r40614N08823
42285C102712J035461Q05414P83375R04227M43998m61834q67197m62377k2689
42276E261090k33016p63268q67463m44043m6847m7679k45405l24250l00768k97591
42266A690760j51289L58584R45745R52285K55496l72818k36564K64940K27407
42257C934546k78805k04706P32362J243923K08689j428224j630683J3663J711051
42248D301816J814545P04919j76231k38930Q4482L90013N78114M51688n2703m25095
42238G432618k19046K0211o07193j793273k108491r23700O71311J332142J052743
$$ plain form
42304 1195023 1238875 1284758 1299506 2087376 3414077 3820121 2941751 2455697 3591888 4988847
42294 4988847 4591714 2884175 2362536 3909272 5523366 5193644 3534503 2593889 3102712
42285 3102712 4138173 4943587 5726962 6631189 7075187 6613353 5746156 5283779 5261090
42276 5261090 5028074 4264806 3397343 2953300 2906453 2858774 2613369 2289119 1988351 1690760
42266 1690760 1539471 1898055 2843800 3796085 4051581 3678763 3442199 3707139 3934546
42257 3934546 3655741 3451035 4183397 5427320 5636009 4207785 2577102 2590765 4301816
42248 4301816 6116361 6821280 6645049 6406119 6490601 6880614 7458728 7910416 7857713 7432618
42238 7432618 7213572 7233783 6626590 4833317 2724826 1801126 2472437 3804579 4857322
42229D857322O94835N96552M48834J91296K10591O60999J142232J128437M38892
42220A0369990o34933j430058j334734m34321M15352M66088r6902m55167j21729
42211F743586O26197J109982Q71655J46456k18681K95796R99489P31071l47233
42202A0958318o83559L61649J245710L76401j377993j811735n04216Q60257J132888
42193A0557720Q61648O01318n7219j037667j051378N12873K233459K462902J548522
42184A6632178R98232J228876J489974J452237J470060J548286J344877J099061
42176B7263781J399717K056368K266328J918284J694004J789586J562032O84012
42168D0634112k55814o44805o35959p45839j220145j994058k782186l107867k733313
$$ plain form
42229 4857322 5552157 6148709 6597543 6788839 6999430 7660429 8802661 9931098 10369990
42220 10369990 9735057 8304999 6970265 6535944 6951296 7417384 7320482 6865315 6743586
42211 6743586 7369783 8479765 9351420 9497876 9279195 9574991 10574480 11305551 10958318
42202 10958318 10274759 10636408 11882118 12258519 10880526 9068791 8564575 9424832 10557720
42193 10557720 11419368 12020686 11963467 10925800 9874422 10387295 12620754 15083656 16632178
42184 16632178 17630410 18859286 20349260 21801497 23271557 24819843 26164720 27263781
42176 27263781 28663498 30719866 32986194 34904478 36598482 38388068 39950100 40634112
42168 40634112 40378298 39733493 39097534 38351695 37131550 35137492 32355306 29247439 26514126
42159B6514126k083324j760227j733776j562151j223721j036177r43596o87289
42151A5483865n12819q14646j237870j130173p39704q23307j173405q81587j01988
42142H068366j0211p14799q56926J00540Q19570K43916o84892o27809J20925M81999
42132F940679L63943K47102l2562o84890r96298l86930L15778J04638m39549j51953
42122E279958O41872P72522L63810M15021O42187j37398j506597j565523K1386
42113D927238J175657M03662j148209j628514r27423o1557N76272J079191J116149
42104E512466M47884k73481l27988p4897k94770p86171o16576L64885J116772
42095E068124O51963p53556j761327j317543J81624J247232J036567L37024K94658
$$ plain form
42159 26514126 24430802 22670575 20936799 19374648 18150927 17114750 16171154 15483865
42151 15483865 14971046 14156400 12918530 11788357 11048653 10225346 9051941 8170354 8068366
42142 8068366 8058155 7343356 6486430 6586970 7406540 7650456 6965564 6337755 6458680 6940679
42132 6940679 7304622 7551724 7519162 6834272 5837974 5451044 5766822 5871460 5431911 5279958
42122 5279958 5921830 6694352 7058162 7473183 8115370 7977972 6471375 4905852 4927238
42113 4927238 6102895 6506557 5358348 3729834 2802411 2740854 3317126 4396317 5512466
42104 5512466 5960350 5686869 5358881 5283984 4989214 4203043 3586467 3951352 5068124
42095 5068124 5720087 4966531 3205204 1887661 2069285 3316517 4353084 4690108 4984766
42086D984766P19910O48710J34204P2835L92396M8907r67775j336474o08881J2738
42076D101336j61776j42709O97812J185527L84363n16013j08442P74039N03006
42067F717143m95617n43821L05526L99006o19585j258098o84821J88911M90238
42058D498882M80853M20686j8948o25882m36834O23635J191073L38986j047969
42049E424482j533377q97199Q626M26462J76286l56634l30374P64305K150389
42040E832966K379208J133423m21857j248390j386115j114240m05549L41569K80579
42031E391594n24237q58504j63595N77336N23338K93555O02767Q34295L04752
42022F981301j16134P43221K219397K641121J884270J371418J649714J738820
$$ plain form
42086 4984766 5704676 6353386 6487590 6560425 6952821 7001728 6033953 4697479 4088598 4101336
42076 4101336 3939560 3796851 4494663 5680190 6064553 5548540 5440098 6214137 6717143
42067 6717143 6221526 5677705 5983231 6382237 5762652 4504554 3819733 4008644 4498882
42058 4498882 4979735 5400421 5381473 4755591 4318757 4942392 6133465 6472451 5424482
42049 5424482 3891105 2993906 3002532 3428994 3605280 3248646 2918272 3682577 5832966
42040 5832966 8212174 9345597 8923740 7675350 6289235 5174995 4769446 5111015 5391594
42031 5391594 4867357 4008853 3845258 4422594 4945932 5239487 5842254 6676549 6981301
42022 6981301 6865167 7608388 9827785 12468906 14353176 15724594 17374308 19113128
42014A9113128J151519Q76741J636140K491760K148530P35934o79361j698686
42006B5775705k644284l345706l042769j724575o51254r00135j858092j958931
41998I649959q54968M0977m04577j286803q94962P26922J722480J036806k05664
41989I530170n39103k46121n72283j566243j950631r99798M75678J169664O54692
41980E956025l92611q88646k74676Q66126J241385K83868j053015j378449m91666
41971C868341O11725J113733J080493Q98194P03156M73742J78959k51563p32781
41962G943999q57530l47816M17447P87995O56209L91478R4171m49978j062304
41953G573671j081861k10753R95350J686422J474381N68001n06259j208909j255973
$$ plain form
42014 19113128 20264647 21141388 22777528 25269288 27417818 28153752 27474391 25775705
42006 25775705 23131421 19785715 16742946 15018371 14367117 13466982 11608890 9649959
41998 9649959 8794991 8835968 8431391 7144588 6249626 6976548 8699028 9735834 9530170
41989 9530170 8991067 8744946 8172663 6606420 4655789 3655991 4131669 5301333 5956025
41980 5956025 5563414 4674768 4400092 5266218 6507603 6791471 5738456 4360007 3868341
41971 3868341 4480066 5593799 6674292 7572486 8275642 8749384 8928343 8676780 7943999
41962 7943999 7086469 6738653 7156100 7944095 8600304 8991782 9085953 8635975 7573671
41953 7573671 6491810 6281057 7276407 8962829 10437210 11005211 10498952 9290043 8034070
41944H034070o89839L10964J447572K059435J446045j11019j191123q24149J56001
41935A0637957K02294p77602j360051o82127M59869Q35928K42741o16399j038267
41926G904343p70561r6975K79889q3816p05877p27273j36623K62818J53671R4247
41916F173843L94012N36892J54873k85926l32801l12926o02787q08633m34603
41907D481944J41828J53299m24113r42813j067127j008756q81053m30822M90056
41898E12443J521828J965317J344609q255r73312o94657L21663P26368P6951o54283
41888D138672o13746k43515l13340n66767k43173N50141R72663P43531M18942
41879D843408M35896O36353P71160Q40078Q53686P52693O21222O17379P30510
$$ plain form
41944 8034070 7344231 7655195 9102767 11162202 12608247 12497228 11306105 10481956 10637957
41935 10637957 10840251 10062649 8702598 8020471 8480340 9316268 9559009 8942610 7904343
41926 7904343 7133782 7036807 7316696 7232880 6527003 5799730 5663107 5925925 6079596 6173843
41916 6173843 6567855 7104747 7259620 6973694 6640893 6327967 5725180 4916547 4481944
41907 4481944 4623772 4777071 4352958 3410145 2343018 1334262 453209 22387 512443
41898 512443 2034271 3999588 5344197 5335942 4362630 3667973 3989636 4716004 4792955 4138672
41888 4138672 3524926 3281411 2968071 2401304 2158131 2708272 3680935 4424466 4843408
41879 4843408 5279304 5915657 6686817 7526895 8380581 9133274 9754496 10371875 11102385
41870A1102385Q88654J102035J175761O32882n76501j628860j716356j126138
41862I853862p67232q52885q16734l99107L2950K75734N62336Q70001P24985J4242
41852I498152o38235o76961l14037q1065r8288j47327j48934j98607l02632l66114
41842F525952l60739l26007k48011l3819L75638Q27218R37452M99114m0557Q4975
41832H241216Q99813J422942R37991J12073J61339J128721J789752J320970L59689
41823A6374506J56173J125540K479087L053555K421293J312366Q13166J020978
41815B8756664Q78646l53442k002893k918229k938172k644492k183464j407598
41807A5187020q47972j266391k250127k472904j517582l25551L24667N97564O23892
$$ plain form
41870 11102385 11991039 13093074 14268835 14901717 14325216 12696356 10980000 9853862
41862 9853862 9086630 8233745 7417011 7017904 7050854 7326588 7888924 8758925 9483910 9498152
41852 9498152 8859917 8182956 7868919 7787854 7689566 7542239 7393305 7194698 6892066 6525952
41842 6525952 6165213 5839206 5591195 5557376 5933014 6760232 7697684 8196798 8156241 8241216
41832 8241216 9141029 10563971 11501962 11614035 11775374 12904095 14693847 16014817 16374506
41823 16374506 16530679 17656219 20135306 23188861 25610154 26922520 27735686 28756664
41815 28756664 29635310 29281868 27278975 24360746 21422574 18778082 16594618 15187020
41807 15187020 14339048 13072657 10822530 8349626 6832044 6506493 6831160 7428724 8052616
41798H052616N6345r01657j259381p03615k15496n25780j001249q32540l05812
41789B363431k9448J40381M68792N46333J09420k05598N9572K43019j99670m70148
41779C026084K20483R66886M49394p73658j039023k36597J91239k14870l38927
41770B251011L34395Q03248L61650k87106m31790m47819p09066o92154o2437M45276
41760A565208J75555l33726l04671K4791K7610j36638O1073M59565M86478J28751
41750B153996j53145j66410j731L38186P40473P87868K95946l58697q79950j436008
41740A320528j910660j553668j51378J181628J345007P83878O24202Q36269N34355
41731C010161k33949m28946K25658P64110N34329P0808K001J07941L165q8670
$$ plain form
41798 8052616 8108961 7207304 5947923 5244308 5028812 4503032 3501783 2669243 2363431
41789 2363431 2333983 2474364 2943156 3489489 3598909 3393311 3452883 3695902 3496232 3026084
41779 3026084 3246567 4213453 4662847 3889189 2850166 2613569 2804808 2589938 2251011
41770 2251011 2585406 3388654 3750304 3463198 3031408 2583589 1874523 1182369 1119932 1565208
41760 1565208 1740763 1407037 1102366 1127157 1154767 1018129 1079202 1538767 2025245 2153996
41750 2153996 2000851 1834441 1832710 2170896 2911369 3699237 3995183 3636486 2756536 1320528
41740 1320528 -590132 -2143800 -2295178 -1113550 231457 1015335 1639537 2475806 3010161
41731 3010161 2776212 2347266 2572924 3337034 3871363 3942171 3944172 4052113 4055278 3966608
41721C966608J37770L95785K66871q8084j81674J16949M99785O01145K97687j07587
41711E905255M469Q58220J730758J704231R58624N44623P56793O73101k92313
41702A2843761j318612j361562o81005l38919o44790r62611q21370m36684j88368
41693F089840j65661k07180j1574O27705J376386J488892P92246R1027L1714P4993
41683A0188388n99670j605769j819513j139875o09431p00434o80979o6109M38517
$$ plain form
41721 3966608 4104378 4500163 4767034 4678950 4497276 4614225 5114010 5715155 6012842 5905255
41711 5905255 5909724 6767944 8498702 10202933 11161557 11706180 12462973 13136074 12843761
41702 12843761 11525149 10163587 9482582 9143663 8498873 7536262 6714892 6278208 6089840
41693 6089840 5924179 5716999 5705425 6333130 7709516 9198408 9990654 10081681 10113395 10188388
41683 10188388 9588718 7982949 6163436 5023561 4414130 3713696 3032717 2966608 3405125
$$ [...]
##END NTUPLES=NMR SPECTRUM
##END=
