##TITLE=31Pdec_DE-130rm_3h
, 24 sc
 26.2.2026
##JCAMPDX= 6.0         $$ Bruker NMR JCAMP-DX V2.0
##DATA TYPE= NMR SPECTRUM
##DATA CLASS= NTUPLES
##ORIGIN= UXNMR, Bruker Analytische Messtechnik GmbH
##OWNER= root
$$ XWIN-NMR		Version 3.5
$$ Thu Feb 26 14:49:55 2026 Russian Standard Time (UT+4h)  she@DPX200
##.OBSERVE FREQUENCY= 81.013821
##.OBSERVE NUCLEUS= ^31P
##.ACQUISITION MODE= SIMULTANEOUS
##.ACQUISITION SCHEME= undefined
##.AVERAGES= 24
##.DIGITISER RES= 17
##SPECTROMETER/DATA SYSTEM= spect
##.PULSE SEQUENCE= zgpg30
##.SOLVENT NAME= D2O
##.SHIFT REFERENCE= (INTERNAL, D2O, 0, 197.392)
##AUDIT TRAIL= $$ (NUMBER, WHEN, WHO, WHERE, WHAT)
$$ ##TITLE= Audit trail, XWIN-NMR		Version 3.5
$$ ##JCAMPDX= 5.01
$$ ##ORIGIN= Bruker BioSpin GmbH
$$ ##OWNER= she
$$ F:/spectra/data/she/nmr/P31/2/pdata/1/auditp.txt
$$ ##AUDIT TRAIL=  $$ (NUMBER, WHEN, WHO, WHERE, WHAT)
(   1,<2026-02-26 14:48:50.98 +0400>,<she>,<DPX200>,
      <created by zg, POWCHK disabled, PULCHK disabled
       configuration hash MD5:
       00 E9 B6 7A A2 85 ED C7 34 08 36 98 17 FE 4E 26
       data hash MD5: 32K
       31 47 8E 5E C3 59 CC 72 00 0F 6E 81 B3 CD 79 0F>)
(   2,<2026-02-26 14:49:00.32 +0400>,<she>,<DPX200>,
      <Start of raw data processing
       efp BC_mod = 2 LB = 1.5 FT_mod = 6 PKNL = 1 PHC0 = 1373.727 PHC1 = 97.10066 SI = 64K 
       data hash MD5: 64K
       20 C4 85 21 C5 90 B6 67 E6 3A 44 1E 7F 6E 50 13>)
(   3,<2026-02-26 14:49:22.51 +0400>,<she>,<DPX200>,
      <pk PHC0 = 17.21474 PHC1 = -24.8 
       data hash MD5: 64K
       A7 02 3E C6 BA 9E AA DF 50 CA 0F 6A 76 61 46 2C>)
(   4,<2026-02-26 14:49:29.06 +0400>,<she>,<DPX200>,
      <abs ABSG = 5 
       data hash MD5: 64K
       11 21 D4 9B 57 7C 73 64 CE 3A 25 6C 3F 58 58 13>)
$$ ##END=
$$ 
$$ hash MD5
$$ 8C B0 D0 8C 7A FF 1F 9B A8 45 51 42 51 4D 13 EA
##$RELAX= 
##$RELAX= 
##$RELAX= 
##$RELAX= 
##$RELAX= 
##$RELAX= 
##$RELAX= 
##$RELAX= 
$$ Bruker specific parameters
$$ --------------------------
##$DU= <F:/spectra>
##$EXPNO= 2
##$NAME= <P31>
##$PROCNO= 1
##$TYPE= <nmr>
##$USER= <she>
##$AMP= (0..31)
100 100 100 100 100 100 100 100 100 100 100 100 100 100 100 100 100 100 
100 100 100 100 100 100 100 100 100 100 100 100 100 100 
##$AQSEQ= 0
##$AQ_mod= 1
##$AUNM= <au_zg>
##$AUTOPOS= <>
##$BF1= 81.014009
##$BF2= 200.13
##$BF3= 200.13
##$BF4= 200.13
##$BF5= 200.13
##$BF6= 200.13
##$BF7= 200.13
##$BF8= 200.13
##$BYTORDA= 1
##$CFDGTYP= 0
##$CFRGTYP= 5
##$CHEMSTR= <none>
##$CNST= (0..31)
1 1 145 1 1 1 1 1 1 1 1 1 1 1 1 1 1 1 1 1 1 1 1 1 1 1 1 1 1 1 1 1 
##$CPDPRG= <waltz16>
##$CPDPRG1= <>
##$CPDPRG2= <waltz16>
##$CPDPRG3= <>
##$CPDPRG4= <mlev>
##$CPDPRG5= <mlev>
##$CPDPRG6= <mlev>
##$CPDPRG7= <mlev>
##$CPDPRG8= <mlev>
##$CPDPRGB= <>
##$CPDPRGT= <>
##$D= (0..31)
0 1 0 0 0 0 0 0 0 0.06 0 0.03 2e-05 3e-06 0 0 0.0002 0 0 0 0 0 0 0 0 0 
0 0 0 0 0 0 
##$DATE= 1772102930
##$DBL= (0..7)
120 120 120 11 120 120 24 19 
##$DBP= (0..7)
150 150 150 150 150 150 150 150 
##$DBP07= 0
##$DBPNAM0= <>
##$DBPNAM1= <>
##$DBPNAM2= <>
$$ [...]
##$SUBNAM3= <"">
##$SUBNAM4= <"">
##$SUBNAM5= <"">
##$SUBNAM6= <"">
##$SUBNAM7= <"">
##$SUBNAM8= <"">
##$SUBNAM9= <"">
##$SW= 400.765351723535
##$SWIBOX= (0..15)
0 1 3 0 0 0 0 0 0 0 0 0 0 0 0 0 
##$SW_h= 32467.5324675325
##$TD= 32768
##$TD0= 1
##$TE= 0
##$TE2= 300
##$TE3= 300
##$TEG= 300
##$TL= (0..7)
0 120 53 12 22 120 120 120 
##$TP= (0..7)
150 150 150 150 150 150 150 150 
##$TP07= 0
##$TPNAME0= <>
##$TPNAME1= <>
##$TPNAME2= <>
##$TPNAME3= <>
##$TPNAME4= <>
##$TPNAME5= <>
##$TPNAME6= <>
##$TPNAME7= <>
##$TPOAL= (0..7)
0.5 0.5 0.5 0.5 0.5 0.5 0.5 0.5 
##$TPOFFS= (0..7)
0 0 0 0 0 0 0 0 
##$TUNHIN= 0
##$TUNHOUT= 0
##$TUNXOUT= 0
##$USERA1= <user>
##$USERA2= <user>
##$USERA3= <user>
##$USERA4= <user>
##$USERA5= <user>
##$V9= 5
##$VALIST= <valist>
##$VCLIST= <CCCCCCCCCCCCCCC>
##$VD= 0
##$VDLIST= <DDDDDDDDDDDDDDD>
##$VPLIST= <PPPPPPPPPPPPPPP>
##$VTLIST= <TTTTTTTTTTTTTTT>
##$WBST= 1024
##$WBSW= 4
##$XGAIN= (0..3)
0 0 0 0 
##$XL= 0
##$YL= 0
##$YMAX_a= 19288
##$YMIN_a= -21962
##$ZGOPTNS= <>
##$ZL1= 120
##$ZL2= 120
##$ZL3= 120
##$ZL4= 120
##$ABSF1= 197.3918
##$ABSF2= -203.3724
##$ABSG= 5
##$ABSL= 3
##$ALPHA= 0
##$AQORDER= 0
##$ASSFAC= 0
##$ASSFACI= 0
##$ASSFACX= 0
##$ASSWID= 0
##$AUNMP= <proc_1d>
##$AZFE= 0.1
##$AZFW= 0.5
##$BCFW= 0
##$BC_mod= 2
##$BYTORDP= 0
##$COROFFS= 0
##$CY= -3
##$DATMOD= 1
##$DC= 0
##$DFILT= <>
##$DTYPP= 0
##$F1P= 0
##$F2P= 0
##$FCOR= 1
##$FTSIZE= 65536
##$FT_mod= 6
##$GAMMA= 0
##$GB= 0
##$INTBC= 1
##$INTSCL= 9.790993e-09
##$ISEN= 30
##$LB= 1.5
##$LEV0= 0
##$LPBIN= 0
##$MAXI= 10000
##$MC2= 0
##$MEAN= 0
##$ME_mod= 0
##$MI= 50
##$NCOEF= 0
##$NC_proc= -9
##$NLEV= 6
##$NOISF1= 182.463
##$NOISF2= 159.3651
##$NSP= 0
##$NTH_PI= 0
##$NZP= 0
##$OFFSET= 197.3918
##$PC= 4
##$PHC0= 1390.942
##$PHC1= 72.30066
##$PH_mod= 1
##$PKNL= yes
##$PPARMOD= 0
##$PSCAL= 0
##$PSIGN= 0
##$REVERSE= no
##$SF= 81.014063255964
##$SI= 65536
##$SIGF1= 159.3651
##$SIGF2= -187.1042
##$SINO= 113.3802
##$SIOLD= 16384
##$SREGLST= <1H.CDCl3>
##$SSB= 0
##$STSI= 65536
##$STSR= 0
##$SW_p= 32467.5324675325
##$SYMM= 0
##$S_DEV= 0
##$TDeff= 32768
##$TDoff= 0
##$TI= <>
##$TILT= no
##$TM1= 0
##$TM2= 0
##$TOPLEV= 0
##$USERP1= <user>
##$USERP2= <user>
##$USERP3= <user>
##$USERP4= <user>
##$USERP5= <user>
##$WDW= 1
##$XDIM= 65536
##$YMAX_p= 321756474
##$YMIN_p= -174290999
$$ End of Bruker specific parameters
$$ ---------------------------------
##NTUPLES= NMR SPECTRUM
##VAR_NAME=  FREQUENCY,     SPECTRUM/REAL,   SPECTRUM/IMAG
##SYMBOL=    X,             R,               I
##VAR_TYPE=  INDEPENDENT,   DEPENDENT,       DEPENDENT
##VAR_FORM=  AFFN,          ASDF,            ASDF
##VAR_DIM=   65536,         65536,           65536
##UNITS=     HZ,            ARBITRARY UNITS, ARBITRARY UNITS
##FACTOR=    0.49542278885378, 1,            1
##FIRST=     15991.5117654749, 0,            0
##LAST=      -16476.0207020576, 0,           0
##MIN=       -16476.0207020576, -174290999,  0
##MAX=       15991.5117654749, 321756474,    0
$$ Real data points
##PAGE= N=1
##DATA TABLE= (X++(R..R)), XYDATA
$$ [...]
46074F857984l786712r30291L087824L370007j773578p265597o556114j51221
46066g147698M761034L765764K67239o89667M47737J91784j493303j667555L4627
46057a530038Q51804j73461o54135J006256L156305L658405K476514L72071k531774
46048F631947n348266n621312j964035L423231O491282N324974J570847j693119
46040H815549k855862k784828l290702m635266n114273l599626j478203p38512
46032a5681723j009407m26619J097474J819946J307214J060635J564934J317465
46024h950081k54697j357683o05330R65919K046378L013312M096049L809932J377951
46015D141750j137180j473039m26318j65930q24740j314743j968559l272641l296887
$$ plain form
46074 6857984 3071272 2140981 5228805 8598812 6825234 -440363 -6996477 -7147698
46066 -7147698 -2386664 1379100 1646339 956672 1404409 1596193 102890 -1564665 -1530038
46057 -1530038 -678234 -851695 -1505830 -499574 2656731 6315136 8791650 9163721 6631947
46048 6631947 1283681 -4337631 -6301666 -2878435 3612847 8937821 10508668 8815549
46040 8815549 5959687 3174859 -115843 -4751109 -9865382 -13465008 -14943211 -15681723
46032 -15681723 -16691130 -17117749 -16020275 -14200329 -12893115 -11832480 -10267546 -8950081
46024 -8950081 -9204778 -10562461 -11167791 -10201872 -8155494 -5142182 -1046133 2763799 4141750
46015 4141750 3004570 1531531 1105213 939283 114543 -1200200 -3168759 -6441400 -9738287
46006i738287j92378L347810K434748k649656n656612k632914K677214M231312
45998h178763J632863m85826P34781L504472M704455L263100J55547k742827l491435
45989i03633j566543J062726J761433M50004m02552O32283J966124J518123j66955
45980D351010q17469K24372J172845L64943j644113k996541k618956q79687J025112
45971a818484J675768K04481k505091l893411k256375R47894K658529K139989
45963b846700J705704K881390L662302J329161k998498m878230j944208K834618
45955b54461M310733R74051l294770l508595P23697M502289L242357j690846m525456
45946D78999k254123J958792L559371K371427J304503J249849O43060o88634r53269
$$ plain form
46006 -9738287 -9930665 -6582855 -4148107 -6797763 -12454375 -15087289 -12410075 -8178763
45998 -8178763 -6545900 -7031726 -6296945 -2792473 1911982 5175082 5330629 2587802 -903633
45989 -903633 -2470176 -1407450 353983 803987 401435 1033718 2999842 4517965 4351010
45980 4351010 3533541 3757913 4930758 5295701 3651588 655047 -1963909 -2843596 -1818484
45971 -1818484 -142716 61765 -2443326 -6336737 -8593112 -7645218 -4986689 -2846700
45963 -2846700 -1140996 1740394 5402696 6731857 3733359 -1144871 -3089079 -254461
45955 -254461 4056272 5030323 1735553 -1773042 -1049345 3452944 6695301 5004455 478999
45946 478999 -1775124 183668 3743039 6114466 7418969 8668818 9311878 8623244 7669975
45937G669975Q1919N13661N6298Q09715K844745K762534q26467l830287k287966
45928G794127J218369J180782k491109m723757l323091j439148j240343n36645
45920c560815J972114L031215K85823k404091r4047N045433O158543J706698k476816
45911I664057k075097p6274j116261m124021m432152r40270K762486L654949K344215
45902E661632Q46686M3910j9642P51648K191255L540666L727738J684271k713135
45893A5715029p175109q048019m695323j284746j496252k856066j84734N951574
45885d073646R079549N962745R35405j087644j098614j935671k121230J008930
45877F669824M842452M181969n26914l360846j627575P60229j74245l105102m482067
$$ plain form
45937 7669975 7751894 8265555 8321853 9131568 11976313 14738847 13912380 10082093 7794127
45928 7794127 9012496 10193278 7702169 2978412 -344679 -1783827 -3024170 -3560815
45920 -3560815 -1588701 1442514 1728337 -675754 -769801 4275632 10434175 12140873 9664057
45911 9664057 7588960 7512686 6396425 2272404 -2159748 -3100018 -337532 3317417 5661632
45902 5661632 6508318 6552228 6532586 7284234 9475489 13016155 16743893 18428164 15715029
45893 15715029 8539920 491901 -4203422 -5488168 -6984420 -9840486 -10025220 -4073646
45885 -4073646 5005903 10968648 11904053 10816409 9717795 7782124 5660894 6669824
45877 6669824 11512276 15694245 15167331 11806485 10178910 10939139 10764894 7659792 3177725
45868C177725l312241q13194J717396K774292J055731k202485l704852k326246
45860c633874k58020J152924L120324N209643L787003j904488o068625l556159
45852b151272K100984L385902k50900k331084J60844K879848K237838J128312
45844G160472L037506N385513L605944j153343l605996k263062q12152j646663
45836I708219k796778k562535k835819n025537n947169j808711N147111Q247938
45828B126719M863403m80626k623195j913743j642797k405259k417404j478244
45820e971146p37762M09917L079593N018227K647115k496191m352400j080333
45812c482980J833081J48296k358183k61691M393609N290531J759079r69170n96938
$$ plain form
45868 3177725 -134516 -947710 769686 3543978 4599709 2397224 -1307628 -3633874
45860 -3633874 -3891894 -2738970 381354 5590997 9378000 7473512 1404887 -2151272
45852 -2151272 -50288 3335614 3084714 753630 914474 3794322 6032160 7160472
45844 7160472 10197978 15583491 19189435 18036092 14430096 12167034 11354882 9708219
45836 9708219 6911441 4348906 1513087 -3512450 -9459619 -11268330 -6121219 2126719
45828 2126719 6990122 6509496 3886301 1972558 329761 -2075498 -4492902 -5971146
45820 -5971146 -6708908 -6298991 -3219398 1798829 4445944 1949753 -2402647 -3482980
45812 -3482980 -1649899 -1501603 -3859786 -4121477 272132 5562663 7321742 6352572 5755634
45803E755634l13895j856470k248761L69556K878893K116503l76891j582071j493182
45794C249316j234851R8186L016650M608149K113681j976038k556683R02071L587192
45785A1807673J914204k418889n549741n754728l612846l27550K479735K843240
45777A381098J72848l441040m863883l091203k68077Q06973j1356j79454J773449
45768g720645L534356J841675k362159m242419j395284K737026L636074J710784
45760b260592Q88787K636306M440344L826727J156929j627079k771849j289624
45752D999949J911192L532594J115297l056690m147733j420266O06867r19253
45744B621957k581334O1875N129952O243505R50085o225974r474273p523130k967892
$$ plain form
45803 5755634 5441739 3585269 1336508 1706064 4584957 6701460 6324569 4742498 3249316
45794 3249316 2014465 2112651 5129301 9737450 11851131 9875093 7318410 8220481 11807673
45785 11807673 13721877 11302988 5753247 -1481 -3614327 -3941877 -1462142 1381098
45777 1381098 1553946 -1887094 -6750977 -9842180 -10110257 -9303284 -9314640 -9494094 -7720645
45768 -7720645 -4186289 -2344614 -4706773 -8949192 -10344476 -7607450 -3971376 -2260592
45760 -2260592 -1371805 1264501 5704845 9531572 10688501 9061422 6289573 4999949
45752 4999949 6911141 10443735 11559032 8502342 4354609 2934343 3541210 2621957
45744 2621957 40623 102498 5232450 11475955 12426040 6200066 -3274207 -10797337 -13765229
45735a3765229J566039M803829N929274M509509J422967j183156j402223P39254
45727B620264K915138K374331r63712l725598k723983Q25529K531056N55285k038684
45718B369626j759403O27693J858390J007411L0081L18712J349615K447975L299230
45709A1549330K725643k94406l991283m992630k926729j036138j206822j541440
45701a714475m50984L50128m38919l55560K723506N806837M629715M74162j780738
45692I243672j366550j969267m462370n086082k179397P16380Q16379K89833J474193
45683b523209K268560J13864k950319l376627j549445K876J428033M027803N729577
45674C171113L133158k500096n962847m916898j893700O67539L047361N068589
$$ plain form
45735 -13765229 -12199190 -7395361 -1466087 3043422 4466389 3283233 1881010 2620264
45727 2620264 5535402 7909733 6946021 3220423 496440 1321969 3853025 4408310 2369626
45718 2369626 610223 1237916 3096306 4103717 4133798 4452510 5802125 8250100 11549330
45709 11549330 14274973 13980567 9989284 4996654 2069925 1033787 -173035 -1714475
45701 -1714475 -2165459 -1815331 -2254250 -2609810 113696 5920533 10550248 11024410 9243672
45692 9243672 7877122 5907855 1445485 -3640597 -5819994 -5103614 -4287235 -3997402 -2523209
45683 -2523209 -254649 -140785 -3091104 -6467731 -8017176 -8014300 -6586267 -2558464 3171113
45674 3171113 6304271 3804175 -2158672 -7075570 -8969270 -8301731 -5254370 -185781
45666a85781M664000J694143k23478J608430M677313M326387q3975m445790n027275
45657G003974k534100n84687j011459j736829K3043L172623L505326k41953l699031
45648C896907k478096J609748L168340P07944k259368l102502k935919l068499
45640d461445k485644l60970J920546K845866K635374J967779J050841N97572
45632C709919J173982J121577j680990n273989m689976Q56242N754537N307324
45624F278626J597463p52262j102413j502127j967513j279607l27553m96786m55679
45615g851J336787K573092J56737l771813l877660M05036L788332K687704n62801
45606B727563k235124j855251n84097J473543M034437N258551L785595N66195
$$ plain form
45666 -185781 4478219 6172362 5948884 7557314 12234627 16561014 16477039 12031249 7003974
45657 7003974 4469874 3885187 2873728 1136899 1159942 4332565 7837891 7595938 3896907
45648 3896907 1418811 3028559 6196899 6904843 4645475 1542973 -1392946 -4461445
45640 -4461445 -6947089 -7308059 -5387513 -2541647 93727 2061506 3112347 3709919
45632 3709919 4883901 6005478 4324488 -949501 -5639477 -4783235 971302 6278626
45624 6278626 7876089 7123827 6021414 4519287 2551774 1272167 944614 447828 -7851
45615 -7851 1328936 3902028 4058765 286952 -3590708 -3185672 602660 3290364 2727563
45606 2727563 492439 -1362812 -1946909 -473366 3561071 8819622 12605217 13171412
45598A3171412k535166m250699l503693p3438L437326L269939l06522k369468
45590F839691O4056L602101L326731k55342k413229r40401J647301K154783N6950
45581A4082641l093196n108907l954728N75682N521213O958508M054121m56710
45573A8578624l832511n565977n874154m235570p69393K408048K949422J016887
45565D675376r52661j163788k38298J13330n14115q45842M0698J062740M41707
45556B619147j404671j631760J397191N187809N479709J458203l059842m250875
45548E794911k641130j606154k533847l421949k407902p39199q02078k193819
45540a0551167j832967J677194N605040O305792L736777R85453j57302q95908
$$ plain form
45598 13171412 10636246 6385547 2881854 2808416 6245742 9515681 9209159 6839691
45590 6839691 6903747 10505848 13832579 13577237 11164008 10223607 11870908 14025691 14082641
45581 14082641 10989445 5880538 1925810 2501492 8022705 14981213 19035334 18578624
45573 18578624 14746113 9180136 3305982 -929588 -1698981 709067 3658489 4675376
45565 4675376 3722715 2558927 2320629 2433959 1919844 1074002 1114700 2177440 2619147
45556 2619147 1214476 -417284 979907 6167716 11647425 13105628 10045786 5794911
45548 5794911 3153781 1547627 -986220 -4408169 -6816071 -7555270 -8357348 -10551167
45540 -10551167 -12384134 -10706940 -5101900 1203892 4940669 5926122 5768820 4872912
45532D872912k332701l060449j453472J268692K454058J727459J034883J217735
45524E729117R92314j63160n82292P32638J880867P91034j221664j197497Q12528
45515G773885J695313J19153j465217q45361N49075L31270p59264k03513J973113
45506I168454L196290K379263J055466J85881j241053l412613m180656k030801
45498E120231J442422L677678L930276K359798j314855n780292o936162k335976
45490A63120M205586O186275K422902k085535l461817l126473l485115l449085
45482b630142r59766K763413M643774L958788K441428J159103k07944j476220
45474I692434j582783j70951J806833K912232J926585j248045m438350m533542
$$ plain form
45532 4872912 2540211 -520238 -1973710 -705018 1749040 3476499 4511382 5729117
45524 5729117 6721431 6558271 5975979 6708617 8589484 9380518 8158854 6961357 7773885
45515 7773885 9469198 9588351 8123134 7277773 7826848 8158118 7398854 7195341 9168454
45506 9168454 12364744 14744007 15799473 15985354 14744301 11331688 7151032 5120231
45498 5120231 6562653 10240331 14170607 16530405 15215550 9435258 2499096 163120
45490 163120 4368706 10554981 12977883 10892348 7430531 4304058 818943 -2630142
45482 -2630142 -3589908 -826495 3817279 7776067 10217495 11376598 11168654 9692434
45474 9692434 8109651 7938700 9745533 12657765 14584350 13336305 8897955 4364413
45466D364413j516175O16928q84452l253654k274122J033052J989845j11617q99755
45457i35537J681876L806250K035247j001766p89180K111965L273610R09386k551750
45448H540101m407509l816504q04885L413888N628352L661245K1557j022568K08242
45439A1421919l43687l006316l110370Q71191L471379N22607l375498j421347
45431E029878M385914N665775K36362m742864l552570M63039J198508j214785
45423G469257k076925J83853K424708J685306j749945n511519o786901l698657
45415h060823K407062O797569N930570J598361j647217k159044j625041r17580
45407B323857Q45043L042338L056808L26357j870462l92640L683911O313303M767337
$$ plain form
45466 4364413 2848238 3465166 2580714 -672940 -2947062 -1914010 75835 -35782 -935537
45457 -935537 746339 4552589 6587836 5586070 4796890 6908855 10182465 11091851 8540101
45448 8540101 4132592 316088 -488797 2925091 8553443 12214688 12236245 11213677 11421919
45439 11421919 11078232 8071916 4961546 5832737 9304116 9826723 6451225 5029878
45431 5029878 9415792 15081567 15317929 10575065 7022495 7485534 8684042 7469257
45423 7469257 5392332 5576185 8000893 9686199 7936254 2424735 -4362166 -8060823
45415 -8060823 -5653761 1143808 7074378 8672739 7025522 4866478 3241437 2323857
45407 2323857 3168900 6211238 9268046 9594403 7723941 7331301 11015212 17328515 22095852
45398B2095852M5018m035728m142881r94160R99623o14802k297032P23225O558598
45389A8337713Q147041L190267k422754l191623j145794j016680k615138k795189
45381A6487843j942409k999154n536137o101303l943951j476260Q15091M786501
45373I0221R284357R594754M300409j633104l302616j930385j590657k899309
45365A1913670l474317k606162j673588q51834J009475L247484L308874O29810
45357A1503412j891606j669432P1583L56136r34983q08177K008562M070036J231855
45348A3937386m959883p756711l294832M071273O772416K963080k200773l486535
45340F045421q43998K290992L088019J048645j973640k767871R7468L736377L961678
$$ plain form
45398 22095852 22140870 18105142 13962261 12968101 13967724 13352922 11055890 11779115 18337713
45389 18337713 26484754 29675021 27252267 24060644 22914850 21898170 19283032 16487843
45381 16487843 14545434 11546280 6010143 -91160 -4035111 -5511371 -4696280 90221
45373 90221 9374578 18969332 23269741 21636637 18334021 16403636 14812979 11913670
45365 11913670 8439353 5833191 4159603 3307769 4317244 7564728 10873602 11503412
45357 11503412 9611806 7942374 8013957 8370093 7435110 6626933 8635495 12705531 13937386
45348 13937386 8977503 1220792 -2074040 1997233 8769649 11732729 9531956 6045421
45340 6045421 5201423 7492415 10580434 11629079 9655439 6887568 6985036 10721413 14683091
45331A4683091J070435n39139Q84427K072799P18749n89440N43918J470011q06795
45322A9508056l388026j522900L097665M294552J153161n30128K403537N709668
45314C0725585M840307J653123M09005J045660P45342m10426J26171K455619L761025
45305D5351411K564908L11068j351450k155572j862183J82061L439851N994694
45297E2474788O692656O174753N407102M502152L435322K752766K958732L821315
45289H8219586M454529L650052O64640l308012n111092k758913J564929L443369
45281I0819088J313254k204384m319251n168151n944703o239948n200532l805191
45273E9250182l669260m285884l652718j453504M13481O82574K63902L87440P56886
$$ plain form
45331 14683091 15753526 15214387 16098814 18171613 18890362 18300922 18844840 20314851 19508056
45322 19508056 16120030 14597130 17694795 21989347 23142508 22612380 25015917 30725585
45314 30725585 35565892 37219015 37628020 38673680 39419022 39008596 39134767 41590386 45351411
45305 45351411 47916319 48227387 46875937 44720365 42858182 43040243 46480094 52474788
45297 52474788 59167444 65342197 70749299 75251451 78686773 81439539 84398271 88219586
45289 88219586 92674115 96324167 96988807 93680795 88569703 85810790 87375719 90819088
45281 90819088 92132342 89927958 85608707 80440556 74495853 68255905 63055373 59250182
45273 59250182 55580922 51295038 47642320 46188816 46602297 47284871 47548773 47936213 48693099
45264D8693099M09222o86562j751422k159662j615732j07215J589097J917159
45256D6287984j75085m091016p920619r582365p857861l400127J043951K681257
45248A6986119J565101K96844K94427K0994j920656l833380l235306p76259Q60444
45239A0258328J213428K088217L434240K705507n93177l010807j858684P70612
45231A5007664J254147k43641o91459P03843J469306j62713k890965m348186l502717
45222F595279p85885K368000L821583K338151o47844k336970j931770j174302
45214H246242j303978j306382J45911K601366M472559M515191K217315j756769
45206A7831455m989078m932797j960181Q08477J414133Q50442J36134j739824
$$ plain form
45264 48693099 49102321 48415759 46664337 44504675 42888943 42781728 44370825 46287984
45256 46287984 46112899 42021883 34101264 24518899 16661038 13260911 14304862 16986119
45248 16986119 18551220 18848064 19142491 19163485 17242829 13409449 10174143 9397884 10258328
45239 10258328 11471756 13559973 16994213 19699720 19106543 16095736 14237052 15007664
45231 15007664 16261811 16018170 15326711 16030554 17499860 17337147 14446182 10097996 6595279
45222 6595279 5809394 8177394 11998977 14337128 13689284 11352314 9420544 8246242
45214 8246242 6942264 5635882 5781793 8383159 12855718 17370909 19588224 17831455
45206 17831455 12842377 7909580 5949399 6757876 8172009 9022451 9158585 7418761
45198G418761n032147o854774m505507K81548L354213L444085K535722J790160
45190B432061N16032r58617r87702J62354J27237j373338j427950J210854L230296
45181B931227J396672k191524k711673O92114L910479L217324r54572n449521
45173H40526p177930m441349J861586P503577P699276K189372l719719m541194
45165B14145j88035M782539O351201M028432l44776m508879o246125m101793P45876
45156G32585M248233K974076j879437n217748l455415J637317N246043M893064
45148I178718K295218K12863q82400k256859m108511m667213k341866J794657
45140g75393M321112K795864j285842l749052k417440N79705K174451K520534
$$ plain form
45198 7418761 2386614 -4468160 -8973667 -8692119 -5337906 -1893821 641901 2432061
45190 2432061 2948093 1989476 1001774 1164128 1291365 -81973 -1509923 -299069 2931227
45181 2931227 4327899 2136375 -575298 116816 4027295 7244619 6290047 840526
45173 840526 -6337404 -10778753 -8917167 -1413590 6285686 8475058 4755339 214145
45165 214145 26110 4808649 11159850 15188282 14843506 10334627 4088502 -13291 732585
45156 732585 4980818 7954894 6075457 857709 -2597706 -960389 4285654 9178718
45148 9178718 11473936 11686799 10804399 8547540 4439029 -228184 -2570050 -775393
45140 -775393 3545719 6341583 5055741 1306689 -1110751 -531046 1643405 4163939
45132D163939L517656M262329J634514l946413p070944l845199K831018P011134
45124H558034O521237L341701n43132l992984m921666j986311K141896L100769
45116A2219544O91121j217240q93349p45848k154320k690002o70938J324335M20778
45107F284081k047045l091359k704831k679916k715973j148566J547212L047390
45099c509007K375951N89711p74671j82741L052465O191743M063641l807701r690767
45090a691376o262215K854489P000483K614928k854833k409895J494962K651333
45082C397876O16373j92664K075855M838379N430372L784980J259144p41516j379758
45073A9089041j223889j710352k838771l019092k171937k475217m292836m196691
$$ plain form
45132 4163939 7681595 11943924 13578438 9632025 2561081 -1284118 1546900 8558034
45124 8558034 15079271 18420972 17877840 13884856 8963190 6976879 9118775 12219544
45116 12219544 12910665 11693425 10800076 10054228 7899908 5209906 4538968 5863303 6284081
45107 6284081 4237036 1145677 -1559154 -4239070 -6955043 -8103609 -6556397 -3509007
45099 -3509007 -1133056 -543345 -1318016 -1500757 1551708 7743451 11807092 7999391 -1691376
45090 -1691376 -7953591 -5099102 1901381 4516309 1661476 -748419 746543 3397876
45082 3397876 4014249 3821585 5897440 10735819 16166191 19951171 21210315 20468799 19089041
45073 19089041 17865152 16154800 13316029 10296937 8125000 5649783 1356947 -2839744
45065b839744J44989N461724O707726L805292J002956N67833Q45148K42018n14336
45056A5423606n87180n32485p56669o10035L03794J380503J724162N63591k224220
45047A4685067m688413l606582R63269L841888Q81684m548537n538535j254069
45039G35772K425644J968723L44809O84241J301479o560j342740k45660J665450
45030G531158J674809R30895K226251M739707N186807L027450N94095j183442
45022B4727730l305204n234740m694564j454397J712480K578216J654398N12235
45014A6496154J59045J283524L760827N542418M290190O04947k402975l088070
45006B6646060k690176k508592k135121j256742q02966j099019r56971N80o4331
$$ plain form
45065 -2839744 -2694755 2766969 9474695 13279987 14282943 14850776 15695924 15937942 15423606
45056 15423606 14836426 14303941 13547272 12937237 13241031 14621534 16345696 16909287 14685067
45047 14685067 9996654 6390072 7353341 11195229 12076913 7528376 1989841 735772
45039 735772 3161416 5130139 5474948 6159189 7460668 7454108 6111368 5865708 7531158
45030 7531158 9205967 10136862 12363113 17102820 22289627 25317077 25911172 24727730
45022 24727730 21422526 16187786 11493222 10038825 11751305 14329521 15983919 16496154
45014 16496154 16655199 17938723 21699550 27241968 31532158 32137105 29734130 26646060
45006 26646060 23955884 21447292 19312171 18055429 17252463 16153444 15196473 15197053 15132722
44997A5132722k600120n905948o660942l698940P84193L443849K790579N09494
44989C794887k67274J239515K144164O9160k441827r57512L528502M707317L4306
44980A1851238m707780l364824J606713K920899q22368l745138j854129J762074
44972C646685K507881P47654n8779J075087J981999R90800j148542k630736k424006
44963D688043r61238K23913l1922j075099j216840r0935R65482J093964R36224
44954D531592J019352Q41719K95529J98969M76127k44158j974648k417216l94924
44945B332342J805622J726270M81442N25746J327598N31084j646528k751836k343808
44936A987932k230900k498744j201184J355936J971999m15287k675033k291444
$$ plain form
44997 15132722 12532602 6626654 -34288 -3733228 -2949035 494814 3285393 3794887
44989 3794887 3527613 4767128 6911292 6980452 4538625 3581113 7109615 11816932 11851238
44980 11851238 7143458 3778634 5385347 8306246 7483878 3738740 1884611 3646685
44972 3646685 6154566 6902220 6843441 7918528 9900527 10891327 9742785 7112049 4688043
44963 4688043 3726805 3950718 3918796 2843697 1626857 1535922 2501404 3595368 4531592
44954 4531592 5550944 6392663 6688192 6887161 7363288 7119130 5144482 2727266 2332342
44945 2332342 4137964 5864234 6345676 6871422 8199020 8730104 7083576 4331740 1987932
44936 1987932 -242968 -2741712 -3942896 -2586960 -614961 -1030248 -3705281 -5996725
44928e996725q48948n23102l50728J260906L197145L880318M250112N175866M454937
44919A4499781M08766l682919l459024l93169L04907j920415k298840R98000L670613
44910H127700K384882j02904k5280J448546J224887N4126Q95611L320404L748259
44901B1076231O69748l678345o496971o516441l449356J623425N348341M562270
44893A3138902L74645k541801j586768Q59811J237055l29833p95445R66622K182883
44884A3506071j60498m786469o945760m128379O64921K841589K123081J985025
44876E099581L696684M341358J725598k044170l920257m122189m440730m622290
44868d286415l449328j717513r69522n24535J053642K615314J976385O2879j22803
$$ plain form
44928 -5996725 -6845673 -7368775 -7719503 -6458597 -3261452 618866 4868978 10044844 14499781
44919 14499781 14908547 11225628 7766604 7373435 7678342 5757927 3459087 4457087 8127700
44910 8127700 10512582 10409678 10384398 11832944 13057831 13111957 14007568 17327972 21076231
44901 21076231 21745979 18067634 11570663 5054222 1604866 3228291 8576632 13138902
44893 13138902 13513547 10971746 9384978 10244789 11481844 11152011 10356566 11323188 13506071
44884 13506071 13345573 8559104 1613344 -2515035 -1850114 991475 3114556 5099581
44876 5099581 8796265 13137623 14863221 12819051 8898794 4776605 335875 -4286415
44868 -4286415 -7735743 -9453256 -10422778 -10947313 -9893671 -7278357 -5301972 -5239093 -5361896
44859e361896J608042K431895J300305K68841N96350J171039J602741L117534
44851F734851N015568L947882j063656n829458n725201j244066L183362M203431
44843I222713J802629j610510k867470m91252L283593M671323L165239J719950
44835A8896215J516945J91148l084279m775830k226203J694186K720006J133614
44827A6065802j82602r75991k604347l932960k902607p11427R8733L17231K042250
44818G214082L482739J514191j475723o0191M461609M153520l260576r224532
44810F805119n953627K362480N638065J425504l685666m213206j447714P48038
44802A678993Q87802k69259j373173r86770J335689L911579M465091K776934M48277
$$ plain form
44859 -5361896 -3753854 -1321959 -21654 247187 843537 2014576 3617317 6734851
44851 6734851 11750419 15698301 14634645 8805187 3079986 1835920 5019282 9222713
44843 9222713 11025342 9414832 6547362 6056110 9339703 14011026 17176265 18896215
44835 18896215 20413160 20604308 17520029 12744199 10517996 12212182 14932188 16065802
44827 16065802 15883200 14907209 12302862 8369902 5467295 4755868 4854601 5171832 7214082
44818 7214082 10696821 12211012 10735289 10675098 15136707 19290227 16029651 6805119
44810 6805119 851492 3213972 8852037 10277541 6591875 2378669 930955 1678993
44802 1678993 2566795 2297536 924363 -62407 1273282 5184861 9649952 12426886 12875163
44793A2875163j325829k155788j613168L124R55369K48700m63239N05551J560042
44784A0589925J45669k555461k907353n65041R53369q4968j313139p62060O8017
44775C568958n48691j561107j549857j205109j102765J40270K869044M328955
44767D939698K698792O16370J105242K388701J094746j323078o13902K721609
44759A3628178L633689O23885k082223j835945j316086k492324k516565L60182
44751H002791J844198j855994o247939m007930L560424P447600L415505k876514
44743I282141m694008k417685k66944L41046N35391M86589n5321J65994K026672
44734E403875L735475L157802R45655j116437l101107n419874o126488l386414
$$ plain form
44793 12875163 11549334 9393546 7780378 7783502 8738871 8987571 8524332 9029883 10589925
44784 10589925 10735594 8180133 5272780 4707739 5661108 5576140 4263001 3500941 3568958
44775 3568958 3020267 1459160 -90697 -1295806 -2398571 -2258301 610743 4939698
44767 4939698 7638490 8254860 9360102 11748803 12843549 11520471 10906569 13628178
44759 13628178 17261867 17885752 15803529 13967584 12651498 10159174 7642609 8002791
44751 8002791 9846989 7990995 1743056 -2264874 1295550 8743150 12158655 9282141
44743 9282141 4588133 2170448 1903504 2244550 2779941 3266530 3211209 3377203 5403875
44734 5403875 9139350 12297152 13242807 12126370 9025263 3605389 -2521099 -5907513
44726e907513M08352R70475j534038k293856J283561N929891P076950M294566
44718A0228388N65318j666066j951807r53761J62045L36013k34953l25802L73591
44709F532966P57793L12164M0252M92178N55338m79437j254710n14325L66294
44700F808513p96922l347283m303750k524590j64760O27454N61131J529612L424488
44691A813893M321220L416644K093724J670882J454065M5722k228132l525951
44683I062067k831334p53550J830262M193351M688296J703522l072704m817697
44675A0002213j402387K823686K199326k517880n314044l397611k61043N13662
44667B645922J53775J160444K485463J536753j207514k859767k180117k92491
$$ plain form
44726 -5907513 -5499161 -4528686 -6062724 -8356580 -7073019 -1143128 5933822 10228388
44718 10228388 10793706 9127640 7175833 6222072 6384117 6720130 6485177 6159375 6532966
44709 6532966 7290759 7602923 7643175 8135353 8690691 8211254 6956544 6442219 6808513
44700 6808513 6011591 2664308 -1639442 -4164032 -4328792 -3701338 -3140207 -1610595 1813893
44691 1813893 6135113 9551757 11645481 13316363 14770428 14816150 12588018 9062067
44683 9062067 6230733 5477183 7307445 11500796 16189092 17892614 14819910 10002213
44675 10002213 8599826 11423512 13622838 11104958 5790914 2393303 2132260 2645922
44667 2645922 2799697 3960141 6445604 7982357 6774843 3915076 1734959 1442468
44659A442468J589187K656302J772817j093776l392143k497682P12777L059096
44651D249046L213657K228004O24592k003019m587470m940079l121360j753388
44643f090017k202159k934576k460290j341880k39582J428488L415931L724544
44635f699541J654912l49129n6842J178924P99087p50850r31588P39350K305588
44626b110089K744648K925675L100478K139845o7506j779253j869640j116543
44618C967615j34421J722389L966019L816052j22491m622511n284461k498582
44610H09609p01281j624487j959352Q49400M027470L697692J215879J144564L694382
44601A1153876L719500j530829p413062p346067j193432M694524N058670R24347
$$ plain form
44659 1442468 3031655 5687957 7460774 6366998 2974855 477173 1189950 4249046
44651 4249046 7462703 9690707 10315299 8312280 3724810 -1215269 -4336629 -6090017
44643 -6090017 -8292176 -11226752 -13687042 -15028922 -15268504 -13840016 -10424085 -6699541
44635 -6699541 -5044629 -5393758 -5450600 -4271676 -3472589 -4223439 -5155027 -4415677 -2110089
44626 -2110089 634559 3560234 6660712 8800557 8733051 6953798 5084158 3967615
44618 3967615 3833194 5555583 9521602 13337654 13215163 8592652 3308191 809609
44610 809609 108328 -1516159 -3475511 -2626111 1401359 5099051 6314930 7459494 11153876
44601 11153876 14873376 13342547 5929485 -1416582 -2610014 2084510 7143180 8067527
44593H067527k724971k486609P99498L729974L936773K185112R22117R22278L61781
44584A5713480k254824n397712n984724l032057J276465L933425L766488K092734
44576A0113275J279897K211510L014854J355548j903062l307835j830509o55207
44568A0278471k082754l401087j114757K757674K952904j184090m617108l779838
44560a90585n79866J803901K948811L145197J306672k118938l268869M37646N566116
44551I050085O239820J615400l353277m318212j903841M94558Q21051n04347j893993
44542F247244k061544q77904P03030J672240J694146P21225j229022l296407l735987
44533a62979j763857J032325K129255P66753j360762j913569j77644K104778K289432
$$ plain form
44593 8067527 5342556 2855947 3655445 7385419 11322192 13507304 14429421 15351699 15713480
44584 15713480 13458656 8060944 2076220 -955837 320628 4254053 8020541 10113275
44576 10113275 11393172 13604682 16619536 17975084 16072022 12764187 10933678 10278471
44568 10278471 8195717 4794630 3679873 6437547 9390451 8206361 3589253 -190585
44560 -190585 -770451 1033450 3982261 7127458 8434130 6315192 3046323 3483969 9050085
44551 9050085 15289905 16905305 13552028 9233816 7329975 7824533 8645584 8141237 6247244
44542 6247244 4185700 3307796 4010826 5683066 7377212 8098437 6869415 3573008 -162979
44533 -162979 -1926836 -894511 1234744 2001497 640735 -1272834 -1450478 654300 2943732
44524B943732m7650j923063k75685L742064N738617L561175l25231k436147j933046
44515I044766O7565K234268K782877J74589m074616n654036k621405J807176L591273
44506G352457K587047P74088j301530l219454k690916J012226L817713J732933
44498A0064564k461284k440517K361003N915976M371111N25280j604171j886182
44490A4845780j804683j284355l19570m46982j958261k279433L24361L533217
44482A0610074L852159J123803j822991k693479j324646Q96529J899217N53200
44474A3093866j577132j653765M58157J607664k01272k894904l260320r55757
44466D616537J796512K898401J644000r50053k144573J44363M019702N042774
$$ plain form
44524 2943732 2896082 973019 697334 4439398 10178015 13739190 13413959 10977812 9044766
44515 9044766 9112331 11346599 14129476 14304065 10229449 4575413 1954008 3761184 7352457
44506 7352457 9939504 10713592 9412062 6192608 3501692 4513918 8331631 10064564
44498 10064564 7603280 5162763 7523766 13439742 17810853 18336133 16731962 14845780
44490 14845780 13041097 11756742 11437172 10990190 9031929 6752496 7076857 10610074
44482 10610074 14462233 15586036 13763045 11069566 9744920 10641449 12540666 13093866
44474 13093866 11516734 9862969 10321126 11928790 11727518 8832614 5572294 4616537
44466 4616537 6413049 9311450 10955450 10005397 7860824 8005187 12024889 17067663
44458A7067663K111797q67957p17885P09085K89280j265706j277113J07495N92640
44449A6749299J9218N24670K668479M119610K550570j611161n250073m867776
44441A4902836k3745M982031M871119k78183m923788n330825l635331k870985
44433G693129k014908O68626L047996K375859L31991k2494k852k598900n701230
44424C777217m154563J706489N479719L485017r34061l012989j898339Q58332
44416E306822L825934N226777L776989J338960J125186K310915N77826m691541
44408A8797868q255159o110415o17687L811747O099344O785433M914283L79796
44400B5805210l520375l694350j508838l19806o85118j081819j480671k788982
$$ plain form
44458 17067663 19179460 18311503 17593618 18302703 18591983 17326277 16049164 16156659 16749299
44449 16749299 16768517 17293187 19961666 24081276 26631846 25020685 19770612 14902836
44441 14902836 14879091 19861122 24732241 24454058 19530270 14199445 10564114 7693129
44433 7693129 5678221 6346847 9394843 11770702 12102693 12080199 12077347 9478447 3777217
44424 3777217 -377346 1329143 6808862 10293879 9359818 6346829 4448490 5306822
44416 5306822 9132756 14359533 18136522 19475482 20600668 22911583 23489409 18797868
44408 18797868 10542709 4432294 3814607 7626354 13725698 20511131 25425414 25805210
44400 25805210 22284835 18590485 17081647 16761841 16076723 14994904 13514233 10725251
44392A0725251l946052k817290N14595L790358N390105N253910L870104K123802
44384B4904783J217991J181494N28386j317890k773651k587391j717225j222374
44376A8214123m31944J012121J674033J053928J288001L454824M647553J993588
44368C2906227k445717m321648k932324j005953p7333J81318o11360k614784l173154
44359A5905272L53844N344917O009878J364712l004510k375359J479068L709407
44351B8787229K526855J0695j288656q67375k80631j296117l483980m259944k409745
44342A7438331j21629M77795R47390L537795O266418N332454J731687O31771L799270
44333D0041282P281899P527280N334586K542570n85998k972793k403853N5774
$$ plain form
44392 10725251 6779199 3961909 4476504 8266862 13656967 18910877 22780981 24904783
44384 24904783 26122774 27304268 27832654 26514764 23741113 21153722 19436497 18214123
44376 18214123 17782179 18794300 20468333 21522261 22810262 26265086 30912639 32906227
44368 32906227 30460510 26138862 23206538 22200585 22123252 22304570 21693210 19078426 15905272
44359 15905272 16259116 21604033 27613911 28978623 25974113 23598754 25077822 28787229
44351 28787229 31314084 31324779 30036123 29168748 28888117 27592000 24108020 19848076 17438331
44342 17438331 17316702 17794497 18741887 22279682 28546100 33878554 35610241 36242012 40041282
44333 40041282 47323181 54850461 60185047 62727617 62141619 59168826 56764973 56820747
44325E6820747j50772m025715o263265l141786J190622R92249k199749k659315
44317D0563016M8712J060318j089421k140020L92234K796428Q64574l630212n240458
44308C3625171j900060K802102L973355P21215k975604k603540J580682M502133
44300C9725454K435406k116579l699830j079637J703273J400497m59681q41364
44292C7067539K32048O11324r7258l36416k629j297242m907785p269953m234736
44283A9764892K717999O752582L685687k459252m522862j348130J832996J717509
44275B8141421Q84209J842090J938925j790192n982612m639064J476466M659102
44267B6530345O93203n141700n255000J83175M048902J920945k875540m636121
$$ plain form
44325 56820747 56669975 52644260 46380995 43239209 44429831 45422080 43222331 40563016
44317 40563016 40611728 41672046 40582625 38442605 38834839 41631267 42495841 38865629 33625171
44308 33625171 31725111 34527213 38500568 39221783 36246179 33642639 35223321 39725454
44300 39725454 42160860 40044281 36344451 35264814 36968087 38368584 37908903 37067539
44292 37067539 37299587 37910911 37813653 37477237 37474608 36177366 31269581 23999628 19764892
44283 19764892 22482891 29235473 32921160 30461908 25939046 24590916 26423912 28141421
44275 28141421 29025630 30867720 32806645 31016453 25033841 20394777 21871243 26530345
44267 26530345 27223548 22081848 16826848 17010023 21058925 22979870 20104330 15468209
44259A5468209k663303q57626j346522j895874l98805J220105J82877k133591
44251G575470k056401L29870J245447k73438n24576K420391M914523L535109Q36365
44242A8002760J064157L033862K328138j048271k548858l56141K133665J821558
44234B4430870j77726j217360m16087J628291L434460K351343l042302r321940
44226A7669549j0278676m094081M115653Q151544O741689K798588o07460k168235
44218B2328571k415193l001915m273266l725737M36836M824976M202601n03137
44210A7873736k798996n83523N14866l169467o479103l555180K208769L238108
44202G249210m13262j995745N42026K064611j21026j714329P42647L767410K844472
$$ plain form
44259 15468209 12804906 11947280 10600758 8704884 8306079 9526184 9709061 7575470
44251 7575470 5519069 5848939 7094386 6820948 6296372 8716763 13631286 17166395 18002760
44242 18002760 19066917 22100779 24428917 23380646 20831788 20475647 22609312 24430870
44234 24430870 24253144 23035784 22619697 24247988 27682448 30033791 26991489 17669549
44226 17669549 7390873 3296792 7412445 15563989 22305678 25104266 24496806 22328571
44218 22328571 19913378 16911463 12638197 8912460 9349296 14174272 18376873 17873736
44210 17873736 15074740 14491217 15006083 11836616 5357513 1802333 4011102 7249210
44202 7249210 6835948 4840203 5382229 7446840 7325814 5611485 6354132 10121542 12966014
44193A2966014j63999l83447K141652K880104M7742l074700l245208j096385J042658
44184A1114431K329422K921308K341086K80464j974554k795740k535142k853289
44176H827986l725021l111096m00467J809832J137098q27628o10531J970966L452426
44167H523565J653337j660747l634719l378024j398812J405776L047010J428822
44159E986208k309981l974493j775690R06472N26921j413301j125009J646257
44151a532616L918032M012117K497546L0218k358202k224020J319698M785846
44143A0448619M337259J432617J95734M82122j086193l847182l222334J092329
44135I832971L537219J440029p62609P48917K890761J359896k208664l683646
$$ plain form
44193 12966014 12802015 12418568 14560220 17440324 17488066 14413366 11168158 10071773 11114431
44184 11114431 13443853 16365161 18706247 18986711 17012157 14216417 11681275 8827986
44176 8827986 5102965 1991869 1591402 3401234 4538332 3710704 3100173 5071139 8523565
44167 8523565 10176902 8516155 4881436 1503412 104600 1510376 4557386 5986208
44159 5986208 3676227 -298266 -2073956 -1167484 -640563 -2053864 -3178873 -1532616
44151 -1532616 2385416 6397533 8895079 8925297 6567095 4343075 5662773 10448619
44143 10448619 14785878 16218495 16414229 16896351 15810158 11962976 8740642 9832971
44135 9832971 13370190 14810219 14047610 14796527 17687288 19047184 16838520 13154874
44127A3154874l140997k882177j943214J711914N672378N503084J530613k001679
44119A7604796l567763m882429n590873l298399Q43845K382274N76096k27982
44111C839565K021988L610918J596790j046130m29809K019913K451421P82842
44103A4847498k72862l28107j113178k282787j639448O19558J484537o04600l814000
44094F896611n560790m803528j730951K271477M200164J788205k933159m887358
44086d759329j842194K999074N270177M191795J865596N0167n46546M14787K090684
44077I734211K209527j35030k348092j237802K611363N711554O399529N973245
44069B8918505N200068K917170q97520l668215l713214k822822l118589l404194
$$ plain form
44127 13154874 10013877 7131700 5188486 6900400 12572778 18075862 19606475 17604796
44119 17604796 14037033 9154604 3563731 265332 1109177 3491451 4067547 3839565
44111 3839565 5861553 9472471 11069261 10023131 9593322 11613235 14064656 14847498
44103 14847498 14574636 14246529 13133351 10850564 9211116 9830674 11315211 10710611 6896611
44094 6896611 1335821 -3467707 -5198658 -2927181 1272983 3061188 128029 -4759329
44086 -4759329 -6601523 -3602449 1667728 5859523 7725119 7775286 7228740 7643527 9734211
44077 9734211 11943738 11808708 9460616 8222814 10834177 16545731 22945260 28918505
44069 28918505 34118573 37035743 36138223 32470008 28756794 25933972 22815383 19411189
44061A9411189j474665J457246K067493P8124j424025j021311o99842j523107
44053A6871102j283449J214421K694776k06665m959997n642017j058139L562894
44045A1192926L828928J648894J490971L800956M973460K724167j237119l855009
44037B4568174l927865k193508J30756J962836K433375J326587o99851k642423
44029B0958081l692486l343382j663707L42237J420990J541253J949355L215545
44021B0727886M080243L179292J146613l91518j436553l332800n651506n527794
44013A2793863j479364L601271N190483K319636j656612l220944j971000K51136
44005A5828469J688629J541605R1691j017410J87912L430565N453470L386417
$$ plain form
44061 19411189 17936524 19393770 21461263 21539387 20115362 19094051 18394209 16871102
44053 16871102 15587653 16802074 19496850 19290185 14330188 8688171 7630032 11192926
44045 11192926 15021854 16670748 18161719 21962675 26936135 29660302 28423183 24568174
44037 24568174 20640309 18446801 18577557 20540393 22973768 24300355 23600504 20958081
44029 20958081 17265595 13922213 12258506 12600743 14021733 15562986 17512341 20727886
44021 20727886 24808129 27987421 29134034 28742516 27305963 23973163 18321657 12793863
44013 12793863 11314499 14915770 20106253 22425889 20769277 17548333 15577333 15828469
44005 15828469 17517098 19058703 19150394 18132984 18320896 21751461 27204931 30591348
43997C0591348j409667m400189l133124r0961O81617j150035k011000M15006L712207
43988B3205202L901038R32798j354827q43612p8893k192777n966261p336692m830652
43979E435324j058681R19870N68024p02307j013370J041967M801905O864150M475868
43970B1332750j46842j733853J009535L369979J197599l442606n524198l527808
43962A2534556N0148K667446L253994J357503j999095l648306j648361J420202
43954A3988087J660410m02201q92862R97514J922724L99167l82421K226141N749410
43945B5265969N953927K503502j421943l608889m396628m696433m628644l879652
43937A1091209k140080L31369J921328Q09857j963781k288833K133079P800728
$$ plain form
43997 30591348 29181681 24781492 21648368 21557407 22239024 21088989 19077989 19492995 23205202
43988 23205202 27106240 28039038 26684211 25840599 25761706 23568929 17602668 10265976 5435324
43979 5435324 4376643 5296513 5864537 5162230 4148860 5190827 9992732 16856882 21332750
43970 21332750 21185908 19452055 20461590 23831569 25029168 21586562 16062364 12534556
43962 12534556 12584704 15252150 18506144 19863647 17864552 14216246 12567885 13988087
43954 13988087 15648497 15246296 14353434 15350948 17273672 17672839 17290418 19516559 25265969
43945 25265969 31219896 33723398 32301455 28692566 24295938 19599505 14970861 11091209
43937 11091209 8951129 9282498 11203826 12013683 10049902 7761069 9894148 17694876
43929A7694876Q718848L505187k858646m741415j816492J366111R21390k087590
43921B0702269l201768l23390L158641K508768j710698l919075j143956K822738
43913A8893529L058883M04225p72499L37485O49673p13303r45999Q83836J497240
43904B3293070j055641l445133j968885J526768K528636O53249p68891q08702
43896A9954471j796003l846764l557167m5880K131439o06421m813002m449576
43888B971097O76738N300420O400491N731542M720941K077681j867415l282419
43880B2729076m84279K237259M27142l515069l588244J009216M940266M274011
43872B8029378P49458j877965k017821j50493J978222J441279k942043o971205
$$ plain form
43929 17694876 26413724 29918911 27060265 22318850 20502358 21868469 22789859 20702269
43921 20702269 17500501 17177111 20335752 22844520 21133822 17214747 16070791 18893529
43913 18893529 21952412 22356637 21584138 21921623 22571296 21857993 20911994 21795830 23293070
43904 23293070 22237429 18792296 16823411 18350179 20878815 21532064 20763173 19954471
43896 19954471 18158468 14311704 10754537 10708657 12840096 12233675 7420673 2971097
43888 2971097 3647835 8948255 15348746 21080288 25801229 27878910 26011495 22729076
43880 22729076 22244797 24482056 24909198 21394129 17805885 18815101 23755367 28029378
43872 28029378 28778836 26900871 24883050 24732557 26710779 28152058 25210015 18238810
43864A8238810m587069L301594P975512L851415l676267n351771J0393N440772
43856B5203389N841271L065989J334358K063643L970247M916916K875173k221418
43848D7049568p003156p486251l789183J87572J777068J665003J075337J2158
43840C3488116j103642j103883l25916m43239j284253q75522M98342j8749k543253
43831B6288001k940859O02218L448943J057550l473912l601624P19501L079630
43823B5179448M45824k805402k160129Q07376K231377J938243K015752K218998
43815B9871487Q99012r84207q64866Q27711R61160q97105j082167K478194O189470
43806C7398689N100802m27776n230137n782436l382013r07038P46593J901183
$$ plain form
43864 18238810 13651741 16953335 24928847 28780262 25103995 19752224 19762617 25203389
43856 25203389 31044660 34110649 35445007 37508650 41478897 46395813 49270986 47049568
43848 47049568 40046412 32560161 28770978 28958550 30735618 32400621 33475958 33488116
43840 33488116 32384474 31280591 30954675 30511436 29227183 28351661 28850003 28831254 26288001
43831 26288001 23347142 23949360 27398303 28455853 24981941 21380317 22099818 25179448
43823 25179448 25625272 22819870 20659741 21467117 23698494 25636737 27652489 29871487
43815 29871487 30770499 29786292 28921426 29749137 30710297 29813192 28731025 31209219 37398689
43806 37398689 42499491 42071715 36841578 31059142 27677129 26770091 27516684 29417867
43798B9417867K084063P89448q60860j177953k85044J73922l57039n74989M58932
43789B9668347J657556J380674j29381q59365L37562J951949J385981j631036
43781C3762287m044351k860449Q50902K904229J309337j165883r83930J241895
43773C1014037J933595k53216k915871l513555k148059l76041N67925k24177k826993
43764B1257645m967974l338678J909222N959675M765178J46827k943615k930222
43756A9858058k282684k323254j257748J568857L055743O74627k844968k603277
43748A3845354J466156M239075K618654k74884j37882J971935J506196k281034
43740B2953570m840674k811795J461086L800678L860972M097006M808769L675324
$$ plain form
43798 29417867 31501930 32291378 31430518 30252565 29967521 30141443 29784404 29209415 29668347
43789 29668347 31325903 32706577 32577196 31717831 32055393 34007342 35393323 33762287
43781 33762287 29717936 26857487 27708389 30612618 31921955 30756072 29772142 31014037
43773 31014037 32947632 32694416 29778545 26264990 24116931 23740890 24308815 24084638 21257645
43764 21257645 16289671 12950993 14860215 20819890 25585068 25731895 22788280 19858058
43756 19858058 17575374 15252120 13994372 15563229 18618972 19293599 16448631 13845354
43748 13845354 15311510 19550585 22169239 21894355 21756473 23728408 25234604 22953570
43740 22953570 18112896 15301101 16762187 20562865 24423837 28520843 33329612 37004936
43732C7004936K3944l421803l782104j075363K459656M470387L704391Q95160
43724D0279204j238662n82679J558381K055494M39574n68426N14020J631069M64358
43715D4552333k397891m948497o134714n297579j792726K833729M802958K800685
43707C4418298M56480J173185K749143J107248k257824j648914L855389P803221
43699D7656226M783485k237476n859900l377649R53864J970210n56586k585234
43691D0746940j108205K146272K746758q30608m901735n039075j691099Q13789
43683C2883037M06339l66422J187835L703697L856455J129482j552376j475293
43675C9772754J128818M009385N439690N377579M542840L064538O75583j892094
$$ plain form
43732 37004936 37028880 33607077 29824973 28749610 31209266 35679653 39384044 40279204
43724 40279204 39040542 38457863 40016244 42071738 42511312 41942886 42456906 44087975 44552333
43715 44552333 42154442 37205945 31071231 25773652 23980926 26814655 31617613 34418298
43707 34418298 34874778 36047963 38797106 39904354 37646530 35997616 39853005 47656226
43699 47656226 52439711 50202235 44342335 40964686 41918550 43888760 43332174 40746940
43691 40746940 39638735 41785007 44531765 43701157 38799422 33760347 32069248 32883037
43683 32883037 33289376 32922954 34110789 37814486 41670941 42800423 41248047 39772754
43675 39772754 40901572 44910957 50350647 55728226 60271066 63335604 64011187 62119093
43667F2119093k919092j837955k69640K17472K69226J046436J508249j18082k613804
43658E7401903k454215J218464M935128N389341L449274K178608K471898K438103
43650G7028504M46118k528045l622967j085378L099231M426439J196497k356384
43642G6604015r00324M441516O930427L335091j591447j745576K555997O230659
43634I5860358O161489L054225j230330m448359l540332K396663Q975301J0176739
43626A17405754N628877J002617N25959K402431K967364K160029K305187L534129
43618A37932347L623259J995891J101914K909498N802494O526156M503702K450222
43610A66845483K481337L451950L408194L067623M458351O824090O988508M320504
$$ plain form
43667 62119093 59200001 57362046 57092406 57309878 57579104 58625540 60133789 60015707 57401903
43658 57401903 54947688 56166152 61101280 66490621 69939895 72118503 74590401 77028504
43650 77028504 77474622 74946577 71323610 70238232 73337463 77763902 78960399 76604015
43642 76604015 75703691 80145207 87075634 90410725 88819278 87073702 89629699 95860358
43634 95860358 102021847 105076072 103845742 99397383 95857051 98253714 107229015 117405754
43626 117405754 123034631 124037248 124563207 126965638 129933002 132093031 134398218 137932347
43618 137932347 141555606 143551497 144653411 147562909 153365403 159891559 164395261 166845483
43610 166845483 169326820 172778770 176186964 179254587 183712938 190537028 197525536 201846040
43602B01846040K288072L572156O262109O978670N565801M230661L881001M118020
43594B38742530N415604Q175222J0449523R738652O751754M556299M211293M058140
43586B92099017L192116K584997K511890J928684J056731J634800L592451M224502
43578C12825188K007933j146420k827847l104618l152894l091825k924326l751907
43570B94833284o060278q125999q010828o288572n321648o485496r021524j0770482
43562B34748457r602472n695298k906444n498701j2193186j6104201j2840090
43555A69908065o288947l301641m619308n194332k690217q37694l147368p369642
43547A36458916q865652o944909m818990m481276m578133l320279j160645J10495
$$ plain form
43602 201846040 204134112 207706268 213968377 220947047 226512848 230743509 234624510 238742530
43594 238742530 244158134 252333356 262782879 272521531 279273285 283829584 288040877 292099017
43586 292099017 295291133 297876130 300388020 302316704 303373435 305008235 308600686 312825188
43578 312825188 314833121 313686701 310858854 307754236 304601342 301509517 298585191 294833284
43570 294833284 288773006 280647007 272636179 266347607 261025959 254540463 245518939 234748457
43562 234748457 225145985 219450687 216544243 211045542 198852356 182748155 169908065
43555 169908065 163619118 160317477 155698169 150503837 147813620 146975926 143828558 136458916
43547 136458916 127593264 120648355 115829365 111348089 106769956 103449677 102289032 102399527
43539A02399527n23172k720595n166615n988632m020691n75206J093939o50922
43531H3847633l557270m163465k097597P0103P86367R37396J159244N08771j093828
43522G6397354j759293p40533k30231j784913l250850k163241j90052n78267k631111
43513F3068863k882489j044386k98007j559050k005434k28225J496579J577709
43505E8125560J653878K794979L013042J086394n08081O29975K802976K733663
43497G2332386q6947l814808o671137o974889l614906J261232L115774J065044
43489E6611749l26705J934519M476595L519255J360857J804042K879509M31479
43481G2691300l804566m682172k483624j972933l445497k474366J056319J661790
$$ plain form
43539 102399527 101876355 99155760 93989145 88000513 83979822 83404616 84498555 83847633
43531 83847633 80290363 76126898 74029301 74099404 74885771 75823167 76982411 77491182 76397354
43522 76397354 74638061 73897528 73667297 71882384 68631534 66468293 66278241 65699974 63068863
43513 63068863 60186374 59141988 58843981 57284931 55279497 55051272 56547851 58125560
43505 58125560 59779438 62574417 65587459 66673853 66165772 66795747 69598723 72332386
43497 72332386 72245439 68430631 61759494 54784605 51169699 52430931 55546705 56611749
43489 56611749 56285044 58219563 62696158 66215413 67576270 69380312 72259821 72691300
43481 72691300 68886734 64204562 61720938 59748005 56302508 53828142 54884461 56546251
43473E6546251k116668m326846j014697L587570M193935K089126J255980J727327
43465F1941978J488104J107632J804298J950396j85187k749726l114915j864700
43457F0377880o65089Q98065K931563L095346Q57997L13459L905547O768514L221541
43448H1704823l768567o263339k841610O37858J141240J820160M292906M883965
43440H1607436J396724k277848j953313Q45865K173996J445260N93662L20620
43432H4152402L05506Q59372J692746J196857p18370j471815R8189J153331o89379
43423H6578839k877446j553432K255012M145162K963970J800642K638184L993723
43415I9944654M377390M482839M830796M363833K925260K497115M069444N372417
$$ plain form
43473 56546251 54429583 50102737 49088040 52675610 56869545 58958671 60214651 61941978
43465 61941978 63430082 64537714 66342012 68292408 68107221 65357495 62242580 60377880
43457 60377880 59712791 60610856 63542419 66637765 67495762 67809221 71714768 78483282 81704823
43448 81704823 77936256 71672917 68831307 69469165 70610405 72430565 76723471 81607436
43440 81607436 83004160 80726312 78772999 79618864 81792860 83238120 83831782 84152402
43432 84152402 84457908 85317280 87010026 88206883 87488513 86016698 86114887 87268218 86578839
43423 86578839 83701393 82147961 84402973 88548135 91512105 93312747 95950931 99944654
43415 99944654 104322044 108804883 113635679 117999512 120924772 123421887 127491331 132863748
43407A32863748L916945Q48535n26263P40390K419436K555568J601134P69053
43399A45188546K16911p7299R28956M046052P741820Q910561O190467J648649
43391A74794663j269266q50085K097305N626758P977404Q120569O214963L679714
43383B06392025K081009J753228J922454J986468J951681J756893J161191M86923
43375B19491872N61326J614198L060947M598916O399618P712851O666412K748043
43367B52854183j396903k317249K15975K981985L381419K496852L411368P216210
43359B68843840J1465098J2480755Q956051L416842J6353M56247K314887K194113
43351C10144186K33981r6675K760840N359978L354164k287624n797842l700844
$$ plain form
43407 132863748 136780693 137629228 137102965 137843355 140262791 142818359 144419493 145188546
43399 145188546 145405457 145328158 146257114 150303166 158044986 166955547 173146014 174794663
43391 174794663 173525397 172675312 174772617 180399375 188376779 196497348 202712311 206392025
43383 206392025 208473034 210226262 212148716 214135184 216086865 217843758 219004949 219491872
43375 219491872 220053198 221667396 224728343 229327259 235726877 243439728 250106140 252854183
43367 252854183 251457280 249140031 249356006 252337991 255719410 258216262 261627630 268843840
43359 268843840 280308938 292789693 301745744 305162586 305178939 305635186 307950073 310144186
43351 310144186 310378167 310281492 313042332 318402310 321756474 319468850 313671008 309970164
43343C09970164R53329K681611Q9001l520937m906874m050597k800183k461776
43335B95953738l356577n336255p803216r819984j0734908j0451056r166737p389119
43327B31895886n953318n293803n033923n076702o298981q756476j0144340q376923
43319A76961420n230932m429635n916989n652692k333650k97247k883274o443146
43311A43773855n335617o96374R77920k529051o208290n612571k850965k307837
43303A19211070m008491m709550l535271k906040m348667o306517o547260m785890
43295H2063384k274396j72357Q65012M14143j280677k750004k215788L40792K598077
43286G7588186K286023j01521k117884k701619k957240l344019k537078m25368
$$ plain form
43343 309970164 310923493 313605104 313694105 310173168 305266294 301215697 298415514 295953738
43335 295953738 292597161 287260906 279457690 269637706 258902798 248451742 239285005 231895886
43327 231895886 225942568 220648765 215614842 210538140 204239159 195482683 185338343 176961420
43319 176961420 171730488 167300853 161383864 155731172 153397522 153100275 150217001 143773855
43311 143773855 138438238 137741864 138719784 136190733 129982443 124369872 121518907 119211070
43303 119211070 115202579 110493029 106957758 104051718 99703051 93396534 86849274 82063384
43295 82063384 79788988 79616631 80481643 80895786 79615109 76865105 74649317 74990109 77588186
43286 77588186 79874209 79772688 77654804 74953185 71995945 68651926 66114848 65689480
43278F5689480L45661j653217l284545r36764L453706M612297J655348r21402
43270F8960564m77126K79656j273145l212300k912025j666982j905095k600727
43262E5192820j477295J88875o49584l115881k935910R42935M160578K871762
43254E5178300r54635k258963N46102L773404L098918j282791m922602m437210
43246D8740523j480035j32330j029250o83494K660844N527591L960611l65825
43238E7198635k092479N99207L937542L820634L46351l443285m938479l255946
43230E2172180P17587M322131M706705J861040p46114K03480L920654O150670
43222G3308333L890250j191367m624251m235632k263568j700589k019689p69642
$$ plain form
43278 65689480 66035141 64381924 61097379 60160615 63614321 68226618 69881966 68960564
43270 68960564 68483438 68763094 67489949 64277649 61365624 59698642 57793547 55192820
43262 55192820 53715525 53904400 53254816 50138935 47203025 48145960 52306538 55178300
43254 55178300 54223665 51964702 52510804 56284208 59383126 58100335 53177733 48740523
43246 48740523 47260488 47128158 46098908 45415414 48076258 53603849 57564460 57198635
43238 57198635 55106156 55705363 59642905 63463539 63809890 60366605 55428126 52172180
43230 52172180 52889767 57211898 61918603 63779643 63033529 63237009 67157663 73308333
43222 73308333 77198583 76007216 71382965 67147333 64883765 63183176 61163487 60393845
43214F0393845J408399R20170k806392n177721k579184K339806M543296L339203
43206F2381422J760424J252583J044897J440620L224056M325253J737997k904638
43198G4262614m190177m77538L493822L189781p6373k039716j032158J428190
43190G4558445L243017L148268J436426L68283J771334L724757K555766j301151
43182H9505145l227382j360387P69777N37900K92246J869527K002902j861296
43174H8528432n351409l141040J643756J286377m215733o349120p23472O552490
43166G8230281Q064733M804027K466173K343454R85182l190434p604443r312976
43158G6785997p704572l639644J262813M455409M133693J621916K38190J247616
$$ plain form
43214 60393845 61802244 62722414 59916022 54738301 52159117 54498923 59042219 62381422
43206 62381422 64141846 65394429 66439326 67879946 71104002 75429255 77167252 74262614
43198 74262614 70072437 69594899 73088721 76278502 76202129 74162413 73130255 74558445
43190 74558445 77801462 80949730 82386156 82754439 84525773 88250530 90806296 89505145
43182 89505145 86277763 84917376 85687153 86225053 86517299 88386826 90389728 88528432
43174 88528432 83177023 80035983 81679739 82966116 78750383 72401263 71677791 78230281
43166 78230281 86295014 91099041 93565214 95908668 96893850 93703416 86098973 76785997
43158 76785997 69081425 65441781 66704594 71160003 75293696 76915612 77153802 78401418
43150G8401418K452449J340069j735818m285710m593947l045496j158168r3597
43142F7281200J21915M33780J626776L034093K868316M96697k092435k267370
43134G1502972k04772J034234n17770l098272l797098k508308j330033q05374
43126F0275579N59397K813165L451182J141714j734654k230380q75293m10448
43118F2990262j642123k895557k990929k460746j903282j141911j98684N24087
43110E0281117J115882J737886J513986l66555k476845k181777O57080K926795
43102E3207569K072403q77767k979723k749282r81481P08938J333485J271183
43094E1005325J881841L489370M040121J560692k190308l220886j089076K4410
$$ plain form
43150 78401418 80853867 82193936 80458118 76172408 71578461 68532965 67374797 67281200
43142 67281200 67403115 67836895 69463671 72497764 75366080 75862777 73770342 71502972
43134 71502972 71298200 72332434 71814664 68716392 64919294 62410986 61080953 60275579
43126 60275579 60834976 63648141 67099323 68241037 66506383 64276003 63400710 62990262
43118 62990262 61348139 58452582 55461653 53000907 51097625 49955714 49757030 50281117
43110 50281117 51396999 53134885 54648871 54282316 51805471 49623694 50280774 53207569
43102 53207569 55279972 54402205 51422482 48673200 47691719 48400657 49734142 51005325
43094 51005325 52887166 56376536 60416657 61977349 59787041 56566155 55477079 55501489
43086E5501489k271862m472281k541803J507449K739113J135949J065344L347448
43078E6010846L649496J73806k589160q33538K453668K495314K15584k58428R36114
43069F2253702J18504k852985m046691k161990j84586N93237K541227N751073
43061F2011491N840745J007504l819911m097872k349356k662960k845007J247173
43053E4331807O587878O194474N61035k213762J315025N161524L709963o88435
43045G4959509l313333l948623l866520j674715K473659L334352k434990r125111
43037E6404228q501487j454617L474225K197126r22253j344336j36493K50581
43029D9966974N31144K086252L691096L503155J829320j04223j970795l305077
$$ plain form
43086 55501489 53229627 48757346 46215543 47722992 50462105 51598054 52663398 56010846
43078 56010846 59660342 59834148 57244988 56411450 58865118 61360432 61576016 61317588 62253702
43069 62253702 62372206 59519221 55472530 53310540 53125954 53719191 56260418 62011491
43061 62011491 67852236 68859740 65039829 60941957 58592601 55929641 53084634 54331807
43053 54331807 60919685 67114159 67675194 65461432 66776457 71937981 75647944 74959509
43045 74959509 71646176 67697553 63831033 62156318 64629977 67964329 65529339 56404228
43037 56404228 47902741 46448124 49922349 52119475 51197222 49852886 49716393 49966974
43029 49966974 50498118 52584370 56275466 59778621 61607941 61503718 59532923 56227846
43021E6227846k789779l38997J759443J428363n27042j456934J71566L343779
43013E7818245N321887M066590P74584p76310J130171L402202K323932q53038
43005G3208263j806320K15238J709708R24876K06763J328904K549472K058740
42997H0395644R06434O45426J087182J979782L744607N017998L093270j208014
42989I5662329k962857l608L555622L790122K894451M411874O262046M102568
42981A17712547o89294k406395M90652L868943M781297M392343L467150L81792
42973A31999035m510382p170440n237851j712721o17568j713666k204499j371452
42965A07460456m81260M19953K460700N099994O014204M277465J842194J093297
$$ plain form
43021 56227846 53438067 53099070 54858513 56286876 55759834 54302900 54474466 57818245
43013 57818245 63140132 67206722 67981306 67204996 68335167 71737369 74061301 73208263
43005 73208263 71401943 71617181 73326889 74251765 74458528 75787432 78336904 80395644
42997 80395644 81302078 81947504 83034686 85014468 88759075 93777073 96870343 95662329
42989 95662329 92699472 92695864 96251486 100041608 102936059 107347933 113609979 117712547
42981 117712547 117023253 114616858 115107510 118976453 123757750 128150093 131617243 131999035
42973 131999035 127488653 120318213 115080362 113367641 112750073 111036407 108831908 107460456
42965 107460456 106979196 107399149 109859849 114959843 120974047 125251512 127093706 128187003
42957A28187003J990097K455483J150573r60654k012640j567682o78887K33536
42949A28796829K148172N251132P240488N497914N84377l929108n091262k875308
42941A37623234Q59398M197397N858874N510957L921795K064507Q6867k046642
42933A58076387l421085l101835j845142j131926o57132J109774L687195M446053
42925A57162289K663255J156045K085848L393592K040400q29226j355062R26352
42917A67243493K161744J91965k062056j364629N82926p585k657026l257914q20568
42908A60010350P86088q84897k924757k046197j3940k64514j662582n30115K283619
42899A54753055J869273k730429o347007n432619l176822l894878o405958o940433
$$ plain form
42957 128187003 130177100 132632583 133783156 132822502 130809862 129242180 128563293 128796829
42949 128796829 130945001 136196133 143436621 148934535 149518912 145589804 140498542 137623234
42941 137623234 138482632 142680029 148538903 154049860 157971655 160036162 160123029 158076387
42933 158076387 154655302 151553467 149708325 148576399 147919267 149029041 152716236 157162289
42925 157162289 159825544 160981589 163067437 166461029 168501429 167672203 166317141 167243493
42917 167243493 169405237 169597202 167535146 166170517 166753443 166745858 164088832 160830918 160010350
42908 160010350 160796438 159911541 156986784 154940587 154926647 154662133 152999551 152469436 154753055
42899 154753055 156622328 153891899 147544892 142112273 138935451 135040573 128634615 121694182
42891A21694182n533804m958560n232228l990761j607836j347144m018224o364653
42883H8640972n805983l712996k713781l120392l311012j997260P64731L486959
42875G2231238L852678R67767k797854l989978k354724j031035k044492l730022
42867F1103578l598299j837031m29614l4721N29548K039599L510610L503970K107164
42858F6894804P65906M092j534162m419564n778104k167131M459729P129985K336394
42849F7691949m779659o831828l450187l08390n64160j895889j698420n42902
42841D7620514M80423J898875L663599L791168J036215k976133n554613n566291
42833D4393757l903764k696319l632787n361960l837856K048335O923129N224219
$$ plain form
42891 121694182 116160378 111201818 105969590 101978829 100370993 99023849 95005625 88640972
42883 88640972 82834989 79121993 76408212 73287820 69976808 67979548 68744279 72231238
42875 72231238 76083916 77051683 74253829 70263851 67909127 66878092 64833600 61103578
42867 61103578 57505279 55668248 55238634 55203913 55733461 57773060 61283670 64787640 66894804
42858 66894804 67660710 67664802 66130640 61711076 55932972 53765841 58225570 65355555 67691949
42849 67691949 62912290 56080462 52630275 52321885 51757725 49861836 48163416 47620514
42841 47620514 48100937 49999812 53663411 57454579 58490794 55514661 49960048 44393757
42833 44393757 40489993 37793674 34160887 28798927 24961071 27009406 33932535 39156754
42825C9156754l20278k150604N56167Q04737m132098p227393k734702L877070
42817B7829653L732030j962109l938623J169716O356409M746873j338993m560404
42809C2034552k198887J570126J902885o39930j155242K830829P192669N772257
42801D7309259j369471p336547o859120k150370J363160J836920Q80229l90693
42793C3283367j647407j663572K15640K245526K776018K929302L893559L652339
42785D5684772J58308l948442m111362m35600K706891L063988K205365J107129
42777D6431049j279389m318194m963507k414538J3757l77104j801938r02027K387042
42768C2775151M768751L438757j034566n056244n091470j282955K310357K094911
$$ plain form
42825 39156754 38836476 36685872 37242039 38046776 33914678 26687285 23952583 27829653
42817 27829653 31561683 29599574 25660951 26830667 33187076 37933949 36594956 32034552
42809 32034552 29835665 31405791 33308676 32668746 31513504 34344333 41537002 47309259
42801 47309259 45939788 38603241 31744121 29593751 30956911 32793831 33674060 33283367
42793 33283367 31635960 29972388 30188028 32433554 35209572 38138874 42032433 45684772
42785 45684772 45843080 41894638 37783276 37347676 40054567 43118555 45323920 46431049
42777 46431049 45151660 40833466 35869959 33455421 33469178 33092074 31290136 30388109 32775151
42768 32775151 37543902 40982659 39948093 34891849 29800379 28517424 30827781 32922692
42760C2922692j169975l978011m147036j644447K631735O211714N204421j185244
42752C4845849p630259q229384m115243j235890j520370j426284J026065L630760
42744A5345244N126657O909695P998201M549258k725719o688270l440346J422482
42736B8497202J202673j901732j279861L041644M868961K007037q46246J29470
42728C5719148K883063L817003K739468J492892P30642M9069n79206r25799r03607
42719D5022673l51111M46412K12698j779929l947876m025708k206153p13917n54279
42710C2102810q49926j121449j679775j749641n4464K246820K222797j41391r80326
42701B9995455J785402M602152L082856j188361k381585J357461N123447M020777
$$ plain form
42760 32922692 31752717 27774706 23627670 21983223 24614958 30826672 36031093 34845849
42752 34845849 27215590 18986206 14870963 13635073 12114703 10688419 11714484 15345244
42744 15345244 20471901 27381596 35379797 39929055 37203336 30515066 27074720 28497202
42736 28497202 29699875 27798143 26518282 29559926 34428887 36435924 35589678 35719148
42728 35719148 38602211 42419214 45158682 46651574 47382216 47431285 46852079 45926280 45022673
42719 45022673 44671562 45117974 45330672 43550743 39602867 35577159 33371006 32657089 32102810
42710 32102810 31252884 30131435 28451660 26702019 26647555 28894375 31117172 30975781 29995455
42701 29995455 31780857 36383009 39465865 38277504 35895919 37253380 42376827 46397604
42693D6397604j24815j438535J865279N102590L564880j051305k828202N70493
42685E2057989M834450M616006L32262k619724q67299K942858L945384J232066
42677F6473992j547516j364148M17176M45906j761799l344033k390312n85740
42669E6343526l40473q39229Q42604M993204P893686O070756N14333m498624o048241
42660F4931542m958545l850055l851308l697680j885009Q03321J699072m05115
42652D8786223l109241k849420O33726L642930K818373j027275m162215m199732
42644D0533369k013787K61783J787154K924301L491614K641345P86133L8167J284618
42635E1734697K083889o5282k981655j841481L358570O415727L331967j682987
$$ plain form
42693 46397604 46272789 44834254 46699533 51802123 55367003 54315698 51487496 52057989
42685 52057989 56892439 61508445 61840707 59220983 58353684 61296542 65241926 66473992
42677 66473992 64926476 63562328 63979504 64425410 62663611 59319578 56929266 56343526
42669 56343526 56003053 55163824 56006428 60999632 68893318 74964074 75478407 70979783 64931542
42660 64931542 59972997 56122942 52271634 48573954 46688945 47492266 49191338 48786223
42652 48786223 45676982 42827562 43461288 47104218 49922591 48895316 44733101 40533369
42644 40533369 38519582 38781365 40568519 43492820 46984434 49625779 50411912 50450079 51734697
42635 51734697 53818586 53753304 50771649 48930168 52288738 58704465 62036432 60353445
42627F0353445k404379L69326J139063q90100r77444K642332N742601N307810
42619G1282654M122579N220036O406600M148728l95715l162888k841530j335159
42611H3445305k28340K28191J1420k55597P49709K512602K122109j221865l483349
42602H3880185r36188L919091N573024L408124K002469L741861N518553L947748
42594A11054867M00872j151100O86317L550388M479754L041976J335096J178587
42586A24576757J752303R71314r79868j475454N20011K589208K459546J106548
42578A31520365L47987j79107j066943n95957K500078N635171N458088K909723
42570A46529405J351619R29526q17807l470538l690263r35904J365586J267389
$$ plain form
42627 60353445 57949066 58318392 59457455 58567355 57589911 60232243 65974844 71282654
42619 71282654 75405233 80625269 87031869 91180597 90784882 87621994 84780464 83445305
42611 83445305 83216965 83445156 83456576 83200979 83950688 86463290 88585399 87363534 83880185
42602 83880185 82943997 86863088 92436112 95844236 97846705 101588566 107107119 111054867
42594 111054867 111455739 110304639 110990956 114541344 119021098 122063074 123398170 124576757
42586 124576757 126329060 127300374 126320506 124845052 125365063 127954271 130413817 131520365
42578 131520365 131868352 131689245 130622302 130026345 132526423 138161594 143619682 146529405
42570 146529405 147881024 148810550 147992743 144522205 140831942 139896038 141261624 142529013
42562A42529013P53750J572318K594288K822909L228308L744413K101646j941607
42554A57405038m381376j855311L486493O612567N431498J879965j071452j426150
42546A66081272J160599M517126N064977J801813j912463k265794N09497L264758
42538A78221785M264229M325082M495968M676232M282127K794439m2063l373240
42530A99644559n122438m026567j456086o9838q93996k682207l926077m530655
42522A76936695n358010o614845p028586n024468j053371J942143J467342j536754
42514A53730146l988360m587643m680741n285908n421838m046363j813298O334
42506A23912329R15677Q11650l29503j730253k247448k143484k881092m581711
$$ plain form
42562 142529013 143282763 144855081 147449369 150272278 153500586 157244999 159346645 157405038
42554 157405038 153023662 151168351 154654844 161267411 166698909 168578874 167507422 166081272
42546 166081272 167241871 171758997 176823974 178625787 176713324 174447530 174957027 178221785
42538 178221785 182486014 186811096 191307064 195983296 200265423 203059862 203017799 199644559
42530 199644559 194522121 190495554 189039468 188969630 188075634 185393427 181467350 176936695
42522 176936695 171578685 164963840 157935254 152910786 151857415 153799558 155266900 153730146
42514 153730146 149741786 145154143 140473402 135187494 129765656 125719293 123905995 123912329
42506 123912329 124828006 125639656 125310153 123579900 121332452 119188968 116307876 111726165
42498A11726165n464909m623980l560526l917939n312360o429898o629639n400036
42490G0386878k035337K659765N814873N275890K045505j193499l029852l847045
42482G6077178m428033m974588m810838k846068N39258K386275J00688m439110
42474E7604762o453051m481466j956308j604004j908215j033547m79605j719386
42466C7969180k405241R9091L593679L645940O1702l163230l542129k024172J40712
42457C4375532K559599L794040K127049j214584k913552k229063j633056k208108
42449C2657857j982170j09140R32131m32581j589966J81424K613569J295707l270145
42440C0296686n531184k529804J843236K334727m47972j439341J312475M101343
$$ plain form
42498 111726165 106261256 101637276 98076750 94158811 88846451 82416553 75786914 70386878
42490 70386878 68351541 71011306 76826179 82102069 84147574 82954075 79924223 76077178
42482 76077178 71649145 66674557 61863719 59017651 59556909 61943184 62043872 57604762
42474 57604762 51151711 46670245 44713937 43109933 41201718 40168171 39688566 37969180
42466 37969180 35563939 35663030 39256709 42902649 42964351 39801121 36258992 34234820 34375532
42457 34375532 36935131 40729171 42856220 41641636 38728084 36499021 34865965 32657857
42449 32657857 30675687 30566547 31498678 31066097 29476131 29657555 32271124 33566831 30296686
42440 30296686 24765502 22235698 24078934 26413661 25965689 24526348 25838823 29940166
42432B9940166L264194J83584j413886p54254J77979O19748J589186L003409L362455
42423C9972581K394872J260302P1757j888568l486006k716223p37894r80956l265736
42414C0624129l202028O86045L842679K683725L42219J248294L619151K519518
42406D2363732j924673m783205l737385j271400K29498J063481J681013J508180
42398C5129241Q32707O90826O27591n63152k015027j702548Q0914J272296J703530
42389C6056378K802310L895164K624840o77297k804803k497878j899365k462852
42381C5036497k978836k643450k506183k565551r60239K233842L781201K105169
42373C1502450L88541K092582N490761N696655J250691l855570m852226j437357
$$ plain form
42432 29940166 33204360 33387944 31974058 31219804 31397783 32017531 33606717 36610126 39972581
42423 39972581 42367453 43627755 43699512 41810944 38324938 35608715 34870821 33889865 30624129
42414 30624129 27422101 28108146 31950825 34634550 34976769 36225063 39844214 42363732
42406 42363732 40439059 35655854 31918469 30647069 30876567 31940048 33621061 35129241
42398 35129241 35961948 36652774 37280365 36717213 34702186 32999638 33080552 34352848 36056378
42389 36056378 38858688 42753852 45378692 44701395 41896592 39398714 37499349 35036497
42381 35036497 32057661 29414211 26908028 24342477 23382238 25616080 29397281 31502450
42373 31502450 31890991 33983573 39474334 45170989 46421680 42566110 37713884 36276527
42365C6276527K150721K003206j016259k633990j011113Q50513j80868k755493
42357C3683244l719607l044689k436866j045025K685469O045231M488664q55464
42349C5800957l599944j041047K524257K921877J377646M94304j64572j619651
42341C6693827k749489k877798l377040m131143k351837K243514N114621L119290
42333C1683945n97306j412586M85120K097486K501492K099702L45504k044433
42325C5158924k057661N72326J184964k476829n115441j891763K552888O24898
42317B8552306n507812o496641l72553M453108K220261k367875k667243L12749
42309A8126300J325203q57998l250947l805647k870935j305358J0390J58934m25381
$$ plain form
42365 36276527 38427248 40430454 39414195 36780205 35769092 36619605 36438737 33683244
42357 33683244 29963637 26918948 24482082 23437057 26122526 32167757 36656421 35800957
42349 35800957 32201013 31159966 33684223 36606100 37983746 38478050 38313478 36693827
42341 36693827 33944338 31066540 27689500 23558357 21206520 23450034 28564655 31683945
42333 31683945 31086639 29674053 30159173 32256659 34758151 36857853 37203357 35158924
42325 35158924 33101263 33673589 34858553 32381724 27266283 25374520 27927408 28552306
42317 28552306 23044494 16547853 16175300 20628408 22848669 20480794 17813551 18126300
42309 18126300 19451503 18593505 15342558 11536911 8665976 7360618 7371008 7529942 7104561
42300G104561r5089J212311J387208l41055j683187p07888J325911K394496K743590
42291A3340858L305937K998875K37923l847949o075878m822547j435407J656899
42283E358711L031769K733174J634659M45373p82339j935978k177095j052455
42275G255819K36398K98162k4361J246321L687512M429377K170687j104901l201797
42266A4993217m096103m231623l055175q76958K58764l55020l61754J835915L583332
42257G694595J519439k749391m268678j749027P96197J83630j639981j235023
42249a448239J140059K591940K201131J661881J875342J721312O22623j14436
42241A0251613L76540Q19101j1938r23867j81865J226079O62149j993229l750882
$$ plain form
42300 7104561 7009472 8221783 9608991 9267936 7584749 6876861 8202772 10597268 13340858
42291 13340858 16646795 19645670 19883593 16035644 9959766 5137219 3701812 5358711
42283 5358711 8390480 11123654 12758313 13203686 12421347 10485369 8308274 7255819
42275 7255819 7492217 7790379 7766018 9012339 12699851 17129228 19299915 18195014 14993217
42266 14993217 10897114 6665491 3610316 2733358 2992122 2637102 2275348 4111263 7694595
42257 7694595 9214034 6464643 2195965 446938 1243135 1426765 -213216 -1448239
42249 -1448239 -308180 2283760 4484891 6146772 8022114 9743426 10366049 10251613
42241 10251613 10628153 11447254 11435316 10511449 10329584 11555663 12217812 10224583 6473701
42232F473701k686158m69411M05409L8197J90229J265256K021910J725989J084999
42223A0050121J046454J467552J103924r54109l431422l339967O1917K654130
42215H658600j90776o573625r149653m537038K187016M632694K938204J292156
42207g42422J240928J690249K601784L812510K576071k294054n782316k394978
42199G07772M595993O510538J787476k225184j141255O75461q68218k509383n64834
42190F968366J595108m94039l822805k552483J951287L256312M49401q86519J766741
42181H231369M392865L903224K743802L460199L951498J694200j239065j396708
42173B5741384L48726L11193k061993l405461j470212J903126L365413J717019
$$ plain form
42232 6473701 3787543 3318132 3723541 3761738 3951967 5217223 7239133 8965122 10050121
42223 10050121 11096575 12564127 13668051 12713942 9282520 5942553 6004470 8658600
42215 8658600 8467824 1894199 -7255454 -11792492 -9605476 -4972782 -2034578 -742422
42207 -742422 498506 2188755 4790539 8603049 11179120 8885066 3102750 707772
42199 707772 5303765 11814303 13601779 11376595 10235340 10910801 10042583 7533200 6968366
42190 6968366 8563474 8069435 4246630 1694147 3645434 6901746 7351147 6464628 8231369
42181 8231369 12624234 16527458 19271260 22731459 26682957 28377157 27138092 25741384
42173 25741384 26090110 26401303 24339310 20933849 19463637 21366763 24732176 26449195
42165B6449195j586727m278083n053549m262647l173744k294874q23251J635663
42157F611983L583979L258170J361880L81362J030465J421381N33258K30072K059051
42148B0471601M023026L259078P06869j56624J200711J780135L40421o17617M30109
42139C1437709J154711l32538j720465l64487J755517Q08376k896620n458504
42131B4383699m694142j462939K878895O587395O567763J728270l644203m435162
42123B7909576j805124p57357j511460L56804M929664O370922K540415p65910
42115C7267530J025799L995559K598500j212166j661706J444088L092635J060033
42107D7610272j930453l309175l346625k896691k056656j165106o99331n32409
$$ plain form
42165 26449195 24862468 20584385 15530836 11268189 8094445 5799571 4976320 6611983
42157 6611983 10195962 13454132 14816012 15197374 16227839 17649220 18182478 18412550 20471601
42148 20471601 24494627 27753705 28460574 28303950 29504661 31284796 31625217 31007600 31437709
42139 31437709 32592420 32259882 30539417 30174930 31930447 32738823 29842203 24383699
42131 24383699 19689557 18226618 21105513 27692908 34260671 35988941 32344738 27909576
42123 27909576 26104452 25347095 23835635 24192439 29122103 35493025 38033440 37267530
42115 37267530 38293329 42288888 44887388 43675222 42013516 43457604 46550239 47610272
42107 47610272 45679819 42370644 39024019 36127328 34070672 32905566 32206235 31673826
42099C1673826q03170k082214l314191k142073R06885J920150j86600j004001
42091B4968612K093149M293734L30333o376724p971104l330445J619070L312046
42083A8938671L433091L063908J028369j437732j022709J534436J793369o80834
42075B6650569j137802K194221M976183M009766J589463J0000k132237m820727
42067C1339436l967553J583960N789276L450244j799535l087955k88283J396835
42059C4416425P5962j587133k047483k123256j562665M11442J757084k30780l758459
42050B5351137m330233j635329J72643n93816r00554J176536L060349K199541
42042B4500274J43915l95322M10159Q94419R71043J355300J506101O50235m62775
$$ plain form
42099 31673826 30870656 28788442 25474251 23332178 24239063 26159213 25972613 24968612
42091 24968612 27061761 31355495 31685828 25309104 17338000 14007555 15626625 18938671
42083 18938671 22371762 25435670 26464039 25026307 24003598 25538034 27331403 26650569
42075 26650569 25512767 27706988 32683171 36692937 38282400 38292400 36160163 31339436
42067 31339436 27371883 28955843 34745119 38195363 36395828 33307873 33019590 34416425
42059 34416425 34492387 32905254 30857771 28734515 27171850 27583292 29340376 29109596 25351137
42050 25351137 21020904 19385575 19558218 18964402 18063848 19240384 22300733 24500274
42042 24500274 24644189 24248867 24659026 25553445 26524488 27879788 29385889 30036124 29573349
42033B9573349p94993p91223j113233r16220N45885J715157N16554k287401l970104
42024B2477771l748499l138344k283913Q48695O227470R707974P905991L075920
42016D1073065j11387j186217l089953n276491l107598L857305Q229002L971604
42008D4359330m229414o483266j034596L999803K435292k499060m494661k679475
42000B9373953l34558R84805J899594K184810J256572K86192M43850J92873k390184
41991C3897907n565082n706280k783030o03138j278197k671851k330938j150578
41983A1808813j403169k920023l200318p99656K712688M361623K908208J00456
41975A3568622j434094j224023r45854j476945j646076n94797M93669L99618q1884
$$ plain form
42033 29573349 28778356 27987133 26873900 25957680 26503565 28218722 28735276 26447875 22477771
42024 22477771 18729272 15590928 13307015 14155710 20383180 30091154 37997145 41073065
42016 41073065 40961678 39775461 36685508 31409017 28301419 32158724 40387726 44359330
42008 44359330 40129916 33646650 32612054 36611857 39047149 36548089 32053428 29373953
42000 29373953 29039395 30024200 31923794 34108604 35365176 35651368 36095218 36288091 33897907
41991 33897907 28332825 22626545 19843515 19240377 17962180 15290329 12959391 11808813
41983 11808813 10405644 7485621 4285303 3485647 6198335 10559958 13468166 13568622
41975 13568622 12134528 10910505 9964651 8487706 6841630 6246833 6740502 7140120 7058236
41966G058236J88476N51179O2672m40874j66935o07088k899237m354814j535399
41957b143784L723627N654635K435287j432751j898292m72246l48484j009382
41949D508610J0442K292096K994107J185673j155684k144174j809607j070667
41941D810796n22588j68555O38537K503014M511030M508898J835271j463362l262258
41932A3390783l726015l719921k717849l37420J754109K058159J974215L395983
41924A2072044M832493L477398L79932o24174P57102N23481k856546n379025l488783
41915I693922P23653L211915L478436L018764J409681j833310l952113k343386
41907A3407562L62589k01628k617624j584050K634281L362025j871710o291015
$$ plain form
41966 7058236 7246712 7797891 7860563 7419689 7252754 6645666 3746429 -608385 -2143784
41957 -2143784 1579843 7234478 9669765 8237014 6338722 5866476 5517992 4508610
41949 4508610 4519052 6811148 9805255 10990928 9835244 7691070 5881463 4810796
41941 4810796 4288208 4119653 4758190 7261204 11772234 16281132 18116403 16653041 13390783
41932 13390783 9664768 5944847 3226998 2889578 4643687 6701846 8676061 12072044
41924 12072044 16904537 20381935 20761867 20137693 20894795 21418276 18561730 13182705 9693922
41915 9693922 10417575 13629490 17107926 20126690 21536371 19703061 15750948 13407562
41907 13407562 13770151 13568523 10950899 9366849 12001130 15363155 13491445 7200430
41899G200430l396570L597982O853814M596404J084651j429807m303183o838106
41891G365615n333740Q39099O827562P887268M372943n4799k456915j940194K68947
41882A7775786J075858j595686n318916n196808k50854M945396O012427L380159
41874B0827362J10913j878100j986293l42769J137680j19403l351392m442966
41866I955032j788563J079192J098329L22250J628722L290838K317706M30755
41858A8334261J316683L568548K264662k640772n290764k399517K299598L987008
41850B1439707K825000J607969Q95795m45017k130785k790222k222907j321741
41842A7857799o84069n98267j209728j639350m23918K054722L243379J828431
$$ plain form
41899 7200430 3803860 7401842 14255656 18852060 19936711 18506904 14203721 7365615
41891 7365615 2031875 2870974 9698536 17585804 21958747 21903948 19447033 17506839 17775786
41882 17775786 18851644 17255958 11937042 6740234 6489380 11434776 17447203 20827362
41874 20827362 20938275 19060175 17073882 16731113 17868793 17749390 14397998 9955032
41866 9955032 8166469 9245661 10343990 10666240 12294962 15585800 17903506 18334261
41858 18334261 19650944 23219492 25484154 22843382 17552618 15153101 17452699 21439707
41850 21439707 24264707 25872676 26768471 26323454 24192669 21402447 19179540 17857799
41842 17857799 17173730 16575463 15365735 13726385 13302467 15357189 18600568 20428999
41834B0428999k31126o47824r7169n58808j733699j568697K12365J457478O54614
41825A7916133j072710j446504N81385M034559O504267N631134J290740l436376
41817C0002628m747604k278865J71940r31628m374627n537978k232605K484173
41809A2555434M323963L178301K490430L805123M685525K873711k8233r95513
41801C2888741M5640P20880J16532m04881n5730J78376l95567r15665n34864J02565
41791C1746027l30089k269329m665163n486501l405603K33224K154309J049555
41783A9026430o61953o78730n35078k606886n096971m140662k75826J841798N97726
41774G469848m86036Q79189K149650J129640J78886J731899L411207J883216j177895
$$ plain form
41834 20428999 20197873 19550049 19452880 18894072 17160373 15591676 15804041 17261519 17916133
41825 17916133 16843423 15396919 15978304 20012863 26517130 32148264 33439004 30002628
41817 30002628 25255024 22976159 23148099 22216471 17841844 12303866 10071261 12555434
41809 12555434 16879397 20057698 22548128 26353251 31038776 33912487 33884254 32888741
41801 32888741 32934381 33655261 33771793 33366912 33311182 33489558 33093991 32178326 31643462 31746027
41791 31746027 31415938 29146609 24481446 18994945 15589342 15822566 17976875 19026430
41783 19026430 18364477 17685747 17150669 14543783 9446812 5306150 5030324 6872122 7469848
41774 7469848 6983812 7863001 10012651 11142291 11321177 13053076 16464283 18347499 17169604
41765A7169604j520557J097835L144423K882269J403367r94841m852716q081334
41757A0248050p096377k328123J450582J657381J044697K474087M104792K745838
41749A4300927m65993j341826J232060L682653K753761k22108j390564M33946
41741A8982856K304303J086882k359629m202465k567372J30406M83453j639353
41733A2219081l470842l132815j400643O9228P44130J175268J893480K562143
41725A0659030J875541j166744n265928p070556m670013p1454L256361M471249
41717B017486N062318N209268L272674o45287l413505k742690m76804n1751j742081
41708F489628k587390q66771J442479J572990n9070m75858J505195L404943K519428
$$ plain form
41765 17169604 15649047 16746882 19891305 22773574 24176941 23182100 18329384 10248050
41757 10248050 3151673 823550 2274132 3931513 4976210 7450297 11555089 14300927
41749 14300927 13834934 12493108 13725168 17407821 20161582 19939474 18548910 18982856
41741 18982856 21287159 22374041 20014412 15811947 13244575 13374981 13858434 12219081
41733 12219081 8748239 5615424 4214781 4284009 5028139 6203407 8096887 10659030
41725 10659030 12534571 11367827 6101899 -968657 -5638670 -5710124 -2453763 2017486
41717 2017486 7079804 12289072 15561746 14916459 11502954 8760264 8283460 8231709 6489628
41708 6489628 3902238 3035467 4477946 6050936 5991866 5516008 7021203 10426146 12945574
41699A2945574k70702j959585j790483j659175k226095j582500J160754L660682
41691H278470L481064J257423j098781l101186m458135l638378n94034J346910
41683A473353j49967k167988q13298K038910J458208k051287k863954N41029L086872
41674E51878J776421N71311L068132N895487M375405M49088q66805M660j415067
41665A4410510n119896n928018j794032K872310L928488K921333L267150M569104
41657A9126949L978414J203482j089350j397417j398301l268975o344698p476578
41649C333526m666196K90344L427549K762124j9635k034126k052169n18005J523308
41640B046720K479690R92047j793313k523146j98530J514386n83840l490050j446314
$$ plain form
41699 12945574 12674872 10715287 8924804 7265629 5039534 3457034 4617788 8278470
41691 8278470 11759534 13016957 11918176 8816990 4358855 720477 126443 1473353
41683 1473353 1323386 -844602 -1657900 381010 1839218 -212069 -3076023 -2534994 551878
41674 551878 2328299 2899610 5967742 11863229 16238634 16687722 15820917 15825577 14410510
41665 14410510 9290614 3362596 1568564 4440874 8369362 11290695 14557845 19126949
41657 19126949 23105363 24308845 23219495 21822078 20423777 17154802 10810104 3333526
41649 3333526 -1332670 -1042326 2385223 5147347 5127712 3093586 1041417 523412 2046720
41640 2046720 4526410 5518457 3725144 1201998 1003468 2517854 1934014 -1556036 -3002350
41631c002350N339889R842384P107187K31874m305898m223009k170605j296942
41623G522530k449395m282696m255498q06492M024243N746806K711603j529561
41615F681540k881402j719487r48548j047419l09302J128193J204654j23033l39344
41606A645852J348106K119977n11366m919018p159133n247921m01284M733248
41598h391539P713709P200007L887206L82266r42784n8900J193406J357519O26843
41589A2967733J78931P82561J947011K232738O94443j842260l367830k693039
41581A0900288m02700K139721L842282L781537J377083k392836m954795m693088
41573I597492l076584k821593m076109m050374r67255L071799M410144K315227
$$ plain form
41631 -3002350 2337539 12179923 19287110 19518984 15213086 10990077 8819472 7522530
41623 7522530 5073135 790439 -3465059 -4271551 -247308 5499498 8211101 6681540
41615 6681540 3800138 2080651 1132103 84684 -224618 903575 2108229 1985196 1645852
41606 1645852 2993958 5113935 4602569 -316449 -7475582 -12723503 -13124787 -8391539
41598 -8391539 -677830 6522177 10409383 10791649 9848865 9789965 10983371 12340890 12967733
41589 12967733 13146664 13929225 15876236 18108974 18803417 16961157 13593327 10900288
41581 10900288 10497588 12637309 16479591 20261128 21638211 19245375 14290580 9597492
41573 9597492 6520908 3699315 -376794 -4427168 -5394423 -2322624 2087520 4402747
41565D402747k76468m96306J209181K116881O86640j835324k927554j213391K379784
41556D046190N150610M546673N70461l629758m585736k222463K56813M75295n83742
41547D024343r45912p89415j355768j923037m70779K711161M536688L000342k28655
41538H558968j926525p04608K276803M591078M051600N20034l151346l618256
41530A0597748j146023O42713j77417j498716j252411r28997k425492l830209
41522a8804k037094J740307L022808M01002k810623l537386k131213M2228K725779
41513b602996N171650N607964M168596L652897N232358N836649K452540k828540
41505B6691118n077570k921017J65737P30999r77458k569396k774915k240942
$$ plain form
41565 4402747 4126279 3629973 4839154 6956035 7642675 5807351 2879797 1666406 4046190
41556 4046190 9196800 13743473 14313934 10684176 6098440 3875977 4132790 4608085 4024343
41547 4024343 3078431 2289016 933248 -989789 -1460568 1250593 5787281 8787623 8558968
41538 8558968 6632443 5927835 8204638 12795716 16847316 17367350 14216004 10597748
41530 10597748 9451725 10094438 9917021 8418305 7165894 6236897 3811405 -18804
41522 -18804 -2055898 -315591 2707217 3108219 297596 -3239790 -5371003 -5328775 -2602996
41513 -2602996 2568654 8176618 12345214 15998111 21230469 27067118 29519658 26691118
41505 26691118 21613548 18692531 18858268 19589267 18611809 16042413 13267498 11026556
41497A1026556j998940j936203r71519J004838J847147o18729m759642n750611
41489b157103j603993L362461L593475m04005k917056r35930K087897J465076
41481B490822k402306m969395l483883J50490K271061J617848k373m44076L16734
41472d455078O74319k48463j537564j786394o66605J022215K104826J597280n26958
41463c822422k752333l225012j919204l43434J183095L852209O980260O997953
41455F951112K264436l263683m531362k213013j170233k676940k729454J018043
41447f351094N053599N058075J732830j335114k981769m204929m398526j841117
41439i268045K361180M411111K706404n0440p04841N15310J363233J027558L91263
$$ plain form
41497 11026556 9027616 7091413 6119894 7124732 8971879 8353150 3593508 -2157103
41489 -2157103 -3761096 -398635 3194840 2790835 -126221 -1062151 1025746 2490822
41481 2490822 88516 -4880879 -8364762 -8214272 -5943211 -4325363 -4327736 -4771812 -4455078
41472 -4455078 -3780759 -4029222 -5566786 -7353180 -8019785 -6997570 -4892744 -3295464 -3822422
41463 -3822422 -6574755 -9799767 -11718971 -12062405 -10879310 -7027101 -46841 6951112
41455 6951112 9215548 5951865 1420503 -792510 -1962743 -4639683 -7369137 -6351094
41447 -6351094 -1297495 3760580 5493410 4158296 1176527 -3028402 -7426928 -9268045
41439 -9268045 -6906865 -2495754 210650 160210 -544631 -29321 1333912 2361470 2752733
41430B752733j87207j314997k793861l106745j368152J257391K925806L202322
41422A367290K817800J898322q8682k490328l183273j178943J526858K120206
41414B789250N48420m87249Q76191L392540M408481K798337l23084k938156l469971
41405G594759j518680J635530L363530J670123k433478n135555l568373N60646
41397B168502K447313J08695k722144j573217K090361K521394j726334m879507
41389a564937j931306L772706M860233J25633m091323k714447K002035M504533
41381D963127K842711m00823j949139o15904K448840M616679L674906J34019k904237
41372A2810179l003360q47033J213038K110006K467116K632510J748314o96646
$$ plain form
41430 2752733 2565526 1250529 -1543332 -4650077 -6018229 -4760838 -1835032 1367290
41422 1367290 4185090 6083412 5994730 3504402 321129 -857814 669044 2789250
41414 2789250 3337670 2850421 3726612 7119152 11527633 14325970 14002886 11064730 7594759
41405 7594759 6076079 7711609 11075139 12745262 10311784 5176229 1607856 2168502
41397 2168502 4615815 4724510 2002366 429149 2519510 5040904 3314570 -1564937
41389 -1564937 -3496243 276463 5136696 5262329 1171006 -1543441 458594 4963127
41381 4963127 7805838 7405015 5455876 4839972 7288812 11905491 15580397 15714416 12810179
41372 12810179 9806819 8959786 10172824 12282830 14749946 17382456 19130770 18434124
41364A8434124l123630k911130K04736K807191J622704j686593k185759J204217
41356A4365860L497249P53812l743052m160468p25217J143294n58665j875179
41348H697634L73293M009611N361467L978445J586708o42119k020093k145152
41340A9199794k142262l526392m916663l074719J663681M666819L407200Q46155
41332A6123613K87527O76872k01395j498361j651003j770252k988610l152961
41324E825430o3125M162550N706872M149779J521913j514868m717620n679547
41316I391384k665980J382500K031362m46163k058552j202775L71771J682648
41308H486195L083579L260362K84017m198014o024520m197160j850600j353992
$$ plain form
41364 18434124 15310494 12399364 12604100 15411291 17033995 15347402 13161643 14365860
41356 14365860 17863109 18616921 14873869 10713401 9988184 11131478 10572813 8697634
41348 8697634 9070927 13080538 18442005 22420450 24007158 23365039 21344946 19199794
41340 19199794 17057532 13531140 8614477 5539758 7203439 11870258 15277458 16123613
41332 16123613 16411140 17088012 16886617 15388256 13737253 11967001 8978391 5825430
41324 5825430 5762305 9924855 15631727 19781506 21303419 19788551 15070931 9391384
41316 9391384 6725404 8107904 10139266 9693103 7634551 6431776 6803547 8486195
41308 8486195 11569774 14830136 15114153 10916139 4891619 694459 -1156141 -2510133
41300b510133j952889k309937j853870K77216L953370N978236L354587j481758
41292C454822l013983l23074K177515K003429J495263K366927K573384P29148
41284A1463431r37395o27746q3385j006325j772234m28628J826288K629027J606725
41275A2669758l03125k320536l145546j452138J509444K453419M26980k042942
41267G795314k887761k362638n94737K517905M321819J535479l223418k991163
41259D110800K912117O171028J384737n551201o431197k485297l35614p98405
41251a023032K20232K467893J550574k379269m104184k076507n06409j349763
41243g200465q93433L189011P092084O508591K704322m19871k017034l529825
$$ plain form
41300 -2510133 -4463022 -6772959 -8626829 -8349613 -4396243 1581993 4936580 3454822
41292 3454822 440839 117765 2295280 4298709 5793972 8160899 10734283 11463431
41284 11463431 10526036 9898290 9814905 8808580 7036346 6607718 8434006 11063033 12669758
41275 12669758 12366633 10046097 6900551 5448413 6957857 9411276 9838256 7795314
41267 7795314 4907553 2544915 1950178 4468083 8789902 10325381 7101963 4110800
41259 4110800 7022917 13193945 14578682 9027481 2596284 110987 -224627 -1023032
41251 -1023032 -802800 1665093 3215667 836398 -3267786 -5344293 -5850702 -7200465
41243 -7200465 -8093898 -4904887 2187197 8695788 11400110 10980239 8963205 5433380
41235E433380m457822k482551K620252P499124Q074218L368688l259814o793040
41227A0002435n119166p36093K459639K900455J066953k354491n796856o163175
41219c740299k051043L305306N392055L994109K374614J804245O68780j284968
41211A0462799j900693m45157J029642R85125l3272j682226m336541o528426n348775
41202g797524p31435L699126N283554M807347L256536j83525m787585o453786
41194b907292k481244L859950O602179L874460q51876l372485k577954k87002
41186A858736J055671N99685l34320k43982K69432m07542j869566k062719q20431
41177a955036k21858p15820k2193K615892M190049K277114q73539j372276R16996
$$ plain form
41235 5433380 975558 -1506993 1113259 8612383 16686601 20055289 16795475 10002435
41227 10002435 4883269 4147176 6606815 9507270 10574223 8219732 2422876 -3740299
41219 -3740299 -5791342 -2486036 2906019 6900128 9274742 11078987 11747767 10462799
41211 10462799 8562106 8116949 9146591 10131716 10098444 8416218 4079677 -2448749 -7797524
41202 -7797524 -8528959 -4829833 453721 5261068 8517604 8334079 3546494 -2907292
41194 -2907292 -5388536 -1528586 5073593 8948053 8096177 4723692 2145738 1858736
41186 1858736 2914407 3514092 3179772 2935790 3205222 2797680 928114 -1134605 -1955036
41177 -1955036 -2176894 -2892714 -2914907 -299015 3891034 6168148 5294609 3922333 4839329
41168D839329K706235J842730q33844l294483l925009k157401O57003J772498
41160A607058K7776k498661l008261r61522K467605N943949P475098M865310p93568
41151A5124784m311168k323444J711108K098931r57800k293713k65688Q78568
41143I661578j789116n155714n126310k609412j070621p92472N29723K877767
41135c474577L616579K037942O17020Q09392O19277j836975m606055m330251j374452
41126g922100K72806j516009l970190l043282J438046N699990O314747L321265
41118E95273m00795j747991J27904K832190K677187j260624n589584o317613l328430
41109a2412483L97632K929069M257869L813548O71786l208216l605521L10646
$$ plain form
41168 4839329 7545564 9388294 8554450 5259967 1334958 -822443 -165440 1607058
41160 1607058 1634834 -863827 -3872088 -4833610 -2366005 3577944 11053042 15918352 15124784
41151 15124784 10813616 8490172 10201280 12300211 11342411 9048698 8783010 9661578
41143 9661578 7872462 2716748 -2409562 -5018974 -6089595 -6882067 -6352344 -3474577
41135 -3474577 142002 2179944 2796964 3606356 4225633 2388658 -2217397 -6547648 -7922100
41126 -7922100 -7649294 -9165303 -13135493 -16178775 -14740729 -9040739 -2725992 595273
41118 595273 194478 -1553513 -1425609 1406581 4083768 2823144 -2766440 -9084053 -12412483
41109 -12412483 -12014851 -9085782 -4827913 -1014365 -342579 -3550795 -7156316 -6845670
$$ [...]
##END NTUPLES=NMR SPECTRUM
##END=
