##TITLE=31Pdec_DE-130_R_TFA
 DMSO+CCl4,64 sc
 23.6.2026
##JCAMPDX= 6.0         $$ Bruker NMR JCAMP-DX V2.0
##DATA TYPE= NMR SPECTRUM
##DATA CLASS= NTUPLES
##ORIGIN= UXNMR, Bruker Analytische Messtechnik GmbH
##OWNER= root
$$ XWIN-NMR		Version 3.5
$$ Tue Jun 23 14:51:25 2026 Russian Standard Time (UT+4h)  she@DPX200
##.OBSERVE FREQUENCY= 81.013821
##.OBSERVE NUCLEUS= ^31P
##.ACQUISITION MODE= SIMULTANEOUS
##.ACQUISITION SCHEME= undefined
##.AVERAGES= 64
##.DIGITISER RES= 17
##SPECTROMETER/DATA SYSTEM= spect
##.PULSE SEQUENCE= zgpg30
##.SOLVENT NAME= CDCl3
##.SHIFT REFERENCE= (INTERNAL, CDCl3, 0, 197.392)
##AUDIT TRAIL= $$ (NUMBER, WHEN, WHO, WHERE, WHAT)
$$ ##TITLE= Audit trail, XWIN-NMR		Version 3.5
$$ ##JCAMPDX= 5.01
$$ ##ORIGIN= Bruker BioSpin GmbH
$$ ##OWNER= she
$$ F:/spectra/data/she/nmr/P31/2/pdata/1/auditp.txt
$$ ##AUDIT TRAIL=  $$ (NUMBER, WHEN, WHO, WHERE, WHAT)
(   1,<2026-06-23 14:49:03.82 +0400>,<she>,<DPX200>,
      <created by zg, POWCHK disabled, PULCHK disabled
       configuration hash MD5:
       00 E9 B6 7A A2 85 ED C7 34 08 36 98 17 FE 4E 26
       data hash MD5: 32K
       63 61 7A A2 D7 EA BD 58 0E CC AA EC 7E BB 6B 95>)
(   2,<2026-06-23 14:49:10.65 +0400>,<she>,<DPX200>,
      <Start of raw data processing
       efp BC_mod = 2 LB = 1.5 FT_mod = 6 PKNL = 1 PHC0 = 1772.999 PHC1 = -362.6993 SI = 64K 
       data hash MD5: 64K
       D1 30 FD 88 45 2F 39 5F DF A6 F0 D4 73 D3 EE DA>)
(   3,<2026-06-23 14:49:25.42 +0400>,<she>,<DPX200>,
      <pk PHC0 = 10.73713 PHC1 = 0 
       data hash MD5: 64K
       64 96 58 D0 3D 72 8E 96 C1 03 A7 61 C0 43 D9 1E>)
(   4,<2026-06-23 14:49:31.92 +0400>,<she>,<DPX200>,
      <abs ABSG = 5 
       data hash MD5: 64K
       C5 46 0F 43 64 66 44 10 A5 5B 0F 90 BC 7D 7C 3F>)
$$ ##END=
$$ 
$$ hash MD5
$$ E8 4B 98 0D 3D CE D5 05 C5 DC EA A4 1E D5 CF B7
##$RELAX= 
##$RELAX= 
##$RELAX= 
##$RELAX= 
##$RELAX= 
##$RELAX= 
##$RELAX= 
##$RELAX= 
$$ Bruker specific parameters
$$ --------------------------
##$DU= <F:/spectra>
##$EXPNO= 2
##$NAME= <P31>
##$PROCNO= 1
##$TYPE= <nmr>
##$USER= <she>
##$AMP= (0..31)
100 100 100 100 100 100 100 100 100 100 100 100 100 100 100 100 100 100 
100 100 100 100 100 100 100 100 100 100 100 100 100 100 
##$AQSEQ= 0
##$AQ_mod= 1
##$AUNM= <au_zg>
##$AUTOPOS= <>
##$BF1= 81.014009
##$BF2= 200.13
##$BF3= 200.13
##$BF4= 200.13
##$BF5= 200.13
##$BF6= 200.13
##$BF7= 200.13
##$BF8= 200.13
##$BYTORDA= 1
##$CFDGTYP= 0
##$CFRGTYP= 5
##$CHEMSTR= <none>
##$CNST= (0..31)
1 1 145 1 1 1 1 1 1 1 1 1 1 1 1 1 1 1 1 1 1 1 1 1 1 1 1 1 1 1 1 1 
##$CPDPRG= <waltz16>
##$CPDPRG1= <>
##$CPDPRG2= <waltz16>
##$CPDPRG3= <>
##$CPDPRG4= <mlev>
##$CPDPRG5= <mlev>
##$CPDPRG6= <mlev>
##$CPDPRG7= <mlev>
##$CPDPRG8= <mlev>
##$CPDPRGB= <>
##$CPDPRGT= <>
##$D= (0..31)
0 1 0 0 0 0 0 0 0 0.06 0 0.03 2e-05 3e-06 0 0 0.0002 0 0 0 0 0 0 0 0 0 
0 0 0 0 0 0 
##$DATE= 1782211743
##$DBL= (0..7)
120 120 120 11 120 120 24 19 
##$DBP= (0..7)
150 150 150 150 150 150 150 150 
##$DBP07= 0
##$DBPNAM0= <>
##$DBPNAM1= <>
$$ [...]
##$SUBNAM3= <"">
##$SUBNAM4= <"">
##$SUBNAM5= <"">
##$SUBNAM6= <"">
##$SUBNAM7= <"">
##$SUBNAM8= <"">
##$SUBNAM9= <"">
##$SW= 400.765351723535
##$SWIBOX= (0..15)
0 1 3 0 0 0 0 0 0 0 0 0 0 0 0 0 
##$SW_h= 32467.5324675325
##$TD= 32768
##$TD0= 1
##$TE= 0
##$TE2= 300
##$TE3= 300
##$TEG= 300
##$TL= (0..7)
0 120 53 12 22 120 120 120 
##$TP= (0..7)
150 150 150 150 150 150 150 150 
##$TP07= 0
##$TPNAME0= <>
##$TPNAME1= <>
##$TPNAME2= <>
##$TPNAME3= <>
##$TPNAME4= <>
##$TPNAME5= <>
##$TPNAME6= <>
##$TPNAME7= <>
##$TPOAL= (0..7)
0.5 0.5 0.5 0.5 0.5 0.5 0.5 0.5 
##$TPOFFS= (0..7)
0 0 0 0 0 0 0 0 
##$TUNHIN= 0
##$TUNHOUT= 0
##$TUNXOUT= 0
##$USERA1= <user>
##$USERA2= <user>
##$USERA3= <user>
##$USERA4= <user>
##$USERA5= <user>
##$V9= 5
##$VALIST= <valist>
##$VCLIST= <CCCCCCCCCCCCCCC>
##$VD= 0
##$VDLIST= <DDDDDDDDDDDDDDD>
##$VPLIST= <PPPPPPPPPPPPPPP>
##$VTLIST= <TTTTTTTTTTTTTTT>
##$WBST= 1024
##$WBSW= 4
##$XGAIN= (0..3)
0 0 0 0 
##$XL= 0
##$YL= 0
##$YMAX_a= 3513
##$YMIN_a= -14847
##$ZGOPTNS= <>
##$ZL1= 120
##$ZL2= 120
##$ZL3= 120
##$ZL4= 120
##$ABSF1= 197.3918
##$ABSF2= -203.3724
##$ABSG= 5
##$ABSL= 3
##$ALPHA= 0
##$AQORDER= 0
##$ASSFAC= 0
##$ASSFACI= 0
##$ASSFACX= 0
##$ASSWID= 0
##$AUNMP= <proc_1d>
##$AZFE= 0.1
##$AZFW= 0.5
##$BCFW= 0
##$BC_mod= 2
##$BYTORDP= 0
##$COROFFS= 0
##$CY= -3
##$DATMOD= 1
##$DC= 0
##$DFILT= <>
##$DTYPP= 0
##$F1P= 0
##$F2P= 0
##$FCOR= 1
##$FTSIZE= 65536
##$FT_mod= 6
##$GAMMA= 0
##$GB= 0
##$INTBC= 1
##$INTSCL= 9.790993e-09
##$ISEN= 30
##$LB= 1.5
##$LEV0= 0
##$LPBIN= 0
##$MAXI= 10000
##$MC2= 0
##$MEAN= 0
##$ME_mod= 0
##$MI= 50
##$NCOEF= 0
##$NC_proc= -8
##$NLEV= 6
##$NOISF1= 182.463
##$NOISF2= 159.3651
##$NSP= 0
##$NTH_PI= 0
##$NZP= 0
##$OFFSET= 197.3918
##$PC= 4
##$PHC0= 1783.736
##$PHC1= -362.6993
##$PH_mod= 1
##$PKNL= yes
##$PPARMOD= 0
##$PSCAL= 0
##$PSIGN= 0
##$REVERSE= no
##$SF= 81.014063255964
##$SI= 65536
##$SIGF1= 159.3651
##$SIGF2= -187.1042
##$SINO= 113.3802
##$SIOLD= 16384
##$SREGLST= <1H.CDCl3>
##$SSB= 0
##$STSI= 65536
##$STSR= 0
##$SW_p= 32467.5324675325
##$SYMM= 0
##$S_DEV= 0
##$TDeff= 32768
##$TDoff= 0
##$TI= <>
##$TILT= no
##$TM1= 0
##$TM2= 0
##$TOPLEV= 0
##$USERP1= <user>
##$USERP2= <user>
##$USERP3= <user>
##$USERP4= <user>
##$USERP5= <user>
##$WDW= 1
##$XDIM= 65536
##$YMAX_p= 296998785
##$YMIN_p= -173039022
$$ End of Bruker specific parameters
$$ ---------------------------------
##NTUPLES= NMR SPECTRUM
##VAR_NAME=  FREQUENCY,     SPECTRUM/REAL,   SPECTRUM/IMAG
##SYMBOL=    X,             R,               I
##VAR_TYPE=  INDEPENDENT,   DEPENDENT,       DEPENDENT
##VAR_FORM=  AFFN,          ASDF,            ASDF
##VAR_DIM=   65536,         65536,           65536
##UNITS=     HZ,            ARBITRARY UNITS, ARBITRARY UNITS
##FACTOR=    0.49542278885378, 1,            1
##FIRST=     15991.5117654749, 0,            0
##LAST=      -16476.0207020576, 0,           0
##MIN=       -16476.0207020576, -173039022,  0
##MAX=       15991.5117654749, 296998785,    0
$$ Real data points
##PAGE= N=1
##DATA TABLE= (X++(R..R)), XYDATA
$$ [...]
##PAGE= N=2
##DATA TABLE= (X++(I..I)), XYDATA
$$ plain form
7509 11187631 9397822 7157745 5733662 5034655 3458340 1211134 932764 3124788
7501 3124788 3973794 481347 -4888641 -7816487 -7849934 -6978627 -5078963 -1229324 2465291
7492 2465291 3338089 2968434 4281661 5186650 1300011 -5454536 -7883934 -4067654 -5583
7483 -5583 156496 -357673 1703819 3468496 1685790 -1020985 -967864 114875 -935228
7474 -935228 -2087474 448187 4994094 6736187 5268579 3854839 2828429 55740
7466 55740 -2970896 -2266880 1072263 964250 -4449115 -9529108 -9375865 -6087220 -3775160
7457 -3775160 -2029258 1519291 5400583 5733145 2111590 -1727114 -2732412 -1197223
7449 -1197223 1236139 3772445 6316901 8809695 11144808 12835950 12826054 10571836 7193728
$$ packed form
7509A1187631j789809k240077j424083o99007j576315k247206k78370K192024
7501C124788Q49006l492447n369988k927846l3447Q71307J899664L849639L694615
7492B465291Q72798l69655J313227R04989l886639o754547k429398L816280M062071
7483e583J62079n14169K061492J764677j782706k706775N3121J082739j050103
7474i35228j152246K535661M545907J742093j467608j413740j026410k772689
7466E5740l026636P04016L339143j08013n413365n079993J53243L288645K312060
7457c775160J745902L548549L881292L32562l621555l838704j005298J535189
7449a197223K433362K536306K544456K492794K335113J691142r896k254218l378108
$$ plain form
7440 7193728 4551283 3150059 1915221 249169 -650625 735292 3878216 6185668
7432 6185668 5556739 2400885 -1136630 -3250049 -3168077 -663255 3608688 7371650 7967591
7423 7967591 4962942 490510 -3300013 -5859677 -7099445 -6569087 -4775086 -3524626
7415 -3524626 -3477780 -2830359 -71495 3309620 4792903 4382925 4054776 4471859 4635974
7406 4635974 4516356 5648660 8700131 12140810 13782647 12517073 8619114 3677129
7398 3677129 146402 -462019 901084 2163756 2715467 3332126 3893732 3041611 455587
7389 455587 -2086579 -2660464 -1302977 368808 1084821 1123790 1785571 3658913 5626351
7380 5626351 6387167 6772946 8790877 11908857 12719825 9888650 7000873 7783159 10332778
$$ packed form
7440G193728k642445j401224j234838j666052q99794J385917L142924K307452
7432F185668o28929l155854l537515k113419Q1972K504822M271943L762962N95941
7423G967591l004649m472432l790523k559664j239768N30358J794001J250460
7415c524626M6846O47421K758864L381115J483283m09978l28149M17083J64115
7406D635974j19618J132304L051471L440679J641837j265574l897959m941985
7398C677129l530727o08421J363103J262672N51711O16659N61606q52121k586024
7389D55587k542166n73885J357487J671785P16013L8969O61781J873342J967438
7380E626351P60816L85779K017931L117980Q10968k831175k887777P82286K549619
$$ plain form
7371 10332778 9572719 4528395 -550631 -2268606 -1659867 -1020182 -539520 449757 1483498
7362 1483498 1933058 2173704 2501838 2540287 2802656 4998311 9290998 12771201 12432815
7353 12432815 8852380 5372432 4015226 3491658 1337508 -2857190 -6946105 -8929603
7345 -8929603 -9425834 -10379724 -11626631 -10817951 -7476636 -4572345 -4112742 -3630898 -158841
7336 -158841 4255152 5093833 2487302 1219819 3398482 5513367 3897530 -789005 -5892565
7327 -5892565 -9814673 -11036163 -7890198 -1808855 2278045 1422750 -1936904 -4255210
7319 -4255210 -5704510 -8013266 -10241620 -10180610 -8146281 -6109986 -4462363 -2675290 -1779031
7310 -1779031 -2907230 -4370674 -3463654 -619250 1323768 1638961 2457386 5008144 7927528
$$ packed form
7371A0332778p60059n044324n079026j717975O08739O39685M80662R89277J033741
7362A483498M49560K40646L28134L8449K62369K195655M292687L480203l38386
7353A2432815l580435l479948j357206n23568k154150m194698m088915j983498
7345h929603m96231r53890j246907Q08680L341315K904291M59603M81844L472057
7336a58841M413993Q38681k606531j267483K178663K114885j615837m686535n103560
7327e892565l922108j221490L145965O081343M086900q55295l359654k318306
7319d255210j449300k308756k228354O1010K034329K036295J647623J787073Q96259
7310a779031j128199j463444R07020K844404J943018L15193Q18425K550758K919384
$$ plain form
7301 7927528 9572006 9559245 7822943 4621459 1877117 2040377 4774225 6751267 5676378
7292 5676378 2991491 1858894 3776169 7692395 11110613 11545319 8265555 3318484
7284 3318484 -222751 -1575061 -2807002 -5636273 -8833443 -9638689 -6953868 -2268624
7276 -2268624 2061789 4581954 4978278 3501496 736821 -2235739 -4149829 -4561707 -4322057
7267 -4322057 -4476754 -4885066 -4628608 -3574150 -2552062 -2082315 -2082703 -2799584 -4579546 -6534720
7257 -6534720 -7044419 -5985509 -4808781 -3980871 -2328211 402236 2596808 3492160 4473834
7248 4473834 6166748 6731847 5159996 3847700 5127801 7226917 6873033 4423888 2888023
7239 2888023 2772619 1636175 -1362792 -3979100 -4437934 -3558685 -2704305 -2140785 -2035266
$$ packed form
7301G927528J644478j2761j736302l201484k744342J63260K733848J977042j074889
7292E676378k684887j132597J917275L916226L418218M34706l279764m947071
7284C318484l541235j352310j231941k829271l197170q05246K684821M685244
7276b268624M330413K520165L96324j476782k764675k972560j914090m11878K39650
7267d322057j54697m08312K56458J054458J022088M69747l88p16881j779962j955174
7257f534720n09699J058910J176728Q27910J652660K730447K194572Q95352R81674
7248D473834J692914N65099j571851j312296J280101K099116l53884k449145j535865
7239B888023j15404j136444k998967k616308m58834Q79249Q54380N63520J05519
$$ plain form
7230 -2035266 -2764961 -3624985 -3273939 -1811674 -349912 1500893 5059451 9099714 9961466
7221 9961466 6423546 1986228 649256 2255234 3593380 2679057 454016 -818583
7213 -818583 151216 2218155 2310525 -1396222 -6714347 -9520525 -8701691 -6849395 -5675276
7204 -5675276 -3552412 1075979 6522650 10187063 12005877 13220614 13321686 10945306
7196 10945306 6988411 4177676 3620928 3923964 3834426 3762347 4157249 4114493 2731382
7187 2731382 981037 1064343 3876947 7718751 9833551 9129696 7123527 6157494 7002819
7178 7002819 8307891 7879352 4298707 -1833199 -7595542 -9667627 -7654594 -4677050
7170 -4677050 -3464942 -2993658 -770922 2747570 4748625 4524431 4174932 4599391 4062963
$$ packed form
7230b035266p29695q60024L51046J462265J461762J850805L558558M040263Q61752
7221I961466l537920m437318j336972J605978J338146r14323k225041j272599
7213h18583R69799K066939R2370l706747n318125k806178Q18834J852296J174119
7204e675276K122864M628391N446671L664413J818814J214737J01072k376380
7196A0945306l956895k810735n56748L03036q9538p2079L94902m2756j383111
7187B731382j750345Q3306K812604L841804K114800p03855k006169r66033Q45325
7178G002819J305072m28539l580645o131906n762343k072085K013033K977544
7170d677050J212108M71284K222736L518492K001055k24194l49499M24459n36428
$$ plain form
7161 4062963 1764714 -321796 -851844 -1513501 -3789702 -5693284 -4458386 -875845 1794974
7152 1794974 2187585 1515351 665216 -688648 -2140677 -2098655 183084 3579455 6383460
7143 6383460 7532214 6639494 4037213 915454 -1436374 -2554580 -2577904 -1775150 -972583
7134 -972583 -1417464 -2972105 -3339717 -742007 3098183 4378948 1616834 -2854928 -5954773
7125 -5954773 -7070607 -7707904 -8873244 -9604084 -8106594 -4191757 -198764 1183823 -98063
7116 -98063 -1727825 -2286269 -2595427 -3231846 -2765065 -35759 3478245 5651492 6929115
7107 6929115 9292313 12689281 14860396 14621649 13245882 12361449 12128381 11681659 10022783
7098 10022783 6545014 2057286 -955792 -671763 1626501 2992005 2421626 1312699
$$ packed form
7161D062963k298249k086510n30048o61657k276201j903582J234898L582541K670819
7152A794974L92611o72234q50135j353864j452029M2022K281739L396371K804005
7143F383460J148754q92720k602281l121759k351828j118206k3324Q02754Q02567
7134i72583m44881j554641l67612K597710L840190J280765k762114m471762l099845
7125e954773j115834o37297j165340p30840J497490L914837L992993J382587j281886
7116i8063j629762n58444l09158o36419M66781K729306L514004K173247J277623
7107F929115K363198L396968K171115k38747j375767q84433k33068m46722j658876
7098A0022783l477769m487728l013078K84029K298264J365504n70379j108927
$$ plain form
7090 1312699 688842 110613 -704566 -1489382 -2923643 -6162461 -10292328 -12599439 -12209896
7081 -12209896 -11132768 -10616377 -8979237 -4807078 -98356 2105254 1767894 1233566 1551658
7072 1551658 1665440 685421 -1037572 -2738764 -3424935 -1827929 1811302 4322753 2379214
7063 2379214 -2962037 -6609660 -5134240 -486066 2790701 2536451 101929 -2207309
7055 -2207309 -3346239 -3753011 -4604225 -6781833 -9884969 -12363089 -12969499 -11741346 -9368030
7046 -9368030 -6426961 -3807806 -2882178 -4012656 -5398457 -4819315 -2541111 -1203127 -2455232
7037 -2455232 -4766411 -5183586 -2579514 1387367 4011360 3775298 1364130 -1021632 -1625942
7028 -1625942 -662059 431571 1136121 2289801 4120827 5137960 4012331 1702756 469204
$$ packed form
7090A312699o23857n78229q15179p84816j434261l238818m129867k307111L89543
7081a2209896J077128N16391J637140M172159M708722K203610l37360n34328L18092
7072A551658J13782r80019j722993j701192o86171J597006L639231K511451j943539
7063B379214n341251l647623J475420M648174L276767k54250k434522k309238
7055b207309j138930m06772q51214k177608l103136k478120o06410J228153K373316
7046i368030K941069K619155R25628j130478j385801N79142K278204J337984j252105
7037b455232k311179m17175K604072L966881K623993k36062k411168k385762o04310
7028a625942R63883J093630P04550J153680J831026J017133j125629k309575j233552
$$ plain form
7019 469204 1267143 3304115 5744600 8458107 11186197 13365209 14993424 16505656 17512462
7010 17512462 16742157 13623436 9100156 4700537 1669644 954513 2644599 5014049
7002 5014049 5504171 3470731 943707 -27448 341441 797740 1315138 2643873 4310354
6993 4310354 4840821 4120424 4050529 6028297 8550833 8494997 4947292 797281 -443207
6984 -443207 1010209 1551912 -809585 -3634966 -3565491 -952102 1284039 2271758 3699577
6975 3699577 5943774 6893279 5414525 3229079 2173004 1973454 1950171 2517680 3546458
6966 3546458 3585266 2364100 1709114 2105258 895763 -3627998 -8672328 -10381959 -8837874
6957 -8837874 -6520031 -3838597 -121738 2470795 824314 -3448736 -4810051 -1281591
$$ packed form
7019D69204P97939K036972K440485K713507K728090K179012J628215J512232J006806
7010A7512462p70305l118721m523280m399619l030893p15131J690086K369450
7002E014049M90122k033440k527024r71155L68889M56299N17398J328735J666481
6993D310354N30467p20397o9895J977768K522536n5836l547705m150011j240488
6984d43207J453416N41703k361497k825381O9475K613389K236141R87719J427819
6975C699577K244197R49505j478754k185446j056075j99550k3283N67509J028778
6966C546458L8808j221166o54986L96144j209495m523761n044330j709631J544085
6957h837874K317843K681434L716859K592533j646481m273050j361315L528460
$$ plain form
6949 -1281591 2744894 2648130 -780616 -3582056 -3646369 -1385585 2361035 6733172 10416074
6940 10416074 12664009 14006113 14830688 14332500 11982743 9007706 7209415 7014862 7573151
6931 7573151 8063887 8095273 7415880 5986379 4089930 2163323 825026 725764 1578162
6922 1578162 1806159 361776 -1524060 -1877225 -908614 -660241 -1960125 -3767839 -5579225
6913 -5579225 -8182348 -11445001 -13431972 -12604539 -9331839 -4760654 5200 3184366
6905 3184366 3000223 89365 -2556436 -2931282 -1636192 345975 3250730 6920094 9831780
6896 9831780 11125804 11721919 12142256 11153746 7978692 3999098 837145 -1442090 -2939570
6887 -2939570 -2964475 -2123715 -2994941 -6467919 -9494489 -9047719 -6564580 -5705623 -7186024
$$ packed form
6949a281591M026485r6764l428746k801440o4313K260784L746620M372137L682902
6940A0416074K247935J342104Q24575m98188k349757k975037j798291j94553N58289
6931G573151M90736L1386o79393j429501j896449j926607j338297r9262Q52398
6922A578162K27997j444383j885836l53165R68611K48373j299884j807714j811386
6913e579225k603123l262653j986971Q27433L272700M571185M765854L179166
6905C184366j84143k910858k645801l74846J295090J982167K904755L669364K911686
6896I831780J294024N96115M20337r88510l175054l979594l161953k279235j497480
6887b939570k4905Q40760q71226l472978l026570M46770K483139Q58957j480401
$$ plain form
6878 -7186024 -8751738 -9057890 -8383187 -6281630 -1939303 3162801 6108881 6620403 7587062
6869 7587062 10649371 13451345 12495039 7348055 1051104 -2841123 -3174363 -1870393 -1915385
6860 -1915385 -4256699 -7008302 -8102289 -7682202 -6919550 -5777800 -3695483 -1570607 -949782
6851 -949782 -1527024 -1347174 496807 2914663 4481389 4599960 3122243 260829 -3027416
6842 -3027416 -5597325 -6945875 -6893011 -5341304 -3298997 -2771095 -4051028 -4509598 -2165860
6833 -2165860 818413 805412 -2082740 -4294467 -3927187 -2485535 -1748500 -2015231 -3661336
6824 -3661336 -7125020 -10485446 -10155084 -5447600 -54817 2382514 2032020 1032503 262215
6815 262215 -438164 -853369 -1045435 -1844111 -3011789 -2451646 888217 4594462 5346753
$$ packed form
6878g186024j565714l06152O74703K101557M342327N102104K946080N11522R66659
6869G587062L062309K801974r56306n146984o296951l892227l33240J303970m4992
6860a915385k341314k751603j093987M20087P62652J141750K082317K124876O20825
6851i49782n77242J79850J843981K417856J566726J18571j477717k861414l288245
6842c027416k569909j348550N2864J551707K042307N27902j279933m58570K343738
6833b165860K984273j3001k888152k211727L67280J441652P37035k66731j646105
6824c661336l463684l360426L30362M707484N392783K437331l50494r99517p70288
6815B62215p00379m15205j92066p98676j167678N60143L339863L706245P52291
$$ plain form
6806 5346753 3172652 1202976 1481438 2788859 2796839 921750 -1621929 -3735239 -5368389
6797 -5368389 -6497289 -6175665 -3750638 -748367 183662 -1170619 -1953822 -414162 1276091
6788 1276091 457191 -1721577 -2451098 -2168244 -3462204 -5832944 -5942045 -3388312 -1828561
6779 -1828561 -3207908 -5028661 -5020596 -4495210 -4794603 -4203639 -1334153 1562530 1792459
6770 1792459 138337 -1354864 -2935973 -5361886 -7026840 -6321668 -4771602 -4432296 -4268663
6761 -4268663 -2710603 -1568939 -3165771 -5459494 -4765225 -1941936 -814440 -1436433 -571152
6752 -571152 1322155 -280605 -6243892 -11512441 -12611617 -11976103 -12058644 -10453436 -4975441
6743 -4975441 764468 1950907 -30663 120559 3507615 6124915 5498141 3615970 2755116
$$ packed form
6806E346753k174101j969676K78462J307421P980j875089k543679k113310j633150
6797e368389j128900L21624K425027L002271R32029j354281p83203J539660J690253
6788A276091q18900k178768p29521K82854j293960k370740j09101K553733J559751
6779a828561j379347j820753Q065N25386k99393N90964K869486K896683K29929
6770A792459j654122j493201j581109k425913j664954P05172J550066L39306J63633
6761d268663J558060J141664j596832k293723O94269K823289J127496o21993Q65281
6752e71152J893307j602760n963287n268549j099176O35514q2541J605208N477995
6743d975441N739909J186439j981570J51222L387056K617300o26774j882171q60854
$$ plain form
6734 2755116 2375038 1548043 1490204 3756121 7489925 9950479 9088902 5074733 93348
6725 93348 -3073849 -3155272 -1427196 -147060 -135843 -616735 -951145 -1278893 -1571513 -1349439
6715 -1349439 -549622 274009 706378 655032 44790 -642587 56437 2933415 6144442
6706 6144442 6752517 4609292 2756856 3085658 3640984 2010013 -288767 396865 4018718
6697 4018718 5807925 2339757 -3489764 -5644628 -2177804 2935085 5121707 4078274
6689 4078274 2372241 1277242 213183 -628862 101104 2190861 3165737 1695829 -123349
6680 -123349 176791 1418129 305797 -3507394 -6661031 -6918218 -6169272 -7179365 -9386833
6671 -9386833 -10057268 -8402678 -6159534 -4442141 -2405697 465880 2737016 2914903 1873332
$$ packed form
6734B755116l80078q26995n7839K265917L733804K460554q61577m014169m981385
6725I3348l167197q1423J728076J280136J1217m80892l34410l27748k92620K22074
6715a349439P99817Q23631M32369n1346o10242o87377O99024K876978L211027
6706F144442O08075k143225j852436L28802N55326j630971k298780O85632L621853
6697D018718J789207l468168n829521k154864L466824N112889K186622j043433
6689D078274j706033j094999j064059q42045P29966K089757R74876j469908j819178
6680a23349L00140J241338j112332l813191l153637k57187P48946j010093k207468
6671i386833o70435J654590K243144J717393K036444K871577K271136J77887j041571
$$ plain form
6662 1873332 2083547 4686033 8107887 9597548 7897684 4568177 2641446 3540802 5443857
6653 5443857 5405911 2981295 633725 453160 1975237 3912168 6342642 9641496 12450187
6644 12450187 12759520 10559019 7503716 4204014 -13653 -4468288 -6629322 -5336394
6636 -5336394 -2663297 -1186355 -870796 -242445 621859 297084 -1419217 -3174032 -4283024
6627 -4283024 -5574642 -7758902 -10372431 -12666228 -14276923 -14699905 -13381909 -10765258
6619 -10765258 -7965857 -4963649 -664033 4395858 7152337 5532424 1690382 -337617
6611 -337617 383060 1205123 130795 -2010577 -4039020 -6307048 -8611324 -8674837 -5266919
6602 -5266919 -1355887 -1152376 -4435487 -6656287 -4837782 -647397 2907255 4890588
$$ packed form
6662A873332K10215K602486L421854J489661j699864l329507j926731Q99356J903055
6653E443857l7946k424616k347570j80565J522077J936931K430474L298854K808691
6644A2450187L09333k200501l055303l299702m217667m454635k161034J292928
6636e336394K673097J476942L15559O28351Q64304l24775j716301j754815j108992
6627d283024j291618k184260k613529k293797j610695m22982J317996K616651
6619a0765258K799401L002208M299616N059891K756479j619913l842042k027999
6611c37617P20677Q22063j074328k141372k028443k268028k304276o3513L407918
6602e266919L911032K03511l283111k220800J818505M190385L554652J983333
$$ plain form
6594 4890588 5311473 3587826 463547 -880080 1411499 4515738 4456289 1863941 679570
6585 679570 1622799 1107455 -2539755 -5807968 -5015471 -1422147 1314598 2330528 3107775
6576 3107775 3562472 2089240 -1075504 -3761980 -5246026 -6865021 -8765838 -8827217 -6124038
6567 -6124038 -3293874 -3612170 -6866521 -9730303 -9561368 -6491879 -2257311 1572306 4063326
6558 4063326 4762595 3771120 1814606 6953 -588761 453707 2386850 3469307 2198202
6549 2198202 -1277048 -4953099 -6396536 -4718499 -1411063 833568 442304 -1685705
6541 -1685705 -3143189 -2398563 -285673 809894 -740843 -4205671 -7130345 -7583854 -5740868
6532 -5740868 -3346685 -2021908 -2284235 -3638807 -4862137 -4432017 -1654384 2348376 5362437
$$ packed form
6594D890588M20885j723647l124279j343627K291579L104239n9449k592348j184371
6585F79570R43229n15344l647210l268213P92497L593324K736745J015930P77247
6576C107775M54697j473232l164744k686476j484046j618995j900817o1379K703179
6567f124038K830164l18296l254351k863782J68935L069489M234568L829617K491020
6558D063326O99269r91475j956514j807653n95714J042468J933143J082457j271105
6549B198202l475250l676051j443437J678037L307436K244631l91264k128009
6541a685705j457484P44626K112890J095567j550737l464828k924674m53509J842986
6532e740868K394183J324777k62327j354572j223330M30120K777633M002760L014061
$$ plain form
6523 5362437 5995699 4438975 1506991 -2115580 -5496358 -7401516 -7312619 -5983748 -4600374
6514 -4600374 -3872126 -4065690 -5096215 -6246369 -6529055 -5584142 -3542675 -222371 4177620
6505 4177620 7635826 7593833 4415997 1633573 1645452 3060455 3579556 3249761 2791349
6496 2791349 945921 -3319189 -7285781 -6826037 -2150060 2033102 2511781 818280 -219617
6487 -219617 -341750 -933717 -2454739 -4308710 -5719999 -5527225 -2598100 2281785 6167234
6478 6167234 6801881 4764388 1947106 -853636 -3700563 -5969247 -6517687 -5125098 -2892232
6469 -2892232 -1285365 -942534 -992193 284722 3276495 5834074 5531612 2849304 400099
6460 400099 -791669 -1948343 -3329507 -3252825 -1416495 -382609 -1839467 -3706363 -3226548
$$ packed form
6523E362437O33262j556724k931984l622571l380778j905158Q8897J328871J383374
6514d600374P28248j93564j030525j150154k82686R44913K041467L320304M399991
6505D177620L458206m1993l177836k782424J1879J415003N19101l29795m58412
6496B791349j845428m265110l966592M59744M675977M183162M78679j693501j037897
6487b19617j22133n91967j521022j853971j411289J92774K929125M879885L885449
6478F167234O34647k037493k817282k800742k846927k268684n48440J392589K232866
6469b892232J606867L42831m9659J276915K991773K557579l02462k682308k449205
6460D00099j191768j156674j381164P6682J836330J033886j456858j866896M79815
$$ plain form
6451 -3226548 -1006487 548234 1197854 2414887 4076294 4591083 3771131 2725392 1238935
6442 1238935 -1692454 -4574112 -3921034 803417 5449317 6102587 3828075 2656199 4245182
6433 4245182 6630561 7630964 7381966 7124547 6938745 5661910 2666867 -1003269 -3422978
6424 -3422978 -3413197 -1256379 1820244 4396751 5389289 4716123 3621683 3571983 4587212
6415 4587212 5471695 5853944 6770078 8680736 10290465 10319749 9129535 7315038 4111703
6406 4111703 -850039 -5246184 -6048662 -3724711 -2161293 -3951964 -7628921 -10169108
6398 -10169108 -10522758 -9736099 -8907280 -8144014 -6922748 -4830564 -2366625 -1053395 -1911211
6389 -1911211 -3793080 -4353563 -2900793 -1138117 -743256 -1421525 -1892028 -1652291 -1004614
$$ packed form
6451c226548K220061J554721O49620J217033J661407N14789q19952j045739j486457
6442A238935k931389k881658O53078M724451M645900O53270k274512j171876J588983
6433D245182K385379J000403k48998k57419j85802j276835k995043l670136k419709
6424c422978R781K156818L076623K576507R92538o73166j094440m9700J015229
6415D587212Q84483L82249R16134J910658J609729K9284j190214j814497l203335
6406D111703m961742m396145q02478K323951J563418j790671l676957k540187
6398a0169108l53650P86659Q28819P63266J221266K092184K463939J313230q57816
6389a911211j881869n60483J452770J762676L94861o78269m70503K39737O47677
$$ plain form
6380 -1004614 -201328 671246 1499698 2261879 2798148 2420981 743089 -947026 -454365
6371 -454365 2570317 5784397 6790848 5645468 4068597 3256465 3380940 4295269 5651057
6362 5651057 6924102 8140675 9900242 11970548 12788980 11331629 8625641 6320639
6354 6320639 4592389 2759700 1253024 1306605 2799798 3821175 2677247 -445054 -3837106
6345 -3837106 -5716389 -5605983 -4837838 -5160746 -6308507 -5970329 -3134411 -111261 487100
6336 487100 -462007 -324883 530968 -984924 -5232226 -8034708 -6024479 -1238183 1772079
6327 1772079 1485281 -315869 -2291099 -4649628 -7018972 -7977031 -7144453 -5813923 -5017818
6318 -5017818 -4436275 -3496365 -2130649 -210803 2289969 4238469 3981894 1622286 -730820
$$ packed form
6380a004614Q03286Q72574Q28452P62181N36269l77167j677892j690115M92661
6371d54365L024682L214080J006451j145380j576871q12132J24475R14329J355788
6362E651057J273045J216573J759567K070306Q18432j457351k705988k305002
6354F320639j728250j832689j506676N3581J493193J021377j143928l122301l392052
6345c837106j879283J10406P68145l22908j147761L38178K835918L023150N98361
6336D87100r49107J37124Q55851j515892m247302k802482K010229M786296L010262
6327A772079k86798j801150j975230k358529k369344r58059Q32578J330530P96105
6318e017818N81543R39910J365716J919846K500772J948500k56575k359608k353106
$$ plain form
6309 -730820 -1643323 -2019556 -3413612 -5990031 -8958528 -11642133 -12977747 -11248775 -5959939
6300 -5959939 574805 4886040 5428094 3308584 630853 -962124 -832716 348152 1176870
6291 1176870 1175554 1248945 1822207 1738643 271593 -990657 -59477 2513130 4471043 4849736
6281 4849736 4117638 2202794 -986939 -3511383 -2929078 -254884 483148 -2469730 -6170585
6272 -6170585 -6718710 -3186664 2782957 8602382 11067926 8173377 2268209 -1360813
6264 -1360813 -837176 261254 -843183 -1391648 2119738 7605540 10284915 9815851 9737751
6255 9737751 11030641 11340322 10394312 11061087 14153261 16746479 17002042 16375546 15315223
6246 15315223 11183579 3337050 -3427604 -4303286 -1070974 439182 -1809359 -4154566
$$ packed form
6309g30820r12503l76233j394056k576419k968497k683605j335614J728972N288836
6300e959939O534744M311235N42054k119510k677731j592977J29408J180868Q28718
6291A176870j316P3391N73262q3564j467050j262250R31180K572607J957913L78693
6281D849736p32098j914844l189733k524444N82305K674194P38032k952878l700855
6272f170585n48125L532046N969621N819425K465544k894549n905168l629022
6264a360813N23637J098430j104437n48465L511386N485802K679375m69064p8100
6255I737751J292890L09681r46010O66775L092174K593218K55563o26496j060323
6246A5315223m131644p846529o764654q75682L232312J510156k248541k345207
$$ plain form
6238 -4154566 -2649602 2515746 8019913 10611126 9173151 5370212 2512514 2651295
6230 2651295 4792679 6636048 7327809 7482575 7483777 7340207 7574146 8545358 9202067 8148349
6220 8148349 5941121 4874640 6233277 8766603 10052036 8736910 5677770 3490119
6212 3490119 4358008 7415546 9120318 7446597 4770000 4805476 7422207 8903269 7263041
6203 7263041 4560749 3100976 2031664 -343427 -2841354 -2728585 -94621 1775523
6195 1775523 738252 -1735106 -3344516 -4203450 -5448964 -5901043 -2863767 3340201 8005655
6186 8005655 6894547 1313002 -3400575 -3918440 -1664590 306530 963760 934887 336223
6177 336223 -1160081 -2749430 -2850209 -1360766 -287848 -1333214 -3468148 -3863110 -1303277
$$ packed form
6238d154566J504964N165348N504167K591213j437975l802939k857698J38781
6230B651295K141384J843369O91761J54766J202j43570K33939R71212O56709j053718
6220H148349k207228j066481J358637K533326J285433j315126l059140k187651
6212C490119Q67889L057538J704772j673721k676597L5476K616731J481062j640228
6203G263041k702292j459773j069312k375091k497927J12769K633964J870144
6195A775523j037271k473358j609410q58934j245514m52079L037276O203968M665454
6186H005655j111108n581545m713577n17865K253850J971120O57230k8873n98664
6177C36223j496304j589349j00779J489443J072918j045366k134934l94962K559833
$$ plain form
6168 -1303277 2145015 3552837 2724388 2142726 3192809 4082604 2708094 199956 -450939
6159 -450939 1334195 3246401 3932552 4660077 6219237 6722388 4441419 1104183 -3166
6150 -3166 1564576 3098576 2664891 1480420 1988745 4798541 8059565 9361024 8078959
6141 8078959 5971492 5083673 5022978 3366301 -673283 -4259065 -3822184 877828 6743284
6132 6743284 10577929 11123312 8912449 5997015 5349397 8453086 13196985 15693609 14517460
6123 14517460 11901173 10578005 10826912 11041469 9937017 7522466 4781064 2997010
6115 2997010 2770542 3280677 3057773 1736590 461540 307863 878219 830558 -516431
6106 -516431 -2359127 -3118793 -2041086 -126408 886612 564328 188930 877708 2127680
$$ packed form
6168a303277L448292J407822q28449n81662J050083Q89795j374510k508138o50895
6159d50939J785134J912206O86151P27525J559160N03151k280969l337236j107349
6150c166J567742J534000m33685j184471N08325K809796L261024J301459j282065
6141H078959k107467q87819o0695j656677m039584l585782M36881M700012N865456
6132F743284L834645N45383k210863k915434o47618L103689M743899K496624j176149
6123A4517460k616287j323168K48907K14557j104452k414551k741402j784054
6115B997010k26468N10135k22904j321183j275050j53677N70356m7661j346989
6106e16431j842696p59666J077707J914678J013020l22284l75398O88778J249972
$$ plain form
6097 2127680 2736378 2264897 927464 -911342 -2198519 -1344038 1673738 4297292 4144169
6088 4144169 2140244 1255492 2684556 5092202 7220905 9161730 10963552 11900462 11559993
6079 11559993 10267073 8243142 5642677 3385404 2541432 2950481 3769835 4953477 6525107
6070 6525107 7046490 5161515 2371526 1615918 3029861 3940477 3332520 3015888 3496835
6061 3496835 2333377 -1509504 -5008406 -5462681 -4765325 -6099471 -8525524 -8581464 -6080332
6052 -6080332 -4448158 -5355841 -6396764 -4837534 -1149017 2137706 3298363 2359860 550165
6043 550165 -591398 -547760 -481880 -1629970 -3200302 -3116447 -770302 2262828 4183643
6034 4183643 4312973 2690483 74216 -1535868 -330249 2649750 4020932 2294773
$$ packed form
6097B127680O08698m71481j337433j838806j287177Q54481L017776K623554j53123
6088D144169k003925q84752J429064K407646K128703J940825J801822R36910l40469
6079A1559993j292920k023931k600465k257273q43972M09049Q19354J183642J571630
6070F525107N21383j884975k789989p55608J413943R10616o07957l16632M80947
6061C496835j163458l842881l498902m54275O97356j334146k426053n5940K501132
6052f080332J632174r07683j040923J559230L688517L286723J160657r38503j809695
6043E50165j141563M3638O5880j148090j570332Q3855K346145L033130J920815
6034D183643J29330j622490k616267j610084J205619K979999J371182j726159
$$ plain form
6026 2294773 117278 820754 3780668 4991559 2030017 -3105290 -6399747 -5930679 -3037500
6017 -3037500 -245296 1071557 1174506 994989 1111259 1409215 1407785 913321 393909 525927
6007 525927 1333130 2129146 2447089 2511931 2502423 2071184 1255773 1089462 2156465 3054715
5997 3054715 1798774 -1269265 -3446300 -2874549 -553014 1195858 1095538 -581414 -2660764
5988 -2660764 -3795620 -3653098 -3594809 -4894563 -6269782 -5100183 -1514853 1005858 172195
5979 172195 -2119743 -2765892 -1375930 542858 2305077 3638667 3198066 231794 -3169051
5970 -3169051 -4073814 -2476302 -847167 -525351 -870395 -1508111 -2886656 -4618962 -5527426
5961 -5527426 -5488774 -5379803 -5337496 -4964278 -4867855 -5755667 -6291164 -4353802 -422715 2783647
$$ packed form
6026B294773k177495P03476K959914J210891k961542n135307l294457M69068K893179
6017c037500K792204J316853J02949j79517J16270K97956j430m94464n19412J32018
6007E25927Q07203P96016L17943O4842r508m31239q15411j66311J067003Q98250
5997C054715j255941l068039k177035N71751K321535J748872j00320j676952k079350
5988b660764j134856J42522N8289j299754j375219J169599L585330K520711q33663
5979A72195k291938o46149J389962J918788J762219J333590m40601k966272l400845
5970c169051r04763J597512J629135L21816l45044o37716j378545j732306r08464
5961e527426L8652J08971M2307L73218R6423q87812n35497J937362L931087L206362
$$ plain form
5951 2783647 4074203 4564245 4642236 3235351 677540 -844346 -793282 -1222043 -2810409
5942 -2810409 -2936164 356262 5020000 7785211 8086382 7103713 5104835 2292142 470534
5933 470534 1028428 2409950 2177986 685375 293430 1774325 3911269 6018054 8384307
5924 8384307 10492381 10998796 9425046 6201330 1593822 -3553897 -6829851 -6432093 -3970133
5915 -3970133 -2703579 -3231122 -3377772 -2127846 -804962 -127649 852467 2070411 1721466
5906 1721466 -333311 -1103013 1611762 5848177 8028116 7181644 4606913 961153 -3734399
5897 -3734399 -8100042 -10034497 -9246047 -7165161 -4508801 -926024 2962009 5366582
5889 5366582 5785348 5846427 6812768 7668330 6717369 4043377 1385268 343584 1503999
$$ packed form
5951B783647J290556M90042P7991j406885k557811j521886N1064m28761j588366
5942b810409j25755L292426M663738K765211L01171r82669j998878k812693j821608
5933D70534N57894J381522k31964j492611l91945J480895K136944K106785K366253
5924H384307K108074N06415j573750l223716m607508n147719l275954L97758K461960
5915c970133J266554n27543j46650J249926J322884O77313R80116J217944l48945
5906A721466k054777p69702K714775M236415K179939q46472k574731l645760m695552
5897c734399m365643j934455P88450K080886K656360L582777L888033K404573
5889E366582M18766O1079R66341Q55562r50961k673992k658109j041684J160415
$$ plain form
5880 1503999 4435173 7504887 8431798 6309056 2823019 465491 -135852 -85647 69653
5871 69653 940921 2634931 4214973 5322850 6699697 8182087 7783725 4324271 -132101
5862 -132101 -2278760 -1376956 754502 3011924 5877686 8790298 9226429 5850997 933188
5853 933188 -2014780 -2047818 -897523 -240213 -439734 -1354887 -2603768 -3095608 -1874761
5844 -1874761 280007 1306793 258972 -1697985 -2914832 -2867421 -1796138 154733 2630005
5835 2630005 4579816 5040624 4306995 3736634 4334303 5812551 7003290 6891383 5178611
5826 5178611 2141523 -1623554 -5159545 -7298429 -7497183 -6476323 -5343718 -4038781
5818 -4038781 -1586754 1777813 3969369 3533164 1800495 1123611 1520534 814342 -1877088
$$ packed form
5880A503999K931174L069714R26911k122742l486037k357528o01343N0205J55300
5871F9653Q71268J694010J580042J107877J376847J482390l98362l459454m456372
5862a32101k146659R01804K131458K257422K865762K912612M36131l375432m917809
5853I33188k947968l3038J150295O57310j99521r15153j248881m91840J220847
5844a874761K154768J026786j047821j956957j216847M7411J071283J950871K475272
5835B630005J949811M60808p33629n70361N97669J478248J190739j11907j712772
5826E178611l037088l765077l535991k138884j98754J020860J132605J304937
5818d038781K452027L364567K191556m36205j732669o76884L96923p06192k691430
$$ plain form
5809 -1877088 -4573242 -5030231 -3557948 -2251239 -2241090 -2690996 -2092158 237659 3688949
5800 3688949 6719614 7760670 6296590 3247958 261678 -1408590 -1655771 -1590075 -2614775
5791 -2614775 -4811965 -6440319 -5826424 -3610286 -2103261 -2434528 -3582431 -4436288 -5243890
5782 -5243890 -6210835 -6203964 -4370407 -2120424 -1725945 -3153096 -3852589 -2003401 1117299
5773 1117299 2464027 406066 -3579972 -6128905 -5174385 -2289897 -1211656 -3321192
5765 -3321192 -5491754 -3807767 1256823 5373185 5988525 5038324 5169212 5566575 3538763
5756 3538763 -1107053 -5602947 -7665713 -7254269 -4960722 -1004019 3376769 5625656
5748 5625656 4650340 2700530 2641663 3990976 3668802 670723 -2189984 -2176364 -539985
$$ packed form
5809a877088k696154m56989J472283J306709J0149m49906N98838K329817L451290
5800C688949L030665J041056j464080l048632k986280j670268k47181O5696j024700
5791b614775k197190j628354O13895K216138J507025l31267j147903q53857q07602
5782e243890r66945O871J833557K249983L94479j427151o99493J849188L120700
5773A117299J346728k057961l986038k548933R54520K884488J078241k109536
5765c321192k170562J683987N064590M116362O15340r50201J30888L97363k027812
5756C538763m645816m495894k062766M11444K293547L956703M380788K248887
5748E625656r75316j949810n8867J349313l22174k998079k860707J3620J636379
$$ plain form
5739 -539985 -808098 -3987454 -7371113 -8070954 -5992802 -2837993 207562 2655187 3725817
5730 3725817 2723424 101816 -2961731 -5792506 -7964329 -8315853 -5988004 -2666933
5722 -2666933 -1846627 -4663963 -7843026 -7390603 -3507720 -19433 697563 140568 740633
5713 740633 2620352 4451026 5831982 6962577 6945248 4671128 1337723 -44861 1643353
5704 1643353 4060982 4463475 2868859 899322 -1183825 -4293731 -7944225 -10096900
5696 -10096900 -9959491 -9121709 -9064745 -8964538 -7141473 -3771904 -893703 -87396 -1085994
5687 -1085994 -2415797 -2657132 -1333275 766464 2346058 3120088 4106564 5965896 7864889
5678 7864889 8770272 8929321 8918139 8257659 6735779 6275774 8986551 13316928 14754166
$$ packed form
5739e39985k68113l179356l383659o99841K078152L154809L045555K447625J070630
5730C725817j002393k621608l063547k830775k171823l51524K327849L321071
5722b666933Q20306k817336l179063M52423L882883L488287P16996n56995O00065
5713G40633J879719J830674J380956J130595j7329k274120l333405j382584J688214
5704A643353K417629M02493j594616j969537k083147l109906l650494k152675
5696a0096900J37409Q37782N6964J00207J823065L369569K878201Q06307r98598
5687a085994j329803k41335J323857K099739J579594P74030R86476J859332J898993
5678G864889R05383J59049j1182o60480j521880m60005K710777M330377J437238
$$ plain form
5669 14754166 11202608 5485008 1467701 -102460 -543010 -435191 -155422 -1299112 -4627562
5660 -4627562 -7574806 -6765592 -2690377 856157 1852131 1718192 1799857 1454008 684959
5651 684959 1574497 5107370 8890108 10230438 9665887 9096275 7992484 4391097 -971863
5642 -971863 -4448589 -3816383 -736527 1690342 2170672 1355927 134644 -1149832 -2290976
5633 -2290976 -2757356 -1791014 839622 4108358 6355288 6958341 6576049 5452842 3066118
5624 3066118 442666 725939 5031646 9185879 7865236 1648857 -3378913 -3391807 -762976
5615 -762976 767562 1213846 2297304 3277863 2257197 155237 70602 3101282 7408165
5606 7408165 11100334 13513582 13763980 10829305 5766354 1508633 -686429 -2810778
$$ packed form
5669A4754166l551558n717600m017307j570161m40550J07819K79769j143690l328450
5660d627562k947244Q09214M075215L546534R95974j33939Q1665l45849p69049
5651F84959Q89538L532873L782738J340330n64551n69612j103791l601387n362960
5642i71863l476726O32206L079856K426869M80330q14745j221283j284476j141144
5633b290976m66380R66342K630636L268736K246930O03053l82292j123207k386724
5624C066118k623452K83273M305707M154233j320643o216379n027770j2894K628831
5615g62976J530538M46284J083458R80559j020666k101960q4635L030680M306883
5606G408165L692169K413248K50398k934675n062951m257721k195062k124349
$$ plain form
5598 -2810778 -6867206 -11473185 -13197349 -10504200 -5073965 283842 3783839 5020593
5590 5020593 4584557 3788331 3907064 4970493 5652608 5006306 4093017 4927590 7515505
5581 7515505 9106422 7575421 4787138 4721011 8188820 11514115 11388678 9099544 8226647
5572 8226647 9567520 10536807 8877605 4719922 -801381 -6653104 -11239179 -12666679
5564 -12666679 -10606836 -6722156 -2864270 -111260 410903 -2078889 -5813703 -6598786
5556 -6598786 -1941174 5755770 11455042 12354323 9567743 5910339 3443905 2738362 3019253
5547 3019253 2767797 1034991 -1501937 -3094941 -2624047 -749083 454666 -706549 -3479308
5538 -3479308 -4712276 -2021903 3321083 8026389 10941861 13368133 15140961 13625218
$$ packed form
5598b810778m056428m605979j724164K693149N430235N357807L499997J236754
5590E020593m36036p96226J18733J063429O82115o46302r13289Q34573K587915
5581G515505J590917j531001k788283o6127L467809L325295j25437k289134q72897
5572H226647J340873R69287j659202m157683n521303n851723m586075j427500
5564a2666679K059843L884680L857886K753010N22163k489792l734814p85083
5556f598786M657612P696944N699272Q99281k786580l657404k466434p05543K80891
5547C019253k51456j732806k536928j593004M70894J874964J203749j161215k772759
5538c479308j232968K690373N342986M705306K915472K426272J772828j515743
$$ plain form
5530 13625218 8294955 3396473 3148461 6172352 7806973 6554274 4783112 4018585
5522 4018585 3583405 3881901 6753000 11381137 13629535 11337561 7186971 4301974 2102101
5513 2102101 -801646 -2471366 -191395 4414090 6707084 5094311 2437028 1389317
5505 1389317 1483953 1449177 1538986 2254872 2806080 2261674 959684 -234089 -1061933 -1686092
5495 -1686092 -2460488 -4208199 -7275800 -9894439 -9294328 -5373042 -1513122 -471616 -1081205
5486 -1081205 -651375 919496 1715308 1504579 2142672 4249685 6012898 6106814 5788690
5477 5788690 6807349 8635700 9267102 7964829 5813060 3954124 2652843 2080099 2686233
5468 2686233 4246640 5411625 4994162 3350699 1804027 846794 -328168 -2275167 -3931366
$$ packed form
5530A3625218n330263m898482k48012L023891J634621j252699j771162p64527
5522D018585m35180K98496K871099M628137K248398k291974m150590k884997k199873
5513B102101k903747j669720K279971M605485K292994j612773k657283j047711
5505A389317R4636l4776Q9809P15886N51208n44406j301990j193773q27844o24159
5495a686092p74396j747711l067601k618639O00111L921286L859920J041506o09589
5486a081205M29830J570871P95812k10729O38093K107013J763213R3916l18124
5477E788690J018659J828351O31402j302273k151769j858936j301281n72744O06134
5468B686233J560407J164985m17463j643463j546672r57233j174962j946999j656199
$$ plain form
5459 -3931366 -3531201 -819065 2324496 3825683 3604252 3305188 3988748 4762674 4011723
5450 4011723 1431595 -1846739 -4903423 -7771150 -10192808 -10734518 -8330561 -4308762
5442 -4308762 -1502527 -1160563 -1914313 -2097428 -1698171 -1319799 -715266 314143 777704
5433 777704 -59556 -1030144 -805391 -462041 -1819454 -3627097 -2550265 1451131 3936536
5424 3936536 1758202 -2783430 -5747804 -6982314 -8731366 -10711290 -10373637 -7490822
5416 -7490822 -4763390 -3497734 -2060592 362633 1649717 256174 -1659915 -1161658
5408 -1161658 897101 915696 -2296184 -5836400 -6580486 -4872476 -3411557 -3674163 -4771716
5399 -4771716 -5430213 -5552364 -5155606 -2955138 2250685 8751429 12355851 10853157 6857179
$$ packed form
5459c931366M00165K712136L143561J501187k21431k99064O83560P73926p50951
5450D011723k580128l278334l056684k867727k421658n41710K403957M021799
5442d308762K806235L41964p53750j83115L99257L78372O04533J029409M63561
5433G77704q37260r70588K24753L43350j357413j807643J076832M001396K485405
5424C936536k178334m541632k964374j234510j749052j979924L37653K882815
5416g490822K727432J265656J437142K423225J287084j393543j916089M98257
5408a161658K058759J8595l211880l540216p44086J708010J460919k62606j097553
5399d771716o58497j22151L96758K200468N205823O500744L604422j502694l995978
$$ plain form
5390 6857179 4645231 4916805 4565717 1438157 -2781704 -5087275 -4934840 -4355823 -5047238
5381 -5047238 -6383800 -6340173 -4070051 -1304146 -590770 -2029200 -3011056 -2070350 -1384370
5372 -1384370 -3508456 -6894139 -7452253 -4151578 -102161 2024574 2508526 1939906 -449521
5363 -449521 -4184284 -6327998 -5202366 -3095608 -2980287 -4438562 -5109272 -4366841 -3117277
5354 -3117277 -1586084 28718 103873 -2343450 -5170095 -5552797 -4101125 -3605498 -4392864
5345 -4392864 -4248927 -2816909 -2557309 -4561705 -6440862 -5679806 -2806107 49826 1856707
5336 1856707 2705645 2705102 2120167 1610162 1523074 1769695 2574168 4096311 5277866 4858999
5326 4858999 3920828 5353924 9796773 13918896 14160189 10894400 7528549 6554642 7877298
$$ packed form
5390F857179k211948K71574l51088l127560m219861k305571J52435N79017o91415
5381e047238j336562M3627K270122K765905P13376j438430r81856R40706O85980
5372a384370k124086l385683n58114L300675M049417K126735M83952n68620k389427
5363d49521l734763k143714J125632K106758J15321j458275o70710P42431J249564
5354c117277J531193J614802P5155k447323k826645l82702J451672M95627p87366
5345d392864J43937J432018K59600k004396j879157P61056K873699K855933J806881
5336A856707Q48938n43n84935n10005q7088K46621Q04473J522143J181555m18867
5326D858999r38171J433096M442849M122123K41293l265789l365851r73907J322656
$$ plain form
5317 7877298 10056578 11422610 10320337 6125852 639407 -2692344 -2010887 742452
5309 742452 1775102 -123814 -1988663 -397486 3976820 7238858 7523040 7019141 7910549
5300 7910549 8825543 7377405 4255338 2008122 955195 -639804 -2831228 -3571003 -2285031
5291 -2285031 -1088258 -1709549 -3433747 -4809659 -5437526 -5383946 -4603637 -3596683 -3125609
5282 -3125609 -2882468 -1871453 -192656 1095315 1657925 1625259 196316 -3073356 -6024762
5273 -6024762 -5917819 -3676081 -2862756 -4099307 -4066812 -963878 2661989 4010163 3556936
5264 3556936 2677515 968662 -1817695 -3927806 -3987581 -2914959 -1593886 750191 3907397
5255 3907397 5294814 3596671 1141285 267394 105807 -518068 -206302 1701491 2103829
$$ packed form
5317G877298K179280J366032j102273m194485n486445l331751O81457K753339
5309G42452J032650j898916j864849J591177M374306L262038K84182n03899Q91408
5300G910549R14994j448138l122067k247216j052927j594999k191424p39775J285972
5291b285031J196773o21291j724198j375912o27867N3580P80309J006954M71074
5282c125609K43141J011015J678797J287971N62610l2666j428943l269672k951406
5273f024762J06943K241738Q13325j236551L2495L102934L625867J348174m53227
5264C556936q79421j708853k786357k110111n9775J072622J321073K344077L157206
5255C907397J387417j698143k455386q73891j61587o23875L11766J907793M02338
$$ plain form
5246 2103829 -1349840 -5134946 -3963321 1364386 4801384 3156930 -734112 -2699603
5238 -2699603 -1404693 2151366 6050618 8160762 7880132 6916427 6429142 4854156 1114446
5229 1114446 -2069566 -1735215 243783 869 -1727682 -784003 3273820 6459116 6953941
5220 6953941 7213163 8620759 9091201 7541037 6139362 6127320 5487296 2891339 260446
5211 260446 -718366 -1048545 -1211410 847447 5730473 9729326 9124098 5117011 1690705
5202 1690705 425237 -24646 -905993 -2104325 -2618932 -703173 4831159 12032052 16498802
5193 16498802 16158294 13331035 10792464 8488346 5900635 4544793 5344930 6098773 4655893
5184 4655893 2482521 1834160 1365863 -1648647 -5975929 -7318599 -4350236 -386860 1263349
$$ packed form
5246B103829l453669l785106J171625N327707L436998j644454l891042j965491
5238b699603J294910L556059L899252K110144k80630r63705m87285j574986l739710
5229A114446l184012L34351J978998k42914j728551R43679M057823L185296M94825
5220F953941K59222J407596M70442j550164j401675j2042o40024k595957k630893
5211B60446r78812l30179j62865K058857M883026L998853o05228m007087l426306
5202A690705j265468m49883q81347j198332n14607J915759N534332P200893M466750
5193A6498802l40508k827259k538571k304118k587711j355842Q00137P53843j442880
5184D655893k173372o48361m68297l014510m327282j342670K968363L963376J650209
$$ plain form
5175 1263349 676018 -498821 -1617739 -2801612 -3888391 -4629538 -4990498 -4814518 -3875286
5166 -3875286 -2342054 -705585 463397 361783 -1570809 -4432641 -6177863 -5923599 -4831349
5157 -4831349 -4012022 -3065403 -1618321 -497389 -31527 949941 2799000 3718585 2824932
5148 2824932 2534663 5143004 8555055 8561629 4495715 -421104 -3788631 -5947676 -7328658
5139 -7328658 -7029891 -4693086 -1475021 1399186 3274621 3352110 1465890 -529401 -516495
5130 -516495 703323 480306 -1325651 -1913223 -39472 2018608 2157426 1316937 1092910
5121 1092910 1113775 875146 1811527 4747654 6898145 4628495 -1259856 -5883321 -6120117
5112 -6120117 -3671105 -1798113 -1401320 -1525518 -1744762 -2116663 -1899499 -419423 1162388
$$ packed form
5175A263349n87331j174839j118918j183873j086779p41147l60960J75980R39232
5166c875286J533232J636469J168982j01614j932592k861832j745222K54264J092250
5157d831349Q19327R46619J447082J120932M65862R81468J849059R19585q93653
5148B824932k90269K608341L412051O574m065914m916819l367527k159045j380982
5139g328658K98767K336805L218065K874207J875435P7489j886220j995291J2906
5130e16495J219818k23017j805957n87572J873751K058080J38818q40489k24027
5121A092910K0865k38629R36381K936127K150491k269650n888351m623465k36796
5112f120117K449012J872992L96793j24198k19244l71901K17164J480076J581811
$$ plain form
5103 1162388 973239 -552795 -798808 1234650 3271115 3197005 2215499 2401789 2610445
5094 2610445 -74346 -5176340 -8518093 -7957307 -6413475 -7402682 -9988161 -10640939 -8574221
5085 -8574221 -6429698 -6095187 -6297250 -4736297 -930614 3661647 7295617 9145402 9450981
5076 9450981 9024307 8710915 9257075 11148675 13831622 15492563 14915162 13481997 13677243
5067 13677243 15307703 15196299 11575069 6875872 4615255 4948247 5075704 3136446 35091
5058 35091 -2076947 -1873547 150644 1949815 1924534 1189046 2530786 6338949 9296750
5049 9296750 8444673 4833580 1436654 -865018 -2913029 -4192822 -2985630 548550
5041 548550 3757279 4412796 2887261 1252172 1141746 2380676 3087170 1645711 -926703
$$ packed form
5103A162388j89149j526034k46013K033458K036465p4110r81506J86290K08656
5094B610445k684791n101994l341753N60786J543832r89207k585479o52778K066718
5085h574221K144523L34511k02063J560953L805683M592261L633970J849785L05579
5076I450981m26674l13392N46160J891600K682947J660941n77401j433165J95246
5067A3677243J630460j11404l621230m699197k260617L32992J27457j939258l101355
5058C5091k112038K03400K024191J799171k5281p35488J341740L808163K957801
5049I296750q52077l611093l396926k301672k048011j279793J207192L534180
5041E48550L208729O55517j525535j635089j10426J238930P06494j441459k572414
$$ plain form
5032 -926703 -1594610 994221 4602016 6043029 4476392 1307730 -1544446 -2301451 -163933
5023 -163933 3116912 4292840 2585460 660898 413921 390443 -792683 -1459159 -26754
5014 -26754 1600547 1157703 232076 1576170 4003390 4049374 1710182 671095 3255595
5005 3255595 8247933 12990568 14768022 11372082 3627456 -3707446 -6751727 -6903527
4997 -6903527 -7331274 -7321941 -4479907 -476307 940512 631968 2878417 7597285 9618211
4988 9618211 6533878 1898777 -590294 -1147626 -919163 93448 578414 -1826027 -5898999
4979 -5898999 -6807718 -2594286 3383277 8011245 11819324 14889311 14360768 9203523 3481518
4970 3481518 1458298 2466541 3404238 3254779 2361421 212878 -3010676 -5071653 -4562644
$$ packed form
5032i26703o67907K588831L607795J441013j566637l168662k852176p57005K137518
5023a63933L280845J175928j707380j924562k46977k3478j183126o66476J432405
5014b6754J627301m42844r25627J344094K427220M5984k339192j039087K584500
5005C255595M992338M742635J777454l395940p744626p334902l044281j51800
4997f903527m27747R333K842034M003600J416819l08544K246449M718868K020926
4988I618211l084333m635101k489071n57332K28463J012611M84966k404441m072972
4979e898999r08719M213432N977563M627968L808079L069987n28543n157245n722005
4970C481518k023220J008243R37697j49459q93358k148543l223554k060977N09009
$$ plain form
4961 -4562644 -3104373 -2492875 -1906414 -62295 2098040 2975119 2524219 1162762 -1319748
4952 -1319748 -4042684 -4506347 -1731883 1780941 2710741 169410 -4178755 -7423754 -6973171
4943 -6973171 -3360123 -1133937 -3800665 -8471197 -9499109 -6764346 -5254168 -6512138
4935 -6512138 -6449444 -2628146 2262989 5780896 8664835 10580124 9155691 5771476 6112190
4926 6112190 11781732 17049807 17071952 13704203 10177488 6251314 2292143 1787858 5351779
4917 5351779 7978085 6648615 5027396 6332293 7567607 5607589 3127859 3451672
4909 3451672 5016624 5679371 6872362 9123440 9610613 8266718 9248824 12296143 11089926
4900 11089926 4893476 1955190 5358839 6480033 285682 -4486000 -252186 5870031
$$ packed form
4961d562644J458271O11498N86461J844119K160335Q77079m50900j361457k482510
4952a319748k722936m63663K774464L512824R29800k541331m348165l244999M50583
4943f973171L613048K226186k666728m670532j027912K734763J510178j257970
4935f512138O2694L821298M891135L517907K883939J915289j424433l384215L40714
4926F112190N669542N268075K2145l367749l526715l926174l959171n04285L563921
4917E351779K626306j329470j621219J304897J235314j960018k479730L23813
4909C451672J564952O62747J192991K251078M87173j343895R82106L047319j206217
4900A1089926o196450k938286L403649J121194o194351m771682M233814O122217
$$ plain form
4892 5870031 5105262 2514858 6293614 12090534 12349923 11315971 15704359 20597140 20351445
4883 20351445 22017714 30285452 32472138 19762479 8669377 15196274 23521961 13530276
4875 13530276 1978114 8688860 -7432779 -112744917 -284186611 -395106102 -355725436
4868 -355725436 -221384754 -115547267 -83494353 -76947255 -55465123 -34513742 -33766913
4861 -33766913 -38706173 -32429884 -24007938 -24595856 -25364005 -17606872 -10693379 -13004838
4853 -13004838 -15060128 -7490846 1233297 10856 -6552436 -8993116 -9284650 -12771169
4845 -12771169 -15134292 -10820559 -5219991 -5838907 -9023088 -7052677 -1688326 264626
4837 264626 -1017263 -1038615 -451466 -2201610 -3849415 -1877103 495576 -1551556 -5431404
$$ packed form
4892E870031p64769k590404L778756N796920K59389j033952M388388M892781k45695
4883B0351445J666269Q267738K186686j2709659j1093102O526897Q325687r991685
4875A3530276j1552162O710746j6121639j05312138j71441694j10919491L9380666
4868c55725436J34340682J05837487L2052914O547098K1482132K0951381P46829
4861c3766913m939260O276289Q421946n87918p68149P757133O913493k311459
4853a3004838k055290P569282Q724143j222441o563292k440680k91534l486519
4845a2771169k363123M313733N600568o18916l184181J970411N364351J952952
4837B64626j281889k1352N87149j750144j647805J972312K372679k047132l879848
$$ plain form
4828 -5431404 -5766384 -4337103 -6733012 -11988018 -14250354 -12862934 -12471434 -14172522 -14369426
4819 -14369426 -12188509 -10957647 -11895228 -12437886 -11478123 -10915758 -11260276 -10474096 -8190131
4810 -8190131 -7024327 -8503638 -10798287 -11500716 -10346256 -8555159 -7190386 -6438227 -5510873
4801 -5510873 -3690400 -1961808 -2131698 -3752368 -4266710 -3167392 -3013465 -4766991 -5536894
4792 -5536894 -3265777 -226650 1018650 1742652 3715319 5086698 3785599 2152916
4784 2152916 3376342 5451801 3926866 -497008 -2347432 735450 5182382 7098187
4776 7098187 6586993 5443024 3952166 1584723 -1258144 -3448701 -4013923 -2641738 -336138
4767 -336138 885083 84658 -1624694 -3264728 -5539066 -8525408 -9778154 -7330247 -3109303
$$ packed form
4828e431404l34980J429281k395909n255006k262336J387420L91500j701088j96904
4819a4369426K180917J230862r37581n42658R59763N62365l44518P86180K283965
4810h190131J165804j479311k294649p02429J154460J791097J364773P52159R27354
4801e510873J820473J728592j69890j620670n14342J099318J53927j753526p69903
4792e536894K271117L039127J245300P24002J972667J371379j301099j632683
4784B152916J223426K075459j524935m423874j850424L082882M446932J915805
4776G098187n11194j143969j490858k367443k842867k190557n65222J372185K305600
4767c36138J221221q00425j709352j640034k274338k986342j252746K447907M220944
$$ plain form
4758 -3109303 -511960 235895 1266499 2628053 2122520 -656720 -3400735 -4519002 -4741633
4749 -4741633 -4875141 -4427643 -3026034 -1122667 1194814 4269319 7350678 8644289 7308607
4740 7308607 4283885 1250970 -158247 1134711 4250747 6107899 4562859 1397050
4732 1397050 227922 1899379 4070597 4893010 4451156 2567276 -1749317 -7483212 -10693158
4723 -10693158 -8442982 -2654114 1597390 1469625 -901861 -1193556 2070061 5859360
4715 5859360 6317020 3394160 594758 440521 2137063 4012241 5733429 6786683 5251502
4706 5251502 445444 -4887197 -7528236 -7767446 -8093829 -9066446 -9160013 -7987100 -6882726
4697 -6882726 -6405248 -5653642 -4182104 -2685240 -1816381 -1915767 -3466144 -6112906 -7872320
$$ packed form
4758c109303K597343P47855J030604J361554n05533k779240k744015j118267k22631
4749d741633j33508M47498J401609J903367K317481L074505L081359J293611j335682
4740G308607l024722l032915j409217J292958L116036J857152j545040l165809
4732A397050j169128J671457K171218Q22413m41854j883880m316593n733895l209946
4723a0693158K250176N788868M251504j27765k371486k91695L263617L789299
4715E859360M57660k922860k799402j54237J696542J875178J721188J053254j535181
4706E251502m806058n332641k641039k39210l26383r72617r3567J172913J104374
4697f882726M77478P51606J471538J496864Q68859r9386j550377k646762j759414
$$ plain form
4688 -7872320 -7219168 -5334487 -4376572 -4357049 -3863829 -2901285 -2438470 -1920286 -57528
4679 -57528 2383816 3371378 2749402 1821305 488894 -1892444 -3389880 -1229940 3173158
4670 3173158 5043638 2901093 401648 358794 1019350 158195 -1023833 -704506 77639
4661 77639 -400958 -1472567 -1916206 -2561356 -4322954 -5725647 -5112373 -3377924 -1846727
4652 -1846727 403958 3989535 6148709 4174517 548084 433178 4625560 9116677
4644 9116677 11439547 12897132 13833474 11601469 5583479 211690 -459703 1463934 1047938
4635 1047938 -2075652 -3665362 -1721560 670398 314435 -1557612 -1662952 568591 2853968
4626 2853968 3503819 2844882 1650511 52641 -1889412 -3882171 -5704554 -6750745 -5636544
$$ packed form
4688g872320O53152J884681R57915J9523M93220R62544M62815N18184J862758
4679e7528K441344R87562o21976r28097j332411k381338j497436K159940M403098
4670C173158J870480k142545k499445m2854O60556q61155j182028L19327P82145
4661G7639m78597j071609m43639o45150j761598j402693O13274J734449J531197
4652a846727K250685L585577K159174j974192l626433j14906M192382M491117
4644I116677K322870J457585R36342k232005o017990n371789o71393J923637m15996
4635A047938l123590j589710J943802K391958l55963j872047j05340K231543K285377
4626B853968O49851o58937j194371j597870j942053j992759j822383j046191J114201
$$ plain form
4617 -5636544 -1831438 2444799 3846802 1804073 -970433 -2329721 -2987081 -4056791
4609 -4056791 -4605619 -3500489 -1951789 -1929243 -3062010 -3307592 -2101280 -858793 -769571
4600 -769571 -1842630 -3647734 -5287381 -5270048 -3311605 -1631389 -2398817 -4565810 -5591200
4591 -5591200 -5597667 -6781409 -8854763 -8560558 -4581913 168319 2527506 2707442 2448834
4582 2448834 2120275 1646047 2179526 4429417 6662746 6714730 5315918 5451601 8608812
4573 8608812 13019431 15526380 14404620 10672039 7124537 5583495 4951921 2923583
4565 2923583 -404673 -2241738 -867298 2058957 3763340 3289901 1296801 -1268718
4557 -1268718 -3066134 -2603873 -25194 2696308 4479122 6350085 8636353 9115237 6255534
$$ packed form
4617e636544L805106M276237J402003k042729k774506j359288o57360j069710
4609d056791n48828J105130J548700K2546j132767k45582J206312J242487Q9222
4600g69571j073059j805104j639647J7333J958443J680216p67428k166993j025390
4591e591200o467j183742k073354K94205L978645M750232K359187J79936k58608
4582B448834l28559m74228N33479K249891K233329N1984j398812J35683L157211
4573H608812M410619K506949j121760l732581l547502j541042o31574k028338
4565B923583l328256j837065J374440K926255J704383m73439j993100k565519
4557a268718j797416M62261K578679K721502J782814J870963K286268M78884k859703
$$ plain form
4548 6255534 2693132 2665628 6548885 10293779 10145767 6160498 1305870 -1354730 -906777
4539 -906777 572543 -206407 -3972915 -7623125 -7898426 -5277383 -2727585 -1795796 -1854463
4530 -1854463 -2178552 -2514946 -2218456 -1019922 -298736 -1672540 -4709471 -7658625 -9570648
4521 -9570648 -9899653 -7462470 -2485465 1589936 1722654 -76042 609657 3790975 5231580
4512 5231580 3632344 2755951 4795025 6302557 3581076 -1647413 -5377281 -7173493
4504 -7173493 -9132085 -11121568 -11050012 -8827116 -6509535 -4991635 -3619517 -2757131 -3777501
4495 -3777501 -6407096 -8576142 -9106624 -8523186 -7354690 -5780221 -4735366 -4970001 -5002822
4486 -5002822 -2497432 2049279 5427592 5954769 5132564 4459447 3260139 911989 -1193767
$$ packed form
4548F255534l562402k7504L883257L744894j48012l985269m854628k660600M47953
4539i06777J479320p78950l766508l650210k75301K621043K549798R31789n8667
4530a854463l24089l36394K96490J198534P21186j373804l036931k949154j912023
4521i570648l29005K437183M977005M075401J32718j798696O85699L181318J440605
4512E231580j599236q76393K039074J507532k721481n228489l729868j796212
4504g173493j958592j989483P1556K222896K317581J517900J372118Q62386j020370
4495c777501k629595k169046n30482N83438J168496J574469J044855k34635l2821
4486e002822K505390M546711L378313N27177q22205o73117j199308k348150k105756
$$ plain form
4477 -1193767 -1618928 -967538 -375879 454927 2072336 3632252 4183746 4239749 4326578 3401763
4467 3401763 805791 -1483691 -1033815 1429881 3185690 3758721 5113463 7581521 8721185
4458 8721185 7270677 5569143 6261782 8380891 8681429 5996684 2606281 1516473 3370248
4449 3370248 5919161 6159348 3371758 76059 -826906 288860 382391 -1894072 -4363009
4440 -4363009 -4566097 -2823840 -767743 1229474 3259173 4152900 3012082 1490006 1926084
4431 1926084 3546866 3108881 -397654 -3944733 -4052086 -464736 4376684 7974404 9110180
4422 9110180 7839558 5103607 1777752 -2149699 -6804252 -11108273 -13470286 -13646212
4414 -13646212 -12469945 -9926457 -5509475 -765554 951238 -1395487 -4418269 -4001326
$$ packed form
4477a193767m25161O51390N91659Q30806J617409J559916N51494N6003Q6829r24815
4467C401763k595972k289482M49876K463696J755809N73031J354742K468058J139664
4458H721185j450508j701534O92639K119109L00538k684745l390403j089808J853775
4449C370248K548913K40187k787590l295699r02965J115766R3531k276463k468937
4440d363009k03088J742257K056097J997217K029699Q93727j140818j522076M36078
4431A926084J620782m37985l506535l547079j07353L587350M841420L597720J135776
4422I110180j270622k735951l325855l927451m654553m304021k362013j75926
4414a3646212J176267K543488M416982M743921J716792k346725l022782M16943
$$ plain form
4406 -4001326 -64967 3778175 4526378 2475444 236075 216838 2652200 5279161 5425180
4397 5425180 2974957 506845 -31453 418457 31278 -932216 -747573 928959 2580894
4388 2580894 3060321 2806862 2602429 2294736 1430197 687243 1922314 6193335 11642933
4379 11642933 14368158 12609951 9394848 9088331 11583081 12547035 9955654 7169839
4371 7169839 7677025 9753827 9425899 6672387 5025631 6035403 7836504 8909716 9583481
4362 9583481 9476220 7138930 3422244 1927668 4268865 7428959 7805950 5751278 3934463
4353 3934463 3002795 1437339 -1249256 -3635895 -4499020 -3953326 -2541420 -622168 1362887
4344 1362887 3126201 4865408 6433103 6711844 5091106 3105128 2951419 4343434 4478786
$$ packed form
4406d001326L936359L843142P48203k050934k239369j9237K435362K626961J46019
4397E425180k450223k468112n38298M49910l87179r63494J84643J676532J651935
4388B580894M79427k53459k04433l07693q64539p42954J235071M271021N449598
4379A1642933K725225j758207l215103l06517K494750R63954k591381k785815
4371G169839N07186K076802l27928k753512j646756J009772J801101J073212O73765
4362I583481j07261k337290l716686j494576K341197L160094L76991k054672j816815
4353C934463r31668j565456k686595k386639q63125N45694J411906J919252J985055
4344A362887J763314J739207J567695K78741j620738j985978j53709J392015J35352
$$ plain form
4335 4478786 1704232 -2064577 -3431332 -1290903 2196856 3937285 2682488 -99068
4327 -99068 -1630087 -368370 2496819 4343831 4111990 3466609 4481035 6683636 7396372
4318 7396372 5093425 1528078 -59696 1595655 4745633 6827774 6950999 6038883 5240472
4309 5240472 4861845 4630256 4314758 3912533 3645175 3951262 5069830 6342766 6384340
4300 6384340 4569766 2181096 1287817 2297287 3378461 2818078 1252386 689059 1763931
4291 1763931 3124391 3444869 2742524 1403315 -655071 -2973908 -3928559 -2457767 235409
4282 235409 1948468 1946621 1022820 -201626 -1426082 -1571425 443008 3590078 5258044
4273 5258044 4499504 3176718 3145892 3855074 3780699 2921655 2556467 3399274 5206149 7534728
$$ packed form
4335D478786k774554l768809j366755K140429L487759J740429j254797k781556
4327i9068j531019J261717K865189J847012k31841o45381J014426K202601P12736
4318G396372k302947l565347j587774J655351L149978K082141J23225r12116p98411
4309E240472l78627k31589l15498m02225k67358L06087J118568J272936M1574
4300F384340j814574k388670q93279J009470J081174n60383j565692n63327J074872
4291A763931J360460L20478p02345j339209k058386k318837r54651J470792K693176
4282B35409J713059j847r23801j224446j224456j45343K014433L147070J667966
4273E258044p58540j322786l0826P09182p4375q59044l65188Q42807J806875K328579
$$ plain form
4263 7534728 9711821 10508972 9018442 5792263 2367499 -269725 -2251151 -3998311
4255 -3998311 -5228851 -4864717 -2132606 1944989 4683339 4276801 1894576 176046 43513
4246 43513 432990 717939 1295148 1755609 911719 -772055 -1235714 -300550 -614379 -3638010
4236 -3638010 -6961205 -7507492 -5557199 -3649188 -3103394 -3540268 -4328120 -4582098 -3150771
4227 -3150771 -457708 1120787 534774 6731 1621463 3776161 3579495 1312277 -239190
4218 -239190 138770 1206607 1605651 839901 -1168292 -3577497 -4865325 -5221348 -6851127
4209 -6851127 -10048751 -11493322 -8986332 -5168489 -3447238 -3061363 -1771953 -454437
4201 -454437 -752768 -1104211 96551 247305 -3336478 -8057279 -10426092 -12250380 -15896786
$$ packed form
4263G534728K177093P97151j490530l226179l424764k637224j981426j747160
4255c998311j230540L64134K732111M077595K738350m06538k382225j718530j32533
4246D3513L89477K84949N77209M60461q43890j683774m63659R35164l13829l023631
4236c638010l323195n46287J950293J908011N45794m36874p87852k53978J431327
4227c150771K693063J578495n86013n28043J614732K154698j96666k267218j551467
4218b39190L77960J067837L99044p65750k008193k409205j287828l56023j629779
4209f851127l197624j444571K506990L817843J721251L85875J289410J317516
4201d54437k98331l51443J200762J50754l583783m720801k368813j824288l646406
$$ plain form
4192 -15896786 -17753449 -14856721 -13387848 -19824754 -28673439 -33910544 -48573837 -90804696
4184 -90804696 -146076042 -167301281 -127811201 -57508004 -8455262 3016746 337672
4177 337672 3476150 7494124 3701595 -2326956 -2529729 293382 589480 224683 2136069
4168 2136069 2966201 2207 -2081671 879020 4129506 1068160 -6073752 -9773409
4160 -9773409 -7843207 -4095610 -1339004 219938 -271371 -3531528 -7263383 -8424208
4152 -8424208 -7290777 -5956187 -4668169 -3050942 -2725325 -4855447 -7059800 -6756768 -5824213
4143 -5824213 -7706098 -11255404 -11930521 -8509179 -4365947 -2094752 -706171 1458169
4135 1458169 4422697 7765844 11122555 12888509 11280489 7588037 5725778 7211716
$$ packed form
4192a5896786j856663K896728J468873o436906q848685n237105j4663293m2230859
4184i0804696n5271346k1225239L9490080P0303197M9052742J1472008k679074
4177C37672L138478M017974l792529o028551k02773K823111K96098l64797J911386
4168B136069Q30132k963994k083878K960691L250486l061346p141912l699657
4160i773409J930202L747597K756606J558942m91309l260157l731855j160825
4152h424208J133431J334590J288018J617227L25617k130122k204353L03032R32555
4143e824213j881885l549306o75117L421342M143232K271195J388581K164340
4135A458169K964528L343147L356711J765954j608020l692452j862259J485938
$$ plain form
4127 7211716 8772425 6679387 1977383 -634641 1312147 5124466 6488896 4751735
4119 4751735 3181478 4041014 5346280 3998853 699550 -848512 746858 2959010
4111 2959010 3519303 3262492 3599284 3954270 3625152 3845290 5695253 7717710 7820957
4102 7820957 5999884 3071040 -1450685 -7461802 -11747729 -10734350 -5419652 -641163
4094 -641163 694596 186473 543001 2066648 3396915 3999743 4690989 6231417 7966488
4085 7966488 7982188 5150829 1085910 -1234269 -1329500 -1933752 -4687815 -7159952 -6244125
4076 -6244125 -2857621 -616924 -922310 -2139686 -2993147 -3841927 -4689577 -4652122 -3680636
4067 -3680636 -2493060 -611740 3176860 8061932 11222569 11227031 9459781 7657935 5975581
$$ packed form
4127G211716J560709k093038m702004k612024J946788L812319J364430j737161
4119D751735j570257Q59536J305266j347427l299303j548062J595370K212152
4111B959010N60293k56811L36792L54986l29118K20138J849963K022457J03247
4102G820957j821073k928844m521725o011117m285927J013379N314698M778489
4094f41163J335759n08123L56528J523647J330267O02828O91246J540428J735071
4085G966488J5700k831359m064919k320179r5231o04252k754063k472137R15827
4076f244125L386504K240697l05386j217376q53461q48780q47650L7455R71486
4067c680636J187576J881320L788600M885072L160637M462j767250j801846j682354
$$ plain form
4058 5975581 4052746 2083241 84991 -2268539 -4517568 -5616369 -5548996 -5133627 -4242976
4049 -4242976 -2348802 -867068 -2144443 -5373895 -6492126 -3616177 183375 1508926
4041 1508926 1412714 2840662 5367449 5851363 3369154 186267 -2037763 -3945933 -5907687
4032 -5907687 -6546057 -5075636 -3013907 -1994630 -1357249 322297 2248270 2049259 -566008
4023 -566008 -2694531 -1731411 1209031 2719930 1442716 -524001 -653153 1088063 3013932
4014 3013932 4060578 4210591 3677687 3145722 3953745 6191345 7151780 3965170 -2093873
4005 -2093873 -6254281 -5954706 -3779782 -3524223 -5314097 -6414100 -5369366 -3136629 -872683
3996 -872683 1146884 2427114 1973325 -356371 -3329242 -5491011 -6093782 -5025277 -2896742
$$ packed form
4058E975581j922835j969505j998250k353530k249029j098801O7373M15369Q90651
4049d242976J894174J481734j277375l229452j118231K875949L799552J325551
4041A508926r6212J427948K526787M83914k482209l182887k224030j908170j961754
4032e907687o38370J470421K061729J019277O37381J679546J925973j99011k615267
4023e66008k128523R63120K940442J510899j277214j966717j29152J741216J925869
4014C013932J046646J50013n32904n31965Q08023K237600R60435l186610o059043
4005b093873m160408K99575K174924K55559j789874j100003J044734K232737K263946
3996h72683K019567J280230m53789k329696k972871k161769o02771J068505K128535
$$ plain form
3987 -2896742 -1210026 -1294246 -2846564 -4457902 -5620826 -7013171 -8600214 -8977207 -7409177
3978 -7409177 -5244496 -4134583 -3825827 -3110116 -2209504 -2403732 -3446896 -3316411 -1125649
3969 -1125649 1381116 2286486 2089219 2409194 3130532 2729865 1136648 283970 1341177
3960 1341177 2949982 3045461 1383668 -557269 -1432082 -1076378 -290865 -72429 -455340
3951 -455340 93385 3083253 7432779 9904301 8982415 6908357 6571604 7763527 8352079
3942 8352079 8082133 8769493 10934412 12581273 11818325 8965869 5568444 2784860 1181159
3933 1181159 687484 267767 -1082793 -2640583 -2590859 -643951 1557252 3024806 4556805
3924 4556805 6564909 7848363 7862026 8267423 10320897 12255298 11592771 9094614 7837902
$$ packed form
3987b896742J686716q4220j552318j611338j162924j392345j587043l76993J568030
3978g409177K164681J109913L08756P15711R00612j94228j043164J30485K190762
3969a125649K506765R05370j97267L19975P21338m00667j593217q52678J057207
3960A341177J608805R5479j661793j940937q74813L55704P85513K18436l82911
3951d55340N48725K989868M349526K471522r21886k074058l36753J191923N88552
3942H352079k69946O87360K164919J646861p62948k852456l397425k783584j603701
3933A181159m93675m19717j350560j557790M9724J946908K201203J467554J531999
3924D556805K008104J283454J3663M05397K053474J934401o62527k498157j256712
$$ plain form
3915 7837902 8643331 8968973 6724111 2857008 -782845 -4127858 -7865035 -11073148 -11850766
3906 -11850766 -9997716 -7509524 -6286041 -6584193 -7929038 -10071999 -12132443 -12080662 -8898866
3897 -8898866 -4951013 -4200165 -7437759 -10956104 -11044496 -8270349 -5684928 -4186790 -2178741
3888 -2178741 730657 2627644 2472165 1815182 2153047 2702495 2305788 1629431 1515631
3879 1515631 693349 -2412306 -6324827 -7423532 -4274343 799474 4619579 5978044
3871 5978044 5343337 3426163 820820 -1873962 -4152966 -5347855 -4411176 -907341 3823595
3862 3823595 7569736 9385835 9822713 9221865 7369728 5088098 4274779 5283895 5751853
3853 5751853 3590221 289247 -451830 2796211 7493011 10071257 9449407 7213853 5212159
$$ packed form
3915G837902Q05429L25642k244862l867103l639853l345013l737177l208113p77618
3906a1850766J853050K488192J223483k98152j344845k142961k060444N1781L181796
3897h898866L947853P50848l237594l518345q8392K774147K585421J498138K008049
3888b178741K909398J896987j55479o56983L37865N49448l96707o76357j13800
3879A515631q22282l105655l912521j098705L149189N073817L820105J358465
3871E978044o34707j917174k605343k694782k279004j194889R36679L503835M730936
3862C823595L746141J816099M36878o00848j852137k281630q13319J009116M67958
3853E751853k161632l300974p41077L248041M696800K578246o21850k235554k001694
$$ plain form
3844 5212159 3784392 2259948 650374 303912 2369337 5610895 6696554 3625018
3836 3625018 -1531958 -4564531 -3914865 -2169926 -2144728 -2991339 -1873696 1330884 3385052
3827 3385052 2159064 -414529 -1156316 238909 1754861 2584872 3684790 5076276 5230307
3818 5230307 3920276 3484398 5758119 9208062 10753930 9550719 7436208 6231343
3810 6231343 6080544 6122424 5408024 3287858 138618 -2327681 -2593498 -1129669 416848
3801 416848 1693234 3933546 7550728 10776011 11400743 9089585 5456815 2521786 1507033
3792 1507033 2454000 4353042 5839358 6068098 4991915 3288359 2539469 4701384 9922501
3783 9922501 14996669 15699810 11344846 5828441 3512541 5165799 8523164 11307297
$$ packed form
3844E212159j427767j524444j609574l46462K065425L241558J085659l071536
3836C625018n156976l032573O49666J744939K5198q46611J117643L204580K054168
3827C385052j225988k573593p41787J395225J515952Q30011J099918J391486J54031
3818E230307j310031m35878K273721L449943J545868j203211k114511j204865
3810F231343j50799M1880p14400k120166l149240k466299k65817J463829J546517
3801D16848J276386K240312L617182L225283O24732k311158l632770k935029j014753
3792A507033R46967J899042J486316K28740j076183j703556p48890K161915N221117
3783I922501N074168P03141m354964n516405k315900J653258L357365K784133
$$ plain form
3775 11307297 12383047 11129573 7597269 3163081 -308626 -2066363 -2525759 -2178122
3767 -2178122 -1486198 -1425210 -2726056 -4585587 -5429435 -5139935 -5284256 -6773194 -8482904
3758 -8482904 -8768296 -7299519 -4729443 -1575851 1588134 3639295 3853679 3036196 2561060
3749 2561060 2352904 921169 -2380192 -6114012 -8280625 -8346762 -7141512 -5362688 -3175107
3740 -3175107 -1124089 -246358 -625247 -596699 1469157 4637379 5846073 3549535 77435
3731 77435 -825321 1442816 3577530 2483795 -1136342 -4229678 -5456369 -6346112 -8577739
3722 -8577739 -11494521 -12790683 -10864509 -6146432 -850878 2202822 1374526 -2370529
3714 -2370529 -6147303 -7805215 -7565651 -6662745 -5186523 -2391034 1202387 3431965 2707608
$$ packed form
3775A1307297J075750j253474l532304m434188l471707j757737m59396L47637
3767b178122O91924O0988j300846j859531q43848K89500j44321j488938j709710
3758h482904k85392J468777K570076L153592L163985K051161K14384q17483m75136
3749B561060k08156j431735l301361l733820k166613o6137J205250J778824K187581
3740c175107K051018Q77731l78889K8548K065856L168222J208694k296538l472100
3731G7435r02756K268137K134714j093735l620137l093336j226691q89743k231627
3722h577739k916782j296162J926174M718077N295554L053700q28296l745055
3714b370529l776774j657912K39564R02906J476222K795489L593421K229578p24357
$$ plain form
3705 2707608 -241193 -3297539 -4937054 -4770689 -2896721 250502 3572438 5790694
3697 5790694 6566304 6608548 6438542 5573080 3357126 246121 -2293682 -3120466 -2327767
3688 -2327767 -958544 -151559 -303256 -504051 896924 4189001 6844564 5622233 700056
3679 700056 -3821628 -4732834 -3545087 -3664320 -5112494 -4982134 -2670110 -1091168 -1836066
3670 -1836066 -2582012 -1236403 396400 -133044 -1415893 -307920 3107857 6311853 8910788
3661 8910788 12285878 15116911 13844299 8452615 3573186 2155661 1801789 -425575
3653 -425575 -3089465 -3275003 -1567276 -598581 -481071 755600 3264662 5269096 6252792
3644 6252792 7128384 7421310 5296084 809451 -3213108 -4067384 -1315832 3774971 9024637
$$ packed form
3705B707608k948801l056346j639515J66365J873968L147223L321936K218256
3697E790694P75610M2244j70006q65462k215954l111005k539803q26784P92699
3688b327767J369223Q06985j51697k00795J400975L292077K655563j222331m922177
3679G00056m521684r11206J187747j19233j448174J30360K312024J578942p44898
3670a836066p45946J345609J632803n29444j282849J107973L415777L203996K598935
3661H910788L375090K831033j272612n391684m879429j417525l53872k227364
3653d25575k663890j85538J707727R68695J17510J236671K509062K004434R83696
3644F252792Q75592K92926k125226m486633m022559q54276K751552N090803N249666
$$ plain form
3635 9024637 11832266 11115550 8850102 7714803 7396620 5525214 2103354 143894 1357875
3626 1357875 3937500 5595137 6320042 6894500 6954066 6040503 4785481 3705666 2458340
3617 2458340 1359241 1700842 3312599 3897846 2375858 808490 1133529 2084709 1743745
3608 1743745 1269430 3095527 6593352 8657680 8136986 6813937 6140550 5732390 5219940
3599 5219940 4956686 4474169 2710397 402747 -133266 1465630 2525488 1049671 -1345814
3590 -1345814 -1681772 616635 3612032 5355122 5147958 3322284 1160053 321920 1088732
3581 1088732 1711073 561447 -1676856 -3019543 -2710973 -1531886 -143356 1461147 3072149
3572 3072149 4219213 5108941 6439908 8056928 8829052 8268325 7450111 7768643 9171731
$$ packed form
3635I024637K807629p16716k265448j135299l18183j871406l421860j959460J213981
3626A357875K579625J657637P24905N74458N9566r13563j255022j079815j247326
3617B458340j099099L41601J611757N85247j521988j567368L25039R51180l40964
3608A743745m74315J826097L497825K064328n20694j323049o73387m08160n12450
3599E219940k63254m82517j763772k307650n36013J598896J059858j475817k395485
3590a345814l35958K298407K995397J743090k07164j825674k162231q38133P66812
3581A088732O22341j149626k238303j342687L08570J179087J388530J604503J611002
3572C072149J147064Q89728J330967J617020P72124n60727q18214L18532J403088
$$ plain form
3563 9171731 10001845 8486118 4457653 -135877 -2665507 -2195366 -204087 1425485 2527768
3554 2527768 3977066 5600710 6209946 5469460 4096213 2142317 -925731 -3784298 -3147352
3545 -3147352 2085970 8103317 9949263 7461602 5250577 6833755 10900214 13773445
3537 13773445 13543232 10785488 6853499 2986253 337673 -505179 -38413 680066 926236
3528 926236 581145 90597 299220 1529839 2598321 1692946 -1390320 -4844951 -7007679
3519 -7007679 -7737907 -7278478 -5377376 -2516731 -481766 -361228 -1239396 -2148840 -3777582
3510 -3777582 -6523059 -8467521 -7648464 -5093396 -2958287 -795940 3062704 7143311
3502 7143311 7856272 5284301 3953624 6493766 10141689 11429071 10895361 10544730 9726512
$$ packed form
3563I171731Q30114j515727m028465m593530k529630M70141J991279J629572J102283
3554B527768J449298J623644O09236p40486j373247j953896l068048k858567O36946
3545c147352N233322O017347J845946k487661k211025J583178M066459K873231
3537A3773445k30213k757744l931989l867246k648580q42852M66766P18479K46170
3528I26236l45091m90548K08623J230619J068482r05375l083266l454631k162728
3519g007679p30228M59429J901102K860645K034965J20538q78168r09444j628742
3510c777582k745477j944462Q19057K555068K135109K162347L858644M080607
3502G143311P12961k571971j330677K540142L647923J287382n33710l50631q18218
$$ plain form
3493 9726512 7037634 4201295 4233431 6742787 8437569 7756795 5945816 4015138 1856554
3484 1856554 334044 961967 2877928 3039339 402878 -2572890 -3586435 -3241721 -2909918
3475 -2909918 -2207488 -415752 1376082 1614534 750164 591310 1807219 3485740 4712678
3466 4712678 5444357 6142521 7269162 8624018 8799190 6438161 2729771 1130073 3233679
3457 3233679 6233727 6258222 3190353 79326 -1455730 -2580356 -4001760 -4227756 -2265192
3448 -2265192 86920 462083 -714604 -860722 1229941 3968514 5084337 4095535 2486138
3439 2486138 2102883 3585402 6019769 7966718 8758532 8516675 7103225 4047016 -48517
3430 -48517 -3024153 -3038323 -315421 3802039 8641125 13642620 16780551 15707723 10793562
$$ packed form
3493I726512k688878k836339L2136K509356J694782o80774j810979j930678k158584
3484A856554j522510O27923J915961J61411k636461k975768j013545L44714L31803
3475b909918P02430J791736J791834K38452q64370j58854J215909J678521J226938
3466D712678P31679O98164J126641J354856J75172k361029l708390j599698K103606
3457C233679L000048K4495l067869l111027j535056j124626j421404k25996J962564
3448b265192K352112L75163j176687j46118K090663K738573J115823r88802j609397
3439B486138l83255J482519K434367J946949P91814k41857j413450l056209m095533
3430d8517k975636j4170K722902M117460M839086N001495L137931j072828m914161
$$ plain form
3421 10793562 5254076 1645730 -304788 -1892991 -3270535 -4055537 -4355768 -3814978 -1249071
3412 -1249071 3066898 6265085 6228070 4911571 5795504 8752869 10281623 8663512 5933364
3403 5933364 4263616 3234845 1734673 106961 -931341 -1514487 -1518462 -124802 2231909
3394 2231909 3319240 1869246 -758511 -2746853 -3681821 -3221889 -591930 2834381 3309788
3385 3309788 -359931 -4293910 -4974294 -4481846 -6284633 -8265448 -5445926 1246137 4897258
3376 4897258 2139544 -2605663 -4241994 -3493313 -3507053 -4088794 -3060366 -728149 699883
3367 699883 769180 968701 2281037 4676887 7732617 9719383 7734994 1321810 -5265198
3358 -5265198 -7077435 -4052851 -319447 1157106 676661 -713424 -2835157 -5239471
$$ packed form
3421A0793562n539486l608346j950518j588203j377544p85002l00231N40790K565907
3412a249071M315969L198187l7015j316499Q83933K957365J528754j618111k730148
3403E933364j669748j028771j500172j627712j038302n83146l975J393660K356711
3394B231909J087331j449994k627757j988342r34968M59932K629959L426311M75407
3385C309788l669719l933979o80384M92448j802787j980815K819522O692063L651121
3376D897258k757714m745207j636331P48681j3740n81741J028428K332217J428032
3367F99883O9297J99521J312336K395850L055730J986766j984389o413184o587008
3358e265198j812237L024584L733404J476553m80445j390085k121733k404314
$$ plain form
3350 -5239471 -6886928 -7562593 -7894462 -7712574 -6093144 -3315671 -1141926 -698914 -1368285
3341 -1368285 -2051116 -2342358 -2278163 -2057215 -2134592 -2604720 -2641628 -1641063 -551821 -656921
3331 -656921 -1326005 -670866 1537467 3262496 2762889 355470 -2493075 -4394052 -4341688
3322 -4341688 -2480437 -800914 -1378676 -3546471 -4431114 -2622280 415682 2853126 4300698
3313 4300698 4517827 2723175 -510154 -2787641 -2961869 -2861189 -4208853 -5644481 -5068787
3304 -5068787 -3423258 -3297563 -4505034 -4008658 -418223 3989044 6403317 6591496 6008418
3295 6008418 5489516 4942873 4221588 3292392 2225375 1639261 2408061 4363344 6062279
3286 6062279 6446958 5979106 5449823 4430763 1917065 -1813591 -4919464 -5643290 -3771068
$$ packed form
3350e239471j647457o75665l31869J81888J619430K777473K173745M43012o69371
3341a368285o82831k91242O4195K20948p7377m70128l6908J000565J089242j05100
3331f56921o69084O55139K208333J725029m99607k407419k848545j900977N2364
3322d341688J861251J679523n77762k167795q84643J808834L037962K437444J447572
3313D300698K17129j794652l233329k277487j74228J00680j347664j435628N75694
3304e068787J645529J25695j207471M96376L590435M407267K414273J88179n83078
3295F008418n18902n46643p21285r29196j067017n86114P68800J955283J698935
3286F062279L84679m67852n29283j019060k513698l730656l105873p23826J872222
$$ plain form
3277 -3771068 -580953 2130571 3056748 2077566 319133 -623521 246673 2814890 6078501
3268 6078501 8737885 9867180 9400372 8026498 6529411 5301184 4479338 4186849 4312250
3259 4312250 4246907 3272810 1337748 -686487 -1592433 -811104 894867 1690073 187382
3250 187382 -2861452 -4883963 -4213190 -2176589 -1491701 -2653888 -3206868 -1110254 2455417
3241 2455417 4832591 5593418 6835799 9775679 12605691 12531698 9128987 4868152 2562963
3232 2562963 2741558 3446588 2529197 232843 -841813 1165490 4835564 7067382 6797391
3223 6797391 5497674 4001978 1139979 -3401081 -7050553 -7291757 -5238140 -3855025
3215 -3855025 -3397354 -1310846 3334836 7943496 9647367 8361086 5687202 2699630
$$ packed form
3277c771068L190115K711524R26177r79182j758433r42654Q70194K568217L263611
3268F078501K659384J129295m66808j373874j497087j228227q21846k92489J25401
3259D312250o5343r74097j935062k024235r05946P81329J705971P95206j502691
3250A87382l048834k022511O70773K036601O84888j162187n52980K096614L565671
3241B455417K377174P60827J242381K939880K830012p3993l402711m260835k305189
3232B562963J78595P05030r17391k296354j074656K007303L670074K231818k69991
3223F797391j299717j495696k861999m541060l649472k41204K053617J383115
3215c855025M57671K086508M645682M608660J703871j286281k673884k987572
$$ plain form
3207 2699630 66823 -1189470 -617399 828308 2005573 2921296 4073620 5446230 7006858
3198 7006858 9115900 11458320 12673569 12074702 10489237 8266774 4144529 -2001962
3190 -2001962 -6853618 -6892778 -3304700 -788936 -1548906 -3266858 -3341236 -2085278 -647957
3181 -647957 1278922 3667341 4356443 1664022 -2414653 -4092624 -2446911 -279894 -611086
3172 -611086 -3885981 -8281287 -11109816 -10162619 -5442705 193430 3410137 3461877 1782475
3163 1782475 -962131 -5361465 -10585977 -13459177 -11499642 -5708577 675513 5264167
3155 5264167 7614763 8367509 8380198 8084196 6977394 4461538 1600952 737203 2424759
3146 2424759 4109194 3266553 743652 -673595 -34762 1456105 3239222 6095060 9906798
$$ packed form
3207B699630k632807j256293N72071J445707J177265R15723J152324J372610J560628
3198G006858K109042K342420J215249n98867j585465k222463m122245o146491
3190b001962m851656l9160L588078K515764p59970j717952p4378J255958J437321
3181f47957J926879K388419O89102k692421m078675j677971J645713K167017l31192
3172f11086l274895m395306k828529R47197M719914N636135L216707N1740j679402
3163A782475k744606m399334n224512k873200J959535N791065O384090M588654
3155E264167K350596P52746J2689k96002j106802k515856k860586q63749J687556
3146B424759J684435q42641k522901j417247O38833J490867J783117K855838L811738
$$ plain form
3137 9906798 12873882 13517046 11854796 8367660 3719489 -121344 -793741 1386874 3321683
3128 3321683 3290002 3066939 4314260 5285389 3778927 1497679 1948151 4744860 5700216
3119 5700216 2887279 -868331 -2655973 -3433937 -5306467 -7367707 -7012199 -4058204 -842328
3110 -842328 1353324 3511424 6257639 8081763 7169782 3951057 866369 -121898 631786
3101 631786 984472 -748313 -4069017 -7004492 -8447655 -9072223 -9634297 -9430824 -7526575
3092 -7526575 -4886018 -3871832 -5582327 -8747857 -11334350 -12201849 -11099966 -8388404
3084 -8388404 -5487962 -4555950 -6502408 -9542323 -10581100 -8176357 -3786444 -177573
3076 -177573 1071387 631259 472395 1954116 4549456 6258528 5383564 2118103 -1472222
$$ packed form
3137I906798K967084O43164j662250l487136m648171l840833o72397K180615J934809
3128C321683l1681k23063J247321R71129j506462k281248M50472K796709R55356
3119E700216k812937l755610j787642p77964j872530k061240L55508K953995L215876
3110h42328K195652K158100K746215J824124r11981l218725l084688r88267P53684
3101F31786L52686j732785l320704k935475j443163o24568n62074K03473J904249
3092g526575K640557J014186j710495l165530k586493q67499J101883K711562
3084h388404K900442R32012j946458l039915j038777K404743M389913L608871
3076a77573J248960m40128j58864J481721K595340J709072q74964l265461l590325
$$ plain form
3067 -1472222 -3123180 -2328700 -811421 -844124 -2897128 -5164885 -5638421 -4266956 -2600536
3058 -2600536 -1675431 -1090672 -169983 834314 1093206 293384 -878183 -1081086 615956
3049 615956 3273714 3956098 541827 -4888206 -7110565 -3503468 2466324 5167668 3269005
3040 3269005 60123 -2176472 -4978636 -9769332 -13918653 -13437294 -8485456 -3544051
3032 -3544051 -2155440 -3650909 -5366685 -5905420 -5140986 -2794475 1078072 4719420 5461837
3023 5461837 2323569 -2729337 -6223338 -5749179 -1594422 3627694 7226693 8701439
3015 8701439 9463591 10236793 9816774 7227601 3984626 2584266 3201839 3694940 2960523
3006 2960523 2460454 3792250 6327851 8226630 8531914 7209681 4296774 408973 -2737106
$$ packed form
3067a472222j650958P94480J517279l2703k053004k267757m73536J371465J666420
3058b600536R25105N84759R20689J004297K58892p99822j171567k02903J697042
3049F15956K657758O82384l414271n430033k222359L607097N969792K701344j898663
3040C269005l208882k236595k802164m790696m149321M81359M951838M941405
3032c544051J388611j495469j715776n38735P64434K346511L872547L641348P42417
3023E461837l138268n052906l494001M74159M154757N222116L598999J474746
3015H701439P62152P73202m20019k589173l242975j400360O17573M93101p34417
3006B960523n00069J331796K535601J898779L05284j322233k912907l887801l146079
$$ plain form
2997 -2737106 -3875272 -3895586 -4594413 -5924428 -5923762 -3506441 -35878 2278347 2579272
2988 2579272 1533488 106613 -1249971 -2507109 -3488581 -3507908 -2049732 -73549 291186
2979 291186 -1704951 -4063465 -4672641 -4563802 -6450570 -10227156 -12391160 -10500114 -5807088
2970 -5807088 -483725 5182887 10950361 14331590 13110051 9078577 6404617 6586546
2962 6586546 7559323 7668747 7743890 8530001 8539557 5970778 1364300 -2992904 -5555360
2953 -5555360 -6527323 -6948409 -7363996 -7122575 -5093089 -1656713 667746 13517 -1864680
2944 -1864680 -1387969 2100892 5638436 6986926 6994125 6618277 4533298 -152204 -5073820
2935 -5073820 -7197011 -6695995 -5566864 -3695849 463889 5834998 8810914 8104447 6787760
$$ packed form
2997b737106j138166k0314o98827j330015O66K417321L470563K314225L00925
2988B579272j045784j426875j356584j257138r81472j9327J458176J976183L64735
2979B91186j996137k358514o09176J08839j886768l776586k164004J891046M693026
2970e807088N323363N666612N767474L381229j221539m031474k673960J81929
2962F586546R72777J09424P5143P86111R556k568779m606478m357204k562456
2953e555360r71963m21086m15587K41421K029486L436376K324459o54229j878197
2944a864680M76711L488861L537544J348490P199l75848k084979m685502m921616
2935e073820k123191N01016J129131J871015M159738N371109K975916p06467j316687
$$ plain form
2926 6787760 8250311 11927318 14264733 12827197 8561712 4615743 3263716 3589473
2918 3589473 2582510 -838514 -3988746 -4040961 -2210543 -1873957 -3281194 -3238332 -120477
2909 -120477 3999789 6939097 8956944 10400091 9776168 6227227 1728090 -1187128 -2150054
2900 -2150054 -1840099 -267052 1898587 2417958 352901 -1819394 -1410594 641127 1618568
2891 1618568 1227803 1148729 1629782 1663543 1814668 3658535 6589601 8153423 7681165
2882 7681165 7000908 7470460 8782102 10626873 12849127 13917360 12129515 8649046 6470058
2873 6470058 5999082 4819327 2486724 1914923 4331561 6215518 3846725 -1433385 -5150826
2864 -5150826 -5280424 -3522415 -2272012 -2599738 -4410774 -6560958 -7213069 -5520584 -2516626
$$ packed form
2926F787760J462551L677007K337415j437536m265485l945969j352027L25757
2918C589473j006963l421024l150232n2215J830418L36586j407237M2862L117855
2909a20477M120266K939308K017847J443147o23923l548941m499137k915218r62926
2900b150054L09955J573047K165639N19371k065057k172295M08800K051721R77441
2891A618568l90765p9074M81053L3761J51125J843867K931066J563822m72258
2882G681165o80257M69552J311642J844771K222254J068233j787845l480469k178988
2873F470058m70976j179755k332603n71801K416638J883957k368793n280110l717441
2864e150826j29598J758009J250403l27726j811036k150184o52111J692485L003958
$$ plain form
2855 -2516626 541231 3641956 6791531 8728827 8501596 7298599 7011316 7664412 7805455
2846 7805455 6863073 5679111 5137833 5512302 6763513 8389463 9323487 8837210 7213559
2837 7213559 5155631 3365050 2994175 5058191 8587302 10770470 9933081 7149400 4243669
2828 4243669 1949193 899612 2120246 4870700 6147275 4488955 2538141 3592052
2820 3592052 7178696 10305784 11527528 11371532 10286054 8771953 8131841 8484163 7587010
2811 7587010 4338333 1462714 1373555 1544114 -1612492 -6035876 -6564262 -3343200 -1760246
2802 -1760246 -3712734 -5089666 -3401016 -1811980 -2821263 -3448697 -598736 3244677
2794 3244677 4103278 2882914 3078168 4551056 4192374 1361874 -1432540 -2450130 -1830814
$$ packed form
2855b516626L057857L100725L149575J937296k27231j202997k87283O53096J41043
2846G805455r42382j183962n41278L74469J251211J625950R34024m86277j623651
2837G213559k057928j790581l70875K064016L529111K183168q37389k783681k905731
2828D243669k294476j049581J220634K750454J276575j658320j950814J053911
2820C592052L586644L127088J221744j55996j085478j514101o40112L52322q97153
2811G587010l248677k875619q9159J70559l156606m423384n28386L221062J582954
2802a760246j952488j376932J688650J589036j009283o27434K849961L843413
2794C244677Q58601j220364J95254J472888l58682k830500k794414j017590O19316
$$ plain form
2785 -1830814 440877 4355221 8038210 9003316 7140008 4309041 1561157 -1128529
2777 -1128529 -3204329 -3866305 -3307377 -1667673 1952872 7142657 10437505 8983325 4809521
2768 4809521 2292231 2384116 2788320 2829280 3881393 5144781 3626729 -626506 -3370060
2759 -3370060 -1946073 1103979 2023811 492317 -1626382 -3454529 -4750567 -4543174 -2464611
2750 -2464611 8691 1503623 2562324 3949613 4727681 3753596 1693982 -138142 -1598381
2741 -1598381 -2722304 -2420952 -131070 2461142 3366843 2951007 2744561 2780435 2362345
2732 2362345 2422274 4322301 6713830 6510316 3367556 626683 945610 3129505 4403041
2723 4403041 3997497 3027917 2170580 1288364 918933 2476418 6446400 11077258 13538644
$$ packed form
2785a830814K271691L914344L682989R65106j863308k830967k747884k689686
2777a128529k075800o61976N58928J639704L620545N189785L294848j454180m173804
2768D809521k517290R1885M04204M0960J052113J263388j518052m253235k743554
2759c370060J423987L050052R19832j531494k118699j828147j296038K07393K078563
2750b464611K473302J494932J058701J387289P78068r74085k059614j832124j460239
2741a598381j123923L01352K289882K592212R05701m15836k06446L5874m18090
2732B362345N9929J900027K391529k03514l142760k740873L18927K183895J273536
2723D403041m05544r69580q57337q82216l69431J557485L969982M630858K461386
$$ plain form
2714 13538644 12556743 9690284 7592429 7053579 6515825 4766221 2931801 2761186 3923641
2705 3923641 4652246 4517259 4574868 4819016 3757415 1217103 -592973 -182155 857399
2696 857399 402336 -724188 -177204 1797696 2413124 679942 -931103 -234865 1413914
2687 1413914 1294285 -782578 -2786916 -3753421 -4411581 -4694161 -3063444 813142 4603335
2678 4603335 5924328 5198812 4407990 3901153 2320142 -482374 -2355904 -1423283 1350383
2669 1350383 2958045 1253760 -3221413 -7628847 -8727077 -5201041 1202423 7173787
2661 7173787 10739533 12225687 12450019 11260460 8538872 5386743 3038720 1436961
2653 1436961 240482 377836 2655828 5262120 5105024 2102440 -244595 292596 1467752
$$ packed form
2714A3538644r81901k866459k097855n38850n37754j749604j834420j70615J162455
2705C923641P28605j34987N7609K44148j061601k540312j810076M10818J039554
2696H57399m55063j126524N46984J974900O15428j733182j611045O96238J648779
2687A413914j19629k076863k004338r66505o58160k82580J630717L876586L790193
2678D603335J320993p25516p90822n06837j581011k802516j873530R32621K773666
2669A350383J607662j704285m475173m407434j098230L526036O403464N971364
2661G173787L565746J486154K24332j189559k721588l152129k348023j601759
2653A436961j196479J37354K277992K606292j57096l002584k347035N37191J175156
$$ plain form
2644 1467752 115585 -2907946 -4028874 -2270684 -241926 213773 298632 1206257 1607457
2635 1607457 228294 -1056783 597591 4541241 6929672 5606078 2623320 1401330
2627 1401330 3033989 6117093 8792898 9866459 8793370 5834505 2197082 -611630
2619 -611630 -1793490 -1785721 -2059762 -4071980 -7699232 -10870173 -11567201 -10036652 -8064813
2610 -8064813 -6418308 -4547907 -2720078 -2242222 -2829196 -2021537 1179059 4023807 3588470
2601 3588470 1256565 1017314 4025177 7640401 9710212 10817926 11641467 10968796 7942583
2592 7942583 4184923 1813546 787557 33297 -41133 1691733 4464174 5999209 5575716
2583 5575716 4851089 5291612 6483891 7641573 9121057 11130176 12101690 10236234 6507301
$$ packed form
2644A467752j352167l023531j120928J758190K028758M55699Q4859R07625M01200
2635A607457j379163j285077J654374L943650K388431j323594k982758j221990
2627A401330J632659L083104K675805J073561j073089k958865l637423k808712
2619f11630j181860P769k74041k012218l627252l170941o97028J530549J971839
2610h064813J646505J870401J827829M77856n86974Q07659L200596K844748m35337
2601C588470k331905k39251L007863L615224K069811J107714Q23541o72671l026213
2592G942583l757660k371377j025989p54260p4430J732866K772441J535035m23493
2583E575716p24627M40523J192279J157682J479484K009119R71514j865456l728933
$$ plain form
2574 6507301 4325180 5440732 7396013 6302551 1660747 -2888049 -3651151 -574831
2566 -574831 3445589 5785758 5913921 4936182 4355600 4857371 5604003 5228890 4030901
2557 4030901 4089378 6137922 7639240 5955846 2643400 2076724 5836830 11004756 14444136
2548 14444136 16040279 16610345 15429488 11980545 8095243 5839418 4637527 2963554
2540 2963554 1706458 2955551 5936332 7167522 5047012 1819377 348457 1055842
2532 1055842 2816687 4914167 7010752 8653766 9846738 11063334 12100103 12076782 10952608
2523 10952608 9594758 7985831 5243904 2141108 1456455 4426008 8637557 11014522
2515 11014522 11239390 10613268 9451447 7842558 7193961 8132540 8221787 5144193 1299513
$$ packed form
2574F507301k182121J115552J955281j093462m641804m548796p63102L076320
2566e74831M020420K340169J28163r77739n80582N01771P46632l75113j197989
2557D030901N8477K048544J501318j683394l312446n66676L760106N167926L439380
2548A4444136J596143N70066j180857l448943l885302k255825j201891j673973
2540B963554j257096J249093K980781J231190k120510l227635j470920P07385
2532A055842J760845K097480K096585J643014J192972J216596J036769k3321j124174
2523A0952608j357850j608927k741927l102796o84653K969553M211549K376965
2515A1014522K24868o26122j161821j608889o48597R38579Q9247l077594l844680
$$ plain form
2506 1299513 1266027 4632918 5676166 1486067 -3640877 -4370458 -1503264 357599 -117213
2497 -117213 -236481 1463830 3278737 3962445 4932847 7599552 10757005 12070154 10830589
2488 10830589 8199907 5729746 4452211 4569525 5269585 5372840 4569221 3495326 2508206
2479 2508206 1265619 -201312 -932826 -127239 1776143 3511470 4114412 3563377 2831618
2470 2831618 3270969 5200038 7025744 6576355 3599882 388320 -299087 2313417 6379104
2461 6379104 8858864 8163335 5900464 5049975 5693869 4343086 -651324 -5027337 -3415180
2452 -3415180 2807909 6867657 6087952 5196932 8326326 12436825 12272376 8327921 5453997
2443 5453997 5651376 6728509 7004341 7019997 6857747 5687644 4248347 4368286 5592933
$$ packed form
2506A299513l3486L366891J043248m190099n126944p29581K867194J860863m74812
2497a17213j19268J700311J814907O83708R70402K666705L157453J313149j239565
2488A0830589k630682k470161j277535J17314P00060J03255q03619j073895r87120
2479B508206j242587j466931p31514Q05587J903382J735327O02942n51035p31759
2470B831618M39351J929069J825706m49389k976473l211562o87407K612504M065687
2461F379104K479760o95529k262871q50489O43894j350783m994410m376013J612157
2452c415180O223089M059748p79705q91020L129394M110499j64449l944455k873924
2443E453997J97379J077133K75832J5656j62250j170103j439297J19939J224647
$$ plain form
2434 5592933 5388145 3159808 1089563 491307 421206 598148 2411500 5692709 7509715
2425 7509715 6039413 3259119 1921754 1914192 1564475 832364 1082670 2712050 4716487
2416 4716487 6019075 6217258 5728500 5693414 6657273 7176925 5384003 2086485 79640
2407 79640 -15960 -404719 -1673746 -1000578 3195743 7800695 8923718 6906215 4542941
2398 4542941 2498883 -125377 -2390040 -2556131 -1734190 -2775842 -5671911 -7429801 -6703272
2389 -6703272 -5334613 -4724334 -3628054 -595040 3730415 7717597 10232075 10351545 7700276
2380 7700276 3988180 2256808 3353810 4626299 3274396 -178602 -2800817 -2631055
2372 -2631055 -121040 3079057 5726084 7408387 7789952 5834159 705728 -6000591
$$ packed form
2434E592933k04788k228337k070245n98256p0101J76942J813352L281209J817006
2425G509715j470302k780294j337365p562l49717p32111K50306J629380K004437
2416D716487J302588J98183m88758l5086R63859N19652j792922l297518k006845
2407G9640r5600l88759j269027O73168M196321M604952J123023k017503k363274
2398D542941k044058k624260k264663j66091Q21941j041652k896069j757890P26529
2389f703272J368659O10279J096280L033014M325455L987182K514478J19470k651269
2380G700276l712096j731372J097002J272489j351903l452998k622215J69762
2372b631055K510015L200097K647027J682303L81565j955793n128431o706319
$$ plain form
2364 -6000591 -10195464 -9122728 -4750392 -1747137 -2472541 -5562069 -8791867 -10999545
2356 -10999545 -11286858 -8955030 -4962296 -1386515 1251098 4186886 7397407 8749491
2348 8749491 7329635 5415949 5441104 6680781 6756705 5077359 2898216 1007441 -605077
2339 -605077 -1313763 -128636 2447746 4351573 4227980 2905445 2258995 3205206 5189408
2330 5189408 7322399 9452179 11686682 13050557 11693709 7252743 2200109 -475553
2322 -475553 -497288 232921 927290 2580092 5188701 6709341 5948034 4634022 5005777
2313 5005777 6522762 6619046 4132544 646350 -1310167 -486524 2340671 5060900 5852757
2304 5852757 4625945 2806176 1799010 2148189 3800086 5986647 6906832 5064250 1427292
$$ packed form
2364f000591m194873J072736M372336L003255p25404l089528l229798k207678
2356a0999545k87313K331828L992734L575781K637613K935788L210521J352084
2348H749491j419856j913686K5155J239677P5924j679346k179143j890775j612518
2339f05077p08686J185127K576382J903827j23593j322535o46450R46211J984202
2330E189408K132991K129780K234503J363875j356848m440966n052634k675662
2322d75553k1735P30209O94369J652802K608609J520640p61307j314012L71755
2313E005777J516985R6284k486502l486194j956517Q23643K827195K720229P91857
2304E852757j226812j819769j007166L49179J651897K186561R20185j842582l636958
$$ plain form
2295 1427292 -966055 -79176 3416024 7578323 10926851 12538686 12114927 10500900 8695158
2286 8695158 6127613 1788604 -2753644 -4075862 -1570109 1228283 1391270 129676
2278 129676 -154319 308272 145777 -228328 -53494 -609390 -2952703 -4795876 -3139364
2269 -3139364 917181 3500425 3596126 3818176 5551626 6832333 5758157 3038144 223552
2260 223552 -2111233 -3590841 -3744433 -3276934 -3465924 -3657111 -1772103 1807820 3444157
2251 3444157 856273 -3523969 -5467229 -3582970 455177 4646919 7757169 8881466
2243 8881466 7957427 6320100 5357002 4922621 4037218 2613146 1552946 1642626 3085246
$$ packed form
2295A427292k393347Q86879L495200M162299L348528J611835m23759j614027j805742
2286H695158k567545m339009m542248j322218K505753K798392J62987j261594
2278A29676k83995M62591j62495l74105J74834n55896k343313j843173J656512
2269c139364M056545K583244R5701K22050J733450J280707j074176k720013k814592
2260B23552k334785j479608j53592M67499j88990j91187J885008L579923J636337
2251C444157k587884m380242j943260J884259M038147M191742L110250J124297
2243H881466r24039j637327r63098m34381q85403j424072j060200Q9680J442620
$$ [...]
##END NTUPLES=NMR SPECTRUM
##END=
