##TITLE=31Pdec_DE-13)_DEP_TFA
 DMSO,64 sc
 29.6.2026
##JCAMPDX= 6.0         $$ Bruker NMR JCAMP-DX V2.0
##DATA TYPE= NMR SPECTRUM
##DATA CLASS= NTUPLES
##ORIGIN= UXNMR, Bruker Analytische Messtechnik GmbH
##OWNER= root
$$ XWIN-NMR		Version 3.5
$$ Mon Jun 29 14:00:40 2026 Russian Standard Time (UT+4h)  she@DPX200
##.OBSERVE FREQUENCY= 81.013821
##.OBSERVE NUCLEUS= ^31P
##.ACQUISITION MODE= SIMULTANEOUS
##.ACQUISITION SCHEME= undefined
##.AVERAGES= 64
##.DIGITISER RES= 17
##SPECTROMETER/DATA SYSTEM= spect
##.PULSE SEQUENCE= zgpg30
##.SOLVENT NAME= DMSO
##.SHIFT REFERENCE= (INTERNAL, DMSO, 0, 197.392)
##AUDIT TRAIL= $$ (NUMBER, WHEN, WHO, WHERE, WHAT)
$$ ##TITLE= Audit trail, XWIN-NMR		Version 3.5
$$ ##JCAMPDX= 5.01
$$ ##ORIGIN= Bruker BioSpin GmbH
$$ ##OWNER= she
$$ F:/spectra/data/she/nmr/P31/2/pdata/1/auditp.txt
$$ ##AUDIT TRAIL=  $$ (NUMBER, WHEN, WHO, WHERE, WHAT)
(   1,<2026-06-29 13:59:43.09 +0400>,<she>,<DPX200>,
      <created by zg, POWCHK disabled, PULCHK disabled
       configuration hash MD5:
       00 E9 B6 7A A2 85 ED C7 34 08 36 98 17 FE 4E 26
       data hash MD5: 32K
       AA FA 61 A0 6C 8B 93 A2 50 2E A8 CE 99 E3 2B 79>)
(   2,<2026-06-29 13:59:45.31 +0400>,<she>,<DPX200>,
      <Start of raw data processing
       efp BC_mod = 2 LB = 1.5 FT_mod = 6 PKNL = 1 PHC0 = 1649.791 PHC1 = -3.301208 SI = 64K 
       data hash MD5: 64K
       9D 27 9A 96 8B 48 18 33 79 DE 4C 24 E2 55 61 87>)
(   3,<2026-06-29 14:00:01.67 +0400>,<she>,<DPX200>,
      <pk PHC0 = 70.62369 PHC1 = 0 
       data hash MD5: 64K
       3D 3E 8D 06 66 B0 AE C6 B3 A2 F1 1A D7 CF 25 1B>)
$$ ##END=
$$ 
$$ hash MD5
$$ C4 EA 52 30 73 E2 66 7B 24 40 E9 DE F0 FC 0E 93
##$RELAX= 
##$RELAX= 
##$RELAX= 
##$RELAX= 
##$RELAX= 
##$RELAX= 
##$RELAX= 
##$RELAX= 
$$ Bruker specific parameters
$$ --------------------------
##$DU= <F:/spectra>
##$EXPNO= 2
##$NAME= <P31>
##$PROCNO= 1
##$TYPE= <nmr>
##$USER= <she>
##$AMP= (0..31)
100 100 100 100 100 100 100 100 100 100 100 100 100 100 100 100 100 100 
100 100 100 100 100 100 100 100 100 100 100 100 100 100 
##$AQSEQ= 0
##$AQ_mod= 1
##$AUNM= <au_zg>
##$AUTOPOS= <>
##$BF1= 81.014009
##$BF2= 200.13
##$BF3= 200.13
##$BF4= 200.13
##$BF5= 200.13
##$BF6= 200.13
##$BF7= 200.13
##$BF8= 200.13
##$BYTORDA= 1
##$CFDGTYP= 0
##$CFRGTYP= 5
##$CHEMSTR= <none>
##$CNST= (0..31)
1 1 145 1 1 1 1 1 1 1 1 1 1 1 1 1 1 1 1 1 1 1 1 1 1 1 1 1 1 1 1 1 
##$CPDPRG= <waltz16>
##$CPDPRG1= <>
##$CPDPRG2= <waltz16>
##$CPDPRG3= <>
##$CPDPRG4= <mlev>
##$CPDPRG5= <mlev>
##$CPDPRG6= <mlev>
##$CPDPRG7= <mlev>
##$CPDPRG8= <mlev>
##$CPDPRGB= <>
##$CPDPRGT= <>
##$D= (0..31)
0 1 0 0 0 0 0 0 0 0.06 0 0.03 2e-05 3e-06 0 0 0.0002 0 0 0 0 0 0 0 0 0 
0 0 0 0 0 0 
##$DATE= 1782727182
##$DBL= (0..7)
120 120 120 11 120 120 24 19 
##$DBP= (0..7)
150 150 150 150 150 150 150 150 
##$DBP07= 0
##$DBPNAM0= <>
##$DBPNAM1= <>
##$DBPNAM2= <>
##$DBPNAM3= <>
##$DBPNAM4= <>
##$DBPNAM5= <>
##$DBPNAM6= <>
##$DBPNAM7= <>
##$DBPOAL= (0..7)
0.5 0.5 0.5 0.5 0.5 0.5 0.5 0.5 
##$DBPOFFS= (0..7)
$$ [...]
##$SUBNAM2= <"">
##$SUBNAM3= <"">
##$SUBNAM4= <"">
##$SUBNAM5= <"">
##$SUBNAM6= <"">
##$SUBNAM7= <"">
##$SUBNAM8= <"">
##$SUBNAM9= <"">
##$SW= 400.765351723535
##$SWIBOX= (0..15)
0 1 3 0 0 0 0 0 0 0 0 0 0 0 0 0 
##$SW_h= 32467.5324675325
##$TD= 32768
##$TD0= 1
##$TE= 0
##$TE2= 300
##$TE3= 300
##$TEG= 300
##$TL= (0..7)
0 120 53 12 22 120 120 120 
##$TP= (0..7)
150 150 150 150 150 150 150 150 
##$TP07= 0
##$TPNAME0= <>
##$TPNAME1= <>
##$TPNAME2= <>
##$TPNAME3= <>
##$TPNAME4= <>
##$TPNAME5= <>
##$TPNAME6= <>
##$TPNAME7= <>
##$TPOAL= (0..7)
0.5 0.5 0.5 0.5 0.5 0.5 0.5 0.5 
##$TPOFFS= (0..7)
0 0 0 0 0 0 0 0 
##$TUNHIN= 0
##$TUNHOUT= 0
##$TUNXOUT= 0
##$USERA1= <user>
##$USERA2= <user>
##$USERA3= <user>
##$USERA4= <user>
##$USERA5= <user>
##$V9= 5
##$VALIST= <valist>
##$VCLIST= <CCCCCCCCCCCCCCC>
##$VD= 0
##$VDLIST= <DDDDDDDDDDDDDDD>
##$VPLIST= <PPPPPPPPPPPPPPP>
##$VTLIST= <TTTTTTTTTTTTTTT>
##$WBST= 1024
##$WBSW= 4
##$XGAIN= (0..3)
0 0 0 0 
##$XL= 0
##$YL= 0
##$YMAX_a= 10145
##$YMIN_a= -8207
##$ZGOPTNS= <>
##$ZL1= 120
##$ZL2= 120
##$ZL3= 120
##$ZL4= 120
##$ABSF1= 0
##$ABSF2= 0
##$ABSG= 0
##$ABSL= 0
##$ALPHA= 0
##$AQORDER= 0
##$ASSFAC= 0
##$ASSFACI= 0
##$ASSFACX= 0
##$ASSWID= 0
##$AUNMP= <proc_1d>
##$AZFE= 0.1
##$AZFW= 0.5
##$BCFW= 0
##$BC_mod= 2
##$BYTORDP= 0
##$COROFFS= 0
##$CY= -3
##$DATMOD= 1
##$DC= 0
##$DFILT= <>
##$DTYPP= 0
##$F1P= 0
##$F2P= 0
##$FCOR= 1
##$FTSIZE= 65536
##$FT_mod= 6
##$GAMMA= 0
##$GB= 0
##$INTBC= 1
##$INTSCL= 9.790993e-09
##$ISEN= 30
##$LB= 1.5
##$LEV0= 0
##$LPBIN= 0
##$MAXI= 10000
##$MC2= 0
##$MEAN= 0
##$ME_mod= 0
##$MI= 50
##$NCOEF= 0
##$NC_proc= -8
##$NLEV= 6
##$NOISF1= 182.463
##$NOISF2= 159.3651
##$NSP= 0
##$NTH_PI= 0
##$NZP= 0
##$OFFSET= 197.3918
##$PC= 4
##$PHC0= 1720.415
##$PHC1= -3.301208
##$PH_mod= 1
##$PKNL= yes
##$PPARMOD= 0
##$PSCAL= 0
##$PSIGN= 0
##$REVERSE= no
##$SF= 81.014063255964
##$SI= 65536
##$SIGF1= 159.3651
##$SIGF2= -187.1042
##$SINO= 113.3802
##$SIOLD= 16384
##$SREGLST= <1H.CDCl3>
##$SSB= 0
##$STSI= 65536
##$STSR= 0
##$SW_p= 32467.5324675325
##$SYMM= 0
##$S_DEV= 0
##$TDeff= 32768
##$TDoff= 0
##$TI= <>
##$TILT= no
##$TM1= 0
##$TM2= 0
##$TOPLEV= 0
##$USERP1= <user>
##$USERP2= <user>
##$USERP3= <user>
##$USERP4= <user>
##$USERP5= <user>
##$WDW= 1
##$XDIM= 65536
##$YMAX_p= 30568866
##$YMIN_p= -356852693
$$ End of Bruker specific parameters
$$ ---------------------------------
##NTUPLES= NMR SPECTRUM
##VAR_NAME=  FREQUENCY,     SPECTRUM/REAL,   SPECTRUM/IMAG
##SYMBOL=    X,             R,               I
##VAR_TYPE=  INDEPENDENT,   DEPENDENT,       DEPENDENT
##VAR_FORM=  AFFN,          ASDF,            ASDF
##VAR_DIM=   65536,         65536,           65536
##UNITS=     HZ,            ARBITRARY UNITS, ARBITRARY UNITS
##FACTOR=    0.49542278885378, 1,            1
##FIRST=     15991.5117654749, 0,            0
##LAST=      -16476.0207020576, 0,           0
##MIN=       -16476.0207020576, -356852693,  0
##MAX=       15991.5117654749, 30568866,     0
$$ Real data points
##PAGE= N=1
##DATA TABLE= (X++(R..R)), XYDATA
$$ [...]
##PAGE= N=2
##DATA TABLE= (X++(I..I)), XYDATA
9621 -2180774 -2525741 -2207497 -2798305 -4899204 -6395805 -5063159 -1851842 115556 -600264
9612 -600264 -2416800 -3106268 -2187685 -976368 -1409782 -4712002 -10005707 -14365728 -15514578
9603 -15514578 -14222728 -12570680 -10413134 -6074084 -679196 1383140 -2090364 -7726465
9595 -7726465 -10744588 -10491558 -9394794 -8223484 -5618525 -1521385 2235325 4839372
9587 4839372 7129629 8944861 8637362 6100711 3719125 2944242 2072179 -876026 -4693276
9578 -4693276 -6276141 -4387545 -524978 3188590 5420978 5504158 3580709 985334 -669528
9569 -669528 -1079371 -1352453 -2574638 -4843253 -7676461 -10735562 -13761936 -15887459 -15450426
9560 -15450426 -11303607 -4758657 566027 1928595 99411 -2277726 -4265460 -6705100
9552 -6705100 -9092301 -9107671 -6136221 -2880841 -2034130 -3297600 -5226361 -7912591 -11595923
9543 -11595923 -14341940 -13968360 -11492707 -10019338 -10555141 -11294126 -10734879 -9055932 -6522108
9534 -6522108 -3112984 17949 1266062 1319072 2707533 5755274 7392065 5315825 1260840
9525 1260840 -1445024 -1880286 -1450159 -1242417 -1256223 -1345882 -1349939 -866893 -5029 418948
9515 418948 350248 1024530 2855136 4035803 2770648 -200664 -3019453 -5598319 -8899880
9506 -8899880 -11835021 -11301539 -5820808 2363768 9169623 11639610 9333522 4383542
9498 4383542 347758 -418118 1311506 3128228 4127440 5247282 6768620 7368810 6168276
9489 6168276 4254245 3482198 4687665 7301231 9665869 9724937 6813774 2980843 1133514
9480 1133514 1751017 2997567 3986108 5575273 7464876 7339139 4422266 1382394 543457
9471 543457 306000 -1970718 -5106956 -5358532 -1954292 1744504 2826498 1879549 876377
9462 876377 447455 334513 630705 1187450 1046579 -211438 -1276756 -352519 2725128
9453 2725128 6269890 8439831 8794609 8338825 8166610 8079400 6957286 4712241 2996556
9444 2996556 3150743 4258571 4409055 3205290 1659427 278913 -1047730 -1788116 -1380584
9435 -1380584 -875382 -1875482 -3902070 -5011869 -5013322 -5439402 -5950548 -3793040 1905846
9426 1905846 7983454 11033563 11077338 9834199 7786901 5134327 3458343 3769162 4412261
9417 4412261 3421229 1633822 1090419 1735618 2263641 2805201 3850064 3811360 1123887
9408 1123887 -1976886 -1431686 2952045 7131414 8221404 6948426 4611577 1314013
9400 1314013 -2013167 -3443688 -3196093 -3734415 -5494195 -5839400 -3715154 -1689285 -1299708
9391 -1299708 -139975 3446231 6231084 4585130 547395 -837359 1535826 4915163
9383 4915163 8341575 13170955 18109145 18927521 14633917 9786034 8501441 9357573 8593755
9374 8593755 5712652 3053144 1511455 -303883 -3152445 -5763516 -6532708 -5211299
9366 -5211299 -2860053 -1056722 -898190 -1918665 -2396014 -1621596 -1247914 -3067720 -5878437
9357 -5878437 -6359667 -3440845 -122406 91265 -2676886 -5564936 -7077620 -8127199 -8894873
9348 -8894873 -7182178 -1563474 5394823 9380812 9240861 7369856 5410985 2356122
9340 2356122 -2238606 -5917976 -6233984 -4148699 -2291967 -1182847 340276 1922993
9332 1922993 1870445 385398 -204004 989121 2020914 1083426 -1309125 -3988545 -6734776
9323 -6734776 -8906059 -8713809 -5913715 -3582859 -4841082 -8757428 -11774263 -12405851 -11910487
9314 -11910487 -10646730 -6991559 -953080 3849886 3962727 428179 -2687213 -3192263
9306 -3192263 -2097916 -621634 1457508 3803514 4313017 1748403 -1697073 -2506843 -105655
9297 -105655 2777902 3911851 3802344 3665191 3094092 1145278 -1411304 -2606991 -1768977
9288 -1768977 -224330 543167 525290 791721 1997366 3412603 3310938 676574 -3253001
9279 -3253001 -5809962 -5725502 -4331646 -3279027 -2215438 -175359 1616530 545806 -3638804
9270 -3638804 -7923945 -9755636 -10079256 -11356124 -13574088 -13869539 -10070761 -3459481 2392398
9261 2392398 4978896 4673312 3514734 2844376 2559798 2380889 2876744 4638901 6928141
9252 6928141 7926668 6380010 2736514 -1082565 -2850152 -1587472 1508909 4153402
9244 4153402 5363344 6049622 6880339 6921299 5480273 3895110 3650777 3668898 1682417
9235 1682417 -2103046 -4984530 -5391966 -4423567 -3670805 -3717246 -4985605 -7516404 -9197339
9226 -9197339 -6880349 -721998 4742252 5537400 2587378 -344631 -1235484 -576796 640554
9217 640554 1426136 458633 -2421892 -5057284 -5313611 -3973893 -3373832 -3812643 -3523520
9208 -3523520 -1909901 -510214 -499367 -1178328 -1366344 -624380 1306476 4560436 7886494
9199 7886494 8841695 6442046 2827862 1203868 2373079 4047862 3619650 1158417 -696445
9190 -696445 85339 2321048 2973250 1011389 -1292893 -1381088 553859 2431352 2982855
9181 2982855 2326901 872852 -721080 -1049864 964916 4607430 8041777 10037065 10060534
9172 10060534 7631594 3245018 -754237 -2164320 -1529121 -1004592 -1031917 -199974 1782248
9163 1782248 3329980 3506474 3108357 2695225 1626991 -201322 -1626557 -2080038 -2379709
9154 -2379709 -2865468 -2693359 -1949514 -2323790 -4240630 -5364638 -3887317 -1599175 -1415575
9145 -1415575 -3097113 -3956326 -3142489 -2589707 -3646687 -5149624 -5544451 -5084560 -4848848
9136 -4848848 -4752854 -3720488 -1419464 1009833 2005941 1099540 -644795 -1679555 -1421591
9127 -1421591 -452280 591278 1648779 2554410 2632268 1780576 1389811 3114939 6758908
9118 6758908 10186264 11517492 10889044 9865841 9489050 9172536 7490465 3963819 -82364
9109 -82364 -2593741 -2597337 -793221 1270254 2147290 1103959 -1313348 -3517403 -4636010
9100 -4636010 -5816599 -8621754 -12353132 -14561667 -14272913 -12804884 -11001717 -8009492
9092 -8009492 -4021152 -1913959 -3927475 -8113139 -10345857 -8999180 -5654794 -2194541
9084 -2194541 444228 1362415 261498 -1204139 -1106325 -232531 -842149 -2491673 -2323572
9075 -2323572 -218945 -70305 -3941309 -8067045 -7615048 -3240837 441479 1465114 1832118
9066 1832118 2770617 2745183 1076474 -36890 926294 1873377 177256 -3073288 -4594420
9057 -4594420 -3709853 -2863038 -3525373 -4308286 -3784373 -2799696 -2607041 -2456435 -866894
9048 -866894 1668045 3097632 2613698 1409294 628992 105830 -398811 9753 2398090
9039 2398090 6413657 10327536 12332839 11445430 7740221 2515052 -1907936 -3344854
9031 -3344854 -1240631 2933427 6817859 8803440 8801416 7751565 6691309 6331235 6992091
9022 6992091 8266177 8916242 8010489 6213153 4865895 3653310 854013 -3326539 -5748158
9013 -5748158 -4489031 -2185117 -2501793 -4578524 -4506448 -1827275 -336149 -1621850 -2165272
9004 -2165272 843144 4435396 3856723 -884086 -5769798 -8152320 -8016927 -5549635 -1256551
8995 -1256551 2444211 3579951 4100510 7194912 11379818 11522968 6353485 664895 -1424468
8986 -1424468 -1402586 -2433313 -4233904 -4900475 -4901637 -5694230 -6343318 -5176783 -3576665
8977 -3576665 -4414021 -7122191 -7882810 -5091099 -1455360 369970 1488389 4309027 8245341
8968 8245341 10165484 8719990 6357739 6346635 8601705 9568418 6619121 1754916 -383342
8959 -383342 1734982 4331957 2843243 -2564001 -7445229 -8350626 -6049339 -3726498 -3534068
8950 -3534068 -5219752 -7022473 -7381945 -6196579 -4480032 -2652270 78814 3941068
8942 3941068 7171908 7746701 5950952 3699044 1760571 -423355 -2240810 -1522229 2375204
8933 2375204 6635384 7334043 3083805 -4035696 -10193458 -12201346 -9636204 -5382901
8925 -5382901 -3063168 -3332114 -3685326 -2124181 615519 2994648 4723036 5627914 4596235
8916 4596235 1742849 -15840 1745870 4929402 4939296 575159 -4668208 -7328198 -7405581
8907 -7405581 -6470010 -4949006 -2750607 -730885 78799 -404180 -2053192 -5116850 -8913637
8898 -8913637 -11298416 -10918214 -9001531 -7567742 -6984937 -6813363 -7706739 -10143837 -12021912
8889 -12021912 -10243503 -4913299 366544 2912749 3576195 4289495 5269505 6002529 7060108
8880 7060108 8973025 10511905 10166398 8728318 8368274 9205757 8672636 4798062 -1215626
8871 -1215626 -6308009 -8457281 -7712574 -5342801 -2950497 -1995456 -3141601 -5719574 -8115290
8862 -8115290 -8928391 -7899318 -5933418 -4296826 -3571543 -3243723 -2463223 -1309714 -1037679
8853 -1037679 -2724138 -5780479 -8299007 -9061766 -8701587 -8382699 -7866848 -6024916 -3247339
8844 -3247339 -1759240 -2586410 -3573525 -2156030 694879 1524762 -687591 -3120164 -3317652
8835 -3317652 -2355442 -2239251 -2311245 -746447 1596184 1686305 -1393104 -5083314 -6752262
8826 -6752262 -6606259 -6612374 -8035011 -10628703 -12926173 -12775491 -8980679 -3191976 1005935
8817 1005935 1728261 587202 253543 1414148 3068348 4648729 6343756 7784187 7818236
8808 7818236 5803397 2456035 -702866 -2538682 -3137639 -3470223 -3762806 -2529893 1433897
8799 1433897 5970766 6503251 1446429 -4878814 -6812522 -4034656 -1458378 -2734006
8791 -2734006 -6338880 -8714732 -8898556 -8354414 -7710191 -5959615 -2823649 -67588 387944
8782 387944 -1143281 -2470971 -2066427 -559273 419282 295677 -59560 261537 1107017
8773 1107017 1682192 1447742 345228 -1240036 -2286770 -1552420 1008509 3551276 3925966
8764 3925966 1941860 -626451 -2243970 -3012810 -3657221 -3902859 -2555790 879231 4974316
8755 4974316 6971954 5010402 217647 -3630307 -3333079 510069 3922204 3540189 -39598
8746 -39598 -3122365 -2859585 -7168 2185131 1532706 -857351 -1964514 -256324 2662043
8737 2662043 3839159 1887440 -2241503 -6783329 -10548742 -12839045 -12947018 -10434135
8729 -10434135 -5876459 -1143689 1331942 299627 -2679982 -3931813 -1185387 3639853
8721 3639853 6401494 5680282 4252658 4900305 6461813 5821604 2709954 21831 -590841
8712 -590841 -777663 -2045672 -2558580 406783 5969240 10098785 10452529 8572269 6850533
8703 6850533 5393520 3019353 -237068 -3181482 -5074149 -5689580 -4492285 -1467721
8695 -1467721 1517552 2031654 147463 -1222695 311792 3945987 6910587 7427804 5840420
8686 5840420 3725988 2760927 3866170 6531344 9086895 10177792 9952755 9726151 10807098
8677 10807098 13573515 16903258 18403366 16334435 11957474 9016284 9968546 13351481
8669 13351481 15660775 15109890 12603073 9816889 7747590 6794598 6740118 6447508 4771161
8660 4771161 2122751 243715 110537 845787 1030607 386286 -293606 -418298 -349477
8651 -349477 -929480 -2308765 -3306804 -2464342 -27467 1954098 2367907 3007029 6182596
8642 6182596 10665355 12048802 7882613 914101 -3837517 -4135083 -1593096 1182602
8634 1182602 2831946 2939737 1256149 -2010782 -5780013 -8598939 -9588853 -8959049 -7725451
8625 -7725451 -6653903 -5214142 -2039817 2980969 7498166 8566291 5744097 1455626
8617 1455626 -1798156 -3448924 -3721394 -2035485 1950973 6492522 8849790 8331962 6668289
8608 6668289 5139156 3223874 858408 -97794 1555197 3925955 4550255 4236422 5522335
8599 5522335 7827044 7679498 4445035 2228827 4111308 7443738 7700252 4923045 3037648
8590 3037648 3888638 5364676 5236343 3690184 1614009 -759812 -2473494 -1554990 2271582
8581 2271582 6124995 6781364 4131141 747841 -1274016 -2061910 -2985354 -4735014 -6363491
8572 -6363491 -6148312 -3665750 -700635 606161 189320 -331494 -166965 -239328 -1675301
8563 -1675301 -4715880 -8998776 -13417201 -15728706 -14104431 -9484682 -4866629 -1979903
8555 -1979903 -313576 503254 -248422 -2213600 -3372096 -3024099 -3095616 -4701416 -5645369
8546 -5645369 -3771433 -935453 -525056 -2052255 -1648724 2026047 5639014 5972054 4223083
8537 4223083 3771194 5365515 6667448 5962049 4278149 3334954 2840689 1216206 -1330840
8528 -1330840 -2120816 634666 4843139 6572849 4806487 2316690 1519358 1451223 -76660
8519 -76660 -3017233 -5429883 -6344597 -6690014 -7661467 -9148816 -9528387 -6715589 -417343
8510 -417343 6261778 9017473 7036079 3815604 2219021 912205 -2305837 -5899617
8502 -5899617 -6531562 -4315935 -2553202 -2556627 -2293554 -583015 777728 287302 -729657
8493 -729657 -520581 393083 658920 434068 426180 -32594 -2003619 -4820339 -6675649 -6943551
8483 -6943551 -6520167 -6092724 -5338557 -3888860 -2053662 -255617 1598288 3651433 5220710
8474 5220710 5113952 3383908 2262404 3993546 7477418 8744777 5882126 1885543
8466 1885543 782416 2247013 2566027 124907 -3072484 -5196956 -6565864 -7088395 -5091149
8457 -5091149 -546967 3116144 2828349 -98806 -1920253 -1201777 474338 1590378 2200198
8448 2200198 2564196 2216559 862736 -813482 -1708830 -1511982 -1409905 -3192852 -6745931
8439 -6745931 -8871181 -6468695 -1090428 1954076 -30338 -3915931 -5347391 -4212865
8431 -4212865 -3310949 -3518545 -3247362 -1763001 -166610 704979 959210 279079 -1982595
8422 -1982595 -5210838 -7789620 -8967860 -8972608 -7710831 -5231387 -3025182 -2563607 -2600048
8413 -2600048 -329218 4414516 8383035 8922783 6680921 3709097 1079734 -645121
8405 -645121 -716340 555371 1407971 861853 100098 503281 1659463 2496512 2942274 3036982
8395 3036982 1816051 -1096625 -3831247 -4201183 -2672485 -1508676 -1440059 -1293192 -806075
8386 -806075 -1410492 -3468847 -4817036 -3556239 -1022952 -309190 -2420886 -5477418 -7494828
8377 -7494828 -8257803 -8076810 -6468084 -3403192 -750580 -618769 -2496404 -3763439 -3160254
8368 -3160254 -1924017 -1019535 578562 3512099 5968747 6121441 5184875 5498893 6563333
8359 6563333 5891440 3277292 912024 -767473 -3545890 -6790980 -6447249 -1094596 4463130
8350 4463130 5110890 2353071 1286357 2413767 1335812 -3639540 -8569005 -10030944
8342 -10030944 -10010164 -11875946 -14406459 -13368231 -7898640 -2050967 254070 -505303 -1072091
8333 -1072091 163854 1569396 696603 -2693166 -6468962 -8574270 -8738290 -7496079 -4689547
8324 -4689547 -279910 3962234 5519967 4257668 2820359 3097677 3713563 2212263 -1320519
8315 -1320519 -4247440 -4538099 -2798347 -1348197 -2051378 -4758326 -7225524 -6923919 -3542433
8306 -3542433 612708 3012380 2992733 1149074 -2068840 -6135437 -9860726 -12258370 -13219981
8297 -13219981 -12352916 -8557673 -2518096 1753392 578595 -4542821 -8376454 -8303389 -6630386
8288 -6630386 -6203669 -6535484 -5424132 -2070173 2743568 7532802 9991587 8324327 4284404
8279 4284404 2492976 4617969 6514995 3849590 -1473908 -3878447 -1713817 1544802
8271 1544802 3155035 4124892 5850470 7422494 7677204 7123303 6379453 5036818 3389503
8262 3389503 2976594 3925255 4017364 2158350 637318 1785006 4206015 4876087 3732714
8253 3732714 3446335 5126709 6782066 6201045 3438861 101983 -2394540 -3479174 -3310403
8244 -3310403 -2323807 -613129 1797032 3876968 4097188 2788277 2337429 3602486 3961179
8235 3961179 1223316 -2126278 -1826599 1743831 3645849 1119450 -3218369 -5791659
8227 -5791659 -6256761 -5607449 -3295535 987491 4707421 4668852 931339 -3734884 -7503386
8218 -7503386 -10423747 -12408496 -12702527 -11331492 -9155788 -6450966 -3055347 282008
8210 282008 2492774 3884263 5146459 4836779 678141 -5866392 -9279817 -6262299 -178963
8201 -178963 3211912 2891168 2460712 3757322 4259465 1689045 -1940203 -2987335 -1143804
8192 -1143804 487288 -506127 -3522319 -6354328 -7295356 -5961470 -3476439 -1927897 -2429767
8183 -2429767 -3663328 -3429971 -1470620 641766 2176503 3804743 5179583 4311955 627114
8174 627114 -3301560 -4817762 -4528798 -4763939 -6032759 -7203072 -8102183 -9260817 -9563155
8165 -9563155 -7060515 -2399654 1213304 2124675 1882374 2019878 1840877 751848 188060
8156 188060 1122359 1801695 533759 -901942 424610 3866981 5971435 5641366 5228347
8147 5228347 6029629 6029846 3618641 766745 209973 1359927 1591304 450608 -212761
8138 -212761 -7006 -1030452 -4329496 -7563738 -7762180 -5146461 -2610325 -2026951 -2618137
8129 -2618137 -2848177 -2404913 -1736312 -680528 1393432 4229834 6200945 5556209 2166164
8120 2166164 -2086653 -4904953 -5752965 -6175230 -7566475 -8985474 -8087778 -4316357 -97164
8111 -97164 1798001 1255970 224588 -287516 -1203853 -3297394 -5542307 -6426838 -6121997
8102 -6121997 -6209721 -7388932 -8478723 -8035197 -6132365 -3803745 -1301312 1808829 4725028
8093 4725028 5134075 1977088 -2553317 -5408517 -6521564 -8261747 -11140241 -12554605
8085 -12554605 -10735350 -7552764 -5610575 -4514229 -2428640 139782 1112197 679716
8077 679716 1126874 2710162 2989649 1156049 -173735 710312 1213525 -1958971 -7524320
8068 -7524320 -10889880 -9970460 -6989318 -4558296 -2635103 -195231 2186408 2942923 1642210
8059 1642210 -876058 -3955730 -7373193 -10170669 -10595082 -7954678 -3771753 -144899
8051 -144899 2497585 4744177 5758844 3748227 -426158 -2621880 -527804 2505490
8043 2505490 1774437 -1815630 -2921568 191150 3101944 2161352 -114471 597500 3836417
8034 3836417 5849805 5730032 5971378 7520118 8142098 6320558 3789403 3013152 4074357
8025 4074357 5101986 4563213 2498370 348800 -307005 349824 132736 -2350774 -5235984
8016 -5235984 -5327761 -2088622 2037590 4946276 6523369 7123137 6682639 5793015 5633440
8007 5633440 6159004 6013295 4790818 3798828 4139530 5654353 8001295 10776921 12242658
7998 12242658 10466852 6724379 5181136 7539556 10290562 9428144 5961754 4119811
7990 4119811 5392244 7281235 7505163 6623920 6100171 5988568 5429627 4026358 1946000
7981 1946000 -437110 -2439823 -3260059 -2690710 -1321306 46869 963569 1585991 2672795
7972 2672795 4748832 6759547 6380128 2707981 -1907295 -3963261 -2503431 435925
7964 435925 2841147 4714029 6790493 8706064 9379302 8531462 6952148 5476083 4301368
7955 4301368 3282773 2444657 2028591 2224184 3028398 4191972 4889430 3555112 -907750
7946 -907750 -7010300 -10804066 -9803923 -6433866 -5510564 -8047325 -9902639 -7577956 -2890060
7937 -2890060 60105 375217 -23385 -689721 -2829066 -5433848 -5097351 -846773 3863247
7928 3863247 5634347 5172176 5011482 5419602 5012755 3896261 3418898 3544705 3153696
7919 3153696 2737091 4092491 6896580 8134777 6150712 3273794 2748501 4354724 4886448
7910 4886448 2246891 -2738980 -8227527 -12993586 -15671568 -14299047 -8328295 -570102
7902 -570102 4406498 4285349 861569 -2225364 -2968278 -1947062 -620448 351907 1114037
7893 1114037 1824434 2387845 2657615 2559899 2291968 2611962 4288668 6587822 7015053
7884 7015053 4013613 -177762 -1201044 2105607 5787476 5639752 2495406 421957
7876 421957 651559 393219 -2112308 -4573820 -4153004 -1467229 911019 2047559 2567586
7867 2567586 2618349 2399106 3394314 6186715 7902019 5083596 -1060390 -5575536 -6267208
7858 -6267208 -5893123 -6906679 -7605201 -5671564 -2611318 -1649710 -2947146 -3884858 -3174647
7849 -3174647 -1942272 -1142629 -468832 6881 -690850 -2609921 -3956686 -2876000 361487
7840 361487 3281427 3274044 161753 -3169357 -3567017 -1248150 718643 920563 1415993
7831 1415993 3773606 5764072 4536625 1250596 -661833 -729444 -1400862 -3248607 -4076355
7822 -4076355 -3280462 -3357678 -5745071 -8402794 -9268977 -9195522 -9300945 -8068756 -3944153
7813 -3944153 970208 2876837 1149384 -1312582 -2103489 -1426345 -581515 -656808 -2738993
7804 -2738993 -7209298 -12233073 -14606029 -12888169 -8739803 -4832827 -2437764 -1270552
7796 -1270552 -497379 723193 2832864 5315040 6967461 7146339 6454736 6041362 6549407
7787 6549407 7781323 8948669 9163466 8095092 6282738 4585158 3390000 2590730 2071175
7778 2071175 1766020 1448781 983056 686859 1005638 1961671 3344460 5196175 7543281
7769 7543281 9814487 11111964 10993567 9584166 7256978 4836463 3684685 4504605 6048436
7760 6048436 6086631 4042200 1868367 1817160 3883619 5987904 6426384 5674797 5588948
7751 5588948 6790392 7221714 4285431 -1228791 -4779530 -3138995 1185991 2894670
7743 2894670 934194 -325693 2262015 5955884 6361783 3850909 2370862 3095680 3112805
7734 3112805 580393 -2463141 -3689523 -3792284 -4221248 -4045957 -1647901 2024226 4597782
7725 4597782 5829444 7392187 9446350 10011751 8063852 5080648 2947420 2101502 2198023
7716 2198023 2784798 2791353 1319375 -289816 695951 4255931 6455064 4308662 74404
7707 74404 -1631005 219833 2576337 3085674 2559318 2520356 2803592 2390878 814816
7698 814816 -1999283 -5678497 -8450516 -7866174 -3649840 1166586 2935760 627733 -3929421
7689 -3929421 -7861305 -8749922 -5780603 -656512 3383986 4490380 3643522 2687000 2038322
7680 2038322 1279475 730428 779289 376206 -1953899 -5764091 -9062407 -11120770 -13117581
7671 -13117581 -15412885 -15975323 -12945194 -7732244 -3876944 -3103767 -4067695 -5128531 -6544651
7662 -6544651 -8797977 -10239552 -8676174 -5176628 -3930912 -7172209 -11915026 -13417213
7654 -13417213 -10767451 -7047737 -4663220 -3030610 -1105302 348184 215300 -1113833
7646 -1113833 -2869411 -5502070 -9440089 -13153282 -14329345 -12794301 -10813344 -10444966
7638 -10444966 -11636622 -12819312 -12314226 -9253824 -4359078 -85760 1087984 -837233
7630 -837233 -3153598 -3233983 -1218163 487456 136036 -1486094 -2293458 -1588189 -771701
7621 -771701 -1135873 -1818043 -1019217 1147432 2554181 2111191 1387044 2214161 3857304
7612 3857304 3965537 1761880 -1125095 -2913875 -3526274 -3887666 -4242829 -3830166 -2129372
7603 -2129372 4084 976702 471436 166519 1534554 3398708 3150882 387581 -2424241
7594 -2424241 -3405967 -3575288 -4711635 -6577521 -7613950 -7069625 -5111384 -2159566 443906
7585 443906 534545 -2315997 -5507780 -6408655 -5359947 -3912555 -1898364 997231 2366211
7576 2366211 -421972 -5311582 -6982268 -3587110 1349448 4358129 5753454 6727658
7568 6727658 6341649 3691083 387020 -1584467 -2518875 -3337591 -3222476 -1426225 56057
7559 56057 -1552841 -5759223 -9048110 -9030108 -6596078 -4154971 -3252266 -3761679 -4128254
7550 -4128254 -2568758 888559 3776908 3502808 14834 -4457056 -7702647 -8878081
7542 -8878081 -8402260 -7507737 -7336812 -7754360 -7684538 -6990585 -6797137 -7389528 -7488898 -6690041
7532 -6690041 -6767139 -8882396 -11175060 -11223019 -9482903 -7873734 -6141478 -2551514 2315831
7523 2315831 5486416 5586197 4382470 3823621 3766301 3328857 2541763 1792844 1141575 841127
7513 841127 1184477 1389601 128975 -2246431 -3378378 -1473556 2804285 7352399 10502176
7504 10502176 11778484 12009342 12721063 14172068 14293197 11344723 7273062 5888775 7469001
7495 7469001 8133059 5660805 2886403 3198177 5235190 5073835 2194465 10875 846146
7486 846146 3334774 5256759 6521607 8234434 10351448 11550445 10853044 8608217 6090740
7477 6090740 4393203 3468046 2271171 235457 -1541126 -1270075 1195871 3677214 3874075
7468 3874075 1973133 376245 757292 2216489 3049505 3575474 5582972 8928361 10764330
7459 10764330 9290882 6427818 4896073 4211904 2139671 -1001893 -2715645 -2630345 -2840987
7450 -2840987 -3523376 -2033107 2157049 5225708 4097854 826614 -914423 -1209677 -2491415
7441 -2491415 -4652288 -5273967 -3857145 -2395676 -1989599 -1834469 -1502009 -1531273 -1664281
7432 -1664281 -883853 715816 2211457 3766948 6020129 7946519 7913699 6598826 6051114
7423 6051114 5997627 4218843 750882 -1727047 -2308706 -3045735 -4584125 -4402688 -1378829
7414 -1378829 1436103 1360543 445159 2031419 5202347 6247349 4270613 1840562 778274
7405 778274 586761 861421 2162646 4025612 4563735 2810000 -209179 -3140102 -5583473
7396 -5583473 -7466020 -8482230 -8437021 -7196702 -4481378 -745525 2206255 2851327 1850245
7387 1850245 981627 699033 336100 164694 1142988 2678414 2772812 793098 -1695038
7378 -1695038 -3233917 -3826923 -3543805 -1747774 1308774 3745181 4166653 3449582 3339950
7369 3339950 4117626 4654484 4213390 3360496 3381796 5131150 7992488 9898468 9170004
7360 9170004 6530905 4449220 4261008 4848502 4434845 2780930 1283185 1657044 4591211
7351 4591211 8750110 11135432 9726544 5989295 3490501 3782026 5051824 5118267 4042208
7342 4042208 3080769 2717064 2760012 3049718 3077891 2153008 760573 267704 378755 -1196079
7332 -1196079 -4996963 -7625804 -5628898 -420741 3140321 2580307 -51206 -1611675
7324 -1611675 -1158059 391278 1813293 2139110 1150321 -74482 -238576 235589 -410688
7315 -410688 -2602147 -4525846 -4628403 -3845670 -4255057 -6135528 -7506605 -6616387 -4143428
7306 -4143428 -2546758 -3471573 -6244360 -9006345 -10632301 -10774191 -8697182 -3900968 1730777
7297 1730777 4406866 2542275 -927639 -2153695 -1399999 -2325451 -6495516 -10865856 -11420649
7288 -11420649 -7756090 -3097767 -650582 -751079 -1207415 158841 3373424 6638657
7280 6638657 8534582 9165575 8975362 7630224 4974063 2085061 147881 -1004649 -2014169
7271 -2014169 -2455097 -1642156 -370602 -268550 -1730047 -3759586 -5306488 -5547860 -3947700
7262 -3947700 -1750557 -2019763 -5570542 -7963954 -4020912 4831342 11313640 10943465 6462457
7253 6462457 2735045 1098347 831586 2636074 7164061 12034525 13777044 12138243
7245 12138243 9906751 8827152 7879204 5634096 2620038 913693 2028347 5165090
7237 5165090 7453291 6639712 3590657 1007725 -225931 -1608595 -3824804 -5415032
7229 -5415032 -5366500 -4457838 -2878711 687821 5834635 9046892 7993383 4953124 3445947
7220 3445947 3572873 3339053 2338241 954556 -1958693 -6779204 -10087440 -8156209 -2717190
7211 -2717190 697875 -330000 -3653243 -7331329 -11341778 -14433860 -14026914 -10495669
7203 -10495669 -7622821 -7394328 -7831380 -7190647 -6590603 -6817589 -6106711 -3182443 577733
7194 577733 3952480 7729827 11721295 13234623 11116580 8290577 7385393 6677812 3629987
7185 3629987 -137840 -1143087 692818 2897756 4935166 7756122 9934686 8531612
7177 8531612 3710160 -1148371 -3934029 -5067064 -4535516 -1620772 1982546 2825170 795281
7168 795281 -66689 2348939 4635646 2831164 -1738463 -4607978 -4432037 -3883807 -4934614
7159 -4934614 -6163521 -5232418 -2169015 497243 -25871 -4540456 -10993257 -15825435 -16953320
7150 -16953320 -15487182 -14017452 -13473583 -12427300 -9365184 -4795700 -883618 518544
7142 518544 -594136 -2297719 -2074009 1227174 6311737 10363748 11194748 8611377 4083328
7133 4083328 -373396 -3043431 -3138372 -1361518 353199 392315 -1090112 -2674071 -3504059
7124 -3504059 -3885611 -4114558 -4019971 -4297033 -6789835 -11793234 -15984655 -15313856 -10045378
7115 -10045378 -4869984 -3455975 -4760486 -5486799 -4167789 -1498198 1453587 3353371
7107 3353371 2313072 -2055680 -6793093 -8009355 -5223632 -1645323 -165554 -657967
7099 -657967 -1288085 -915570 65560 48473 -2588332 -7264223 -10433754 -8897422 -4026355
7090 -4026355 -735025 -1757917 -4898622 -6700335 -6670714 -6334584 -5873760 -3968826 -405587
7081 -405587 2996183 4113397 2226058 -1642098 -5122958 -5736828 -2963080 1015706 3589286
7072 3589286 4593372 5982798 8809633 11693243 12598300 11240353 9170842 7929372
7064 7929372 7633965 7300219 6154356 4337611 2327172 182825 -2011082 -3235037 -2157063
7055 -2157063 996746 4178431 5767746 6263382 7005402 8144609 9007609 9680268 10639365
7046 10639365 11122164 9637783 6400858 3686298 3104365 3816959 4212036 4021450 3645519
7037 3645519 2613926 469515 -1451482 -1156139 946026 1983950 316163 -2286496
7029 -2286496 -3168106 -2090128 -523934 1233830 4121669 7780414 10200489 10456872 9875857
7020 9875857 9460821 7955694 4250197 502313 429489 4431194 8457749 8527993 5012949
7011 5012949 1523536 624335 1859994 3408812 4195186 4095743 3160567 1520328 -190011
7002 -190011 -1068645 -831889 -73546 557280 985584 1158994 489019 -1254687 -2853028
6993 -2853028 -2723006 -1143934 87962 664476 2644192 7109266 11514374 12254493 8948975
6984 8948975 4304482 575726 -1653821 -1952191 -247621 1364737 54455 -3699771
6976 -3699771 -6281175 -6185546 -6034593 -7607404 -8164566 -4868117 -373568 94280 -3828329
6967 -3828329 -7192951 -6557185 -3411455 -376624 2133918 4188240 4935448 5021739 7207448
6958 7207448 11822129 14353657 11124552 5399143 3567803 6130245 7288229 4125006
6950 4125006 1212234 3431076 8201619 9149816 5380315 2171315 2637705 3583232 1385661
6941 1385661 -2041620 -2506655 -295541 429041 -1666351 -2989546 -557935 3619623 5652908
6932 5652908 5043701 4398607 5047693 5516744 4278452 1923086 -16539 -1066011 -1884413
6923 -1884413 -2970239 -3777431 -3032058 -224291 2912006 3306465 79801 -3514004 -3348800
6914 -3348800 555494 4123003 4496007 3065712 2360073 2102255 331403 -2838031 -4924837
6905 -4924837 -4419212 -2607400 -1643587 -1861006 -1442871 1546061 6593571 10050267 8132412
6896 8132412 1593004 -3830731 -3415998 896144 3025714 457146 -3356814 -4601688
6888 -4601688 -3912738 -3889139 -4457693 -3500199 -736816 1853568 3018016 3100130 2035948
6879 2035948 -900895 -4731188 -6516124 -4822745 -1800195 -307411 -253244 390471 1738833
6870 1738833 1489756 -1315777 -4019620 -3355230 126750 2380711 699558 -3352491 -6561989
6861 -6561989 -8093910 -9244877 -10156698 -9280080 -6336459 -3334115 -1568982 108219 2371489
6852 2371489 3049328 407445 -2790926 -2086580 2086732 4115872 261526 -6901798 -12165643
6843 -12165643 -13188661 -10974647 -7358208 -4004516 -2257461 -2159597 -2643136 -3520530 -5459952
6834 -5459952 -7174014 -5514586 -344702 3591076 2706727 102114 1322115 6403889
6826 6403889 10524161 11483712 11479837 11312278 8295035 1891730 -3209585 -2815643 1173438
6817 1173438 4072707 4775658 5381246 6393504 6226926 4881113 4537261 6123671 7977172
6808 7977172 8462037 7688586 6020303 2993459 -1170842 -4502392 -5025303 -2870036 90151
6799 90151 2060701 2312857 1230093 104835 222583 1352657 1613558 -391014 -3664853
6790 -3664853 -5833377 -5736570 -4041148 -1516393 1803413 5242304 6818211 5393422 2658612
6781 2658612 1317747 1701577 2020978 1849996 3007534 6260164 9446060 10281999 9032481
6772 9032481 6658406 2425045 -3991394 -9539106 -10214643 -5995110 -477802 3952622
6764 3952622 7397905 9153396 7227170 2326863 -1352113 -1409226 -410756 -1478035 -3331015
6755 -3331015 -2680860 265445 1984676 656298 -1786082 -2597175 -1097159 1572522 3967744
6746 3967744 5251992 5433429 4816220 3158953 277462 -2315895 -2089600 1173244 4338322
6737 4338322 4594081 2713221 1221842 950269 1268060 2246336 4288014 6556349 7867971
6728 7867971 8305914 8062629 5890041 1062237 -4126661 -6459468 -5774724 -4382955 -3273873
6719 -3273873 -1767846 -410340 -864761 -2630097 -2980173 -996756 970283 822155 -618030
6710 -618030 -1499542 -1586721 -2035785 -4038461 -8174033 -13490238 -17019057 -16168688 -11916771
6701 -11916771 -7660276 -4839319 -2174115 652990 1888661 1379678 2003140 5309068
6693 5309068 8415782 7851964 4558868 2334546 2560841 3163119 2214140 147677 -1648508
6684 -1648508 -2632256 -3149440 -3701170 -4363784 -4526265 -3476856 -1453954 533696 2021686
6675 2021686 3169840 3432233 1738793 -1391725 -3533099 -3159287 -1540556 -995713 -2481496
6666 -2481496 -5574065 -9261343 -11814822 -11496380 -8626432 -5664836 -4311956 -4010391 -4029004
6657 -4029004 -4823390 -6001479 -5368552 -2137735 934712 1109741 -311657 -217299 1520914
6648 1520914 2580889 2565843 3414761 5528219 6766196 6076174 5481768 7190543 10414865
6639 10414865 12226567 10676466 6529176 2588171 1325445 2460207 3237307 1893471
6631 1893471 -37628 -186868 976667 1033648 -452747 -1391803 -603773 644989 1146936
6622 1146936 1617189 3034133 4828810 5902899 6179301 5973849 4805666 2175619 -768083
6613 -768083 -1460709 1663516 7050701 10732324 9884785 5918405 3265055 4736795 9014220
6604 9014220 12998463 14909234 14078304 9974634 3883005 -54901 1224991 5111747
6596 5111747 5768809 1451629 -3449267 -4263391 -1167217 2617391 5175022 6705047 7779310
6587 7779310 8692554 9675807 10429772 10013460 7946881 4788040 1292787 -2026572 -4282220
6578 -4282220 -4433161 -2552607 250487 3266911 6072462 7075126 4525067 -266954
6570 -266954 -3078620 -1634645 1519748 2618561 1482342 775123 1736344 2939669 2874105
6561 2874105 1815758 1009495 1246480 2378000 3504271 3763278 3314149 2965736 2516419
6552 2516419 632216 -2784782 -5359384 -4812988 -2048222 -236711 -1189189 -3790612 -5662131
6543 -5662131 -5258876 -2701756 273299 1414615 181696 -1155878 307528 4714269
6535 4714269 9026572 10151576 7889058 4703466 3090400 3339517 3725359 2858181 1537293
6526 1537293 1599547 3059120 3675540 1953776 -687151 -1938933 -1925261 -2872122 -5531785
6517 -5531785 -7419923 -5401217 426019 6036876 6912706 2238733 -4470404 -9020559
6509 -9020559 -10213984 -9323086 -7008573 -2824432 2204598 5011592 3939388 1216722
6501 1216722 359658 2074766 4216799 4940878 4233107 2799316 1071814 -698957 -2533542
6492 -2533542 -4849690 -7612722 -9622080 -9534363 -7332510 -4062786 -636017 2310614 4074332
6483 4074332 4466522 4127712 3282196 1033310 -2834415 -6306359 -7148242 -5847238 -4639353
6474 -4639353 -4008769 -2318779 1012720 4153017 5277990 4636050 3570537 3003200 3445086
6465 3445086 4958066 6438184 6455175 5493747 5681835 7388528 8043549 5945818 3470143
6456 3470143 4045182 6898674 7633085 4111717 -910299 -3960377 -5264152 -7102226 -9355529
6447 -9355529 -9327840 -5808079 -913668 2818824 5260624 7405769 8861720 8470684 6580858
6438 6580858 4716549 3270598 1428233 -639489 -1547677 -1048060 -575696 -715760 -170478
6429 -170478 1619380 2878061 2232333 1309088 2411761 4722061 5060466 1890434 -3223561
6420 -3223561 -7477297 -8459369 -5031879 1058529 5216782 4364212 1029334 430027 3604409
6411 3604409 6408828 5608315 2665144 444105 -613483 -1235074 -1095212 -278265 -795348
6402 -795348 -3908912 -7330341 -7684046 -4875782 -1714176 -38858 372090 -268814 -2166263
6393 -2166263 -4288626 -4902970 -4299391 -4775100 -7122097 -9081567 -8344594 -5488099 -2763060
6384 -2763060 -1311734 -856107 -985595 -1254641 -796105 610705 1610398 1018340 152663
6375 152663 1503903 4921687 7265394 6773922 5693325 6728275 8572284 7797047 4545408
6366 4545408 2970784 5221534 8096365 7615715 4505680 2526764 3062729 4462628 5770257
6357 5770257 7585686 9209877 8467412 5382404 3021284 3259543 4427171 4830890 5741196
6348 5741196 8314249 10079380 8083329 4081503 2609922 4201552 4498071 850959
6340 850959 -3908661 -6044640 -6141312 -7097194 -8995848 -9193282 -6825406 -4275763 -3740138
6331 -3740138 -4471304 -4291786 -2453806 -86045 1409355 1689384 1561036 1932343 2235554
6322 2235554 200014 -5564015 -12567072 -15607012 -12046784 -4975755 59851 723320
6314 723320 -943249 -2123760 -1999030 -982673 723233 2963701 5347875 7862804 10644436
6305 10644436 12636913 11999174 8758141 5478859 3927453 2546008 -914320 -5493922
6297 -5493922 -8122877 -7940236 -6914751 -6222052 -4680889 -1438387 2176433 4585284 5822950
6288 5822950 6347408 5852119 4614044 4199355 5004147 4558655 448572 -5961411 -10843050
6279 -10843050 -12387566 -11930573 -11076068 -10098698 -9295311 -9398409 -9760122 -8274436 -4502725
6270 -4502725 -1226863 -1213331 -3592760 -5242717 -4913061 -3920663 -3185018 -2067367 -675475
6261 -675475 -882822 -3427900 -5667311 -4444864 -547546 1888347 480694 -2821514 -4727687
6252 -4727687 -4393851 -3307295 -2838997 -3182948 -3879783 -4273147 -3943854 -3362228 -3437986 -4019876
6242 -4019876 -4011314 -3500840 -4066047 -5896671 -6616204 -4757108 -2416232 -1921948 -1682782
6233 -1682782 1222409 5530411 7010336 4972021 3179429 3556763 3456337 962548 -1350013
6224 -1350013 -854773 416657 -862046 -3646267 -4038969 -1102997 2280261 3509679 2247679
6215 2247679 -829956 -4256332 -5408434 -2993124 394446 1046386 -806958 -1618641 105514
6206 105514 2408108 4019828 6174940 9113205 10197218 7636597 3626326 1497094
6198 1497094 1471809 1408652 411655 -543670 -834319 -954672 -1222574 -1341726 -1378622 -2021489
6188 -2021489 -3655598 -5918886 -8264081 -10364138 -11837272 -12020194 -10328137 -6884008
6180 -6884008 -2711548 959353 3721239 5979386 7715728 7915489 5845946 2369319
6172 2369319 -739316 -2256066 -1632713 1348946 5737709 9043225 9455970 8097651 7425340
6163 7425340 7804110 7581176 6227134 4981100 4154542 2359980 -726048 -3169633 -3570410
6154 -3570410 -2980988 -2594592 -1422609 1860919 6120611 8711228 8438092 6126633 3112966
6145 3112966 581346 -456804 -52700 363913 -225382 -997054 -760874 80820 454718
6136 454718 582864 1319440 2164458 1791593 287095 -914645 -1329955 -2018345 -3649288
6127 -3649288 -5415857 -6295350 -6270813 -5852674 -5203234 -4094345 -2233315 393298 3075606
6118 3075606 4648930 4844947 4780121 5134624 4577624 1588388 -2472091 -4064868 -1776565
6109 -1776565 1603052 2177033 -861429 -4883049 -6882122 -6069822 -3865113 -2044417 -976096
6100 -976096 354464 2488427 4168951 3644657 996610 -1900859 -3664509 -4402168 -4320379
6091 -4320379 -2923907 -410401 1446851 1037857 -1195292 -3622475 -5439146 -6721472
6083 -6721472 -7274864 -6942076 -6566766 -6860693 -6411539 -2887868 3196162 7936784 8474060
6074 8474060 6254739 4280524 2802298 209726 -2985374 -4463374 -4503760 -6470617 -11336719
6065 -11336719 -14747415 -12161889 -4983565 1280729 3752821 4130752 4628138 5243040 5403107
6056 5403107 5446352 5379763 4159404 1237685 -2573354 -6321439 -9568079 -11566041 -11459524
6047 -11459524 -9591201 -6929225 -3242850 1933843 6598641 7599387 5297564 3619390
6039 3619390 4234923 4211989 1376427 -1726585 -2178737 -1552404 -2510399 -3348685 -721487
6030 -721487 3868386 5413517 2750695 -250691 -1089256 -1605716 -3513313 -5098325 -4193681
6021 -4193681 -1367500 1553715 3754579 5031414 5418333 6046928 7905916 9135446 6600799
6012 6600799 1170481 -1913353 346997 4756008 6605829 5429596 3717655 2576730
6004 2576730 1581765 977707 1095919 926001 -242982 -1103345 -610629 -527420 -3092594
5995 -3092594 -7354736 -10436108 -11419662 -11388554 -10564156 -8167085 -4525384 -812639 2634930
5986 2634930 5298638 4904031 168188 -5461057 -6602730 -2901492 312041 -729753
5978 -729753 -3657809 -4261050 -2361132 -849674 -694827 223710 3531066 7579749 8886974
5969 8886974 5803375 400451 -3511419 -4254677 -3422303 -2825654 -1916852 221542 1948943
5960 1948943 931426 -1774697 -2728667 -1290269 -412114 -1380313 -1203425 2797244 8509842
5951 8509842 11584322 10604124 7413071 3838137 563551 -1692804 -2280336 -1663078 -772886
5942 -772886 326580 1980997 3898193 5659098 7238242 7921077 6281087 2881221 1206739
5933 1206739 3428774 6662846 6499484 3374765 1911533 4030405 6476554 6116686 4176801
5924 4176801 3350365 3543681 2986251 1646082 917176 1006333 1021914 1051187 1960977 3337674
5914 3337674 3558052 2036695 -113900 -1749965 -2615947 -2538235 -1278918 336479 562306
5905 562306 -1131511 -2997247 -2970296 -1159538 318560 -362492 -3101107 -6171993 -7767434
5896 -7767434 -7588783 -7172936 -8129135 -9811331 -9589994 -6089995 -1359145 1159987 216543
5887 216543 -2757593 -5987081 -8401118 -8586364 -5124251 846070 5100052 4157878 -958392
5878 -958392 -6058462 -8284872 -8062302 -7235368 -6952012 -7367315 -8012294 -8177846 -7829391
5869 -7829391 -7959642 -8949179 -9045263 -6223266 -1534645 1380390 577220 -2283930 -4879593
5860 -4879593 -6838844 -8237302 -7819414 -4892241 -1367837 563474 1713419 4166511
5852 4166511 6915944 6384634 1811545 -2688289 -2890709 520909 3219775 2347409 -1040939
5843 -1040939 -3865526 -3963739 -1384032 2095015 4397889 4556521 3095533 1334098 469946
5834 469946 930580 2040751 2536905 1970394 1287806 1376618 1608741 952351 82616 798495
5824 798495 3233856 5175173 4626633 1852405 -1489076 -3946804 -4565968 -3009193 -243423
5815 -243423 1926286 2725311 2924704 3125616 2847407 1933225 1402607 1967077 2992937
5806 2992937 3844415 4793184 5521550 4444017 1134182 -2158771 -3440571 -4034287 -6269467
5797 -6269467 -9196104 -9627362 -7190228 -5183760 -5765567 -7103066 -6627327 -4826679 -3989901
5788 -3989901 -4715787 -5628160 -5768808 -5457684 -4899818 -3356375 -112158 4367481 8547508
5779 8547508 10921319 11021475 9510182 7352726 5064686 2823078 841348 -812834
5771 -812834 -2367043 -3754658 -4324424 -3817320 -3072600 -2812797 -2296853 -494628 1737507
5762 1737507 2207324 199449 -2646036 -4464138 -4918869 -4708744 -4670463 -5530511 -7102686
5753 -7102686 -7535962 -4983581 -385612 3113561 3972418 3567768 3100373 1557100 -1825830
5744 -1825830 -5250243 -6576355 -6274294 -5996062 -5543939 -3730061 -1343954 -544792 -1512741
5735 -1512741 -2202517 -1588835 -851785 -909553 -984172 -423429 47836 70684 983847 3849708
5725 3849708 7158187 8113891 5913668 2557846 490097 399682 1469306 2908386 4571545
5716 4571545 6231788 6940874 5764554 3213017 1339308 1899143 4533759 6956400 6646058
5707 6646058 2387267 -4882473 -12057554 -15574148 -14432182 -11360371 -10016030 -11169965
5699 -11169965 -12524311 -11969835 -9783927 -7593181 -6430294 -6194613 -6017525 -4660384 -1338736
5690 -1338736 3276121 7305693 9251434 9098609 7952553 7101067 7227600 7731820 6892481
5681 6892481 3644422 -690593 -3353949 -3043554 -1073281 412194 379528 -1066817 -3310566
5672 -3310566 -5231342 -5586533 -4203737 -2201474 -517168 1035596 2687726 3608490 2891114
5663 2891114 1205298 463387 1725078 3842389 4288734 1527928 -2966750 -5339616 -3123007
5654 -3123007 1468161 3403903 635012 -3458227 -4577188 -2968289 -2305191 -3895711
5646 -3895711 -4701857 -1783012 3413342 6670206 5802974 2449695 -292638 -619840 1328318
5637 1328318 4042057 5408802 4022461 574569 -2554215 -3712418 -3558085 -3689529 -4395677
5628 -4395677 -4798380 -4711173 -4825953 -4994965 -3965021 -1413519 1241878 2912083 4187785
5619 4187785 5420919 5107779 2172573 -1338530 -2351762 -1043753 -423844 -1664295 -2586108
5610 -2586108 -1403244 710272 2044297 2966474 4332265 5152479 3997948 1629320 258272
5601 258272 832856 2614922 4717350 6434693 6682337 4884900 2193468 316394 -658145
5592 -658145 -1859917 -3302555 -3570226 -2012867 142253 1317936 1259525 811606 742299
5583 742299 1075303 1121120 63705 -2206158 -4956488 -7342295 -8643171 -7752221 -3813488
5574 -3813488 1901317 6269019 7795047 8445818 10366548 12275505 11533026 8637912 6553498
5565 6553498 5967892 4693935 2252633 1471147 3939710 6911398 7004212 4709761 2697951
5556 2697951 1449036 -449554 -2613325 -2584501 580363 4835745 7781264 8901551 8577707
5547 8577707 6640186 3150374 -308468 -1446393 526977 3973185 6244633 6051030
5539 6051030 4432746 3256126 2907526 2148599 364054 -1163814 -1058406 -28400 43100
5530 43100 -1232091 -2338471 -2065186 -869584 167680 669295 912287 1347107 2484203
5521 2484203 4423458 6160609 6201226 4320604 1994558 633122 87757 -614897 -1820352
5512 -1820352 -3186932 -4383328 -4977140 -4118768 -1396623 2040981 4135465 4002504 2897479
5503 2897479 2841033 4471967 6337164 6236916 3414047 -483249 -2856622 -2655720 -1015091
5494 -1015091 604621 1921720 2893402 2483233 -20631 -2905520 -3204645 -456883 2254424
5485 2254424 1864473 -1326956 -4911157 -7806060 -10838812 -14389990 -17185403 -17827617 -16474618
5476 -16474618 -14487892 -12998588 -12176912 -11516170 -10524337 -9238621 -8048132 -6923205 -5149306
5467 -5149306 -2210430 1280125 3911065 4593257 3241640 880523 -680545 -138802 1679077
5458 1679077 2327378 688861 -1611499 -2904566 -4306358 -7765828 -12053287 -13394610
5450 -13394610 -10314456 -5345474 -1282622 1788128 4636603 6538392 6609663 5637931 4599871
5441 4599871 2853892 -117314 -2542026 -2466402 -1238446 -2198589 -5923775 -9168914 -9006418
5432 -9006418 -6064617 -2937160 -907495 831658 3572114 7360253 10504490 10859262
5424 10859262 8147579 4632853 2720332 2482515 2548037 2514765 2819704 2960290 2054880
5415 2054880 914683 1125409 1920500 689231 -2593199 -4270067 -2083900 1011109 612232
5406 612232 -3085755 -5888805 -5733904 -5330289 -7980551 -12891002 -16069615 -14967514 -10998510
5397 -10998510 -7693115 -7274294 -9236602 -11620382 -12949112 -12893148 -11801113 -10264979 -8895388
5388 -8895388 -7884020 -6873053 -5691760 -4800930 -4283042 -3009019 -166907 2648100 2604298
5379 2604298 -783491 -4865361 -7174365 -7779051 -7482347 -5771584 -2456374 193354 -419273
5370 -419273 -3339355 -4776158 -3036854 -621868 -541483 -2313869 -3052187 -1500263 604333
5361 604333 997529 -462126 -1812489 -1007297 2202024 5943876 7749693 6793554 4556490
5352 4556490 2872972 1675455 -348887 -2953130 -3795874 -1701274 836698 190616 -3806834
5343 -3806834 -7602966 -8213232 -5918739 -2499015 959123 3500558 3730948 1622383 -539040
5334 -539040 -808564 -25479 96039 -57718 880361 2353109 2729756 2307864 2648940 3358882
5324 3358882 2587271 679496 38952 907120 744862 -1109973 -1694934 749644 3337629
5315 3337629 2513174 -951366 -3736852 -4843405 -5658713 -6505913 -6328504 -5390447 -5536397
5306 -5536397 -7635187 -10712929 -13524843 -15286668 -15168958 -12835622 -9272529 -5597811
5298 -5597811 -1674134 2359618 4160107 1522706 -3503114 -5830543 -3525144 -271733
5290 -271733 -298612 -2936271 -4158138 -2165709 852436 2194167 1740189 927164 141599
5281 141599 -1458190 -3984298 -6199142 -7311908 -8167003 -9565385 -10291694 -8449906 -4491470
5272 -4491470 -1135162 -80299 -533952 -1322041 -2356757 -3103151 -1816656 1898279 5333623
5263 5333623 5488637 2716491 -109060 -1196308 -1016773 -789986 -1471381 -3494717 -5943653
5254 -5943653 -6801210 -5599289 -4820364 -6851448 -10549548 -12851254 -12753522 -11346568 -8928493
5245 -8928493 -5087475 -1221657 268569 -383506 -454269 886301 1282454 -635417 -2625338
5236 -2625338 -2182597 -345362 -31514 -1952463 -4241981 -5426341 -5906230 -6563100 -7280005
5227 -7280005 -7308244 -6546152 -5923920 -6262197 -6950029 -6568613 -5071488 -4098750 -4265970 -3665224
5217 -3665224 -832508 2043621 1415063 -2577750 -5997110 -6224157 -4709224 -4042103 -4567754
5208 -4567754 -4921361 -4168120 -2392753 -439928 286557 -1027603 -3306308 -4715217 -5201507
5199 -5201507 -6348339 -8598878 -10415006 -10470027 -8919132 -6288017 -3019830 -398548 82357
5190 82357 -1372278 -3449945 -6128175 -10008338 -13307596 -12797485 -8585157 -4784290 -4134512
5181 -4134512 -4971164 -5016580 -4980613 -6275454 -8010891 -8716961 -8681235 -8300045 -6611028 -4000357
5171 -4000357 -3821167 -8209281 -14303670 -17749099 -18142586 -17824725 -17132352 -14637833 -10875441
5162 -10875441 -7931447 -5935872 -3593040 -1757113 -2757504 -6149151 -8652017 -8602272
5154 -8602272 -7202113 -5162726 -1731384 2225052 3843885 2423872 804549 945214
5146 945214 1114149 -442752 -1829957 -407254 2451129 2727221 -650545 -4333716 -4961268
5137 -4961268 -2992533 -1372584 -1715392 -2889428 -2868566 -881134 2531493 6614952 10382679
5128 10382679 11841267 9150409 3509927 -709599 -456601 2308021 3229696 1159098
5120 1159098 -971004 -526457 1833189 3658200 3071670 -659334 -6713103 -12241155 -14368606
5111 -14368606 -13471512 -12513888 -12374473 -10233778 -4088673 3375560 7608716 7361031 4843395
5102 4843395 2061308 -453797 -2116242 -2454880 -2938880 -5978655 -11291192 -15317879 -15250233
5093 -15250233 -11932822 -7760401 -3491231 1218844 5464743 7421530 6682738 4598755
5085 4598755 2456523 835963 530297 2155327 4495222 5162350 3743938 2529338 2926814
5076 2926814 2935517 68946 -4533453 -7326569 -7098989 -5945254 -5409856 -4212142 -779368
5067 -779368 3903615 7300707 7935371 5925653 2110652 -2059456 -4587741 -4307417 -2102946
5058 -2102946 -40104 501936 -556276 -2613123 -4836264 -6242087 -5995661 -3841128 -314400
5049 -314400 3321592 5705216 6498658 6622649 6806643 6430223 4672297 2149951 149148
5040 149148 -1157917 -2147106 -2009554 298395 3551565 5036117 4187490 3351717 4461206
5031 4461206 6920062 9121026 9868916 7894906 2488077 -4475559 -9411437 -10919963
5023 -10919963 -10786385 -10539845 -9584654 -7605250 -5993261 -5479739 -4795492 -2936501 -359741
5014 -359741 2906038 7264333 10637614 9263705 3185665 -2696876 -5080293 -5911336 -7339946
5005 -7339946 -7536492 -4957325 -2495014 -3097654 -4937361 -5453000 -6542320 -10485580 -14006081
4996 -14006081 -12486892 -7786680 -5620940 -6797592 -7339109 -6157667 -6046182 -7385411
4988 -7385411 -7363322 -5871247 -6020318 -7883892 -7606720 -4153546 -1468903 -2114119 -3740344
4979 -3740344 -3923126 -3923212 -5262258 -6409045 -5321243 -2459349 418049 2045592 1522298
4970 1522298 -878529 -2579613 -1504609 161834 -1329213 -5208229 -7155883 -6134894
4962 -6134894 -5255542 -5596522 -4668083 -2015855 -773000 -1906420 -2137242 354639 3011994
4953 3011994 3730635 3808188 3918963 2006808 -2245008 -5382504 -5348988 -4603465 -5602883
4944 -5602883 -7160360 -7601466 -7550561 -7456781 -6453613 -5568657 -7546983 -11506332 -12657552
4935 -12657552 -9588293 -6715214 -6986261 -7523764 -5495643 -2861328 -1790268 -664675
4927 -664675 1461590 1437942 -2778084 -7961538 -10519742 -11147077 -11147809 -9188708 -5692491
4918 -5692491 -5290581 -10243181 -15929180 -17321396 -15630707 -14483008 -14200729 -14024156 -15144010
4909 -15144010 -17282124 -17149518 -14344561 -13521214 -16745526 -19561169 -18797213 -17853220 -19703570
4900 -19703570 -21488226 -20881919 -20632950 -21923991 -21267765 -19039407 -21718279 -29728774 -33616588
4891 -33616588 -29479558 -26644613 -31508548 -36510949 -35530973 -36308324 -44618740 -50632819
4883 -50632819 -46657728 -43608827 -51648108 -60310922 -59673749 -63873234 -85988141 -108207041
4875 -108207041 -114054188 -132526383 -196588231 -261290553 -228251927 -75197574 93568737
4868 93568737 163622130 135909775 94186943 84487151 83588948 68327413 53343854 52860672
4860 52860672 53587144 43500540 34447491 38484625 46309481 45414956 40450417 40635655
4852 40635655 42333500 38031415 30773417 27464989 27140449 25957933 25657021 28293052
4844 28293052 29885219 27027941 23292920 22532420 22256513 19579875 17271021 18032324 18935575
4835 18935575 17353089 16606974 19776485 23051299 21280290 16022513 12522617 11963615
4827 11963615 11596858 9926135 7725325 6021061 5830025 7598449 9216050 7606836
4819 7606836 3470097 757026 626575 444801 -489233 197766 2146570 1675228 -885224
4810 -885224 -38 5764299 10007425 8374065 5825578 8630221 14448410 16489906 13485277
4801 13485277 9447028 6594104 4413170 3561019 5132629 7254649 6958858 4484623
4793 4484623 2197673 799515 37278 1240686 5274346 9437199 10132929 7550055 4526803
4784 4526803 2155504 -220192 -1994582 -1756552 81844 2112864 4528130 8107074
4776 8107074 11553116 12637400 11309520 9269858 7341984 5580607 4854634 5731850 6688270
4767 6688270 5949707 4318651 3733027 3850975 2734857 479123 -473503 1269489 4387302
4758 4387302 6708684 7089643 5392954 2099181 -1716180 -4791152 -6192955 -5413707 -2748718
4749 -2748718 256521 1952039 2523292 3455552 4899544 5475786 5153141 6021370 9121303
4740 9121303 12533698 13812639 12565129 9773302 6609070 4724875 5335731 7052972
4732 7052972 7133897 5669909 5395253 6369419 4976284 361763 -2471391 420538 5442254
4723 5442254 6214093 2299086 -1266877 -1432100 294342 1719500 2324227 2168621 1862760
4714 1862760 3176749 6688083 9645896 9236099 6855331 5661927 5096538 2205273 -2076922
4705 -2076922 -2957849 871680 4330892 2488141 -3165698 -7243342 -6975666 -3975059 -1040814
4696 -1040814 543149 956581 710717 52080 -753395 -909354 345882 2361388 3417580
4687 3417580 3219561 3598697 5410974 6378776 4176166 456709 -795781 1620168 5161188
4678 5161188 7387707 8195761 8085459 6787193 4512021 2781853 2986834 4968222 7350534
4669 7350534 8559796 7714779 5429810 3442565 2641860 2085732 788830 -584861 -927768
4660 -927768 -281580 1150216 3935559 7387596 8343154 4818805 -181441 -1601925 1400097
4651 1400097 5098746 6803979 7525980 8585095 8717422 6037601 986524 -3988583 -6786176
4642 -6786176 -7271940 -7262240 -8479000 -9665860 -7085040 322207 7840629 9882972 6936628
4633 6936628 4311956 4657373 5692641 5519982 5739828 7653880 9159644 8092759 6198831
4624 6198831 7007218 10984087 14951802 15764766 13247594 9938374 8603972 9535964 10299105
4615 10299105 8947381 6826961 6536831 7875361 8420864 7870689 8542036 10942835 12216678
4606 12216678 10478924 7669561 6082324 4776581 2018754 -929416 -1642915 -950976
4598 -950976 -2297109 -6778518 -11435408 -12952322 -11040702 -7368680 -2844749 2450360
4590 2450360 7219933 8734870 5757571 880772 -1719096 -1017680 104272 -518969 -1181320
4581 -1181320 460440 3012272 3030211 -53807 -3737601 -6535938 -9022410 -11001675 -11103310
4572 -11103310 -9602817 -8359732 -7324638 -4458903 1645 2784592 2480939 1655150
4564 1655150 2205602 2245704 278660 -824029 2390847 8343151 12133141 11537616 8228202
4555 8228202 4241002 433078 -2238003 -2975339 -2684739 -2991598 -3849041 -3967662 -3129171
4546 -3129171 -2162053 -1219575 -123984 173974 -1252367 -3040571 -2793561 -674243 425439
4537 425439 -1311448 -4455878 -6360414 -5767592 -3051545 486921 2847683 2197975 -1375497
4528 -1375497 -5394375 -6882182 -4749269 -473263 3178568 4236248 2820264 490553
4520 490553 -1565344 -3309261 -5056764 -6794747 -8238829 -8494640 -5877161 125478 6474102
4511 6474102 8493807 5305736 1262574 475066 2012644 2618784 2193852 3504421 7261728
4502 7261728 10521512 10228698 6278630 898590 -3254741 -4310259 -2248308 807159
4494 807159 2465870 2418346 2223003 3181255 5262213 7416084 7947598 5574821 1467477
4485 1467477 -833267 784974 4222478 5944833 5424595 4601011 4018255 2493916 317707
4476 317707 -361353 1129329 2909825 3550993 3770574 4247879 4071221 2721484 1789582
4467 1789582 3145015 6385486 9118903 8985153 5025829 -1611987 -7709666 -10050648
4459 -10050648 -8313935 -5065985 -2696325 -1689815 -1961702 -3699856 -5933104 -6347687
4451 -6347687 -4149990 -1584065 -838666 -695329 1657653 6164032 9495684 9268157 6875127
4442 6875127 5468990 6284307 7753261 7644577 5335446 2106764 -282133 -1061180 -611985
4433 -611985 412846 1610540 2391738 1628132 -1518149 -6178464 -9561469 -8825834 -3698210
4424 -3698210 2807501 6725236 6386967 3253669 -124278 -2222267 -2753587 -1974356 -367988
4415 -367988 1726439 4621262 8656804 12810537 15110754 14982628 13877389 12915339 11598176
4406 11598176 9941809 9798856 11983243 13762300 11905878 7245119 3481981 2219667
4398 2219667 2138804 2593445 4467049 6991933 7137654 3504126 -1757582 -6100841 -9195460
4389 -9195460 -11175650 -10920479 -7932917 -3884085 -471725 2492580 5265760 6493804
4381 6493804 5414419 3953508 4266371 5532866 5515259 4087983 2713299 1386658 -1055271
4372 -1055271 -3898163 -4607984 -2394891 337132 699436 -1889915 -5719270 -8162954 -7139886
4363 -7139886 -2922990 1235264 1809424 -1224703 -4396753 -4571503 -1654156 2203324 4447055
4354 4447055 3328230 -645481 -4030139 -3227328 1211067 4798188 4532442 2280818 1492746
4345 1492746 2387845 2435315 473236 -1935610 -2978224 -2534655 -1578783 -1128287 -1881467
4336 -1881467 -3535229 -4338350 -2714690 334245 1738657 -238677 -4249424 -7951457
4328 -7951457 -10473939 -11903467 -11655712 -8998161 -4757485 -1039925 884494 1527072 2005840
4319 2005840 2714362 3159540 2429417 -108747 -3868175 -6901074 -7468415 -5725252 -3233703
4310 -3233703 -1184270 -54103 -462305 -2616150 -4817158 -4443946 -1183098 2352687 4141137
4301 4141137 5128965 6684299 7441302 5090481 548174 -2222621 -823969 3028924 5971080
4292 5971080 6356022 4615590 1834861 -963293 -2990431 -4100541 -4667774 -4663735 -3400921
4283 -3400921 -542627 3199391 6689399 9118114 9908562 8702103 6066512 3675707
4275 3675707 3001998 3862430 4677628 4205559 2821284 2015343 2662009 3989267 4635097
4266 4635097 4604090 5302515 7265618 8941032 8729594 7284117 6274198 5564074 3670307
4257 3670307 900014 -372438 723695 1986101 1500583 511094 944897 1848796 1113542
4248 1113542 -264198 884700 4527192 6561726 4707040 1960280 1722160 2358804 343550
4239 343550 -3079508 -3164494 665593 3453899 2302006 517789 1551203 3143131 1484646
4230 1484646 -2152502 -3685558 -2743150 -1773649 -329144 3941003 9167985 10243843 6558897
4221 6558897 2980253 1928627 377702 -3314209 -5653352 -4238188 -2282342 -3103624
4213 -3103624 -4827378 -4487612 -2976660 -2062589 -1079150 -524217 -3675537 -9845836 -11721767
4204 -11721767 -5465991 2000954 2694285 -990554 -2487036 -2947693 -7035952 -11909386
4196 -11909386 -12025212 -10961377 -15498046 -21300005 -19671247 -16047660 -22411428 -29777498
4188 -29777498 -11293315 37233369 80537596 83919729 55111884 28309059 18700289
4181 18700289 14321231 5837714 -19702 1671673 3391979 -903719 -5934241 -5975317
4173 -5975317 -3986049 -3403079 -890523 5826194 11161537 9750881 5003386 3209988
4165 3209988 4333259 4579381 3775449 4440256 6585350 8307650 9322522 10247130 10471565
4156 10471565 9426523 7663840 4870160 -108062 -5668421 -7764693 -5766441 -3742230
4148 -3742230 -3547638 -1357587 5535799 12846009 14438429 10099019 4234186 -244698
4140 -244698 -2814963 -2761461 157852 4076045 7134926 9437287 10573836 8174517 2042984
4131 2042984 -3265049 -3699578 -981311 1014715 2281299 4781269 7180196 6665831 4453046
4122 4453046 4251907 5980229 5957672 3158314 502449 -421518 -1405158 -3457996 -4646212
4113 -4646212 -3569570 -1730918 -814158 -161524 1492082 3750809 5356972 5779401 5111099
4104 5111099 3753107 2906859 4083532 7313418 10581064 11450574 8920238 4082660 -346597
4095 -346597 -1793111 -101538 2416764 3759266 3936245 3250599 827815 -3437613 -7135953
4086 -7135953 -7745362 -5705654 -3219219 -1297059 16999 135184 -756297 -355237 2725885
4077 2725885 5757496 5137561 2109523 1533113 4991823 8776518 9349253 7518994 6078889
4068 6078889 5992627 6219820 5366676 2566474 -1687018 -5107308 -5539887 -3402516 -733857
4059 -733857 1528259 3170626 2617495 -1426414 -6415267 -7707720 -4517886 -741455 976965
4050 976965 2410370 5603583 9159147 10877935 11164293 11317318 10835824 9016981 7319318
4041 7319318 7521058 8865829 9256280 8051393 5708541 2081256 -2606522 -6139377 -6082605
4032 -6082605 -2842209 776871 2717736 3140547 3467574 5116482 8212260 10447470 8632967
4023 8632967 2872956 -2378624 -3391052 -1749263 -1412470 -2632191 -2242701 382392 1488256
4014 1488256 -1781361 -7183108 -10296244 -9729859 -7516231 -5651600 -4395659 -3561817 -3429571
4005 -3429571 -3781325 -3303264 -970779 2363140 4678310 5214364 5423284 6952698 9258351
3996 9258351 10216726 8983497 7060167 6111399 5765748 4399101 1461860 -1815668 -3678641
3987 -3678641 -3145201 -461860 2932550 5078097 4902593 3100362 1275260 323630 17957
3978 17957 -41458 313614 1434483 3092782 4487872 5149679 5625026 6800387 8470027
3969 8470027 9306429 8785529 8376227 9792844 12592887 14801005 15572348 15635368 15169980
3960 15169980 13273896 10195982 8146058 8498558 9557399 8706935 5943204 3673308
3952 3673308 3440326 4369502 4879958 4703587 4805063 5910433 7460566 8025862 6973940
3943 6973940 5610435 5869749 7660879 8576083 6913416 3993321 2423057 2786382 3334789
3934 3334789 2656188 1347337 795367 1173793 1159204 -543648 -3582513 -6000956 -6127254
3925 -6127254 -4230425 -1806430 411736 2647691 4454847 4598386 3183894 2221630 2778325
3916 2778325 2920041 337518 -3623888 -4578499 -119706 7024412 11495182 10552473 6585575
3907 6585575 4518275 6712342 10670303 12236733 10531760 8329913 7700077 7427374 5666776
3898 5666776 3054901 1376844 626010 -422688 -1525220 -1063911 1294978 3728672 4111855
3889 4111855 1721252 -2438392 -5981704 -6746309 -5456091 -5679064 -9283150 -13102424 -12611771
3880 -12611771 -8052162 -3875485 -2433735 -1667266 501547 3146901 5178258 7807181
3872 7807181 11660675 13930163 11521214 5809769 1387049 510872 1225353 920516 -486801
3863 -486801 -1482156 -1413197 -1064140 -1467917 -2807918 -4399545 -5607144 -6572721 -7524322
3854 -7524322 -7512062 -5109779 -996661 1527530 56313 -3642698 -5487564 -3928281 -1227625
3845 -1227625 228573 967889 2606989 4318254 3199562 -1545700 -6442690 -7204896 -3873380
3836 -3873380 -794693 -1030773 -2599000 -1845521 886287 1771511 -449768 -2184936 -219234
3827 -219234 3420571 4386968 2150014 128734 208516 311985 -1826059 -4991081 -6062056
3818 -6062056 -3738841 620981 4755462 6793535 5727923 2187012 -1452108 -2976747
3810 -2976747 -2589184 -2532774 -4315518 -6816277 -7366364 -4554615 45200 2982886 2163327
3801 2163327 -881305 -2495268 -1013781 1257042 780036 -3068454 -7444548 -9198767
3793 -9198767 -7519427 -3631866 743288 4153556 5733859 5680792 5035548 4464135 3576347
3784 3576347 1782615 -642873 -2730766 -3597521 -2811685 -703796 1287744 1551256 396116
3775 396116 250329 2545703 5255119 5275280 2853920 1514910 3221325 5681684 5548860
3766 5548860 2683248 -281254 -1609438 -2034772 -2923912 -4195759 -4371898 -2291432 1180187
3757 1180187 3273184 2000929 -1186062 -2856443 -2260967 -2647362 -6441845 -10950933 -11403085
3748 -11403085 -7283108 -2705326 -673682 -82809 899876 1563505 540219 -1363086 -2523365
3739 -2523365 -3223006 -4621124 -5865500 -4777775 -1461579 940213 -210107 -4103546
3731 -4103546 -7643589 -8425741 -6088085 -1919589 1949886 3768969 3642340 3504350 4846412
3722 4846412 6775149 7199028 5722805 4159791 3861064 3781600 2191797 -550250 -2403569
3713 -2403569 -2560968 -2316672 -2664400 -2660171 -1178483 1013239 2343743 2686351 2929717
3704 2929717 2961755 1962958 506156 375825 2002064 3886626 5032219 6030616 6970869
3695 6970869 6369775 3703908 1287753 1626888 4013377 5787682 6102390 6124449 6054675
3686 6054675 4749225 2644163 2238697 4310601 5904230 4114817 388174 -1350356
3678 -1350356 -220305 475266 -2012390 -6137334 -8168308 -6632356 -3308878 -659216
3670 -659216 241916 -439396 -1911933 -2836550 -1944028 693275 3560592 5286260 5703598
3661 5703598 4971758 2655169 -1247395 -4952891 -6015268 -3994723 -1023538 541709
3653 541709 177782 -1297058 -3130811 -4751236 -5264936 -4017805 -1577437 722976 2370618
3644 2370618 4089718 6350649 8133459 7964898 5982801 3944768 2751274 995489
3636 995489 -2734980 -6623808 -6721998 -2006533 3452456 4983220 2759937 738244 946802
3627 946802 1501682 475146 -1093851 -1399488 -860558 -957905 -1582484 -1698929 -1640579 -2345799
3617 -2345799 -2789744 -868176 2780746 4470541 2304797 -783884 -837774 1694674 2855896
3608 2855896 1013842 -956984 102787 3785123 7883426 11629489 14624137 14272066
3600 14272066 8147876 -947549 -6117937 -4259681 85011 929736 -1771591 -3931430
3592 -3931430 -4175614 -4520444 -5039601 -2758916 2963241 7983966 8501673 5766138 3363900
3583 3363900 2155817 559737 -1764633 -3291278 -2979937 -1125569 1564512 4002026
3575 4002026 4600278 2971906 1100800 1019004 1956404 1708199 232228 -363689 689840
3566 689840 1567622 538968 -1769192 -3316881 -2632213 357718 4219058 6545868 5827245
3557 5827245 3043271 472982 -936534 -1813290 -2242338 -1134661 1896816 5444713 7722501
3548 7722501 8202519 7605978 7173838 8005939 10013155 11326171 9786134 5304813 35819
3539 35819 -3630848 -4389838 -1983236 2487923 6378439 7472586 6452659 5835853 6289389
3530 6289389 5889586 3553670 1164319 1046349 2723229 3451736 1193749 -3637199 -8461457
3521 -8461457 -10133227 -7563109 -3372834 -1585130 -2972857 -4180657 -2281500 1514929
3513 1514929 3957396 3893746 2616616 1449436 1064948 2324130 5496473 8798722 9707125
3504 9707125 7979583 5812829 4767122 4125667 2862122 1705692 2025572 3460552 4081950
3495 4081950 3011066 1806392 2534535 4914627 6357265 5080635 2382946 1179381
3487 1179381 2777694 5756024 7525312 6227699 1731820 -4022272 -7980348 -8552891
3479 -8552891 -7125458 -5959056 -5187288 -3542272 -1486466 -1174335 -3058120 -4987016 -5439936
3470 -5439936 -5337279 -5606525 -5310043 -3719352 -2093341 -1469148 -517018 2195800 5244807
3461 5244807 6049283 4616870 3294688 3325276 3761777 3527018 2613907 1236738 -622661
3452 -622661 -2670126 -4370093 -5523454 -6169448 -6537549 -7690349 -10958693 -15603744 -18367418
3443 -18367418 -16891787 -12473901 -7925962 -4109578 -571704 1792609 1472011 -756648
3435 -756648 -2156632 -1326205 549905 1393719 -337959 -4949795 -10217401 -11866675 -7901575
3426 -7901575 -1763794 1387509 806843 -256442 -273621 -1075106 -3724602 -6413589 -7290215
3417 -7290215 -6346139 -3777289 454366 4537267 5388748 2591663 -880576 -2867744 -4202027
3408 -4202027 -5802639 -6779856 -6779560 -7049546 -7572295 -6356386 -3472874 -2440247 -5099291
3399 -5099291 -8197120 -7927729 -5063101 -2483267 -347480 2590922 5105121 5060714 3472821
3390 3472821 3028593 3441578 2088977 -1194702 -3581209 -3402935 -1630064 649344 2975897
3381 2975897 3725386 995543 -3913918 -6629010 -4302813 1638447 7444964 9912293
3373 9912293 7830599 3093525 74555 1272337 3916380 3707050 1188619 522714 2151239
3364 2151239 1620265 -2925728 -6868815 -5459064 -185282 4408835 6994546 8703861
3356 8703861 8658184 4887057 -1165975 -5230897 -5525978 -4296547 -3718912 -3215885 -1657535
3347 -1657535 275191 1246176 1195638 995047 1202615 1847938 2479297 1963689 -558716
3338 -558716 -3806694 -4651037 -1529122 3030117 4619201 1697774 -2935740 -5685351 -6078859
3329 -6078859 -6225983 -7104986 -7110575 -4758532 -1298110 747828 818510 450305 528806 299874
3319 299874 -585832 -926620 149927 1582997 1893028 1272009 868752 845668 711015 1125054
3309 1125054 3557598 7794947 11251874 11731986 10188531 9718748 11820045 14404400 14009902
3300 14009902 9695438 4096004 510038 -327777 -32825 175658 879108 3153863 6867479
3291 6867479 10609163 12741988 12441751 10367595 8429455 8243070 9660130 11251273 11937777
3282 11937777 11343730 8996960 4657262 -410544 -3861657 -4424597 -2722573 -52931
3274 -52931 2237713 2319120 -958499 -5736863 -8044582 -6191144 -2561550 -30685 1248239
3265 1248239 1986402 1242017 -1528978 -3791974 -2750765 10565 254045 -2604662 -4488165
3256 -4488165 -2764113 21340 313691 -1226819 -1187915 1494030 4517878 5688812 5026629
3247 5026629 3275091 371160 -3604620 -7100734 -7982944 -5620814 -1332200 3313363
3239 3313363 7896081 12354653 15409815 15013846 10789606 5226511 1776632 2084520 5310389
3230 5310389 9321494 11880100 11572792 8834735 5789458 4103710 3261665 1799282 -314373
3221 -314373 -1789278 -2134460 -2123430 -2087029 -1292132 469423 1938163 1809623 312920
3212 312920 -1301456 -2351121 -3292574 -4933557 -7222369 -8687518 -7479877 -3516962 911078
3203 911078 3477927 4151324 4109090 3232334 686892 -2339605 -3063388 -962805 1104166
3194 1104166 916663 -449 915008 3057432 3535537 1585173 -234250 575609 3669568
3185 3669568 6939817 8924678 9322201 8115586 5385883 1908299 -931892 -2320851
3177 -2320851 -2853899 -3582090 -4139296 -2689693 1480681 5987256 7324661 4838445 1511787
3168 1511787 599373 2611383 5719645 7592368 6368953 1661096 -4205316 -7419416
3160 -7419416 -6661893 -4758847 -4898059 -6395427 -6187443 -3604273 -1117935 -430948 -382660
3151 -382660 505870 1564560 1409883 388229 20904 741985 1549346 1592505 1015273 365403
3141 365403 130974 860810 2783920 4978492 5705006 4243314 2045928 1350050 2695990
3132 2695990 4517865 5303331 5272254 5347566 5337831 4328210 2489260 1068962 444677 -457936
3122 -457936 -2352665 -4483777 -5994723 -7108672 -7942395 -7371824 -4547742 -731530 2006596
3113 2006596 3481985 5131687 7240465 8285011 7494773 6422620 6901188 8385774 8508024
3104 8508024 6027877 2378037 102339 147066 1000742 550356 -1513258 -3585728 -4253554
3095 -4253554 -3583759 -2076971 384584 3463297 5192838 3557114 -827741 -4938055
3087 -4938055 -6405039 -5343961 -3177833 -952752 790174 1613465 1454824 881105 681217
3078 681217 1383729 3015278 4899214 6052521 6409701 7066881 8372997 8631915 6390232
3069 6390232 3472915 3474844 7079250 11196497 13302449 14063873 14445361 12977823 8404963
3060 8404963 3197494 1398067 3722296 7575057 11447583 16030523 20406481 20545884
3052 20545884 13995377 4409603 -1148797 689178 6676775 10983020 10774890 7636212
3044 7636212 4760604 3609649 2945338 575554 -3918801 -8117376 -8805339 -5347877 -565190
3035 -565190 2267992 2870787 3587531 5865788 8445512 9486479 9144441 8836348 8765117
3026 8765117 7694549 5009658 1639550 -1210737 -3116730 -4039554 -3958909 -3208201 -2279967
3017 -2279967 -1122260 477413 1887372 2295806 2364893 3504587 5161526 4892746 2108252
3008 2108252 -326705 167235 2294054 3041961 2008865 1197104 1454379 1727076 1448043
2999 1448043 1055122 95200 -2618637 -6435321 -8738605 -8181968 -6124193 -4173773 -2388309
2990 -2388309 -813785 -550633 -1742729 -2385587 -1002719 922194 1098993 -194544 -992023
2981 -992023 -1001979 -1778216 -3866075 -6027504 -7487596 -8981990 -11040398 -12818802 -13345395
2972 -13345395 -12802327 -12012704 -11526629 -11464959 -11285059 -9580277 -5400588 -132939 3322763
2963 3322763 3939386 3834999 5235920 7361074 7634368 5213841 1882756 -256673 -717229
2954 -717229 -346593 -240802 -1057942 -2511965 -3370304 -2694484 -1218320 -727711 -1831003
2945 -1831003 -3142754 -3221286 -2698189 -3550584 -6202456 -8194707 -6591828 -1721928 2421820
2936 2421820 2406969 -401937 -1152677 2627964 7819677 9342700 5955418 985945 -2041129
2927 -2041129 -2604382 -1979453 -895233 526470 1827964 2655972 3584600 5215511 6645237
2918 6645237 6139425 3797779 2587853 5565984 11911416 16624612 15177224 8450539
2910 8450539 2071216 433696 2404431 3759594 2655092 890662 334419 477503 111442
2901 111442 -578389 -788244 -538932 -18011 1484560 4583603 8309944 10720462 10564948
2892 10564948 7655315 2523843 -3147822 -6647088 -6419171 -4012175 -2648934 -3887369
2884 -3887369 -6514192 -8440399 -8746820 -8030784 -7509252 -7650858 -7376479 -5305747 -2148257
2875 -2148257 -574315 -1885442 -4330890 -5966387 -7335015 -9254313 -9752324 -6373951
2867 -6373951 -765518 2341588 782194 -3198015 -6609636 -8038766 -6229195 -336476
2859 -336476 7009019 10524918 8478635 5322626 5770088 8740763 9944742 8317035 6517479
2850 6517479 6277910 6746345 7258246 8649034 11087137 12739902 11643551 7926682 3677341
2841 3677341 1107186 813299 1468001 1514224 1186777 1869332 3376396 3625728 1718677
2832 1718677 -587205 -1628675 -2006361 -2424669 -1573059 1460725 4404264 4183976 1024422
2823 1024422 -2243991 -3800665 -3359882 -675878 3319294 5201566 2639313 -1367195
2815 -1367195 -1669725 1954635 4970405 5186572 4969263 5644163 4866508 1735415 -185133
2806 -185133 1791882 4914231 5471424 4674968 5864769 8308688 8566401 6669881 5959609
2797 5959609 6934959 6136696 2268054 -813129 588866 4798591 7486022 7457533 6849236
2788 6849236 6666989 5208018 1277046 -3292407 -5505450 -4487609 -1846129 601344
2780 601344 2327976 3496405 4026747 3737788 2730784 1167218 -730263 -2012901 -1240207
2771 -1240207 1618162 4137944 3593380 -5767 -4081826 -6377590 -6452559 -4783462 -2320583
2762 -2320583 -1111505 -3225243 -7995901 -11819733 -11811541 -8592718 -4679537 -1517905 741880
2753 741880 1917004 1935896 1614451 1838132 2413512 2851297 3612298 5232264 6774311
2744 6774311 6702963 5102808 3599299 3106256 3000564 2590790 1980212 1124141 -592496
2735 -592496 -3130270 -5268143 -6188376 -6623881 -7261232 -6845541 -3736916 656788 2148809
2726 2148809 -1325070 -6626061 -9023501 -7852692 -6326814 -6320488 -6319416 -4983723 -3574904
2717 -3574904 -3354198 -3454257 -3441987 -5159106 -9027293 -11054968 -7526582 -1093030 2140176
2708 2140176 706626 -1554017 -2412881 -3639325 -5864999 -6385190 -3983660 -1355069 -420181
2699 -420181 525709 2409940 2364822 -1596775 -6601693 -9198985 -10242397 -11673817 -11792454
2690 -11792454 -8391059 -3971050 -2697933 -3839020 -3309827 -712324 252842 -1850103
2682 -1850103 -4126788 -4014165 -2021496 540055 2927980 3789275 2128787 -183037 -107610
2673 -107610 2187437 3803301 3746363 3474810 2992223 681075 -2369618 -2222612 2227744
2664 2227744 7059188 8425692 6739729 4278651 1627834 -1696725 -5292485 -7902649
2656 -7902649 -7953482 -4277702 1346622 3391945 -1700126 -9383819 -11381662 -6494396 -1755676
2647 -1755676 -1953477 -4148474 -4761185 -5533713 -8400120 -10199249 -7847553 -4428131 -4488466
2638 -4488466 -6566087 -5937434 -2103149 1975802 5706680 10091293 12948941 11069986
2630 11069986 6264512 3345609 2493241 -412136 -5726390 -8577736 -6767436 -4301674
2622 -4301674 -4754161 -6170256 -5494678 -3772331 -3439530 -3665445 -2106097 718433 2136637
2613 2136637 1255785 -517408 -2111994 -3650215 -5005694 -5308245 -4022589 -1673553 425544
2604 425544 993728 -13442 -954469 -227058 1566569 2453586 2072650 2153286 3708869
2595 3708869 5511335 5993993 5064008 3306750 984087 -1230217 -1918786 -497842 1671843
2586 1671843 2506676 975880 -2389883 -5713810 -6595667 -4254716 -993496 87527 -1079086
2577 -1079086 -1895685 -1343150 -1167658 -1960563 -959802 4161461 11280211 15840902 15689995
2568 15689995 12135288 7498809 3564712 1370346 488456 -766220 -2689178 -2738091 1209205
2559 1209205 7051149 10420805 10048673 8550821 7884483 6978911 4793033 2903494 3037107
2550 3037107 3899823 2924905 353807 -830824 918396 3644174 4562303 3112998 367754
2541 367754 -3093144 -6975379 -9677185 -9033134 -5105492 -709182 1637894 2185863 2612896
2532 2612896 3401657 3751649 3204452 1891710 -285046 -3150239 -5192159 -4690792 -2094449
2523 -2094449 195192 722457 266474 -153162 -973451 -2825554 -4757386 -4989443 -3006939
2514 -3006939 -65096 2102299 2603765 1860837 1189081 1497791 2173807 1849821 447823
2505 447823 -448908 300201 1893500 2977449 3731979 5434587 8183117 10099388 9183523
2496 9183523 5633450 1998636 801245 1922432 2777038 1498638 -694938 -1334835 -385548
2487 -385548 -381739 -2645177 -5212661 -5599831 -4196605 -3363505 -3990529 -4690411 -4194161 -2817208
2477 -2817208 -1061601 1779467 6324736 10945303 12487801 9873750 6051792 5083139
2469 5083139 7493023 9905809 9455638 6876099 4548053 3535489 4125678 7165324 11982260
2460 11982260 14342208 10289189 2128528 -2999698 -1437075 3251816 5876883 5384669
2452 5384669 3111510 -939853 -6468121 -10053556 -8407015 -3698225 -1741607 -4686877
2444 -4686877 -8710803 -9404520 -6460689 -2160298 1953093 5267696 7059664 7240880 7095470
2435 7095470 7655053 7943782 6173816 2354418 -1468763 -3578538 -4263542 -4872653 -5890014
2426 -5890014 -6586984 -6414696 -5960499 -6032469 -6287611 -5629968 -3898822 -2316797 -2181736
2417 -2181736 -3859044 -6874465 -9797678 -10187204 -6545375 -887546 2562809 2240824 907366
2408 907366 1228962 1964217 677065 -1799747 -2584737 -1147248 721410 2566919 5395191
2399 5395191 8228729 8192853 4844700 1212298 -580788 -1657288 -2983880 -2900602 -372014
2390 -372014 2052142 1546200 -609972 -1132058 113748 554785 -22337 1359336 5808557
2381 5808557 9903299 9979777 7000095 4896035 5122865 5244649 3078314 247335 268616
2372 268616 3828772 7575915 8133059 6124833 4867298 5629448 6238322 4890042 3123773
2363 3123773 3179804 3931382 2142149 -2581830 -6851918 -8045484 -7286619 -6772837 -6509386
2354 -6509386 -5513009 -4178204 -2909475 37591 6101628 12473302 14275533 11173776
2346 11173776 8263955 8956513 10332749 8044675 3071349 171374 1137161 3121739
2338 3121739 3131246 982818 -2132246 -5056497 -6358269 -5281569 -3355015 -2592692 -2037763
2329 -2037763 972751 5920502 9066966 9161812 9281056 11251304 12267624 9888349 6763622
2320 6763622 6572307 8002697 7068317 3521793 505575 -979706 -2658361 -4508096 -4314599
2311 -4314599 -2078144 -650457 -1047012 -882470 1318204 3706454 4503241 4731471 5863037
2302 5863037 7333385 7999217 7735917 6219704 2631453 -1874916 -3954974 -2264226 266312
2293 266312 202591 -2347942 -5180940 -7190128 -7942004 -6200915 -1556767 3887951 7815350
2284 7815350 10397183 12645584 13769259 12779527 11241835 11385346 12372242 11450445 8275689
2275 8275689 5166452 3381651 2096078 1059674 1301736 2748698 3851604 4253364 5343456
2266 5343456 7381009 8491700 7572700 5944285 4850235 3446257 921436 -1169513
2258 -1169513 -740844 1666472 3404697 2906840 976037 -636563 -685090 1133035 3910273
2249 3910273 5770516 5349761 3087363 528287 -1302798 -2216094 -2171607 -1384456 -826648
2240 -826648 -1400805 -2553741 -2835358 -2007951 -1352333 -1419741 -922568 974429 2432801
2231 2432801 858436 -3354455 -6958535 -7898784 -7232217 -6437660 -5118659 -2895219 -1442619
2222 -1442619 -2152009 -3168147 -1745997 1136168 1800388 -519066 -2618282 -2660700 -2934089
2213 -2934089 -5470205 -8181316 -8022568 -5493031 -3058823 -1168367 928096 2111134
2205 2111134 932069 -673931 859695 5249156 8155042 6861265 2942529 -1174759
2197 -1174759 -4790219 -7007496 -5854863 -1475692 2597785 3868013 4451419 7552039
2189 7552039 11936326 13038459 9259616 4553428 4069674 8574150 13752950 14544807 10098854
2180 10098854 4568545 2622494 4421139 6230344 5790761 4749515 4918854 4902536 2905956
2171 2905956 948727 2795791 8110751 12045268 11437249 8674433 7852628 9099252 8916062
2162 8916062 5421028 1112071 -134877 2350577 5446431 5995890 4119729 2135547
2154 2135547 922595 -1050080 -4743929 -8305780 -9245699 -7895861 -6883467 -7405110 -7834138
2145 -7834138 -6371352 -3498526 -1015901 178621 347713 -293584 -1954978 -4612684 -7679407
2136 -7679407 -10322088 -11781154 -11589434 -9883350 -7426130 -5050742 -3087273 -1374291
2128 -1374291 365164 2217452 3878755 4670060 4059435 2361665 736373 344966 1520772
2119 1520772 3549812 4974957 4463984 2152039 123761 621825 3322915 5169942 3661783
2110 3661783 -153484 -2782908 -2168289 360582 2023006 1637715 342571 -149255 679954
2101 679954 2080906 3149146 3591045 3551657 3266871 3210220 4133005 6255340 8517177
2092 8517177 9417731 8735837 7621972 6771412 5552956 3509773 1538790 508208 -231450
2083 -231450 -1488046 -2357242 -1762308 -1234406 -3434606 -7666359 -9808310 -7918020 -5162382
2074 -5162382 -5199413 -7014232 -6987105 -4300621 -1236121 676466 1491910 662888 -2222666
2065 -2222666 -4640630 -3121587 1163885 2788475 -427438 -4162105 -4119432 -2038230 -1876083
2056 -1876083 -3251990 -3030159 -1237196 -523970 -816909 386486 2362120 959651 -4600541
2047 -4600541 -9324684 -9107109 -5921362 -3551462 -1662595 1946485 5558871 4784958 -732336
2038 -732336 -5932503 -6523002 -3525692 -487681 1176119 2107526 2106342 -36012 -3961702
2029 -3961702 -7036425 -6989018 -4257644 -1010395 1373708 2879723 3516885 2998799 2023058
2020 2023058 2205108 3636658 3894315 1246758 -2100844 -2363447 373112 1726592 -1155135
2011 -1155135 -5821221 -8140109 -7574947 -6497706 -5619538 -3105193 1668074 5980796 6525396
2002 6525396 3042582 -1721756 -5017809 -6361360 -7116950 -8285171 -8897319 -7011309 -2540642
1993 -2540642 1657859 2474932 11140 -2701244 -3372615 -2716088 -2746337 -3930313 -4934607
1984 -4934607 -4810587 -4511017 -5840740 -9108712 -12302564 -12998728 -10951937 -8222148 -6732193
1975 -6732193 -6520189 -6670741 -6879634 -7221488 -7214510 -6317072 -4901295 -3613626 -2217393
1966 -2217393 -343350 1067402 800367 -182282 670367 3763869 6006755 4467968 96460
1957 96460 -3719816 -5450226 -6571262 -8688030 -11171404 -12149571 -10904572 -8743909 -7806116
1948 -7806116 -9005235 -10785457 -10229661 -6147670 -859580 2000301 1363595 -630384 -1814425
1939 -1814425 -2292868 -3001153 -3580756 -3084953 -1756156 -415442 1287812 4037020 6353133
1930 6353133 5170455 -233214 -6586064 -10077051 -10147115 -8604606 -6360256 -3000650 1077310
1921 1077310 4279272 5752278 6102689 5895994 4856449 2924139 814161 -879906 -1948253
1912 -1948253 -1731880 325227 2678517 2116884 -2375074 -7528162 -9196351 -6884424 -3217930
1903 -3217930 92595 3417904 6656375 8240111 7641650 6814955 7597137 8947272 8431368
1894 8431368 5761130 3175218 2446487 3051710 3600240 3707081 3712518 3560105 2987320 2288711
1884 2288711 1864151 1315594 97246 -1010326 -369634 2121864 4247189 3951228 1865435
1875 1865435 378243 661008 1676051 1967159 1368309 688407 422698 200223 -673699
1866 -673699 -2262342 -3724143 -4406643 -5100009 -7153790 -9941635 -10555404 -7194295 -1836815
1857 -1836815 1890879 2656113 1637339 -235668 -2941554 -5567490 -6338923 -4908982 -2707672
1848 -2707672 -754268 853656 1101622 -1678826 -6785667 -10796158 -11609847 -10882911 -11151818
1839 -11151818 -12512235 -13573070 -13693630 -12549417 -9318381 -4249802 428305 2903722
1831 2903722 3597129 3124426 611340 -3769933 -6733273 -5311138 -948648 2631123 4267982
1822 4267982 5132720 5237698 3971378 3188713 5489409 9314053 9841197 5582745 396760
1813 396760 -2260966 -3614193 -6365727 -10188920 -12550854 -11916541 -8287529 -2397819 3874700
1804 3874700 7906731 8847215 8512757 8523358 8025954 5663148 2363362 503689 1210322
1795 1210322 3778112 6831020 8843933 8428333 5434708 1385142 -1856659 -3265428
1787 -3265428 -2352986 931287 5320991 8550559 9395082 8361110 5911254 1599847 -4120809
1778 -4120809 -8809667 -10150147 -8304410 -5282914 -2894219 -1941435 -2237464 -2630157 -2045495
1769 -2045495 -945732 -480267 -78898 2065811 5602453 7574342 6562767 4927974 5357767
1760 5357767 7415617 9314593 10815624 12043868 11530925 8317017 4519149 2826172
1752 2826172 2443169 489720 -3218327 -5815711 -5728868 -4578202 -4317901 -4749968 -4557044
1743 -4557044 -3157995 -933981 1318303 2923800 3997077 5203783 6270068 5857006
1735 5857006 3967433 2924000 4194082 5759300 4985932 2850892 2496775 4358724 5730131
1726 5730131 4886312 2709367 279468 -2098749 -3139507 -940080 3926407 8222985
1718 8222985 9975457 10361783 10807325 10595426 8714495 6080396 4369872 3979010 4217935
1709 4217935 4229093 2917342 -480058 -4760206 -7071040 -5852745 -2400045 977991 2898246
1700 2898246 2643368 89912 -2963263 -3296213 257506 5046975 7687419 7816001 7484245
1691 7484245 7895583 8282171 7452967 5193148 2388333 514465 627629 2352488 4272238
1682 4272238 5395116 5483333 4185516 1398880 -1307926 -1504020 1023308 3534090 3652486
1673 3652486 2113397 1313461 2431303 4898894 7426846 8570958 7514535 5292517
1665 5292517 4144153 4823632 5684340 5042327 3049514 662818 -1487780 -2473505 -1323892
1656 -1323892 1118412 2715888 3388004 5296232 8280816 8435604 3923788 -848064 -682703
1647 -682703 2948639 4228598 1462491 -1440822 -1613622 -592782 -261256 171465 1326524
1638 1326524 1343212 -1192984 -4432474 -5628831 -4624629 -3119340 -2021401 -1482249 -2410809
1629 -2410809 -5802628 -10620894 -13608325 -11618989 -4349787 4616122 9889890 8874868
1621 8874868 4405548 1416770 1179084 898246 -1015696 -2387844 -1268240 501604 224598
1612 224598 -1182878 -669273 1986905 3674701 2402725 -192691 -1322919 -276522 1458406
1603 1458406 2071095 844623 -1530466 -3680036 -4937406 -5836333 -6822053 -7138153 -5866598
1594 -5866598 -3447473 -1069838 884273 2596344 3710540 4017749 4535936 5829476 5716737
1585 5716737 1466362 -5291410 -8931696 -6709872 -2613170 -1940518 -4191522 -4621385 -1628599
1576 -1628599 1371408 1661297 948039 1810705 3589584 4305353 4408703 5562081 6979565
1567 6979565 6309064 3900851 2978589 4937661 7308966 7590604 6599008 6313713 6562162
1558 6562162 6119368 5538930 6293409 8000513 9143457 10079259 12513969 15881900 17176282
1549 17176282 15272336 12762200 12017476 11751262 9526615 5865236 3363628 2775149 2541236
1540 2541236 1816819 1476941 1924136 2106909 1364769 493125 227803 156943 -115207 -165734
1530 -165734 -2568 -678291 -2401838 -3229097 -1275534 2325962 4213434 2471278 -1546690
1521 -1546690 -4897721 -5535621 -3312429 283056 3079151 3653737 2159578 -316253 -2626691
1512 -2626691 -3392467 -1200479 3470505 7265434 7013489 3787625 1809130 2926349 4497880
1503 4497880 3775996 1973531 1940593 3635840 4710821 4821169 6308409 10048132 13051181
1494 13051181 11667418 6033911 37119 -2819074 -2709899 -2611611 -4453686 -6597959 -5868479
1485 -5868479 -2109132 732242 -776727 -5003809 -7138544 -5016007 -969584 1925877
1477 1925877 2990677 2749567 1125278 -1517778 -3173589 -2083329 746358 2488011
1469 2488011 1828297 258002 -10629 1311877 2278835 1029997 -1521975 -1987853 1515715
1460 1515715 6251719 7582364 4859585 2324539 3307208 5933830 6338255 4065304 1758799
1451 1758799 790279 108429 -900412 -1136878 157527 2091358 3458412 3847034 3012895
1442 3012895 658397 -2598714 -5276991 -6572163 -6873316 -6588215 -5710286 -4774846 -4753392
1433 -4753392 -5418921 -5221099 -3619497 -2294137 -2933895 -4696173 -5028855 -2597668 1445873
1424 1445873 4744536 5597509 3932571 1129459 -1244466 -2818213 -4226340 -5516771
1416 -5516771 -5690719 -4361795 -2863533 -2591199 -2799614 -1342432 2435969 6638555 8836993
1407 8836993 8269197 5792877 2616177 -323138 -2449228 -3873429 -5272410 -6650533
1399 -6650533 -6540956 -3529940 1343458 4903201 5157252 3400560 2303805 2889054 4478355
1390 4478355 6607255 9114299 10714143 9742969 6869504 5087086 5943846 7388468 6673774
1381 6673774 4012149 1719859 804622 376186 -17925 484509 2259763 3982154 3928611
1372 3928611 1923734 -329290 -648396 1668683 4932509 6461534 5210623 2544538
1364 2544538 374200 -388976 636531 3461095 6382265 6374192 2624389 -1726908 -3325219
1355 -3325219 -2763154 -2823490 -3940798 -4268446 -3382653 -2688577 -2399449 -1391205 -228900
1346 -228900 -935393 -3021802 -3127582 15886 3295457 3621084 1918154 729246 307515
1337 307515 -480551 -1321476 -1148960 -320539 344336 1576280 4195611 6464267 5650498
1328 5650498 2216980 -4603 1498541 4761663 5777950 3136703 -595041 -1792368
1320 -1792368 512858 4055036 6257860 6920819 7371830 7915047 7763116 7113743 7188804
1311 7188804 7931715 7745502 6113320 4377570 3118065 1061289 -2158818 -4489666 -4485795
1302 -4485795 -3798346 -4555198 -5978102 -5867715 -4024625 -1803930 624108 4102253 8211805
1293 8211805 11316448 12450271 11539287 8606516 4510674 1447146 711182 873141 107652
1284 107652 -865016 -482540 252965 -1020630 -4127409 -6669173 -7902186 -9252741 -10957616
1275 -10957616 -11310713 -9844528 -8470966 -8517012 -8930710 -8398965 -7274621 -6438238 -5848576
1266 -5848576 -5021372 -3712666 -1823027 118584 562482 -1233933 -3138802 -1943043 2637708
1257 2637708 7595520 10163526 9736599 6683227 1975455 -1854955 -2250147 192552 2463998
1248 2463998 3463746 4941229 7719736 10054733 10665011 10367750 9551229 7137629 3549937
1239 3549937 1558216 2211254 2832232 1222899 -972539 -1513081 -1298068 -1908219 -2066955
1230 -2066955 -170164 1674143 189910 -3570391 -5250025 -3395197 -998197 -646733
1222 -646733 -1467382 -1563094 -487212 1884383 6396231 12674763 17551578 17321931 11605575
1213 11605575 4266749 277262 1416450 4771514 5707673 2493943 -2386975 -5289610
1205 -5289610 -4594119 -873809 4209169 8313752 9490312 8151964 6645420 5878514 4162813
1196 4162813 675163 -2123196 -1620854 1162149 3249930 3669502 3339184 2476724 882361
1187 882361 -286326 163990 1184933 1186540 1051991 2516954 4437929 4076175 1730100
1178 1730100 637629 2185241 4480264 5913644 6843833 7250136 6038578 3649450 2437856
1169 2437856 3397943 4994845 5928010 6413266 6204065 4404051 2083865 1923896 4127039
1160 4127039 5747289 5155206 3785570 2183974 -1680980 -7898161 -12238471 -11420316 -7646257
1151 -7646257 -4649501 -2197382 1648427 5355516 5574465 2640344 115640 -575705 -1201136
1142 -1201136 -2695545 -3755466 -3637058 -3181246 -2761666 -1999300 -1614633 -2683503 -3814105
1133 -3814105 -2035388 2791559 7000270 7362617 4228118 11901 -3176582 -3902052 -1815819
1124 -1815819 1338190 2935663 2315688 827630 -849478 -3041777 -4680162 -3678752
1116 -3678752 -678295 552933 -1996831 -5854255 -7887598 -8374605 -9214772 -10355405 -10474421
1107 -10474421 -9527110 -8162110 -6015433 -3045115 -1292463 -2606654 -5444005 -6622008
1099 -6622008 -5740340 -5160013 -5814274 -5873719 -3983066 -1303557 484186 1182809 1244657
1090 1244657 735220 61100 192581 1206839 1888714 1540062 825451 90039 -1483232
1081 -1483232 -3847898 -4944250 -3495551 -1788506 -3299227 -7882356 -11693353 -12284934
1073 -12284934 -11535008 -12309795 -14052153 -13795247 -10861186 -8227602 -8657333 -11177421 -12589739
1064 -12589739 -11445023 -9111399 -7446490 -6985349 -7394733 -8116299 -8143991 -6699608 -4898929
1055 -4898929 -5243206 -8273410 -11129059 -11038294 -8984724 -7799120 -7652516 -6317655 -3601125
1046 -3601125 -2075819 -2503039 -1903626 1717651 5505183 5604220 3067672 2467380 5323887
1037 5323887 8291092 8008852 4709728 395431 -3659419 -6365080 -6326170 -3651142 -496607
1028 -496607 1655907 3475102 5047132 3945360 -1342996 -7615681 -9776591 -6965946
1020 -6965946 -2925795 -397023 1635561 4473069 6746727 6749939 5354297 4372050 3561625
1011 3561625 1513310 -1443361 -3363361 -3236876 -1642722 606147 2596113 2603725 -415792
1002 -415792 -4504239 -6167837 -4831808 -3729159 -5310034 -7773611 -7814832 -5251857 -2784235
993 -2784235 -1986039 -1812137 -1016068 39280 602220 1025430 2106353 3799898 5338507
984 5338507 6092233 5852825 4861023 3993241 4319402 5989091 8080238 9913220 11725714
975 11725714 13423661 13629711 11272078 7651761 5336006 4794525 3636469 -49233 -4809683
966 -4809683 -7490459 -7068445 -5432792 -4576107 -4457886 -3922594 -2419949 -187076 2146137
957 2146137 3309886 1922850 -1405797 -3435109 -1598189 2436257 4570917 3676022 2713187
948 2713187 3674317 4190220 1422341 -2712824 -3413227 616832 5764464 8526775 8818650
939 8818650 7563071 4227123 -1262754 -6508994 -9029357 -9279044 -9078735 -8266882 -5447551
930 -5447551 -1288847 1730223 2802325 3351517 3762233 2360799 -1112222 -3530954 -2107254
921 -2107254 1361233 2472935 96552 -2062612 -418593 3650279 5257852 1690780
913 1690780 -4668448 -9170659 -9487646 -6721669 -3012682 325345 2432174 2668542 1784237
904 1784237 1870796 3684575 5042821 3576787 329518 -1369739 -264438 1731112 2824267
895 2824267 3433762 4327775 4789021 3894775 2192619 922186 628073 1413909 3407768
886 3407768 6026612 7828476 8010227 7166464 5992780 4443823 2759825 1831671 1782323
877 1782323 1806003 2155054 4104720 6707200 6246537 1301473 -3904436 -4350558 -901687
868 -901687 1279364 61967 -1627835 -947899 1444838 3808273 5767958 7025515 6349588
859 6349588 3489590 176520 -2041460 -3280172 -3821117 -3200896 -1879837 -1733041 -3464064
850 -3464064 -5296689 -5582477 -4964585 -4614517 -4240234 -3513067 -3603311 -5233004 -6719492
841 -6719492 -6121034 -4073608 -2396723 -1265846 -275237 -997605 -5169210 -10675506 -12765615
832 -12765615 -9972145 -6070202 -5190082 -7445261 -10562382 -13266658 -14989415 -14219647 -10085540
823 -10085540 -5029351 -3176265 -5419283 -8007202 -7011856 -2894781 572354 1025283 -382906
814 -382906 -1247381 -553152 1315793 3502596 4523698 2616220 -2038460 -6312972 -7332751
805 -7332751 -6151669 -5959413 -6912955 -5817403 -1722561 1504230 425957 -2751299 -3325070
796 -3325070 -860023 706626 -817626 -3193422 -3696277 -2652012 -1724226 -1065893 40490
787 40490 1181462 1174332 -277811 -2445972 -4471081 -5522432 -4768161 -2160630 1172028
778 1172028 4016016 6074718 7338407 7257915 5554867 3340813 2167400 1895395 602158
769 602158 -2817961 -6586881 -7451790 -4304866 205741 2274604 956800 -1171186 -1427698
760 -1427698 10322 1281906 1881846 2975789 5051866 7004786 7898842 8147867 8245490
751 8245490 7580315 5485294 2532588 -248319 -2672024 -4792999 -5747441 -4789968 -3247298
742 -3247298 -3572523 -5872319 -7058492 -4809993 -1226170 -541935 -3449068 -5943264 -4694126
733 -4694126 -1587161 -1017550 -3834188 -6516487 -6322796 -4665478 -4334632 -5461520 -6025144
724 -6025144 -5161218 -4085223 -4179486 -5607139 -7499723 -8342980 -6693902 -2901176 273211
715 273211 289913 -1977185 -3104927 -1245006 1934633 3574245 2621586 271454 -1398123
706 -1398123 -875053 1676668 4343696 5185017 4116090 2466042 1085195 11919 -423295
697 -423295 215663 1216554 1292796 553610 264678 497168 -97296 -1785501 -3092047 -3348602
687 -3348602 -3747515 -4755924 -4686142 -2492022 13438 891287 1411390 4050196 8154215
678 8154215 10485239 9934454 8910631 9373716 9848408 7776940 3352747 -613075 -2097284
669 -2097284 -1828246 -1833952 -2935061 -4074558 -3741258 -1604183 1190482 2889816 2248044
660 2248044 -502276 -3280524 -3508263 -851837 1835124 1523653 -1312680 -3397181 -2814703
651 -2814703 -784187 758428 1312313 993023 -383845 -2323392 -3428246 -3253914 -2902274
642 -2902274 -2923980 -2499479 -1720341 -2380389 -4870525 -6627834 -5860137 -4557212 -5027515
633 -5027515 -5513455 -2813400 2055114 4710157 3460147 810471 -1020665 -2402071 -3681729
624 -3681729 -3892696 -3087452 -2846745 -3361692 -2926467 -1428280 -1279572 -3411591 -5309405
615 -5309405 -4837622 -3248763 -2387887 -1666034 -249544 316920 -1362764 -3432230 -3361283
606 -3361283 -2030018 -1980897 -2907584 -2497007 -1052040 -1425666 -4173103 -6388462 -6268703
597 -6268703 -5640862 -6463471 -7437734 -6075041 -2437038 1053921 2509293 1829890 -80083
588 -80083 -2030606 -3045936 -3209594 -3574275 -4505179 -4837297 -3612643 -1917728 -1642833
579 -1642833 -2657853 -2672386 -334837 2641455 3393106 1493368 -462019 -58454 2125875
570 2125875 3691755 3646134 3005472 2317073 554643 -2524489 -4675311 -3800801 -1397471
561 -1397471 -1063410 -3661980 -6243234 -6263164 -4637972 -3464559 -2762033 -1453792 -273172
552 -273172 -1209783 -4213773 -6620270 -6525334 -5298575 -5824163 -8991176 -12640570 -13606222
543 -13606222 -10469960 -4832828 -255722 551525 -1995882 -5011467 -6068361 -4958037
535 -4958037 -2620476 390299 3559300 5673491 5994651 5714351 6527459 7770445 6919005
526 6919005 3535513 645333 639457 1489909 -552244 -5251719 -8154668 -6415722 -2365747
517 -2365747 -121773 -688136 -2173833 -3368852 -4720446 -6152730 -6230751 -4201584 -1453197
508 -1453197 -3038 -208392 -709823 -319107 625854 793293 -541907 -2619475 -4049222
499 -4049222 -4441775 -4721203 -5644055 -6633436 -6632202 -5601203 -4393034 -3480571 -2746333 -2410962
489 -2410962 -3119015 -4859622 -6681056 -7876823 -8717064 -9494219 -9505669 -7802542 -4782175
480 -4782175 -2337744 -2161262 -4064395 -6096207 -6352076 -4740978 -2991382 -2909117 -4740530
471 -4740530 -7251071 -9022545 -9334258 -8123422 -5760426 -2950778 -389312 1701058 3540537
462 3540537 5349408 7077376 8347247 8471823 6977107 4520632 2694607 2151581 1467559
453 1467559 -1033682 -4666967 -6937828 -6652502 -5000352 -3309409 -1374275 1243508 3760948
444 3760948 5173784 5590550 5390002 4085286 1433429 -1135489 -1802916 -683813 564719
435 564719 1126652 1566319 2234752 2731630 3001169 3462690 3873504 3492486 2590238 2341524
425 2341524 2981847 3671667 4456323 6298193 8363640 7621572 2957122 -2118021 -3256041
416 -3256041 -756699 1205690 347653 -1345530 -1252132 342281 1361843 783788 -963426
407 -963426 -3251069 -5529079 -6994226 -7195502 -6792693 -6865395 -7472538 -7474337 -5952762 -3604874
397 -3604874 -2465050 -3848254 -6450028 -7199726 -4648065 -807422 1383313 1673889 2030044
388 2030044 3138704 3642686 2995857 2575602 3018140 2791250 916293 -999579 -1390505
379 -1390505 -1504454 -3107382 -4931004 -4392082 -2039894 -1052121 -2292674 -3022147 -1289544
370 -1289544 1159701 1650271 56531 -1926527 -3200871 -3424404 -2244798 -86940 1290847
361 1290847 712310 -414605 597675 4454856 8719526 9910959 6638570 1140305 -2344857
352 -2344857 -1661962 842987 1241493 -811509 -1874158 -18073 2349897 2437794 1332964
343 1332964 1855982 3895314 4799147 3570933 1828380 814137 104706 -442393 169780
334 169780 2240453 4405230 5288615 5008481 4669027 5268234 6984597 8450675 7187326
325 7187326 2340017 -3317352 -5864276 -4536471 -1803845 340085 1725699 1911942 -26690
316 -26690 -2840312 -3394776 -1186565 250633 -1487619 -3661390 -2233970 2226766 5603939
307 5603939 5961218 4945105 3968566 2379960 -23015 -1552622 -1062274 84757 -71170
298 -71170 -1358329 -1956374 -977721 553508 1223337 1035897 1396260 3313122 5882657
289 5882657 7070341 6005891 3699648 1279781 -1236843 -3636202 -4356824 -2264909 1139047
280 1139047 2942167 1926871 -867126 -4009492 -6330223 -6321861 -3342353 399367 1447137
271 1447137 -590572 -2451354 -1847027 -487402 -1018590 -2918968 -3558439 -2111669 -186884
262 -186884 852766 1109683 842806 -142771 -1467943 -2042231 -1524280 -925388 -1276428 -2398054
252 -2398054 -3334743 -3469106 -3002499 -2745643 -3418753 -4717850 -5289021 -4281425 -2725553
243 -2725553 -2553954 -4322904 -6739074 -8399522 -9029844 -8877540 -7937548 -6248864 -4214391
234 -4214391 -2232523 -640713 -176593 -1502511 -3802959 -4856007 -3301757 -177570 2428709
225 2428709 3453975 2921105 1098986 -1006708 -1143164 2295151 7803724 11768514 12267627
216 12267627 10621538 8946240 7692713 6232880 4354913 2028898 -1161663 -4958506
208 -4958506 -7530132 -7105531 -4244885 -1257675 503419 1656450 3186144 4969527 6099705
199 6099705 5866942 4340504 2651307 2475383 4284615 6291600 6245864 4129521 1761004
190 1761004 -95967 -2347273 -4962351 -5974020 -4358950 -2097464 -1563767 -2195885 -1849328
181 -1849328 -545536 -415604 -2083096 -3546570 -3228245 -2054669 -1481290 -1166796 -113037
172 -113037 965243 158280 -2938763 -6402818 -8163653 -8145707 -7758378 -7803775 -7705496 -6930104
162 -6930104 -6316678 -6986414 -8162701 -7554777 -4558530 -1666841 -1358825 -2734410 -3150971
153 -3150971 -2403338 -2694979 -4444164 -5008711 -2645612 799941 2809375 3559457 4216289
144 4216289 3852878 1057284 -2499661 -3439360 -1492203 210524 106065 277892 2271133
135 2271133 3762706 1721978 -3043424 -7081373 -8908352 -9849445 -10786352 -10717314 -8932277
126 -8932277 -6456631 -4447320 -2674933 -526589 1642730 3091563 3729565 3701955 2740069
$$ [...]
##END NTUPLES=NMR SPECTRUM
##END=
