##TITLE=31Pdec_DE-129_TFA
DMSO-d6, 64 sc
 25.2.2026
##JCAMPDX= 6.0         $$ Bruker NMR JCAMP-DX V2.0
##DATA TYPE= NMR SPECTRUM
##DATA CLASS= NTUPLES
##ORIGIN= UXNMR, Bruker Analytische Messtechnik GmbH
##OWNER= root
$$ XWIN-NMR		Version 3.5
$$ Wed Feb 25 14:12:01 2026 Russian Standard Time (UT+4h)  she@DPX200
##.OBSERVE FREQUENCY= 81.013821
##.OBSERVE NUCLEUS= ^31P
##.ACQUISITION MODE= SIMULTANEOUS
##.ACQUISITION SCHEME= undefined
##.AVERAGES= 64
##.DIGITISER RES= 17
##SPECTROMETER/DATA SYSTEM= spect
##.PULSE SEQUENCE= zgpg30
##.SOLVENT NAME= DMSO
##.SHIFT REFERENCE= (INTERNAL, DMSO, 0, 197.392)
##AUDIT TRAIL= $$ (NUMBER, WHEN, WHO, WHERE, WHAT)
$$ ##TITLE= Audit trail, XWIN-NMR		Version 3.5
$$ ##JCAMPDX= 5.01
$$ ##ORIGIN= Bruker BioSpin GmbH
$$ ##OWNER= she
$$ F:/spectra/data/she/nmr/P31/2/pdata/1/auditp.txt
$$ ##AUDIT TRAIL=  $$ (NUMBER, WHEN, WHO, WHERE, WHAT)
(   1,<2026-02-25 14:11:00.56 +0400>,<she>,<DPX200>,
      <continue with go, POWCHK disabled, PULCHK disabled
       configuration hash MD5:
       00 E9 B6 7A A2 85 ED C7 34 08 36 98 17 FE 4E 26
       data hash MD5: 32K
       6D 47 30 8B 0D 6A 08 6D 32 6F 08 19 9F 0F C3 FF>)
(   2,<2026-02-25 14:11:04.31 +0400>,<she>,<DPX200>,
      <Start of raw data processing
       efp BC_mod = 2 LB = 1.5 FT_mod = 6 PKNL = 1 PHC0 = 1395.766 PHC1 = 66.30067 SI = 64K 
       data hash MD5: 64K
       F9 19 EB 48 B6 49 D9 62 75 AA E3 84 E4 8B DB 87>)
(   3,<2026-02-25 14:11:30.39 +0400>,<she>,<DPX200>,
      <pk PHC0 = -9.450855 PHC1 = 0 
       data hash MD5: 64K
       23 0B 85 6B 73 1A 74 D2 57 6F C0 B1 05 A0 BD F7>)
(   4,<2026-02-25 14:11:37.07 +0400>,<she>,<DPX200>,
      <abs ABSG = 5 
       data hash MD5: 64K
       A6 4E 3B AC 15 E9 9B 17 3C E9 F1 D9 49 9F C8 FC>)
$$ ##END=
$$ 
$$ hash MD5
$$ 76 59 F4 BF 7B CC 47 43 BB 20 B1 84 A0 35 53 C9
##$RELAX= 
##$RELAX= 
##$RELAX= 
##$RELAX= 
##$RELAX= 
##$RELAX= 
##$RELAX= 
##$RELAX= 
$$ Bruker specific parameters
$$ --------------------------
##$DU= <F:/spectra>
##$EXPNO= 2
##$NAME= <P31>
##$PROCNO= 1
##$TYPE= <nmr>
##$USER= <she>
##$AMP= (0..31)
100 100 100 100 100 100 100 100 100 100 100 100 100 100 100 100 100 100 
100 100 100 100 100 100 100 100 100 100 100 100 100 100 
##$AQSEQ= 0
##$AQ_mod= 1
##$AUNM= <au_zg>
##$AUTOPOS= <>
##$BF1= 81.014009
##$BF2= 200.13
##$BF3= 200.13
##$BF4= 200.13
##$BF5= 200.13
##$BF6= 200.13
##$BF7= 200.13
##$BF8= 200.13
##$BYTORDA= 1
##$CFDGTYP= 0
##$CFRGTYP= 5
##$CHEMSTR= <none>
##$CNST= (0..31)
1 1 145 1 1 1 1 1 1 1 1 1 1 1 1 1 1 1 1 1 1 1 1 1 1 1 1 1 1 1 1 1 
##$CPDPRG= <waltz16>
##$CPDPRG1= <>
##$CPDPRG2= <waltz16>
##$CPDPRG3= <>
##$CPDPRG4= <mlev>
##$CPDPRG5= <mlev>
##$CPDPRG6= <mlev>
##$CPDPRG7= <mlev>
##$CPDPRG8= <mlev>
##$CPDPRGB= <>
##$CPDPRGT= <>
##$D= (0..31)
0 1 0 0 0 0 0 0 0 0.06 0 0.03 2e-05 3e-06 0 0 0.0002 0 0 0 0 0 0 0 0 0 
0 0 0 0 0 0 
##$DATE= 1772014182
##$DBL= (0..7)
120 120 120 11 120 120 24 19 
##$DBP= (0..7)
150 150 150 150 150 150 150 150 
##$DBP07= 0
##$DBPNAM0= <>
##$DBPNAM1= <>
$$ [...]
##$SUBNAM3= <"">
##$SUBNAM4= <"">
##$SUBNAM5= <"">
##$SUBNAM6= <"">
##$SUBNAM7= <"">
##$SUBNAM8= <"">
##$SUBNAM9= <"">
##$SW= 400.765351723535
##$SWIBOX= (0..15)
0 1 3 0 0 0 0 0 0 0 0 0 0 0 0 0 
##$SW_h= 32467.5324675325
##$TD= 32768
##$TD0= 1
##$TE= 0
##$TE2= 300
##$TE3= 300
##$TEG= 300
##$TL= (0..7)
0 120 53 12 22 120 120 120 
##$TP= (0..7)
150 150 150 150 150 150 150 150 
##$TP07= 0
##$TPNAME0= <>
##$TPNAME1= <>
##$TPNAME2= <>
##$TPNAME3= <>
##$TPNAME4= <>
##$TPNAME5= <>
##$TPNAME6= <>
##$TPNAME7= <>
##$TPOAL= (0..7)
0.5 0.5 0.5 0.5 0.5 0.5 0.5 0.5 
##$TPOFFS= (0..7)
0 0 0 0 0 0 0 0 
##$TUNHIN= 0
##$TUNHOUT= 0
##$TUNXOUT= 0
##$USERA1= <user>
##$USERA2= <user>
##$USERA3= <user>
##$USERA4= <user>
##$USERA5= <user>
##$V9= 5
##$VALIST= <valist>
##$VCLIST= <CCCCCCCCCCCCCCC>
##$VD= 0
##$VDLIST= <DDDDDDDDDDDDDDD>
##$VPLIST= <PPPPPPPPPPPPPPP>
##$VTLIST= <TTTTTTTTTTTTTTT>
##$WBST= 1024
##$WBSW= 4
##$XGAIN= (0..3)
0 0 0 0 
##$XL= 0
##$YL= 0
##$YMAX_a= 14643
##$YMIN_a= -3677
##$ZGOPTNS= <>
##$ZL1= 120
##$ZL2= 120
##$ZL3= 120
##$ZL4= 120
##$ABSF1= 197.3918
##$ABSF2= -203.3724
##$ABSG= 5
##$ABSL= 3
##$ALPHA= 0
##$AQORDER= 0
##$ASSFAC= 0
##$ASSFACI= 0
##$ASSFACX= 0
##$ASSWID= 0
##$AUNMP= <proc_1d>
##$AZFE= 0.1
##$AZFW= 0.5
##$BCFW= 0
##$BC_mod= 2
##$BYTORDP= 0
##$COROFFS= 0
##$CY= -3
##$DATMOD= 1
##$DC= 0
##$DFILT= <>
##$DTYPP= 0
##$F1P= 0
##$F2P= 0
##$FCOR= 1
##$FTSIZE= 65536
##$FT_mod= 6
##$GAMMA= 0
##$GB= 0
##$INTBC= 1
##$INTSCL= 9.790993e-09
##$ISEN= 30
##$LB= 1.5
##$LEV0= 0
##$LPBIN= 0
##$MAXI= 10000
##$MC2= 0
##$MEAN= 0
##$ME_mod= 0
##$MI= 50
##$NCOEF= 0
##$NC_proc= -9
##$NLEV= 6
##$NOISF1= 182.463
##$NOISF2= 159.3651
##$NSP= 0
##$NTH_PI= 0
##$NZP= 0
##$OFFSET= 197.3918
##$PC= 4
##$PHC0= 1386.315
##$PHC1= 66.30067
##$PH_mod= 1
##$PKNL= yes
##$PPARMOD= 0
##$PSCAL= 0
##$PSIGN= 0
##$REVERSE= no
##$SF= 81.014063255964
##$SI= 65536
##$SIGF1= 159.3651
##$SIGF2= -187.1042
##$SINO= 113.3802
##$SIOLD= 16384
##$SREGLST= <1H.CDCl3>
##$SSB= 0
##$STSI= 65536
##$STSR= 0
##$SW_p= 32467.5324675325
##$SYMM= 0
##$S_DEV= 0
##$TDeff= 32768
##$TDoff= 0
##$TI= <>
##$TILT= no
##$TM1= 0
##$TM2= 0
##$TOPLEV= 0
##$USERP1= <user>
##$USERP2= <user>
##$USERP3= <user>
##$USERP4= <user>
##$USERP5= <user>
##$WDW= 1
##$XDIM= 65536
##$YMAX_p= 258956490
##$YMIN_p= -241742760
$$ End of Bruker specific parameters
$$ ---------------------------------
##NTUPLES= NMR SPECTRUM
##VAR_NAME=  FREQUENCY,     SPECTRUM/REAL,   SPECTRUM/IMAG
##SYMBOL=    X,             R,               I
##VAR_TYPE=  INDEPENDENT,   DEPENDENT,       DEPENDENT
##VAR_FORM=  AFFN,          ASDF,            ASDF
##VAR_DIM=   65536,         65536,           65536
##UNITS=     HZ,            ARBITRARY UNITS, ARBITRARY UNITS
##FACTOR=    0.49542278885378, 1,            1
##FIRST=     15991.5117654749, 0,            0
##LAST=      -16476.0207020576, 0,           0
##MIN=       -16476.0207020576, -241742760,  0
##MAX=       15991.5117654749, 258956490,    0
$$ Real data points
##PAGE= N=1
##DATA TABLE= (X++(R..R)), XYDATA
$$ [...]
9357 -4824205 -1187411 7651806 19172362 24428773 17965955 5694603 -1900282 -2811139
9349 -2811139 -3509456 -6277880 -4898000 3808552 12042691 10956094 2942201 -3282070
9341 -3282070 -5797936 -9500389 -15528012 -19722111 -21278931 -23948371 -27052256 -23876930
9333 -23876930 -12499294 -833811 3860610 4455710 7473471 12192375 12885089 8951854
9325 8951854 6088159 8211372 13578478 18454235 19874746 15296949 4794352 -5795675
9317 -5795675 -8952221 -4337492 650064 987674 182081 3232263 7688714 6950680 522754
9308 522754 -4686039 -3597026 1365494 5247594 6759165 6767983 4411977 -900818 -5550828
9299 -5550828 -4656617 992449 5128580 4114789 1276692 1519892 4719825 6716537 4619564
9290 4619564 -1128170 -8100435 -13009454 -13046054 -8489211 -3050706 -5756 636187 -138978
9281 -138978 -2753654 -6760981 -9230951 -9362898 -12129970 -21846792 -33246493 -35369447
9273 -35369447 -25417973 -12940294 -7799334 -9084327 -9568822 -6829015 -4641938 -5305283
9265 -5305283 -6003730 -3450704 1504907 5413746 6431316 5658082 5189717 5866654 6818614
9256 6818614 6659447 4855529 2167437 311830 980375 3919435 5844947 3448328 -1448793
9247 -1448793 -2637287 1992646 5700272 1099007 -8934246 -14420216 -11772016 -7420492
9239 -7420492 -6813349 -6978242 -3546185 1157442 2355641 637634 -117299 628965 1019191
9230 1019191 1608839 3511772 4092936 769201 -2505992 694497 9330488 15915072 17667096
9221 17667096 19270389 23005407 23954282 18894711 13214570 13319663 17003117 17717356 15193693
9212 15193693 14826551 17609707 17608474 10844556 1499727 -3194561 -871061 5352671 11161985
9203 11161985 13086349 8480751 -2486811 -14634265 -20732687 -18303298 -11889642 -7282281
9195 -7282281 -5156379 -2426907 1727713 4819639 5967268 7653412 10749236 11590881
9187 11590881 7325843 1252677 -1403939 -1002301 -1832223 -4178964 -3907390 -309784 1752736
9178 1752736 -399094 -2892650 -1841681 611457 839165 75062 1079032 1438210 -3978311
9169 -3978311 -14945238 -25278990 -29992019 -28867360 -23439303 -15062883 -6436589 -838629
9161 -838629 1382322 2642917 4082973 4812523 5283411 7547181 11265881 13144671 11619750
9152 11619750 8705014 5879185 1850523 -3590471 -6989447 -5188199 714999 7593895
9144 7593895 13630029 16904286 13938830 3764857 -8205421 -14405700 -12979109 -8799593
9136 -8799593 -7274106 -9490966 -12721602 -13355358 -9936741 -5080508 -3140047 -4354293
9128 -4354293 -3870593 505530 2757810 -3842079 -15249670 -19128093 -9678079 5680095
9120 5680095 16306932 19709040 19953712 19681585 18536522 16775350 15400710 13487296
9112 13487296 9407635 4749837 3713700 7790663 13128885 14065336 8410045 -728711
9104 -728711 -7559845 -8518534 -5468088 -3383008 -4143450 -4033848 1022446 8973823 12777488
9095 12777488 8064994 -1988275 -9725002 -9963082 -4089519 1612859 1562920 -4430373
9087 -4430373 -11643821 -15133238 -13237153 -7224795 93506 4931944 4621012 992825
9079 992825 -535578 2736616 7597289 10097403 10899132 11963050 10907244 4171709 -5521724
9070 -5521724 -11160543 -11394227 -12203886 -16465443 -17938989 -10151175 2941991 10830996
9062 10830996 9435059 5276850 6618440 14155379 21457782 22277725 16300403 8774602
9054 8774602 5222415 6481121 9104736 9964700 8699691 5844208 1643529 -1945476
9046 -1945476 -1272443 4246213 9710001 10325286 7806792 7677961 11097426 13090581 9128482
9037 9128482 594827 -6719517 -7630436 -1531293 6425823 8955300 4110712 -1885912
9029 -1885912 -2403868 602147 164592 -4024120 -4181857 3616820 12641017 14773881 11571675
9020 11571675 10803901 15301660 20870101 23449923 22940397 20642129 17800952 16578595
9012 16578595 18099324 19508738 17193606 12896168 11860480 14316371 14116139 7779540
9004 7779540 -130452 -3747704 -3638931 -3789665 -4483040 -3332378 -1380364 -2580581 -7219617
8995 -7219617 -10566966 -9172504 -4922774 -1452914 401488 1537567 1137448 -3030497
8987 -3030497 -11050017 -19237401 -23014845 -21569990 -19019616 -19563558 -21558746 -19102707
8979 -19102707 -10943209 -4400566 -6531066 -13734732 -15748049 -9474048 -2420493 -765654
8971 -765654 -637599 4398402 12401336 15913944 13112231 9542269 9183567 9690601 7645392
8962 7645392 3717640 495501 -1433114 -3068248 -4921541 -6949555 -8763182 -8928761
8954 -8928761 -6020210 -1153746 2673422 4477250 6057864 8104526 8525150 6064474
8946 6064474 2483190 -829675 -5179786 -10755525 -13741703 -11284129 -6957386 -6295719
8938 -6295719 -7919536 -4656232 5596838 15068043 14734953 4639956 -7000886 -12896683
8930 -12896683 -12380422 -9316840 -6903230 -4941820 -1551759 2765944 4128433 352408
8922 352408 -3943074 -1291572 8541354 16687514 16203390 11103809 9771373 12109957 9736021
8913 9736021 -1135269 -13692721 -19949251 -20577210 -20943757 -21459073 -18017258 -10542596
8905 -10542596 -4550356 -2863651 -1154368 5038600 12457718 13564907 6481302 -2401044
8897 -2401044 -5915576 -3294906 863631 2365156 735127 -1699385 -2387131 -641715
8889 -641715 1820835 2511975 664445 -2250544 -4449079 -5256383 -4383311 -1462232 2324841
8880 2324841 3488047 -465356 -6955543 -9950913 -6793732 -1611952 -143106 -2404782
8872 -2404782 -3075864 989926 6630382 9196538 9034960 10259400 14080417 16815949 15200075
8863 15200075 10668143 6587734 3451211 -713276 -6333539 -11178486 -12878707 -10688278
8855 -10688278 -5312666 969503 4660262 4220169 2943610 5919603 13574267 20907215
8847 20907215 23969579 24178289 24716477 25702548 25563431 24825146 24989002 24598736 19950563
8838 19950563 10227851 -402986 -6669673 -7041179 -4461250 -2994877 -3633900 -3280463
8830 -3280463 1007702 6768621 7919763 3216305 -625904 2205339 7631131 6903979
8822 6903979 -714808 -7014489 -7036693 -5268477 -6795417 -8646275 -5291433 1421251 4170056
8813 4170056 252552 -6082865 -11055674 -15599549 -20997884 -24781025 -23467819 -17009782
8805 -17009782 -8668431 -2002201 1009230 498074 -1514584 -2910424 -3444860 -3912362 -3902921
8796 -3902921 -2535752 -1054377 -1648515 -3340856 -2566875 976388 2987265 1469838 1048627
8787 1048627 6245983 13310420 14196378 7800231 1728936 2117433 6581283 9080182 7425157
8778 7425157 3212653 -2002425 -6690971 -7921562 -4100752 1769776 5032407 5024302 4580222
8769 4580222 4458017 2276716 -2240227 -4924465 -2477224 2324138 3474469 -1294948
8761 -1294948 -8566384 -13480997 -13724402 -9475371 -1902294 6725388 12452616 11514008 4324520
8752 4324520 -3102547 -4060285 1463977 6261048 4777605 716762 2365150 11209260
8744 11209260 19784287 21710164 19017559 16876137 15600767 12446166 8122402 5719106
8736 5719106 4525617 1074608 -3399326 -2799574 4302974 10380390 8022675 -411737
8728 -411737 -6396512 -5832518 -1595175 2630026 5842866 7263968 5576126 2323160 2006328
8719 2006328 6055276 9514506 7037474 595983 -2453375 1043041 5708969 4265832
8711 4265832 -3785933 -12174329 -15372983 -13840652 -11965019 -13036946 -17001609 -21249577
8703 -21249577 -22033344 -16407631 -5111557 6470999 12201159 10819197 6683890 4715532
8695 4715532 6045395 8951938 11832083 13554645 12554636 8216196 2865746 135424
8687 135424 1017780 3195543 4307265 3782949 1117514 -4878195 -13373482 -20284137 -22282545
8678 -22282545 -20717581 -18939064 -17013318 -12772681 -7757336 -7301055 -12688576 -17384425
8670 -17384425 -14935870 -8085689 -5296756 -9023906 -12417195 -8827323 -403246 5327235
8662 5327235 4712589 797539 -1787357 -1923409 -2064255 -5129212 -11783489 -19899428 -26339597
8653 -26339597 -29277297 -28549951 -24429103 -17734686 -11315061 -9210076 -12881003 -19344188
8645 -19344188 -24003384 -24341632 -20514908 -14363339 -8929290 -6804180 -7249114 -6722410 -3780747
8636 -3780747 -1147990 -823981 70432 4942144 11054881 11638746 4497868 -5143355 -10595141
8627 -10595141 -9335248 -2729436 6052605 12675434 13398161 8317432 1612140 -2188577
8619 -2188577 -1148174 4187358 11394989 16817556 18296569 17495341 17116937 16248434 11887596
8610 11887596 5053534 938639 1454157 1665697 -3692440 -13042300 -20098445 -21211134
8602 -21211134 -18041937 -14226876 -11561517 -8993203 -4352570 2368040 7597961 7587317
8594 7587317 2883874 -2717853 -7001022 -10000211 -10629290 -7203805 -1740693 1135240
8586 1135240 781658 1156714 3474442 3941680 1224287 6301 3229521 6608159 5816417
8577 5816417 3746421 4698195 6282216 4270452 1688873 4948456 12897541 17618472
8569 17618472 15509910 10615552 7342360 6612299 9025651 14837367 20135004 19606460
8561 19606460 14223185 10233800 9684969 8114550 2686515 -3906174 -9258328 -14333646
8553 -14333646 -18410056 -17501514 -11140642 -5037340 -3489033 -4291646 -4457821 -5453850 -8613888
8544 -8613888 -10469336 -7632136 -2539258 147643 -516988 -3291483 -8230969 -14158192
8536 -14158192 -16530581 -13104782 -8748164 -9367169 -13534025 -15274137 -12790250 -8945820
8528 -8945820 -5076637 -291601 4079426 5173285 3540194 2126316 308630 -5682511
8520 -5682511 -15549715 -23109751 -23381299 -17711739 -10517362 -4709478 -2118247 -4741921
8512 -4741921 -12344482 -20408730 -23257654 -19359280 -12554092 -7922430 -6562179 -4565628
8504 -4565628 2192919 12327801 19551008 19477451 13813749 6989913 1421924 -2175732
8496 -2175732 -2921784 -1206143 386283 657987 2020828 5963933 8995538 7222121 2695104
8487 2695104 616921 2139148 4697747 7401459 10422029 10881451 6162829 413443
8479 413443 196681 3510647 1442718 -7466737 -13101566 -7805000 3241851 10822344
8471 10822344 13831124 16009388 16426565 11510951 3307013 -2406733 -4769483 -7219379
8463 -7219379 -8942565 -4584141 6346192 16550695 20026645 18865801 18045994 17863389
8455 17863389 15354731 10236992 5151634 1153889 -3221949 -8044872 -10016712 -6021736
8447 -6021736 2542538 10680835 15071323 16934887 18764027 19705781 16621402 9491082
8439 9491082 2869894 947366 3593984 8465499 14072152 18689401 19399984 15735323
8431 15735323 11967015 11674651 11720226 6377438 -3397902 -10128958 -9602559 -5237641 -1403232
8422 -1403232 2313768 7583619 12752802 15283536 15157696 12517538 5797574 -3466790
8414 -3466790 -7691299 -1204197 10610491 16318484 12166169 4970182 1250761 93266
8406 93266 -1345924 -1738431 984824 4793306 6645565 6953288 6478360 1951312 -9597405
8397 -9597405 -23661717 -31057741 -28006955 -19050030 -10032924 -2941208 1722933 2580662
8389 2580662 -171205 -3435935 -4737899 -4615695 -4012083 -2331338 -76989 -277739 -4371849
8380 -4371849 -8934543 -9545870 -6401895 -3326555 -2419532 -2324456 -982124 2166961 5943866
8371 5943866 7446125 3453374 -5798177 -14941988 -17876602 -13763914 -7445075 -4714335
8363 -4714335 -8127324 -15632382 -21605661 -21159167 -15530566 -11251224 -11880922 -13345389 -10488165
8354 -10488165 -4988352 -2186061 -2849579 -4055202 -6364547 -12811375 -20789466 -22773052
8346 -22773052 -17310267 -12233223 -13216192 -15163484 -9911768 1886095 11746579 13350265
8338 13350265 7209433 -1855315 -7428905 -4308490 6098825 14321271 11600523 13564
8330 13564 -9786981 -10451251 -4145864 2173532 3426995 -1698107 -11126494 -19951943 -23204889
8321 -23204889 -19667722 -12065619 -3862025 2523323 5530842 5578934 5954889 9195067 12373766
8312 12373766 9627060 445194 -8037498 -9130347 -4356373 -640146 -1555620 -4302022
8304 -4302022 -4821354 -3052995 -2014040 -3192732 -4760526 -4780624 -4843521 -8584464 -16277296
8295 -16277296 -22855578 -22939597 -16898290 -10377050 -8521342 -12117967 -18393443 -23307380
8287 -23307380 -23361394 -17620425 -8606418 312091 8556137 17687666 27100942 32734711
8279 32734711 31362492 24772736 18295631 15696203 16391105 17435605 17468089 18027278 20549109
8270 20549109 22884301 20948144 14416509 8094031 5484861 3438542 -3204192 -12980913
8262 -12980913 -18334619 -15228897 -8243118 -4561775 -5969508 -8625552 -8398002 -4609925
8254 -4609925 -233530 376662 -4284865 -10122095 -11297979 -7673751 -5169361 -7139382
8246 -7139382 -9356390 -6839587 -2037888 -1146069 -4352200 -5765280 -2963589 -499935
8238 -499935 -1896476 -3494105 -150800 6545326 10495809 9722012 7936199 7816736 7503132
8229 7503132 5035080 2017295 191348 -2413867 -8279773 -15349751 -19298656 -20031388
8221 -20031388 -21611680 -25457149 -27970256 -26276832 -22124760 -17801225 -12231419 -4627488
8213 -4627488 1375261 1724943 -2063742 -5311930 -6518777 -6351735 -2432931 7941747
8205 7941747 20078063 24584006 20071646 16164914 19949300 25693241 23631659 14084698
8197 14084698 5948595 4007033 5006227 5397361 5792662 6548406 4999078 -134313 -5612474
8188 -5612474 -7745982 -6935944 -5890906 -5496960 -4749231 -3408935 -2692886 -3788280 -6689034
8179 -6689034 -10013189 -11673438 -10696614 -8616146 -7914359 -8868608 -9168331 -6816244 -2071126
8170 -2071126 3619012 9125295 13841826 17804052 21678378 25034982 24743487 17434677
8162 17434677 4357038 -8087815 -13579572 -10383307 -762132 11431981 21658524 26052550
8154 26052550 24255510 19683093 15569431 12108644 8547379 5936166 5814008 7731154
8146 7731154 9936656 10955403 8767306 792555 -12269182 -24261668 -28816942 -26047912
8138 -26047912 -20864815 -15836069 -10093219 -4918207 -4705540 -10088695 -14611964 -11863928
8130 -11863928 -3224114 4864600 9144697 11290441 12808770 12557675 9869528 6903473
8122 6903473 6506464 9285937 13313952 15455181 13290041 7770311 3919164 6349554
8114 6349554 13412591 18222121 16476908 10601515 4479539 -2736622 -13774469 -25845545
8106 -25845545 -31134827 -25926731 -15495475 -7594600 -3992083 -1726113 -514386 -3799669
8098 -3799669 -11917148 -19099535 -20192007 -17132568 -15092768 -14550968 -12046359 -7830831
8090 -7830831 -6795674 -10212907 -12035296 -7020409 1533761 6622839 7028146 6790486 7403876
8081 7403876 6799870 5585337 7571910 12552198 14551484 10147820 3598186 335844
8073 335844 -193673 -1264646 -2521599 -1853398 -653494 -1825032 -4267352 -4404626 -1928758
8064 -1928758 931381 4586166 10830189 16984554 17788081 14162996 13672334 19570581 24981593
8055 24981593 21912036 11861165 2985093 -450968 -1146352 -2740278 -5121200 -6072834
8047 -6072834 -4787375 -2799206 -2305603 -3771192 -5532357 -6808947 -10100361 -17668363
8039 -17668363 -25998665 -28111953 -22561365 -15558860 -12034336 -9652891 -5263690 -1861360
8031 -1861360 -3076835 -4737807 258299 10089767 14937908 10467515 3292903 1049819
8023 1049819 3469606 6415707 8942346 11669327 12291863 8133307 1257797 -3507493
8015 -3507493 -4665630 -4384210 -3559472 -544395 4918216 10015226 12395083 12964961 13693912
8006 13693912 14371251 13322584 10415331 7406668 5263094 2943453 -143601 -1926753
7998 -1926753 -63899 3819839 4997006 1649082 -2681661 -4556524 -5803537 -9838251
7990 -9838251 -14912570 -15909814 -12534624 -10402051 -12452293 -14139076 -10211200 -2549073
7982 -2549073 2645430 3024022 1330363 -192150 -2416233 -6247122 -10284894 -12547739
7974 -12547739 -12584095 -11204461 -9317174 -7238512 -4521294 -1119263 774346 -1952092
7966 -1952092 -8440182 -12579145 -9697051 -2812993 1681312 3238547 6770246 12956992
7958 12956992 15373348 10321569 4133454 5418278 13112886 18024715 15063118 8179401
7950 8179401 2812871 -815755 -4439707 -6394277 -3751123 2170735 6210618 4978352
7942 4978352 -241723 -5656892 -7979533 -5958372 -1211483 2749348 4333931 6065950
7934 6065950 10471723 14692244 13274976 6918091 3716991 8853760 16711350 17509069
7926 17509069 9801922 1723101 211438 3494785 5383151 3458679 835781 1648480
7918 1648480 6545281 11773009 11939739 4710494 -6652510 -16175606 -20467154 -20099592
7910 -20099592 -16678286 -11099443 -4749293 351192 3462086 5052749 4476939 532566
7902 532566 -4999991 -7906511 -7374761 -7839238 -12326648 -17068406 -16403031 -10879976 -6391889
7893 -6391889 -6370502 -8846129 -10826916 -11596166 -11155260 -8934501 -5404196 -2565412 -1619792
7884 -1619792 -1829548 -2355386 -3476471 -5267792 -6648416 -6642616 -5655732 -5009547 -5672848
7875 -5672848 -7097527 -6840019 -2776973 2950018 4226433 -2011101 -10555518 -13365587
7867 -13365587 -9384134 -4768911 -3607013 -3437402 -1159367 1809097 3113596 3920237
7859 3920237 5977995 7273554 4710659 -806509 -5727010 -8761196 -10771079 -11197183
7851 -11197183 -8948077 -6449104 -8240289 -14378549 -18776442 -15974271 -7258915 1620731
7843 1620731 6930924 9159038 9869356 8793458 4953294 -240108 -2786076 -426863
7835 -426863 3408331 2475640 -4500420 -11335940 -11706069 -6867177 -3244407 -4053538 -7143722
7826 -7143722 -10282790 -13789042 -16941562 -16272380 -10102763 -1875020 3790977 6293413
7818 6293413 7686869 8011950 5302870 -363398 -5875340 -8581845 -8768561 -8230989 -8012399
7809 -8012399 -8087096 -7987237 -7057892 -4927367 -2369031 -1233911 -2905148 -6695387 -9940278
7800 -9940278 -10084534 -7081684 -3399077 -983472 1165492 4878182 8652118 8319439 3092685
7791 3092685 -1567160 304489 7878908 14742407 16822077 16154241 16362859 17147126 14871275
7782 14871275 7313170 -3502442 -12725945 -16495969 -15050866 -12333082 -11892607 -13424981
7774 -13424981 -14395030 -14413246 -15695681 -18812389 -20575090 -17876182 -11981756 -6917069 -4318153
7765 -4318153 -1858846 3146925 10001003 15018908 15187178 11111826 6177059 2717511
7757 2717511 -100514 -3561219 -5849567 -4070819 267891 1612588 -2112473 -6042478
7749 -6042478 -5607689 -4007506 -7684758 -16154305 -22041120 -21284333 -17650157 -15617202 -14218063
7740 -14218063 -11038519 -7812773 -7677713 -9715735 -10614308 -9923534 -9538764 -9435298 -8288727
7731 -8288727 -7403936 -9356660 -12920580 -14163646 -13046365 -13666721 -16286616 -14658905 -5000495
7722 -5000495 6823950 12276212 11666889 12895816 19360049 24926361 22507044 13147272
7714 13147272 3739749 -1531789 -4305487 -7841443 -12662302 -16726667 -18271485 -17636074
7706 -17636074 -16599725 -16303001 -16182177 -15245283 -13797741 -12809966 -11813478 -9000273 -3924318
7697 -3924318 1207900 3742037 3137824 760352 -1733258 -3031807 -2466017 -848937 -42479
7688 -42479 -534092 -551385 1005404 2112970 448712 -2100822 -803572 5507367 12121957
7679 12121957 13965477 11320561 8227497 6886716 6172954 4968396 4080694 4096011 3518749
7670 3518749 849936 -2283579 -1945597 3666420 11670125 17326686 18900009 18420546 17650344
7661 17650344 15276865 9611632 2579997 -1735441 -2417022 -2591466 -3936291 -3299107 2609834
7652 2609834 11133011 15824991 14350679 10837994 9489543 8806243 4352852 -4206220
7644 -4206220 -11312062 -11091747 -3674851 4583948 7133387 3390414 -1398531 -2419411
7636 -2419411 -153381 2150302 4325178 9450507 17723576 23454522 20731016 10738941
7628 10738941 1049220 -2088877 910752 4975985 5908388 3559638 760786 -78245
7620 -78245 656864 744944 -927005 -3385549 -5592345 -7828369 -10253264 -11862156 -12527716
7611 -12527716 -14651455 -20501332 -28453990 -33821336 -33082902 -25983719 -14864305 -4353145
7603 -4353145 -255728 -4723739 -12288802 -14428236 -9078714 -2367983 -69061 -1396531
7595 -1396531 -3104477 -5124193 -8223345 -9496622 -5314740 2696289 9282914 12465334
7587 12465334 14473551 16337442 16472189 15151032 15318041 17147301 16345269 10670400 4412103
7578 4412103 2955135 5726031 8232226 8883132 9608373 10997708 11362393 10711875 11492948
7569 11492948 14065707 14657780 9859919 1312636 -5842511 -8066423 -5700524 -1244042
7561 -1244042 2995049 5682245 6176455 4357869 1074966 -1475143 -908774 2865618 6862938
7552 6862938 7727072 4901273 332121 -4161013 -7846688 -10092277 -10266486 -8646879 -6112047
7543 -6112047 -3234091 -925317 -995728 -3974433 -7328935 -8645571 -9692240 -13404937 -17084925
7534 -17084925 -13929799 -3189165 6551753 8165886 5758753 8132671 15131763 17279396
7526 17279396 9283084 -2128125 -6334101 -843266 7805752 12780513 13356618 13094864
7518 13094864 14252103 15489584 14866599 13511714 14347863 17318818 18715215 16521804
7510 16521804 13400970 11910391 9955436 5092547 841137 3141417 11377174 18684839
7502 18684839 21429003 22540911 24426921 24885006 22626062 20847988 21396844 20521073 15164827
7493 15164827 9111376 7443433 8425013 6873928 2943884 1028152 1530986 692066 -1615621
7484 -1615621 -898116 3856720 7462142 6428497 4136952 4778804 6561021 4962753 -383033
7475 -383033 -6168372 -10652417 -14319462 -16340171 -14366734 -8356113 -1945036 929104
7467 929104 -463171 -3705782 -5661086 -4743591 -1920711 44382 -1157385 -5413623 -10253648
7458 -10253648 -12747024 -11656395 -8290381 -5243555 -3976845 -3878636 -3849166 -3764526 -3537784
7449 -3537784 -2040723 1276542 4511554 5154451 3469836 1983864 1821880 1746348 764777
7440 764777 -698438 -2468132 -5044152 -7807823 -8895639 -7250739 -2866234 4622827
7432 4622827 14557431 22571679 23367332 17340802 10578064 6679405 2827620 -3563829
7424 -3563829 -8862321 -8086505 -2476155 2471472 4177306 3442768 -237808 -8153711 -17608075
7415 -17608075 -23015307 -22517450 -19338195 -16171460 -12659570 -9128193 -7854581 -8678515
7407 -8678515 -7844323 -3981130 -1370562 -3853486 -8678410 -10469308 -9002439 -8295596 -8826383
7398 -8826383 -5746181 3622117 13990143 16587079 8605348 -3373890 -9297908 -4560272
7390 -4560272 6413189 14712845 14988734 9409429 4445255 4648462 9600187 15645252
7382 15645252 19382465 19644105 17055556 12355331 5636465 -2471338 -9653037 -13388141
7374 -13388141 -13650548 -12715491 -12109055 -11574803 -11490442 -13661443 -18042752 -21189909 -20586821
7365 -20586821 -18274538 -16714306 -13310319 -4517238 5349404 6621463 -1800481 -7634504
7357 -7634504 217823 16689507 26700297 23755011 15266135 10343346 10274270 12500025
7349 12500025 16043844 18852769 16120379 6985974 -1340483 -1954186 2393059 4259428
7341 4259428 3213058 5484238 12620246 17648143 14183159 4100268 -5643192 -9699767
7333 -9699767 -6874474 -584413 1896895 -4619174 -16167196 -22842124 -20741422 -15826937
7325 -15826937 -13980922 -13287526 -9955478 -5981237 -5272799 -6698206 -7296996 -8768641 -13767597
7316 -13767597 -18482346 -16878052 -11231248 -10082617 -14957817 -17379424 -11934331 -5046431
7308 -5046431 -5985633 -14277931 -21425553 -22064673 -18253175 -14027749 -10224741 -5207821 1613687
7299 1613687 7619738 8211338 1666329 -6857707 -8954210 -2432049 5287976 5792403 -196656
7290 -196656 -4335706 -1135572 6452802 11935603 12678165 11174969 10809318 12055695 12565329
7281 12565329 10007820 4446117 -1901254 -6664186 -8586283 -7322534 -3240820 2271636
7273 2271636 7269328 10515723 11757113 10758553 7130132 1485831 -4144639 -7620309
7265 -7620309 -8004589 -5659354 -1824303 1947836 4819659 7126831 9234160 10717815
7257 10717815 11865627 14699005 19927993 23459447 19471913 8028677 -3441907 -8254580
7249 -8254580 -7770803 -8245547 -12144688 -15668062 -14505453 -9093831 -3100842 1373526 5069015
7240 5069015 8371868 9038943 4817540 -2495188 -8103339 -9769571 -9560902 -8595911 -3466931
7231 -3466931 8356634 21833281 28326011 26218459 22640955 23502983 26323264 24959402
7223 24959402 17496075 6892058 -2718355 -7382091 -4223969 4951446 12654690 12281283
7215 12281283 5531016 682008 3551392 11900153 18377746 17516289 10238257 2588437
7207 2588437 -210494 1538019 4156621 6302543 9257941 11731433 9405956 2003457
7199 2003457 -3717479 -1947711 4371941 7925870 6632286 4238496 3141108 1791867
7191 1791867 -1077971 -4313645 -7177524 -10885400 -16293160 -22170406 -26101114 -25768826
7183 -25768826 -20365658 -12484245 -6859984 -4828300 -2221491 4068811 10082137 9972535
7175 9972535 5190071 2788653 5429421 9187584 11463561 14497263 19231143 21735610
7167 21735610 18817991 12497289 6005988 -144178 -5071802 -5500659 -1341699 936427
7159 936427 -3722920 -10414519 -10093852 -2713227 2378160 127933 -2802974 1980067 11941092
7150 11941092 16472024 10765619 1348719 -3085764 -1758283 59661 -260436 -171421 2923102
7141 2923102 8305321 14071575 18648430 19202242 12974850 2652976 -3707001 -1747415
7133 -1747415 3616259 5834794 6374868 10881890 18253637 21009376 16375020 9642177
7125 9642177 5077982 659307 -5053137 -7365592 -1913075 7512027 12779003 10800478
7117 10800478 5247018 1180676 1593927 6910997 13792687 16067581 10984296 3678603
7109 3678603 1816410 6534808 12173336 14256942 13725650 13025468 12057235 9778530 7169650
7100 7169650 6291071 7289390 7936579 6185899 2530343 -511530 -1229908 -378074 785964
7091 785964 3225958 8778758 16122906 20896554 21060363 19677321 20520865 23032117 23883135
7082 23883135 21804285 18286989 14739989 11646635 9795809 9645903 9649997 7644160 4132335
7073 4132335 2180602 3587601 6690870 8430306 7390247 4356257 849667 -2102880
7065 -2102880 -3851530 -3357751 310907 5643435 7763121 2506843 -7648926 -13984986
7057 -13984986 -9935475 1627734 10844787 10188581 765626 -9673359 -14019682 -11599020
7049 -11599020 -7356646 -5545427 -5445051 -4316817 -2327409 -1249177 213347 4912337
7041 4912337 11035657 12821166 9046096 5620494 7304160 11905528 15698421 18990830
7033 18990830 21778289 19441787 9620217 -292774 -316905 8698484 15801319 13868804
7025 13868804 6488635 633438 -1244135 -332489 1771875 2897106 753562 -4135345
7017 -4135345 -8390395 -9648631 -8144188 -4550076 502829 4789241 6052394 5481062
7009 5481062 6044068 7359697 6369315 3313681 2254868 4638677 7097803 7249487 7055663
7000 7055663 8358207 9559171 9317794 9289703 10014803 7913973 295045 -9298767 -14474246
6991 -14474246 -12988266 -7490372 -1286301 3451216 4764792 1674035 -4116669 -9070060
6983 -9070060 -10320280 -7190237 -2052009 -146737 -5626621 -16093165 -23592398 -22925852
6975 -22925852 -16687439 -10494552 -6311657 -2954192 -111365 1681078 3039393 4261127
6967 4261127 3426814 -721681 -5392645 -6681868 -4878788 -3300614 -2457146 757352 7538436
6958 7538436 14134679 15809680 12055682 6761717 4177606 5257192 7357662 7270570 4508776
6949 4508776 1013385 -2033713 -5110378 -7570406 -6693981 -1527278 4411154 6828580
6941 6828580 5671636 3911478 2641838 582433 -1892011 -1479863 4259020 13613085
6933 13613085 22008249 25644545 23831975 18935337 14316216 11589391 9636862 6338754
6925 6338754 842405 -5714235 -10674008 -11299724 -7622907 -3997401 -5335860 -11020352
6917 -11020352 -15263638 -14763742 -12857910 -13853517 -16309626 -15349926 -9613108 -2283000 3583399
6908 3583399 7289022 8744581 7798312 5419076 3222972 1872190 1439321 2278518 3703332
6899 3703332 3404169 644351 -1618442 -810152 606277 -1724093 -7039169 -9487791 -5384564
6890 -5384564 2582311 8580680 8726538 3521905 -2176857 -2469673 3429328 9420882 10015120
6881 10015120 7779879 8827664 12539826 12155432 5853458 407072 1352449 5446371
6873 5446371 6731262 5459403 6267180 10345574 14043823 13992379 10087710 4164296 -1561678
6864 -1561678 -5292272 -6911941 -7889197 -8823941 -8600887 -7207745 -7106209 -9528525 -11363857
6855 -11363857 -8797635 -3199450 -393255 -3817586 -10525517 -14641661 -13581894 -10089816
6847 -10089816 -8318201 -8425472 -6208700 955860 9260122 12251182 9107897 5741892
6839 5741892 6911936 10912626 13980655 16246632 19716773 22821908 21621151 16191327
6831 16191327 11909849 13172853 18250949 21891382 21768104 20784173 22936497 27948189
6823 27948189 31273485 29702913 25240216 21642898 18637172 12934530 4714080 -1058837
6815 -1058837 -1139543 1893541 4086032 4958855 4949569 1690806 -6426320 -15044293 -17533848
6806 -17533848 -13781411 -10743426 -13480490 -19529878 -23471300 -23495524 -21183671 -17496364
6798 -17496364 -12264457 -6892424 -4525818 -6319212 -8913398 -7551488 -2203964 902865
6790 902865 -4279879 -16027583 -25860551 -27524455 -22637860 -16683129 -12544932 -10277838
6782 -10277838 -10268022 -12505685 -13880420 -10568896 -3699047 821639 -506793 -4260987 -4422846
6773 -4422846 433865 6127453 8455067 8142250 9332560 13346458 15458255 9954733
6765 9954733 -1799546 -11468812 -13478344 -11610560 -12917516 -17620103 -19516061 -15318505
6757 -15318505 -8548912 -3621605 -839933 888951 516833 -2908569 -7163444 -9218971
6749 -9218971 -9234962 -9538180 -10763658 -11652518 -12042032 -13336556 -15710412 -17031205 -15615821
6740 -15615821 -12928825 -12415246 -15731404 -20609152 -22713310 -19726750 -13487617 -7930067
6732 -7930067 -5245321 -4483725 -3323242 -64664 5869653 13696233 20800141 23926536
6724 23926536 22305744 19022871 17787922 18397362 17094616 12264980 8057832 9911501
6716 9911501 16777530 20959860 17280362 9652321 5653410 6880422 9022939 9999193
6708 9999193 11896802 14240382 12261789 5115414 -442575 363470 2415688 -1107003
6700 -1107003 -6985254 -6508442 900986 7689987 10960879 15513113 22767732 26487672
6692 26487672 23424389 19577762 20362938 21860048 18371245 12514456 10219740 10358673
6684 10358673 7632424 2802589 1498900 3964076 4133863 -524512 -5297625 -5753186
6676 -5753186 -3105690 -444843 1238538 1547571 -78720 -1734890 50156 4847222
6668 4847222 7874493 7180570 7205921 12167262 19144957 21361309 16686578 10009689 7897093
6659 7897093 12562306 20327089 25075251 24022644 20108248 17492985 15974944 12953636
6651 12953636 9784068 10993184 16372356 19433823 16382926 11687202 11007388 12857012
6643 12857012 11934288 7500144 3335880 1566623 1673174 4193318 10049385 16405466
6635 16405466 17918004 12748059 4072516 -4056628 -8932346 -8235690 -1547060 6923257
6627 6923257 11375255 10714618 7987735 3812382 -4326533 -15385443 -23295586 -24785924
6619 -24785924 -23566264 -23513563 -22571589 -17613018 -11037739 -7264108 -5770209 -3283205 -738138
6610 -738138 -1886872 -5684411 -6221212 -1302131 3829411 3151030 -3151758 -9671542 -10944823
6601 -10944823 -4970937 5397228 13903334 16594492 16175753 17187343 17312324 9221888
6593 9221888 -7310414 -21394932 -23315300 -16108630 -9842416 -8250279 -7358134 -4930058
6585 -4930058 -3739995 -5000666 -5080683 -1089416 4801747 8933453 10502523 10297108 8452394
6576 8452394 5839667 4886408 6560156 8779695 9855893 10963575 12864260 12940336 8745539
6567 8745539 2461508 -1647321 -2660683 -2386182 -882014 3105418 8026089 10694911
6559 10694911 11938789 16160947 23694095 28237595 24845905 16914857 11768060 11957605
6551 11957605 14562839 16760760 17497324 14795219 6704255 -4076258 -10904309 -10751243
6543 -10751243 -7987735 -8105971 -10084153 -8265754 -690223 7936430 11918568 10367307
6535 10367307 6224957 2044258 -927754 -1001277 3122288 9117036 11621205 8247846
6527 8247846 3213467 2234213 4850330 5249526 725785 -4614232 -6059186 -4513168 -3822620
6518 -3822620 -5011489 -6851332 -9786853 -14716730 -19062794 -18864320 -14537995 -9866952
6510 -9866952 -5301950 2211042 11718416 16803908 14619402 10711804 10454060 10608838 5322990
6501 5322990 -2985357 -5764769 -339259 6408340 6688440 -578234 -10748952 -17436271
6493 -17436271 -15590477 -5620232 4922004 8315877 5919828 5976234 12046922 19139069
6485 19139069 22051880 21102198 17497497 9953614 -60418 -5844174 -3651725 1178217
6477 1178217 1665300 -1160449 -1563628 1615800 5130908 7771361 10067847 9839478 4935699
6468 4935699 -1021535 -2471267 -351340 402175 665889 5859843 14446819 17138345 10513828
6459 10513828 2730122 989245 1052597 -4448272 -13331428 -16863381 -11694951 -2012753
6451 -2012753 7540526 14541525 16261690 11252828 3419640 -885282 -326013 832910
6443 832910 -638777 -3605165 -5368542 -3838040 2369725 11471842 16667936 12062882
6435 12062882 1106541 -6010759 -4796509 -1365435 -2903249 -8271292 -11605817 -11143850
6427 -11143850 -9751236 -8989130 -7562672 -5283737 -4624206 -7478231 -12608784 -16812908
6419 -16812908 -17163540 -12304734 -3421648 5737179 11255345 12002756 9577007 5768351
6411 5768351 1563597 -1466542 -1011027 3266925 7914124 8481683 4398089 -272262 -1721298
6402 -1721298 -1029744 -2403730 -7051732 -10870147 -9361775 -3403673 1745607 2513876 -37370
6393 -37370 -3274180 -6439673 -9733607 -11923951 -11376811 -9190214 -9071053 -13102056 -18771967
6384 -18771967 -21394239 -18983396 -13509335 -7530988 -1555083 3982149 5761553 -258164
6376 -258164 -12942460 -24719221 -28387401 -24224330 -18354743 -14723608 -11281429 -4715417
6368 -4715417 3567145 8559966 8167427 6141839 7251867 10775890 10969115 4311094 -5741810
6359 -5741810 -12590767 -13409664 -10201799 -5665797 -1571820 -592510 -4869423 -11104521 -11498161
6350 -11498161 -2873194 8219826 13050799 10805767 7325132 6282187 6628603 7412373
6342 7412373 9424389 11684047 11251558 7623592 3256784 -902406 -5905260 -10052947
6334 -10052947 -9095605 -3339510 788014 -323352 -1876933 1392595 5971270 4521346
6326 4521346 -2161804 -5063904 684146 9029127 10693969 3813325 -5666106 -11817397
6318 -11817397 -14222888 -16323696 -20397198 -25017017 -27150279 -25876846 -23070826 -20664521
6310 -20664521 -18757152 -16737286 -14570450 -12312836 -10103103 -9258549 -11019442 -13127235
6302 -13127235 -10638430 -2409164 5911423 8441508 6567338 6386729 10087709 13719586
6294 13719586 13073725 8184594 1727520 -4092099 -8464000 -11904029 -15547585 -19063097
6286 -19063097 -19912895 -16432489 -10615192 -5843075 -3229566 -2465361 -4238828 -8449135
6278 -8449135 -11824991 -11431751 -9234483 -8826682 -9047122 -6240908 -2079688 -2730732 -9448989
6269 -9448989 -16126513 -17921469 -16693752 -15852967 -15442839 -14882722 -15042928 -14607454 -9911110
6260 -9911110 -1787826 3229735 2666575 2862153 8422258 12960190 7895521 -3999764
6252 -3999764 -12299904 -13275164 -11831135 -10879912 -8234327 -4414611 -4343827 -8869483 -12339545
6243 -12339545 -11742841 -11465172 -15308910 -19995077 -21158639 -20666111 -22709620 -26236976 -26586822
6234 -26586822 -22646900 -17874613 -15232482 -14467304 -13568311 -10512143 -4744018 1201394
6226 1201394 3351780 1457086 253675 3435711 8992561 13210222 16293117 20042383
6218 20042383 22319796 18974025 10809345 4009578 2944179 6029766 9279889 10547138
6210 10547138 9288115 5458937 610395 -2066151 -752479 3000367 6300221 7587560
6202 7587560 6380753 2295691 -3507801 -6857986 -3413650 6023508 14863756 17268082
6194 17268082 14626554 13312745 15870204 17271276 11707046 644379 -8959572 -12916514
6186 -12916514 -12518858 -9971186 -5975273 -2373475 -1987993 -3662865 -1993481 5161629
6178 5161629 13044867 17046385 18891449 21355471 21120467 13183795 -123827 -11045809
6170 -11045809 -16065065 -17473266 -16330062 -10953427 -2979758 1947630 1489468 -1035616
6162 -1035616 -3312956 -7121719 -12302306 -13561735 -7200687 3256918 11497204 14566931
6154 14566931 12074213 4481280 -3918725 -5487736 1971994 10808468 13210649 11617793
6146 11617793 13503213 19160693 21999415 19295840 15083604 12389511 9693454 6325830
6138 6325830 5036842 6926647 8852992 8245706 6325712 4446778 1356072 -3288405
6130 -3288405 -6188735 -4352066 314748 2898187 877649 -3603321 -5781143 -2529044
6122 -2529044 3655131 5631571 -456158 -9058550 -11203364 -6108058 -1233027 -186067
6114 -186067 2352997 10453025 18473696 18537772 11781825 5707360 3380883 1924335 -100595
6105 -100595 -898119 -1071654 -4588519 -12392484 -19759232 -21888765 -18660073 -12645935 -5973528
6096 -5973528 -530344 2204600 3410025 6101345 10227884 11423088 7040414 1198172
6088 1198172 848415 7597383 15705001 18210004 13705865 6798628 2415700 328381
6080 328381 -3515653 -9901349 -13156090 -7991344 1944586 6712474 1748009 -7062175
6072 -7062175 -11063704 -7626599 379827 9362887 15930332 16926072 13270667 11458946
6064 11458946 16366097 23961834 26166931 22079472 18542650 18966593 17949441 10143529
6056 10143529 -643467 -6130672 -4502500 -1424178 -1072313 -1197727 1952553 7772324
6048 7772324 12397654 13154905 9853223 3557126 -3459854 -7601902 -6567789 -2333305
6040 -2333305 513649 -50698 -1767264 -2255595 -2691861 -5325989 -8826917 -9188175 -5474731
6031 -5474731 -1878852 -2704648 -7298671 -11686755 -13624902 -13736034 -12717567 -10448096 -8084871
6022 -8084871 -8094580 -10656927 -12050763 -8757232 -2253198 2353213 2307636 -26767 -860099
6013 -860099 160508 141290 -2507422 -5265906 -4179513 1099548 6183478 6517772 2307875
6004 2307875 -2236900 -4128941 -4342568 -4978397 -5707653 -4761324 -2410530 -1273089 -3011325
5995 -3011325 -6417640 -9419244 -11752219 -14661093 -18515013 -21717232 -22190817 -19555770
5987 -19555770 -15314708 -10610988 -4553945 3679547 11027109 11442704 2805712 -8734984
5979 -8734984 -14493114 -12826017 -9617550 -9119513 -8639596 -4407518 1150935 2008964 -3241968
5970 -3241968 -9459553 -10842602 -6156330 1200187 5693993 3136345 -5055891 -11468449
5962 -11468449 -10060852 -3883283 -1475184 -5068780 -7233671 -1559325 7965027 12556643
5954 12556643 10610474 8627164 10829326 13127969 9283696 -195951 -7963985 -7634954
5946 -7634954 -34634 8151283 11139586 9220157 7182056 8136524 10405305 11096038 10588676
5937 10588676 11073226 11870656 9716645 4330699 591414 3064257 9985868 14849969
5929 14849969 13320753 6850239 2068 -3681767 -3008595 1132055 5564477 5818707
5921 5818707 -16091 -8334574 -13223281 -13314066 -13016580 -15508735 -17394194 -13577832 -5375350
5912 -5375350 945492 3162177 5091590 8293784 7765297 -12635 -9231188 -10806755
5904 -10806755 -4323104 1698976 1021430 -3899473 -7132686 -6162187 -2200427 2309548
5896 2309548 4399131 1823264 -4062651 -8506985 -8083757 -3885699 601269 2850603
5888 2850603 2014012 -1219270 -4462259 -5454295 -4648979 -3548528 -412596 8292990 20750957
5879 20750957 28662317 26514284 18479239 12373045 9954027 7878999 5633292 6239539
5871 6239539 9383431 9941612 5230973 -777587 -3005115 -1736293 -824702 -1848518 -3076022
5862 -3076022 -3003122 -2135958 -1560813 -1902992 -3745323 -7199250 -10608644 -11323281 -8777389
5853 -8777389 -5675143 -4801850 -5444952 -4790187 -2537993 -1513551 -2819253 -3339222 -547583
5844 -547583 2664118 1762170 -2405565 -5181778 -6118080 -9412394 -15126264 -16729360 -11315875
5835 -11315875 -6296346 -9743054 -18195812 -21395553 -16877893 -11847316 -10745340 -9112902
5827 -9112902 -2058769 8062571 16042963 20517169 22297744 20599897 15649963 11712056
5819 11712056 12421128 14965467 13495809 7135141 350500 -3778067 -6192005 -7797181
5811 -7797181 -7254571 -4134376 -864933 177036 -904987 -3254746 -6676600 -9476357
5803 -9476357 -7776325 -432898 6869902 6773874 105623 -3425237 3060045 14004171
5795 14004171 17544147 10429513 2365779 4148160 15199639 25665063 28203114 23986325
5787 23986325 18388613 15003853 14432241 15606012 16898738 17819638 20248012 26088141
5779 26088141 33420145 37389541 35657627 30752970 26363463 23776898 22816393 23357187
5771 23357187 24207187 22958141 18873353 13823802 8723031 1721976 -7641452 -15211787
5763 -15211787 -16732425 -14031349 -12894855 -15280171 -17208969 -14804242 -9428511 -5595161
5755 -5595161 -5470538 -6595090 -4612037 1955361 9756731 14359454 15728304 17601085
5747 17601085 20864406 21302173 16499301 11254004 11517303 15309200 15155119 8561301 247796
5738 247796 -6132632 -12168672 -18744541 -21962994 -18884409 -13141050 -10512353 -11578208
5730 -11578208 -12646111 -11813931 -10232114 -8961635 -8396923 -9532726 -11867418 -11147689 -3994787
5721 -3994787 5133517 6870775 -1049355 -9108594 -7046919 3161670 9921237 6727897
5713 6727897 -535338 -2371063 2326316 6512242 5258425 1473919 951154 5349689
5705 5349689 12017505 18110646 22049471 22483531 19282434 15455608 14974393 17789533 19290025
5696 19290025 15780629 8749607 2821431 1234626 4252544 9963472 14948496 15733461
5688 15733461 11760044 6388022 3387245 2863887 1958367 -961664 -4384622 -5975197
5680 -5975197 -5529504 -4902652 -5159200 -4350441 702988 9452034 15697813 13248117 3527057
5671 3527057 -5437721 -8466743 -8193046 -8577994 -7548176 -905413 8496892 11726072 5214786
5662 5214786 -3502422 -4347073 3770791 12841773 15512724 12068229 8179386 8207017 11432052
5653 11432052 13741284 12286617 8468021 6110740 6803629 8143340 7312729 5201377
5645 5201377 5143859 7709626 8913530 5030579 -1961823 -5874924 -3415910 2174063 5653741
5636 5653741 6078189 6323945 7594578 8000373 7177704 8509317 14025709 19497345 18249100
5627 18249100 9287269 -1413061 -7736967 -8831074 -7390245 -5427199 -3156166 -306887
5619 -306887 2843538 4929890 3760981 -1290447 -6885979 -7973505 -3484417 2409058
5611 2409058 6123064 9150117 14060503 18227963 15902760 6490146 -3590467 -9134134
5603 -9134134 -12667515 -19347517 -27603429 -29894334 -23506127 -15919878 -15907783 -21760583 -23014309
5594 -23014309 -13746062 425507 10231790 13345976 13458275 11972352 6413647 -3002947
5586 -3002947 -10824906 -12897747 -11794795 -12558706 -15361149 -15882492 -11935334 -6352184 -3127555
5577 -3127555 -3167039 -4341089 -3907512 -489433 4657326 7874765 6223795 1082520 -2763997
5568 -2763997 -2418198 -22974 138742 -3688093 -9985111 -16202813 -19749148 -17969774 -10238311
5559 -10238311 -491479 5083530 4419784 1760277 1893577 4137363 4445813 1784250 -1277313
5550 -1277313 -3851729 -8169670 -14300300 -17537674 -14254239 -7717814 -4334620 -5560600
5542 -5560600 -7358760 -6979823 -6099658 -6573638 -6836358 -4503210 -411206 1767947 -801509
5533 -801509 -7118209 -11958693 -9471557 84668 7790417 4427173 -7717615 -15930340
5525 -15930340 -12321922 -3600672 -1533174 -7092946 -9903939 -2508523 10545327 19145790
5517 19145790 18830334 13195916 7827258 4697263 2057269 -1873317 -5842645 -6710132
5509 -6710132 -4086345 -2639553 -7729757 -18653013 -27988743 -28362327 -19054709 -6010748
5501 -6010748 3436770 5874787 3552237 1675542 3182835 5786517 4872915 -554412
5493 -554412 -5842159 -5220985 2141810 11357620 17221373 19770278 23265376 29356895 33437809
5484 33437809 30383537 22662691 18469265 20970182 23862528 20237007 11996430 6463139
5476 6463139 6314559 7566111 6194769 2210714 -2378019 -5496571 -4935875 -121899 5809079
5467 5809079 8801130 8431097 6584640 2803667 -4528479 -12841311 -16407159 -13549497
5459 -13549497 -8479817 -5363689 -4914824 -6996665 -11182958 -13982020 -11430445 -5803833
5451 -5803833 -3462206 -4459889 -2039317 4337564 4309500 -8565315 -24699116 -29675142
5443 -29675142 -22446663 -13461322 -8546268 -4681964 -104616 1803226 -75545 -1954361
5435 -1954361 -2261725 -4323535 -9356677 -12973586 -11638154 -7490675 -3888788 -584574
5427 -584574 3843728 8454632 11384760 11971381 9971961 5728377 1931647 1632323 3928047
5418 3928047 5667854 7406707 12062018 17150682 15760524 8022105 4017278 10070213
5410 10070213 18503095 17775894 8189879 52725 -854066 1752156 3081321 3249853 3970959
5401 3970959 5172417 6750776 9665298 13741559 17212707 19182867 20128847 19923703 17846895
5392 17846895 14218890 9543451 3036653 -4852167 -9815980 -8030003 -2665773 -1135755
5384 -1135755 -5290040 -9408540 -9428900 -8886833 -12392818 -17368609 -16903880 -8998172 1077490
5375 1077490 7122377 7698083 5542312 3662963 2605516 633824 -3436900 -7478991
5367 -7478991 -7380109 -1887443 5454443 10585294 13585849 16989437 20579649 20654231 14682509
5358 14682509 4582726 -5158466 -10911113 -10996801 -5582463 2739761 9414177 11088251
5350 11088251 8442778 4618189 1028435 -3440671 -8630426 -10818174 -6423647 2865476
5342 2865476 11053335 14095706 13257875 11845731 10801302 8886624 5586972 1932650
5334 1932650 -929207 -2571367 -3125996 -3233205 -3376253 -2352324 2216799 10093041 16386413
5325 16386413 16041620 10193545 5210454 4638807 4884169 979033 -5309044 -6575955 531584
5316 531584 9576902 10822804 2703313 -6115902 -7173639 -1975269 1514528 323303
5308 323303 -244392 4612426 11898423 15206240 12888428 8006354 2751579 -2190118 -4012156
5299 -4012156 744533 10152540 17253478 18694352 19152588 24250422 32081077 35425482
5291 35425482 30761072 21529128 13227533 8856949 9456326 15335757 24374088 31087395
5283 31087395 30533836 23373701 14945463 8574892 1814068 -8855750 -21084341 -27554479
5275 -27554479 -24160626 -14602268 -5840765 -1524129 -1277425 -3424681 -5472144 -4138906
5267 -4138906 1256553 6328300 6072296 1407786 -2030073 -1339243 979470 1923389 1778011
5258 1778011 2140972 3516433 5897800 8636070 8952696 4220802 -3048415 -6426029 -3652778
5249 -3652778 398849 1165400 491619 1761325 3072774 530043 -4160620 -5203796 -1132417
5240 -1132417 3548869 5476858 6502173 9489226 13977351 17751177 19736824 19596941
5232 19596941 16903753 12530671 8926509 7174066 5218960 787544 -4968579 -8493091
5224 -8493091 -7982106 -4938581 -1591793 1794307 6277823 11698504 16133623 18271163
5216 18271163 19170488 20402966 21055158 18329729 11168727 1590393 -7669503 -14819148
5208 -14819148 -18180986 -16648898 -12236598 -9380676 -9855306 -10897413 -10187741 -9442731 -10260175
5199 -10260175 -9929730 -5701194 -470900 949378 -706624 -1091007 -175226 -1620986 -4620114
5190 -4620114 -3905805 673751 2187655 -2635089 -7741085 -7266509 -4218993 -3887203 -4366503
5181 -4366503 -1026131 3855872 4379037 1529932 1559324 4562320 3818395 -2142566 -5722443
5172 -5722443 -2045146 3105939 2233056 -3117622 -6564400 -7158934 -8563001 -10808214 -10072592
5163 -10072592 -5970976 -2671712 -2145487 -1747496 167315 1066275 -1089186 -3715258 -2860530
5154 -2860530 1689321 6738720 9509154 9534945 8026865 6374089 4137629 -1446686 -11691946
5145 -11691946 -22098910 -25147275 -18723841 -8581459 -834215 4341299 9117953 12286639
5137 12286639 11479122 8356193 6662954 6700137 6460479 6821864 10130305 14308546 14637436
5128 14637436 12108146 13482504 20648590 25950033 22004600 11352089 1906699 -3004576
5120 -3004576 -4876294 -3882206 899965 6588260 8384331 6706994 6783251 9968372 10747891
5111 10747891 4707811 -4873624 -11566876 -13780987 -14683994 -16104275 -16303821 -13578576
5103 -13578576 -9104993 -5273277 -2662686 285182 4835038 9849643 12839901 13316008
5095 13316008 13692933 15265129 14604775 7359010 -4002401 -10193998 -5491957 4552573
5087 4552573 9259392 5249640 -1058783 -2901307 -794936 517749 -1099222 -4213858
5079 -4213858 -7299766 -9833318 -10900319 -9773225 -7731666 -6720051 -6162331 -3704016
5071 -3704016 641477 3970008 4781117 4500317 3230811 -2182661 -12424315 -20879800
5063 -20879800 -19412139 -8425088 2996495 7292404 5253698 2293803 1774205 3647730
5055 3647730 6815725 10637834 15185876 20550151 24711969 23198760 14058918 2646551
5047 2646551 -2872939 -1281338 1052223 246678 35235 4323459 10303671 13175594 13030846
5038 13030846 12270987 10476127 7428690 7465183 14230994 23655879 28776740 29440895 30185424
5029 30185424 30423606 25316657 16220451 11113685 12593915 13869891 10053804 5604547
5021 5604547 5842686 8086101 7313707 4973702 4970912 4741166 -1810681 -13722173 -22241034
5012 -22241034 -21302617 -13829525 -6856450 -4232883 -4818452 -4721023 -720994 5972150 9261972
5003 9261972 4165529 -6438258 -13707010 -12189619 -5149038 185279 768747 63946
4995 63946 3387537 11976204 21458827 26024188 24120035 19480440 16400158 15322622 13934474
4986 13934474 11062479 7682611 4910782 2973727 2053225 2543817 4223059 6209774
4978 6209774 7981251 9881567 12667566 16820523 21896388 26362744 28750239 29007155
4970 29007155 27602715 23391722 14582708 2889119 -5486159 -5261986 2458444 11898315
4962 11898315 18812815 22999844 25450845 25741591 22905760 17102902 9464723 1309868
4954 1309868 -5751840 -9856320 -10242609 -8603982 -8164425 -10586243 -13800719 -13651014 -8170673
4945 -8170673 221316 7219463 10624278 11059447 9628625 6714524 3356845 2046635
4937 2046635 4555651 9130009 11200922 8069948 2661367 939694 4815472 9747950
4929 9747950 11522651 12950201 19447464 29296752 34409061 31502980 26082874 23295482
4921 23295482 21885845 20722237 23410380 30296883 33271694 26990459 19368520 21045385
4913 21045385 28802606 30275097 22354863 13729619 10555010 10669870 11426441 12392325 10681909
4904 10681909 4559960 941452 7511322 18568268 22346427 21301278 28511445 43166343
4896 43166343 48856082 40496197 33043904 36176301 40311537 37711328 37451152 46557799
4888 46557799 55275009 55761320 57028171 65336833 68790919 59816895 53702011 63851738
4880 63851738 78152188 83034241 89312336 106866162 119366058 120676742 147129168 217350510
4872 217350510 258956490 170689423 -32240778 -206091917 -241742760 -180635340 -130458093
4865 -130458093 -123265458 -115167446 -85004668 -59976651 -54524629 -48625616 -33775658 -30492222
4857 -30492222 -47311829 -61742443 -56721886 -44756811 -41604577 -42426248 -38329063 -34088960
4849 -34088960 -34933502 -33861578 -25391457 -17087188 -16219430 -18149156 -17403009 -17550732 -21225334
4840 -21225334 -22376765 -17015418 -10849353 -8900177 -8132609 -6782769 -9760930 -18118579
4832 -18118579 -24178266 -23694470 -22002513 -22181217 -19047371 -11400832 -7451125 -10287179
4824 -10287179 -10937015 -4925322 -2492477 -11307184 -21722339 -22433451 -19527209 -24859126
4816 -24859126 -34579938 -35670342 -27655196 -21301343 -19426882 -15219189 -8356197 -7359301
4808 -7359301 -14549328 -21770994 -23342059 -22095331 -20441606 -16019641 -9126105 -5003257
4800 -5003257 -5280722 -5148144 -2238937 -990386 -4798951 -10332137 -13176116 -13784146 -14581434
4791 -14581434 -15522608 -15139211 -12530336 -7073553 126483 4329881 1618427 -4342344
4783 -4342344 -5636115 -1184636 1567723 -2086802 -7462119 -8311964 -5669356 -4323857
4775 -4323857 -4547870 -2471575 2986383 7449931 5107642 -5965068 -21309301 -32554459
4767 -32554459 -34755984 -31466428 -29371373 -28315749 -22156990 -10631943 -3050841 -5375433
4759 -5375433 -9786943 -4806393 7469030 13074805 5203272 -6708603 -9787735 -3116009
4751 -3116009 4235416 5858681 2826857 -1762490 -6604633 -10051958 -9475681 -4976924
4743 -4976924 -104893 3494691 8807924 17521355 24222030 21566765 10678348 1334413
4735 1334413 327466 3577114 2322772 -5588947 -13666360 -14781160 -8589868 -1127894
4727 -1127894 1411871 -1581615 -5043691 -4189612 -299418 914108 -3417979 -10151240
4719 -10151240 -14888085 -16872759 -17243922 -15248033 -9408121 -1012872 6675842 11993270
4711 11993270 14905268 14165507 7838029 -2652943 -11773742 -14960906 -13382591 -12448863
4703 -12448863 -16073063 -23172065 -29548758 -32358523 -32180091 -31039460 -29614821 -27152644
4695 -27152644 -23243785 -18567873 -14586989 -13408320 -16356924 -20910605 -21229106 -15087656
4687 -15087656 -8462499 -8423445 -12413146 -10799877 -970455 7795107 6422097 -3001172
4679 -3001172 -12494725 -18917211 -23720731 -26025853 -22782125 -14653845 -6594208 -2963773
4671 -2963773 -5095007 -11505273 -17036773 -14921793 -4589537 5186128 6210654 1389716
4663 1389716 -683312 878717 -896666 -8211759 -14068063 -12443579 -6165974 -1725679
4655 -1725679 -1270390 -2449711 -2289035 825478 5760210 8405284 6449566 4052685 6434407
4646 6434407 9916951 4728342 -10139918 -22558455 -22283073 -13926497 -9025306 -10288441
4638 -10288441 -11013704 -7246023 -2592394 -736991 265139 3629495 7576905 6826481
4630 6826481 -139956 -7444932 -7260409 753907 7813890 6363174 -53283 -1810366
4622 -1810366 3176143 7432103 6339086 4834580 7872220 11233559 8248567 805754
4614 805754 -3617710 -3067958 -2165924 -3639293 -5602032 -6625378 -6981985 -4692368 3340056
4605 3340056 15105202 23875351 26165706 24385144 20629049 13735428 4765880 -508186
4597 -508186 1348226 6206336 8364000 8100930 8658245 8891969 4810937 -2869812 -8644929
4588 -8644929 -10218320 -11518975 -16097354 -21709781 -23924789 -21839444 -17250606 -10744010
4580 -10744010 -2402100 4925133 7284994 4979762 2846220 4072141 6581460 6956661
4572 6956661 5061716 2641438 152841 -1805339 -304071 6054675 12005672 9725743
4564 9725743 -706365 -9673599 -9438565 -3508004 -1286063 -6256747 -13594717 -17902502
4556 -17902502 -18719690 -18107788 -16617181 -13262414 -7429210 424343 8595208 13930731
4548 13930731 13266096 6232269 -3960039 -13101445 -18855962 -21053486 -20396915 -17846243
4540 -17846243 -14717244 -12223961 -10534149 -8726594 -6108743 -3267758 -1033402 1542755
4532 1542755 6689763 14338818 20363524 20445070 15180634 9101830 4796391 732126 -4613441
4523 -4613441 -9602446 -12119248 -12979510 -14605230 -18051915 -22992217 -28478748 -31712130
4515 -31712130 -28653519 -19092371 -9238703 -5534745 -6990786 -7505247 -4972956 -3494218
4507 -3494218 -6222756 -10857425 -14069789 -16229189 -18806587 -20227142 -17890279 -12498792
4499 -12498792 -6900337 -1610833 5083608 12722990 17671505 17450031 13696855 9666988
4491 9666988 6684545 4364720 2561228 1165035 -797751 -3451166 -3995806 651869
4483 651869 8337368 11743892 6508584 -2334071 -5140744 1312447 10523604 14626308
4475 14626308 13132592 11400584 12508524 13704290 10806793 3793677 -2965288 -5142225
4467 -5142225 -2523713 965384 1109218 -2458429 -5892884 -4974267 892784 8471128 13885660
4458 13885660 15742737 15589079 15709398 16328327 15080733 9718496 1089765 -7407246 -13059041
4449 -13059041 -15249219 -13832653 -8260884 471140 8477565 11478378 8714287 3584645
4441 3584645 233040 -450026 -1456587 -5685383 -10975185 -10879431 -2535939 7724477 10409301
4432 10409301 4496352 -1145127 874715 8045293 13247050 13952891 12005483 7879501
4424 7879501 1061205 -5336462 -6586468 -3756922 -3867479 -10535674 -18395316 -19519046
4416 -19519046 -12625032 -3018305 4678198 10299535 14966254 17320334 14711203 7175216
4408 7175216 -1519486 -7316534 -9350316 -9037712 -6708672 -1352892 6078084 11619434
4400 11619434 12105689 8563872 4417458 1619459 -194200 -2266106 -5908872 -11545804
4392 -11545804 -17039566 -18846804 -16598640 -14236437 -14170304 -12900527 -6139606 3604848
4384 3604848 9067254 7215790 1986572 -1837677 -3261578 -3101994 -1479382 1305658
4376 1305658 4297845 7165934 9358718 8084320 1025293 -8257417 -12069571 -7766795
4368 -7766795 -1489778 -305593 -3956124 -7310698 -8002077 -7806374 -8159720 -8264557 -7466787
4359 -7466787 -6491298 -5749269 -4355623 -1655201 1074473 1061414 -3432468 -10512052 -15155098
4350 -15155098 -13803510 -8402343 -4272004 -4031889 -5604161 -6188348 -5466494 -4040239 -1387112
4341 -1387112 3004122 8226672 12769823 15054908 12917043 5567528 -2929285 -5827179
4333 -5827179 -1706352 2887592 1711720 -3366657 -6581093 -7369116 -9920603 -14944604
4325 -14944604 -18014034 -17114132 -16333328 -19219005 -22578879 -20837705 -14258608 -8738650
4317 -8738650 -8210085 -10896563 -13150907 -13434017 -11419768 -6517112 305999 5543867 6989090
4308 6989090 7191685 9952183 14217966 15016480 10234201 2574533 -5461912 -13760430 -20264121
4299 -20264121 -19887851 -11603727 -2541163 -332739 -4188224 -8043252 -9575262 -10559500
4291 -10559500 -10656268 -7551961 -2652436 -253658 -697182 -107289 2538055 3739567 1646530
4282 1646530 -1584846 -4214973 -5914474 -3999803 4168430 13588507 14315374 4786310
4274 4786310 -5220588 -8810036 -10947906 -17450958 -23041019 -19008369 -7381129 1898848
4266 1898848 4955428 6331948 9000932 10535684 9276864 6914117 3916685 -1611032
4258 -1611032 -9394785 -16189166 -20108388 -21284097 -18281822 -9213537 2547689 8650748
4250 8650748 3868227 -8897984 -22313603 -30296579 -30063145 -22644314 -12919904 -6486418
4242 -6486418 -5008904 -5644816 -4651613 -301146 6192238 10528249 8045394 -807465 -9940758
4233 -9940758 -15254395 -19326862 -24391415 -25044873 -15299708 -673024 5492408 -1269535
4225 -1269535 -10924150 -12242580 -5599291 398731 101989 -4721065 -8400662 -6643672
4217 -6643672 -96043 6302184 8890076 9103164 9122276 6342450 -2333412 -12094131 -13136395
4208 -13136395 -3053892 9485462 14852853 11320778 3259482 -3748170 -4868066 951706
4200 951706 7961984 8584446 2563393 -3823788 -7536335 -10848910 -13425846 -11173541 -5372877
4191 -5372877 -3860269 -8873177 -12109801 -7066796 1618142 7004521 10167954 14453161
4183 14453161 16467978 11441267 2539880 -3447868 -5747218 -7380318 -7518958 -4062140
4175 -4062140 -117161 439976 701288 5414023 10615686 7848138 -2528029 -11096824
4167 -11096824 -12134293 -8459188 -3650498 2408049 9027888 12540456 10294723 2719117
4159 2719117 -7658746 -15205123 -12946314 -1841075 5929480 1195430 -9279929 -14127581
4151 -14127581 -15695204 -22534363 -28657328 -21242649 -10028181 -24194433 -68759383 -105658045
4143 -105658045 -97038121 -53171409 -16677989 -8524899 -12385646 -8885831 -940388 584341
4135 584341 -2854171 -2527090 3310227 9849356 13698209 13406815 7595319 -1480770 -7034517
4126 -7034517 -5371825 -500422 2582343 4585217 7989073 11252119 11700468 10341645
4118 10341645 9392731 8730301 8921522 13346824 22137653 28268721 25901258 19029222 14990980
4109 14990980 12784773 6322151 -2758701 -5614735 -291040 4595460 3406963 1739634
4101 1739634 6080621 12931866 15016241 12627481 11297197 11878936 10443029 6019051
4093 6019051 1674992 -952351 -2222977 -839928 4245317 9293933 9652356 7575358
4085 7575358 9106911 13036390 10949402 217601 -10860189 -14448529 -12805604 -12018630
4077 -12018630 -12304044 -10230290 -5827652 -1417494 3136303 8116495 9812513 4942199
4069 4942199 -2467505 -4599046 215915 5860002 6258061 632686 -8283283 -16839970
4061 -16839970 -21433869 -20749861 -17254018 -13997753 -11094382 -7833818 -5671653 -5215303
4053 -5215303 -2947996 4002443 12055598 15693293 15667788 16365645 17000496 13248935 6736946
4044 6736946 3914395 4635264 1302477 -7824374 -13836564 -10603384 -4617916 -4733137 -8799203
4035 -8799203 -8357049 -1826158 5242129 10052092 14431979 17969499 16945784 10777447
4027 10777447 3601918 -1444798 -4667874 -6063043 -4288267 -758906 -3072 -3418469
4019 -3418469 -6170570 -3296465 3179777 6173971 1983131 -5413636 -8938689 -6079327
4011 -6079327 -857976 1754897 1821769 3347662 8325275 14545910 19105389 20634135 17344770
4002 17344770 7273730 -6655614 -15466222 -12543448 -1720546 6935877 8431046 6193188
3994 6193188 4974701 5061583 4623640 3999881 5073615 8019811 10834410 11846969 11488545
3985 11488545 11201532 11066973 9474388 5707421 1645751 -779429 -2632710 -5592401
3977 -5592401 -7434740 -4372809 1729903 4028294 796117 -914591 4189954 10845403
3969 10845403 10897806 5447124 1965207 2189673 1466586 -777688 711933 6480157 8841101
3960 8841101 3291154 -3367533 -2080649 5852544 11394106 10532074 8467109 11266712
3952 11266712 17913588 21934141 18714491 10345477 4074144 5842656 14743331 24223879
3944 24223879 28632569 27174280 21664757 13388958 3793797 -4177640 -8290210 -9959941
3936 -9959941 -13010124 -19331592 -26475697 -29368356 -24580443 -14119880 -5004005 -3296753
3928 -3296753 -8048137 -12706728 -12698939 -9462955 -6783502 -6303646 -8049586 -12175741 -17514752
3919 -17514752 -20623922 -19245672 -15362613 -12200786 -9578297 -5281845 -157803 1743380
3911 1743380 -1505569 -7173484 -11605171 -14077622 -15532846 -15418958 -12038715 -5630631
3903 -5630631 710874 3833449 3551966 2400454 2861911 5498765 9351633 12697659 12965091
3894 12965091 7750485 -2095421 -11194853 -13880364 -10084552 -5253245 -4096250 -6290214
3886 -6290214 -8788202 -9997436 -10223879 -9905443 -9595143 -10888835 -15307485 -22004288 -27603903
3877 -27603903 -28678520 -24363187 -16920321 -9736796 -4178772 1325411 8148068 14066816
3869 14066816 15059815 10601643 4772142 1181159 -921984 -3995600 -7819812 -10108647
3861 -10108647 -10334439 -10511361 -12378019 -15695144 -19526863 -23609347 -27501197 -28989940
3853 -28989940 -24789156 -14218744 -2095113 4373024 3407726 1526773 5609743 13460177
3845 13460177 16531084 11874667 6261959 6759921 12039173 16089416 16510537 15097076
3837 15097076 13122438 10424569 7480579 4576294 263720 -6036896 -11573635 -13914581
3829 -13914581 -15194472 -18594216 -22269619 -21708920 -17225780 -13697760 -12657025 -10066128
3821 -10066128 -3395154 3835349 6865640 5528075 3111386 2169754 3192302 4918328
3813 4918328 4597178 553701 -4220082 -3864081 3337446 12211474 16382364 14303572 8681803
3804 8681803 3167579 1251851 4960081 12017279 16956473 17396273 16517027 17121091 16918135
3795 16918135 13319988 9429757 9979069 13179517 12404416 5854312 -815486 -2580641
3787 -2580641 -972606 204369 1029026 3939600 8399216 10893667 10004623 8582461 9826794
3778 9826794 12862233 14050756 12649689 13130758 19813222 29793645 34234200 28015599
3770 28015599 15655767 5547387 728507 -1308754 -1691390 1525854 7487640 10327897
3762 10327897 6200414 -678806 -3088971 -468373 652866 -3907490 -9970173 -10500186
3754 -10500186 -4777000 998446 1897302 91543 970801 5331555 8349311 6531516
3746 6531516 2915949 3278759 8424065 12724128 10544684 2424464 -5708597 -8385848
3738 -8385848 -5249442 -815050 -8489 -3243039 -5822424 -3013405 4445124 11033751
3730 11033751 12414181 8968999 3356206 -2886000 -8953171 -13354138 -15324342 -16282436
3722 -16282436 -17301695 -16218469 -10457586 -2273278 2832618 3905178 6702706 15579874
3714 15579874 26681815 33010020 33651299 32952504 31902817 26822333 18009632 13418308
3706 13418308 19409769 31641895 39897813 39752230 34986142 30290353 26821909 24426486
3698 24426486 22895425 20238615 14399473 7848614 5924112 9041703 11292800 9164576
3690 9164576 6835617 9145966 13495511 13525437 8085179 1752385 -1657215 -1619192 1295397
3681 1295397 5414302 7003997 4025444 -44411 -665425 732500 -528347 -3602129
3673 -3602129 -2481710 4480711 11782070 14677960 13595665 9155825 3446 -11153238
3665 -11153238 -16327241 -12038629 -4755504 -1492996 -422716 3249973 7464463 7184031
3657 7184031 4422175 5804418 11768244 16309973 16764490 15779532 13478075 6179749 -5145592
3648 -5145592 -12918187 -12705451 -8663269 -6005703 -3992122 -167735 3992915 6341868
3640 6341868 8504268 12242596 14907457 13290365 9278748 7195199 7718867 8521801 8859896
3631 8859896 9564817 10277334 10250585 9921350 8425510 2482486 -7942065 -15844290 -14701237
3622 -14701237 -7912052 -4690902 -7559287 -10379893 -8842620 -5924578 -4925999 -3326885
3614 -3326885 2565570 10915909 16372685 16732884 14538580 13086983 12888385 11750491 7889004
3605 7889004 3412549 3369783 9066442 13950374 10273430 -667179 -9724662 -11646183
3597 -11646183 -10242682 -10487331 -11487927 -10669538 -9550331 -10273400 -10048161 -4648419 4488449
3588 4488449 11828378 15444235 18379373 22455518 25153144 23698577 19076741 14611417
3580 14611417 12451081 12394813 12924501 12649125 11152297 8629703 5203606 1700746 383640
3571 383640 2268253 3796676 -246 -7939576 -12695763 -10681720 -7221125 -8193227 -11243876
3562 -11243876 -10634046 -6738521 -3819496 -1140501 5621833 15012705 20219583 19722248
3554 19722248 19401450 21653214 20228764 10190337 -3468428 -12528755 -16037606 -18416873
3546 -18416873 -20656627 -19451786 -13437666 -5046652 3336609 11173490 18144822 23673210
3538 23673210 27327855 27505166 21635722 10694983 1410926 53294 5321399 11158733
3530 11158733 15043243 18669105 21283913 18435647 9014958 -1334586 -6667229 -7303990
3522 -7303990 -7236322 -7751306 -7034912 -4699436 -3319593 -5252773 -9930384 -14649166 -16876658
3513 -16876658 -15777589 -12623513 -9907351 -9144668 -9210927 -7513369 -3155079 1761038 4706259
3504 4706259 6062458 8491411 12735786 15841983 15110563 12475053 12275870 14854680 15520568
3495 15520568 11204482 5401458 3927121 7279336 10214299 8847250 5655023 6215332
3487 6215332 11937112 17386746 15795334 7411114 708019 3001545 10797818 13411948
3479 13411948 6934293 -202667 1333177 9168960 13461315 11133765 9081370 13035074
3471 13035074 19690431 22261467 18903159 12472016 5805141 915777 -89386 2444161
3463 2444161 3930456 546946 -4635266 -4761540 1077133 5265593 831539 -9660163
3455 -9660163 -17170004 -16609251 -11218575 -7016599 -6132076 -6699949 -6613557 -4980751 -1395021
3446 -1395021 3353338 6273465 4750463 414169 -2375478 -2669307 -4474180 -10470719
3438 -10470719 -17192502 -19315812 -16581670 -13100385 -11234945 -9971517 -8829597 -9337400
3430 -9337400 -11694828 -13047282 -10559096 -4425445 2843677 8246686 8935933 3493398
3422 3493398 -5877429 -13787740 -15781779 -11854497 -5811649 -1903080 -1885938 -4153492 -5447565
3413 -5447565 -3975618 -638211 2810848 5179646 4768622 -340944 -8614904 -14202933
3405 -14202933 -13182127 -8966656 -7975182 -11608178 -16400120 -20022362 -21971800 -20075007
3397 -20075007 -12945689 -5542907 -5178241 -11161647 -15534257 -15494319 -17258540 -24915045 -33767262
3388 -33767262 -39128500 -43385720 -47993716 -46363168 -33622539 -17768130 -10979724 -12953333
3380 -12953333 -12808201 -6057491 423810 979865 -766399 614717 4148748 5637817
3372 5637817 4250990 2582076 3079915 6229292 9942019 10585164 7476721 5477299 9116940
3363 9116940 15199318 16299529 11018734 5165535 2989671 3442929 5401537 9572094
3355 9572094 13617632 12362238 5695221 267374 454066 3479320 6382888 11166736
3347 11166736 18539414 22619213 17850568 7215053 -1826098 -6377851 -8375462 -9081704
3339 -9081704 -8390710 -7245665 -6238606 -3771081 807841 4809764 6386186 7875682
3331 7875682 11140037 13152620 10838535 6954668 6122988 8060596 9833257 11497272
3323 11497272 13714832 13109982 6872942 -599643 -3040376 -2210364 -4358165 -8162529
3315 -8162529 -5616825 4202581 11531816 9177042 1723646 -2397833 -1680965 -8011
3307 -8011 584054 972414 1971065 3641033 5140995 3792821 -2068067 -8230568 -7624028
3298 -7624028 -144586 6076243 6069023 4731995 7853409 12213133 10963457 5037102 2224288
3289 2224288 6456317 14014668 19841709 22443029 22405796 20424737 17592050 14784693 11528706
3280 11528706 7477977 4111075 2581819 1216513 -1893686 -5008361 -4840603 -1896660
3272 -1896660 -342502 -2602038 -6913100 -10182191 -10706852 -8240051 -3925583 -283517
3264 -283517 805578 92608 -433517 145700 2537774 8506086 18080493 26633572 28364774
3255 28364774 22576420 13655910 5452128 -1126086 -5640984 -7270850 -6640103 -4911070
3247 -4911070 -931471 6777768 14937794 17283296 13092106 9321484 11393974 15776781
3239 15776781 15443932 9707431 4138120 2318885 2401149 1947550 2001010 4575249 8617096
3230 8617096 10717842 9071212 5185619 1851560 656753 1815689 5215966 10283143
3222 10283143 15217342 18106463 19096321 19538550 18303471 11715878 -523504 -11750004
3214 -11750004 -14409263 -8757062 -1761010 2123754 4703327 8208045 10682686 9483064
3206 9483064 5449165 596406 -5328165 -12664309 -18555573 -19542513 -16153562 -11558957
3198 -11558957 -6597812 265738 8118632 12306220 9324805 983358 -7454310 -11864038
3190 -11864038 -11140126 -6118905 1308688 7970566 10208711 6857824 1483257 -251186
3182 -251186 3386370 8311023 10249008 10199889 11451081 13088584 11093365 5375366 402747
3173 402747 -1897604 -4137480 -6594538 -4868394 1753447 5931151 2256917 -3550698
3165 -3550698 -2801225 2806523 4712261 1887248 1423187 4539629 2828791 -7820993
3157 -7820993 -18759241 -19936194 -12950119 -6391019 -3633616 -2447914 -2870677 -7354896
3149 -7354896 -14114271 -17293247 -14508102 -9276679 -5355641 -2921300 -1056296 -137833
3141 -137833 -520672 -1631625 -3235434 -5400814 -7000765 -6625573 -5130446 -4856816 -6089474
3132 -6089474 -6502449 -4200126 768518 7459574 13867069 16067181 11087776 1551387
3124 1551387 -5412366 -5165824 436414 6375755 9182978 7708629 2313333 -4760104
3116 -4760104 -10011561 -11417636 -9905082 -7969573 -8130792 -12090959 -18789748 -23517597
3108 -23517597 -22252969 -17218162 -14530665 -15654962 -15364773 -9679098 -1330527 5177732
3100 5177732 9538048 13077794 14212629 11186854 6685990 4840629 5232070 4264435 1129367
3091 1129367 -1894296 -3857853 -5388165 -5358964 -1832340 3949033 8493670 10552827 11021584
3082 11021584 9650574 6382849 4441736 6279552 7461429 1625016 -8313952 -11840714
3074 -11840714 -5535857 2053166 3652007 3113328 6406470 10165174 7189510 -1488582
3066 -1488582 -8434546 -10889243 -12121610 -13551109 -13456663 -12926579 -15308453 -19014232 -18003086
3057 -18003086 -11064431 -4238589 -1816468 -812312 2809443 7832971 11409548 14526568
3049 14526568 19423657 24309116 24768107 19068948 9241705 -1655986 -10842516 -15878319
3041 -15878319 -16169399 -13891891 -11721333 -10291397 -8923079 -7527421 -6455731 -5717946
3033 -5717946 -5665140 -7278974 -10518740 -13374608 -13633514 -10842680 -6142491 -1407495 1192295
3024 1192295 528397 -1930089 -3305626 -2312983 290048 3512927 5841347 3988435 -3960844
3015 -3960844 -13741022 -17629545 -13388039 -6467576 -1952089 931623 4167017 6276440
3007 6276440 6032454 5929721 7279816 6202353 -69632 -6723247 -7378621 -3441725 -756420
2998 -756420 448344 4620750 11467941 15855532 17117863 20069642 25412223 27388379
2990 27388379 23576286 19069719 17134568 13398282 4803240 -2318835 -199977 8769490
2982 8769490 15485075 16192426 14251796 11973503 8061012 3099412 1088175 4085791
2974 4085791 9875650 15827006 20776044 22262980 16731457 4883651 -6670306 -12007310
2966 -12007310 -12157271 -12420022 -14814464 -15681046 -10911123 -2157859 3333379 -28761 -9248843
2957 -9248843 -15035117 -12307330 -6212694 -5013567 -9036938 -11227285 -8359843 -6308075
2949 -6308075 -11712729 -22201872 -28435212 -24170603 -11616925 1780386 9149033 7825396
2941 7825396 439943 -6899917 -9209535 -6214100 -1132617 3276966 6405729 8537618
2933 8537618 9776407 10056105 8747841 4509539 -2852850 -10495156 -14369211 -13351201
2925 -13351201 -9999881 -6901025 -4131097 -1086470 1298296 1917407 1650203 2001813 2283430
2916 2283430 436960 -3170647 -4760349 -877956 7773639 16678686 21021893 19024855
2908 19024855 13164088 8535327 8895289 13605380 18854901 21585050 21096879 17455121
2900 17455121 10893772 3471734 -1362677 -2663750 -3446861 -6205667 -8871328 -8000499
2892 -8000499 -4574330 -3072473 -4926344 -6336540 -3584580 2087765 6281307 6430176
2884 6430176 3882165 2171328 3800335 7625667 9397433 6427495 1488867 -242113
2876 -242113 1808068 2796094 -173904 -3134824 -396602 7454644 13896186 14193378 10109760
2867 10109760 6757919 6913946 9408312 12017603 14463631 17787238 21182371 21382178
2859 21382178 16787821 10828869 8462501 9788629 10380053 8207975 6490421 8255187
2851 8255187 11632088 12893203 11403366 9159493 7794552 8113076 9905656 10191799 5200551
2842 5200551 -3019119 -6109107 2306 7728979 6893571 -1581936 -7875962 -7529017 -5691584
2833 -5691584 -6903955 -8729340 -8007107 -6247262 -4827229 -789718 7417548 14209935
2825 14209935 12412777 2441217 -8432865 -14494371 -15728990 -15073646 -15014079 -16107849
2817 -16107849 -16386863 -13375297 -8616599 -7897694 -14048616 -21668802 -22699883 -15865693
2809 -15865693 -6950496 -1017988 1316334 441932 -4223244 -11038128 -14839372 -11961665
2801 -11961665 -5254909 -1802549 -5498848 -12673630 -15420959 -9582031 668838 7162236
2793 7162236 6669050 3573440 3022912 4461321 4377996 2622970 1814707 1851139 -208803
2784 -208803 -4578604 -7506864 -6935402 -5682582 -7102258 -10671817 -14089964 -16943456 -19328881
2775 -19328881 -18847664 -12795782 -3384540 2155021 -1876870 -13701975 -25030058 -27594552
2767 -27594552 -19300963 -5460537 5242817 6873004 170541 -8340586 -11552114 -7630495
2759 -7630495 -1424630 765413 -1770416 -3470942 671653 9400877 17488766 21566596
2751 21566596 21346659 17007852 9098434 536025 -5100054 -7831382 -10541000 -13257050
2743 -13257050 -11852342 -4286078 5060924 10048552 9770082 8283884 8849799 11090093
2735 11090093 13076930 13723663 13039521 11591734 9830131 7248316 2804102 -3213067
2727 -3213067 -8853748 -12918609 -16316098 -19760134 -21556614 -19540377 -14443533 -9655272
2719 -9655272 -7912799 -9089224 -10467610 -8562698 -2084946 6094003 11824487 15436543
2711 15436543 21622748 31393591 37598374 32737311 19177347 6656142 556722 -2080515
2703 -2080515 -5007307 -7411892 -8111699 -9444411 -12931579 -14788805 -10407502 -1495347
2695 -1495347 5370304 6567777 4425211 2785641 2819389 3711697 4888816 6223898 7098352
2686 7098352 6199956 2391916 -3802764 -9626082 -12273636 -12047387 -11501369 -10624366 -5588749
2677 -5588749 5221296 16116119 18882903 12324242 3660625 -21291 1153316 2107484
2669 2107484 -536775 -5670005 -9950478 -11293011 -10605596 -10524024 -11990434 -12722724 -10447253
2660 -10447253 -6719078 -4967741 -5090092 -3388441 1290328 4908900 3849622 316696
2652 316696 -715249 2005721 5613150 7917845 9349473 10540741 11023411 10668163 10025357
2643 10025357 8769220 5884720 1954981 -675271 -844101 -129717 -597193 -2204794 -3252679
2634 -3252679 -2451491 113189 3297427 5738710 7037790 8111425 9498562 9847665 7996525
2625 7996525 6390028 9414460 16868029 21848194 18080484 7951318 5882 -1131604
2617 -1131604 1107083 1816938 1699122 4907536 11881958 17801197 18242897 13823813 8359409
2608 8359409 4239124 1001538 -2397575 -5336869 -5826394 -2881489 1398478 2900268
2600 2900268 -18446 -3543311 -2317594 2953018 4678082 -2549344 -14322202 -21199791
2592 -21199791 -19839140 -15514060 -13954314 -15010445 -15295296 -13005486 -8302061 -2420432
2584 -2420432 1510597 140586 -5173022 -8380456 -6346643 -2906074 -2222683 -2464384 -886942
2575 -886942 -802678 -6167437 -11821689 -8007466 5104730 15870206 16267825 10836578 7278331
2566 7278331 5639814 2064000 -2793236 -5660099 -7074804 -9613207 -12177179 -11611414
2558 -11611414 -8031391 -3551013 2003741 8618194 11474666 5393696 -6688027 -15909845
2550 -15909845 -18423672 -18363736 -19356241 -19253319 -15346968 -9507336 -5228309 -3424283 -3649511
2541 -3649511 -6063357 -9818572 -12551997 -13641079 -15115655 -17481295 -17801340 -14102813
2533 -14102813 -8598245 -4122324 -383946 3537415 5948356 5177087 3202811 3101791
2525 3101791 4283646 3482413 -360460 -4745832 -6336660 -3214311 4037121 11506530
2517 11506530 14150040 11253625 7852769 8284923 10729577 11234982 10293514 10774696 11495175
2508 11495175 8865860 4540237 5072132 12268795 19165579 18429076 10996495 3649210
2500 3649210 1154107 3459387 7620764 9189718 4040099 -7284504 -17931178 -20716131
2492 -20716131 -15586540 -8786944 -5227954 -4559775 -4734526 -5879697 -8534505 -10067823
2484 -10067823 -6088291 3773962 13282363 14797707 7207302 -2922426 -8870720 -10641136
2476 -10641136 -12467972 -15301620 -15678452 -12111792 -8038628 -6104697 -3391601 3641101
2468 3641101 11919831 14602821 10745640 6993755 8221434 10970331 9202739 3386146
2460 3386146 -248193 1750362 6242170 8494095 7615881 5644437 3717004 1385004
2452 1385004 -1382484 -3630657 -4651857 -4133894 -1046207 5733899 14574768 20129490
2444 20129490 17301485 6793544 -4334416 -8747983 -5532493 -308631 1247119 -927941
2436 -927941 -2684824 -1751293 -438843 -1600304 -3756745 -2665270 2366964 6269123 3907223
2427 3907223 -3235675 -8050913 -5459055 2350472 8728904 9595389 6944366 5776820
2419 5776820 8364783 12134529 13320892 11797974 10736806 11428732 10835814 6098619 -398706
2410 -398706 -3633447 -3000168 -2961701 -5737590 -7128490 -2219500 7463032 15790887 19267342
2401 19267342 18773203 15230441 8108213 -1043255 -7744367 -9487998 -8822676 -9444180 -11420279
2392 -11420279 -12418659 -11539594 -9370095 -6120799 -2797211 -2650429 -7426782 -12528324 -10278835
2383 -10278835 676034 12608332 17090074 13344969 6415354 106589 -5067023 -9080155
2375 -9080155 -11651175 -13828031 -16626087 -17763100 -13373283 -4326856 2476952 1774013
2367 1774013 -3223249 -4752941 -134446 6020843 9121297 10037119 11337250 11655185 7879164
2358 7879164 1522173 -1877315 -510237 898723 -1558374 -4553701 -2596326 2621285
2350 2621285 3088703 -5192694 -17221989 -25520979 -27706426 -25638714 -20701555 -13229888
2342 -13229888 -4648286 2919477 8403508 11388863 11402441 9399669 8167851 8991260 9541504
2333 9541504 7417373 4022346 2285124 2367950 2653831 2982739 3218156 771858 -5381865
2324 -5381865 -9620677 -4932879 6246730 12769776 8496727 -168625 -3426223 89042
2316 89042 4412074 5161566 2806075 -349236 -1981374 -50869 4852974 8334905 6515020
2307 6515020 936336 -3125687 -2276343 2776957 8579253 10290049 4367800 -6692896
2299 -6692896 -14506699 -13649056 -8651119 -7908447 -12289456 -15233798 -13612917 -12060010 -14587133
2290 -14587133 -17414661 -14008793 -4170428 5596132 9275307 6125865 -501603 -6311440
2282 -6311440 -8297330 -6239040 -2751026 -769236 -467554 609762 3748259 6030220
2274 6030220 2668517 -6795788 -15994230 -17526268 -10869369 -2146151 3822634 7855836
2266 7855836 11971752 14794122 14305731 12055790 10960645 11017689 10742408 10868111 12607483
2257 12607483 13770900 11007471 5238147 901020 254566 1840138 3464316 2954081
2249 2954081 -2232525 -11056419 -15968308 -10145377 2559138 11236091 11787453 10296425
2241 10296425 11518732 11982392 7967461 3155103 3065337 6986443 10614701 12764112 14689130
2232 14689130 16149882 16563432 16995565 17247235 14640214 9658895 8418378 14316416 21181026
2223 21181026 20799814 14105762 8337255 5563260 1244109 -6914331 -15722057 -22085774
2215 -22085774 -25457143 -24357324 -16737076 -5126963 4008298 7830066 9737651 13234917
2207 13234917 17426876 19796362 19341479 15717330 9246167 3120189 1745964 5239644
2199 5239644 8668180 7889419 3268827 -2665687 -7515256 -8474612 -3734911 4343415 10969761
2190 10969761 14405136 15931195 14646046 7964010 -1677241 -6864254 -4555671 96383
2182 96383 1988461 2350085 3378063 2835654 -840560 -3396457 -891442 3242764 3833020
2173 3833020 3147912 7123084 14600526 17963703 13890926 6454341 -567002 -7557819
2165 -7557819 -14232338 -17555849 -16852957 -15745601 -16548989 -17164454 -15747158 -14106290 -13912197
2156 -13912197 -13479438 -11062575 -7748657 -4263211 1460464 9974284 16558150 15877883
2148 15877883 8817213 1339573 -2106875 -1164612 2788282 8125849 12914920 16298923
2140 16298923 19280146 21712634 19924470 10744420 -2732296 -12881719 -15186926 -11403733
2132 -11403733 -5549278 -257470 2646652 1859970 -1463309 -4207505 -5236697 -6554011
2124 -6554011 -9318422 -11368346 -10687724 -9230114 -10838267 -16201909 -21515128 -21776359 -15141444
2115 -15141444 -5308490 451376 -2082141 -9142189 -13428703 -13591817 -14940968 -19533560
2107 -19533560 -21390957 -15533899 -6638531 -2837568 -4682355 -7094863 -9427429 -15229964
2099 -15229964 -22784730 -24701228 -18506270 -9850674 -2951287 4264502 12085087 14348389
2091 14348389 7795525 -450435 -1872530 1698243 2648994 212721 469107 5487570
2083 5487570 10301002 10809632 8215516 4831443 843023 -3747290 -8088618 -11884112
2075 -11884112 -14638249 -14525158 -11710462 -10675786 -14026892 -16150505 -9863887 1845285
2067 1845285 8598527 7152700 4652154 6063262 7517114 5493840 3569012 4368834
2059 4368834 2596867 -6510709 -17412318 -20883519 -16859727 -13217040 -14091631 -16558542
2051 -16558542 -17769897 -18684673 -20387796 -21824978 -21814406 -19871038 -15531948 -10018863 -7131243
2042 -7131243 -8724251 -10728077 -7629006 457133 8971431 15027769 17625306 14115931
2034 14115931 3040250 -9952820 -15528798 -11149490 -3142375 2199434 4236325 4043560
2026 4043560 1010863 -4253854 -8600705 -10511419 -11525724 -11640256 -8056458 -1081191
2018 -1081191 3612634 2322691 -1088743 -1004407 1841078 2452496 -620692 -3982985 -4605666
2009 -4605666 -2754905 -739237 -1524245 -7008208 -14740593 -18173236 -13573322 -5119491
2001 -5119491 394638 2241764 4946264 10123442 14227698 14448286 11910422 8154815
1993 8154815 3222092 -1059409 -470984 6004054 13360246 16258468 14657735 10959988
1985 10959988 4908800 -4351353 -13481243 -17522556 -16719694 -15760185 -15761506 -12042003 -1789268
1976 -1789268 10295858 16957018 16096686 10858808 4787799 158610 -1127517 1115675
1968 1115675 4101183 5287246 5661466 6650761 5671111 -343316 -7756838 -8602159 -1579274
1959 -1579274 4789939 3039891 -3490710 -5712103 -708880 5619449 6553306 1496112
1951 1496112 -5066208 -9092371 -10728350 -12875783 -15963839 -15710541 -8878173 -62494
1943 -62494 2391985 -1990462 -4244902 1255539 8388340 8245653 1436352 -4356701 -5170038
1934 -5170038 -2871667 302838 2697697 1312285 -4147582 -7437972 -3219206 3694319
1926 3694319 4547661 317722 -286703 4249603 6338514 3706565 3807881 9374331 10892467
1917 10892467 923411 -13192720 -19647463 -18016612 -15641555 -14267811 -10865210 -7882628
1909 -7882628 -11227789 -18649053 -20470533 -13534312 -5892418 -4863725 -7414316 -6184912
1901 -6184912 -48249 5530240 5979133 2089028 -2131333 -4228727 -5701513 -9312354
1893 -9312354 -14084708 -15272495 -10718617 -4384918 -962053 79349 1541067 2633878
1885 2633878 898789 -2120046 -2493000 -102877 1876450 2835110 4848887 7548340 8351891
1876 8351891 7787304 9119100 12195015 12833157 8977930 2588081 -4844370 -13170618 -19491477
1867 -19491477 -19320171 -13377344 -7622599 -5082176 -3557362 -2830985 -6804447 -15222951
1859 -15222951 -20535507 -18079958 -13412785 -13673289 -16656304 -15111525 -8433367 -3263007
1851 -3263007 -4127462 -9183984 -14316015 -16876893 -16319184 -14872249 -16282398 -20700889 -22979023
1842 -22979023 -19338615 -12820473 -8184795 -4857369 -50415 4359400 4310830 639937
1834 639937 -2619584 -4879584 -7122774 -5744313 2922351 12601503 11662504 -76799
1826 -76799 -8491572 -3374369 8486984 14026660 11022445 7625891 9195529 12666673
1818 12666673 12246664 5516741 -4954742 -12705292 -12371426 -6678029 -4986203 -10973711
1810 -10973711 -15982561 -10385217 2075766 8878221 5896575 1579934 3190307 6839007
1802 6839007 4598763 -4169163 -12663128 -14353844 -7819147 3140042 11557074 12231958
1794 12231958 7267593 4495717 8358237 14878819 17639144 15491892 11422163 7027797
1786 7027797 2401927 -731604 -803749 -576841 -4550375 -11614548 -14842336 -10431361 -3304181
1777 -3304181 -1218631 -5547125 -10539721 -10552071 -5629258 -204219 1975929 1247966 1031707
1768 1031707 3606863 7136935 7795404 4839874 1998731 3029459 7363474 11420901
1760 11420901 12968297 12450052 10964323 9228651 8430754 9622452 11252547 9179138
1752 9179138 964926 -10417854 -18586840 -19426252 -14025970 -6537239 -702249 1167574
1744 1167574 -2364418 -11164212 -21832701 -28286423 -25964826 -16115499 -5169076 937462
1736 937462 1618952 379399 -472426 -2012870 -5279446 -8020228 -7197132 -3733828 -1810525
1727 -1810525 -3107618 -4696045 -3997584 -2964604 -4690384 -8006151 -9054001 -7241653
1719 -7241653 -5640154 -5395592 -3983004 -389043 1919465 -144382 -4305269 -5817064
1711 -5817064 -3459319 53900 1957440 1061988 -2702005 -7236355 -8263805 -3788611
1703 -3788611 2549753 5958250 6895086 8826100 10963778 8914512 2679444 -2143353
1695 -2143353 -2889113 -3723814 -8076953 -12605940 -12908395 -10665421 -9857247 -9257887 -4645478
1686 -4645478 3254542 8717937 8377530 3868690 -2321588 -8742398 -12804289 -11898509 -7806296
1677 -7806296 -5681146 -7354657 -9495109 -9418784 -8347474 -7280137 -4458007 24271 1430507
1668 1430507 -3373677 -9820640 -10701794 -5738986 -1095046 184854 1934630 7736387
1660 7736387 14681616 17346618 15116326 11917105 10001284 7770996 4040775 1225882
1652 1225882 2720676 8996998 17756420 26266004 31737263 31035434 23040182 11309131
1644 11309131 1972236 -1722353 -1500911 -1041487 -2655057 -6331315 -9482600 -8186526
1636 -8186526 -1941410 2849763 -995983 -11303588 -17996898 -16708578 -14592551 -18394612
1628 -18394612 -23189390 -20069498 -10415718 -3754830 -3566627 -4145230 -1142978 3638292
1620 3638292 8901905 16364168 23958876 24837340 17273061 8524774 4346765 1323667
1612 1323667 -5085930 -11282128 -11149037 -6238556 -3093098 -3496002 -4240355 -4417498 -6317163
1603 -6317163 -10238834 -14108779 -17224638 -19428945 -18415260 -13469280 -9995220 -13750029
1595 -13750029 -21622177 -24969097 -21597954 -17114288 -14290679 -9566623 -2250934 1322347
1587 1322347 -2480453 -7507175 -6450877 -1797311 -1789574 -8394988 -15458167 -17480839 -14702418
1578 -14702418 -9693661 -3906306 1214376 3255476 880704 -4650389 -10865762 -15981287
1570 -15981287 -19179846 -19997846 -17840628 -12026824 -2912193 6761643 12822425 12961049
1562 12961049 8464321 2226295 -3851807 -8926561 -12274105 -13626902 -13498059 -12134185
1554 -12134185 -9139149 -4986003 -1463728 605981 2467711 4452579 3568995 -2981596
1546 -2981596 -12366184 -17377907 -14062307 -5861131 945023 3868598 4733642 5619041 7093656
1537 7093656 9520573 12510157 12528183 5067663 -8026875 -16533497 -11853580 1839200
1529 1839200 11298178 9621505 3207376 1728041 6342504 11480531 13923748 14682141
1521 14682141 14216466 11480884 7183823 3453224 594299 -1973870 -2744542 -826010
1513 -826010 -452295 -6743970 -16878010 -21926252 -18787696 -13942943 -13324646 -15199308 -16427413
1504 -16427413 -18788126 -23525907 -25368119 -19202867 -9305008 -4654109 -6696676 -8308794
1496 -8308794 -4068148 4725800 15107079 26117747 36040824 41251281 40135548 34739733
1488 34739733 27244662 18289609 9851901 5653677 6397880 7882991 6650595 5145930
1480 5145930 8214288 15701281 21469094 19910744 11603047 1892000 -5030475 -9307000
1472 -9307000 -12365734 -12367248 -5639744 6711466 17056205 19065892 15102799 12000253
1464 12000253 10900260 6351289 -3896739 -13329122 -13946024 -6152960 2022384 4348418
1456 4348418 2051060 173221 827142 1542661 -424631 -3975183 -5587121 -4034658 -1561813
1447 -1561813 -312630 -459237 -2839079 -9563363 -18928291 -23285532 -17133508 -5684185
1439 -5684185 -91421 -4831270 -14897383 -24525793 -31930540 -34925876 -29956154 -19145276
1431 -19145276 -11630728 -12625101 -15921591 -12554669 -2862391 5656455 8895740 8190048
1423 8190048 4595327 -1542930 -6310596 -4901434 575681 2294869 -2709440 -8816307
1415 -8816307 -10690952 -10346195 -12075341 -14954946 -14843330 -11239849 -7969660 -8023018 -10642380
1406 -10642380 -12992245 -12845472 -10327743 -8141062 -8736374 -10336493 -7917840 246369
1398 246369 9212982 12662503 9709984 4332589 222939 -896552 2061158 8399879
1390 8399879 13769299 13547332 8748488 5406434 7289833 11989762 14967669 14546283 11643330
1381 11643330 7424550 3270715 1012585 987553 1105688 -476062 -3014387 -5034964 -7014212
1372 -7014212 -10258055 -14305137 -17484813 -19049891 -18744090 -15528920 -9489861 -4114589
1364 -4114589 -3181817 -5178391 -4276834 2007506 9220312 11686129 8962805 4274230 -774531
1355 -774531 -6229093 -9935875 -8183957 -1195790 5323416 6169640 2331430 -1293569 -2632927
1346 -2632927 -4424949 -9378220 -15500796 -17770813 -13930069 -7266583 -3118791 -3197564 -4170546
1337 -4170546 -1973843 3177116 6850687 5520769 873562 -1808968 573740 5895249
1329 5895249 10069149 11972306 13254039 13991430 11711071 5960109 955077 882075 4182857
1320 4182857 5612508 3063828 -901657 -3701585 -5070441 -4659588 -1586316 2469545
1312 2469545 3850449 2286036 1366595 1407369 -3016814 -14168279 -24486122 -25155070 -18515298
1303 -18515298 -14857684 -17945718 -21045121 -17944679 -10844741 -5190852 -3064406 -4893250
1295 -4893250 -12009124 -23138108 -32662726 -36858705 -38348620 -40050249 -38638186 -30086707
1287 -30086707 -19186668 -16107767 -22865941 -29415242 -25724093 -13653410 -4026097 -4526390
1279 -4526390 -13282431 -22972292 -28382293 -29413958 -28253024 -25563088 -20730669 -14958641
1271 -14958641 -11162432 -9490330 -5624344 3647817 14573593 19074279 12845362 -953726
1263 -953726 -14624903 -20308808 -14031271 54055 10572793 9290044 881360 -2485593
1255 -2485593 3255912 9759933 9245508 4990350 4366937 7250911 8421192 8219952 12498941
1246 12498941 21737588 27610409 23377925 12988435 6464388 8988688 17249460 24369488
1238 24369488 25624468 20569773 12338205 5193341 1693855 1871681 4411657 7117193
1230 7117193 6860749 2225760 -3021072 -2716051 3094262 5672978 -2359304 -16705970
1222 -16705970 -26060786 -26378653 -24978466 -29212098 -36430628 -38698400 -33735049 -26599285
1214 -26599285 -22324457 -21495225 -22771263 -25371042 -27837350 -27709712 -24459721 -20677207
1206 -20677207 -18411750 -15882291 -10036334 -1712426 4011552 3254908 -2092252 -6247595
1198 -6247595 -5765838 -2891248 -2043763 -3926735 -5305814 -4990369 -6852060 -13992883 -22020076
1189 -22020076 -22725336 -14542046 -4873754 -771860 -1790361 -4491064 -9203823 -17451419
1181 -17451419 -25823103 -28609204 -25822448 -22863152 -21686609 -17896871 -8609637 1736388
1173 1736388 6744818 5761810 2766807 400958 -978082 -355193 3150147 6848054 5906290
1164 5906290 -904433 -9643456 -16008142 -19200583 -20401849 -20171754 -18829318 -17312147
1156 -17312147 -15914429 -13545563 -9689575 -5831304 -3472773 -1918179 341331 3071756
1148 3071756 5004483 6387673 8744683 12260324 15308337 16578842 15812913 12464772
1140 12464772 6067525 -1384473 -5991021 -6529903 -6438430 -9140896 -13176917 -14733980 -13778587
1131 -13778587 -14088055 -17153314 -19734549 -18865739 -16211078 -15138304 -15680584 -15278522 -13289896
1122 -13289896 -11598384 -10768187 -8501160 -3144560 2989246 5401887 2221489 -3483513
1114 -3483513 -6323827 -3713321 1383443 3298487 -344906 -6397849 -10752756 -13569892
1106 -13569892 -17599959 -22164314 -22480468 -16256027 -7864341 -3309431 -2917901 -2210471 860167
1097 860167 3323708 2605705 1054579 2549297 6511021 8391866 5830587 1617714 -160710
1088 -160710 1145581 3032466 3229076 1271535 -2100904 -5169046 -5395578 -1453723 4682915
1079 4682915 9336429 11119202 11704923 12265174 11323351 7585006 3138383 1485693 2865846
1070 2865846 3688997 1027306 -3919379 -7740934 -9235200 -10494770 -13246477 -15173711
1062 -15173711 -11591728 -1409498 10076619 16071273 15200463 11568083 8657372 6211157
1054 6211157 3303636 727723 -1340936 -4640038 -9236281 -11689007 -10100405 -8356384
1046 -8356384 -11069352 -15928930 -15820210 -8226060 1722724 7700245 7777240 3420409 -2792838
1037 -2792838 -7397480 -7820635 -5581608 -4974895 -7707657 -11602685 -14632375 -16343593 -15126510
1028 -15126510 -9254773 -1995225 14996 -3774904 -5608331 -632217 5006664 2744271
1020 2744271 -5999581 -12477594 -12806663 -10696776 -9718849 -10003429 -12407804 -18947743 -27675862
1011 -27675862 -32992131 -33032553 -31822520 -32129042 -31068440 -25590047 -18038400 -12668420 -9646018
1002 -9646018 -6214843 -1986459 433102 -430854 -2658008 -3025468 -329398 3431149 5209160
993 5209160 4623172 4418936 5751852 4754795 -2848622 -14483483 -22125399 -21243343 -14607793
984 -14607793 -7171416 -1904045 -1337412 -7238892 -15944999 -19284161 -14011002 -6117479
976 -6117479 -2119683 -803497 1621051 3073254 -784953 -7617110 -10779440 -9494106
968 -9494106 -9382688 -12844789 -15828873 -15059097 -11876674 -7348951 -88300 8547658 13285814
959 13285814 12477520 11308046 13345824 14043036 8040926 -1015030 -4276719 625703 7484996
950 7484996 10338137 9296962 7612174 7382687 8846947 10719592 10972106 9744764 10464921
941 10464921 14820443 18245260 15316777 8831470 7304920 12472174 15774181 10197197
933 10197197 -258312 -7309705 -9618840 -11530081 -14112664 -14293176 -11611563 -9244583
925 -9244583 -7989589 -5142796 -635868 1198886 -1647305 -5025130 -4596253 -1893840 -1009752
916 -1009752 -2392709 -3907583 -5655416 -9069167 -12186449 -10518121 -3386113 3952660
908 3952660 5706930 1100158 -5723931 -9064009 -4839338 6421336 18184863 21819827
900 21819827 14255869 1151912 -8809643 -12154082 -12283713 -13963058 -17829966 -20588568
892 -20588568 -19475002 -15350769 -11064484 -7748126 -4371920 -996536 -117742 -3199821
884 -3199821 -7701646 -9881328 -9362806 -8498228 -8530864 -9592609 -13328728 -20987110 -28687482
875 -28687482 -29531014 -22264496 -13679899 -10061429 -10222795 -9960395 -9236682 -10318064 -11619841
866 -11619841 -8828925 -1283122 7194760 13241784 15718381 13475940 6438949 -740759
858 -740759 -1295504 5416067 12160940 12474163 7721333 3169316 225413 -3793045 -9674653
849 -9674653 -13760502 -11926728 -4430351 3731055 6828982 3023885 -4550813 -11201124
841 -11201124 -14499819 -14256890 -10646237 -5124569 -2142374 -5658210 -12904098 -15554816
833 -15554816 -9494682 -417130 3153815 -70646 -4518720 -6394447 -7596198 -10974802
825 -10974802 -15579695 -18306251 -18067335 -16494013 -15449709 -15306250 -15459829 -15396851 -14653074
816 -14653074 -12198365 -7114426 -621287 3641750 3065919 -498677 -2648057 -1845708 -909409
807 -909409 -2712987 -6667702 -10303373 -12094583 -11666909 -9612114 -8478940 -11281356 -16964991
798 -16964991 -19898684 -16534279 -10374889 -7274713 -7777518 -7829517 -5771121 -4309227 -5448291
789 -5448291 -7195388 -6343745 -2159505 3335454 7053720 7015614 4718957 4707238 9523984
780 9523984 15887665 18415879 16032198 11466168 5731175 -2201245 -10331165 -13486014
772 -13486014 -9878267 -3609469 1192945 4778150 8212534 9547045 6904702 2538692
764 2538692 346190 998959 2117909 1690161 -718564 -4169361 -5785356 -2451997 4370057
755 4370057 7958779 3669785 -4763197 -9452781 -7594705 -3463672 -2230453 -4718592
747 -4718592 -7670226 -6813745 -416402 8217500 13014110 11784364 8693032 7887285 7598531
738 7598531 4430250 880470 3001789 11160418 18401631 18601966 11923018 1766915
730 1766915 -8943548 -17127009 -19667686 -16681137 -11969278 -8676441 -6923635 -6376623
722 -6376623 -7691502 -10039287 -10518175 -7858109 -4145183 -1763427 -1526864 -4393620 -10749098
713 -10749098 -16501505 -14861222 -5028195 5341844 9981742 11840500 16211129 20200525
705 20200525 15990993 2921010 -10548583 -17048373 -16597791 -12252496 -5828203 -260784
697 -260784 -535640 -7861667 -15983302 -17572798 -13135405 -10297197 -14537509 -22994332 -27670569
688 -27670569 -23367484 -12256000 -1452578 3628804 3571240 2714846 3635713 5196652 5402568
679 5402568 3723789 -24801 -6665083 -15718690 -23948593 -27821652 -26771191 -22427907
671 -22427907 -15430495 -5328514 6173257 14359540 15689168 11887225 8073484 6907936
663 6907936 6221433 2904796 -2542300 -6748963 -7711440 -6479315 -5003776 -4180166 -4032479
654 -4032479 -3884574 -1974530 3130657 10033452 15194497 16686083 15270302 11513102 5115733
645 5115733 -1615252 -3687502 55840 3688990 1593287 -3592947 -5346256 -3583910
637 -3583910 -4662669 -11550865 -20056418 -25588996 -27906355 -27646118 -23945001 -18160239 -14731583
628 -14731583 -14944313 -14376074 -10206797 -6634114 -8475603 -13112990 -13997509 -9595528 -3897276
619 -3897276 -168439 992014 -504162 -3175286 -2729984 2388619 5810224 111784 -11713484
610 -11713484 -18535539 -15317379 -8274089 -4711259 -4946188 -6695226 -10024031 -13632063
602 -13632063 -12711440 -6172971 -1107955 -4156317 -12310428 -18132127 -20364295 -22559697
594 -22559697 -24149028 -21079278 -14677110 -11798700 -14577293 -16624086 -12010760 -3006389
586 -3006389 3669392 4202547 -870654 -8623709 -14755292 -16046300 -14030863 -13171727 -13792087
577 -13792087 -10775541 -1660496 8148179 11777129 9124518 4875931 1237797 -2948733
569 -2948733 -7910735 -12262785 -15466340 -17130442 -15207583 -8951359 -2395017 -284145
561 -284145 -1258995 69075 4514715 7158598 5488130 3088090 3095126 3071054 -334324
552 -334324 -5772733 -10218393 -14417771 -20737055 -27307220 -28892409 -23482180 -14707593 -7604521
543 -7604521 -4571184 -5357631 -8219831 -10544375 -10632902 -9712639 -10569864 -13668897 -16296793
534 -16296793 -16255381 -14647675 -13592788 -12464541 -8700445 -2563563 1172934 -1663137 -8651899
525 -8651899 -12589436 -9899358 -4445420 -1220975 548343 4172845 7885958 6575404
517 6575404 1087521 -989259 3549725 7676677 3831867 -5469812 -12330083 -14739835
509 -14739835 -16158118 -16369286 -11201399 -1738521 4197789 2571326 -1120804 -216477 4140198
500 4140198 6696829 6691102 7660467 10957498 14301326 15862466 15695446 13352500 7627831
491 7627831 -833561 -9232311 -15450925 -19381396 -21233060 -20244826 -15578228 -7621378 1465109
482 1465109 7919779 8280509 2764955 -3982010 -7345414 -7439639 -7472626 -8126503 -6591302
473 -6591302 -1878036 2037258 1008023 -2803274 -2592530 4209313 11350791 10366175 684474
464 684474 -9672559 -13640332 -12179741 -10216717 -8882695 -5735847 -1050772 1179571
456 1179571 -764258 -3642174 -4321029 -3960115 -4922373 -6731381 -7954229 -9510197 -12910291
447 -12910291 -17100094 -20066001 -21754574 -22245694 -19068892 -10561689 -832494 3215601
439 3215601 50024 -5101881 -7304972 -6527036 -4662918 -2255539 -51540 -277407 -3739498
430 -3739498 -7909665 -10080695 -10481071 -10264816 -8492369 -3835374 1829730 4265236 1447403
421 1447403 -4192131 -8180907 -7936736 -4665156 -1920194 -1895931 -3171046 -3073971 -1793694
412 -1793694 -1904159 -3646472 -3851076 -1150010 829471 -1545345 -5877673 -6400361 -1751957
403 -1751957 3576496 5446341 4077368 1202655 -3074803 -8554691 -12752237 -13133887 -10298801
394 -10298801 -6875477 -4343165 -2967241 -3705819 -7302150 -11612085 -12820534 -10377746
$$ [...]
##END NTUPLES=NMR SPECTRUM
##END=
