##TITLE=31Pdec_DE-128rm3
 , 24 sc
 17.2.2026
##JCAMPDX= 6.0         $$ Bruker NMR JCAMP-DX V2.0
##DATA TYPE= NMR SPECTRUM
##DATA CLASS= NTUPLES
##ORIGIN= UXNMR, Bruker Analytische Messtechnik GmbH
##OWNER= root
$$ XWIN-NMR		Version 3.5
$$ Tue Feb 17 15:45:16 2026 Russian Standard Time (UT+4h)  she@DPX200
##.OBSERVE FREQUENCY= 81.013821
##.OBSERVE NUCLEUS= ^31P
##.ACQUISITION MODE= SIMULTANEOUS
##.ACQUISITION SCHEME= undefined
##.AVERAGES= 24
##.DIGITISER RES= 17
##SPECTROMETER/DATA SYSTEM= spect
##.PULSE SEQUENCE= zgpg30
##.SOLVENT NAME= CDCl3
##.SHIFT REFERENCE= (INTERNAL, CDCl3, 0, 198.062)
##AUDIT TRAIL= $$ (NUMBER, WHEN, WHO, WHERE, WHAT)
$$ ##TITLE= Audit trail, XWIN-NMR		Version 3.5
$$ ##JCAMPDX= 5.01
$$ ##ORIGIN= Bruker BioSpin GmbH
$$ ##OWNER= she
$$ F:/spectra/data/she/nmr/P31/2/pdata/1/auditp.txt
$$ ##AUDIT TRAIL=  $$ (NUMBER, WHEN, WHO, WHERE, WHAT)
(   1,<2026-02-17 15:43:42.42 +0400>,<she>,<DPX200>,
      <created by zg, POWCHK disabled, PULCHK disabled
       configuration hash MD5:
       00 E9 B6 7A A2 85 ED C7 34 08 36 98 17 FE 4E 26
       data hash MD5: 32K
       D9 92 F1 C7 CD 33 05 59 E7 5E 84 40 A6 A5 0F CE>)
(   2,<2026-02-17 15:43:59.12 +0400>,<she>,<DPX200>,
      <Start of raw data processing
       efp BC_mod = 2 LB = 1.5 FT_mod = 6 PKNL = 1 PHC0 = 1444.345 PHC1 = -19.29932 SI = 64K 
       data hash MD5: 64K
       93 13 CC D8 83 7A 0F 28 F4 2E 8C 71 2E 33 C1 F6>)
(   3,<2026-02-17 15:44:21.45 +0400>,<she>,<DPX200>,
      <pk PHC0 = -3.221101 PHC1 = 8.400001 
       data hash MD5: 64K
       F4 2E CA BF 71 B5 F9 75 29 B7 B2 18 20 8D 5F 0F>)
(   4,<2026-02-17 15:44:29.60 +0400>,<she>,<DPX200>,
      <abs ABSG = 5 
       data hash MD5: 64K
       FD 70 B6 28 C5 88 12 89 3B D1 BE DD 77 45 55 30>)
$$ ##END=
$$ 
$$ hash MD5
$$ F7 93 09 AE 2A D7 BB 43 3C F9 53 56 3F 50 BB 20
##$RELAX= 
##$RELAX= 
##$RELAX= 
##$RELAX= 
##$RELAX= 
##$RELAX= 
##$RELAX= 
##$RELAX= 
$$ Bruker specific parameters
$$ --------------------------
##$DU= <F:/spectra>
##$EXPNO= 2
##$NAME= <P31>
##$PROCNO= 1
##$TYPE= <nmr>
##$USER= <she>
##$AMP= (0..31)
100 100 100 100 100 100 100 100 100 100 100 100 100 100 100 100 100 100 
100 100 100 100 100 100 100 100 100 100 100 100 100 100 
##$AQSEQ= 0
##$AQ_mod= 1
##$AUNM= <au_zg>
##$AUTOPOS= <>
##$BF1= 81.014009
##$BF2= 200.13
##$BF3= 200.13
##$BF4= 200.13
##$BF5= 200.13
##$BF6= 200.13
##$BF7= 200.13
##$BF8= 200.13
##$BYTORDA= 1
##$CFDGTYP= 0
##$CFRGTYP= 5
##$CHEMSTR= <none>
##$CNST= (0..31)
1 1 145 1 1 1 1 1 1 1 1 1 1 1 1 1 1 1 1 1 1 1 1 1 1 1 1 1 1 1 1 1 
##$CPDPRG= <waltz16>
##$CPDPRG1= <>
##$CPDPRG2= <waltz16>
##$CPDPRG3= <>
##$CPDPRG4= <mlev>
##$CPDPRG5= <mlev>
##$CPDPRG6= <mlev>
##$CPDPRG7= <mlev>
##$CPDPRG8= <mlev>
##$CPDPRGB= <>
##$CPDPRGT= <>
##$D= (0..31)
0 1 0 0 0 0 0 0 0 0.06 0 0.03 2e-05 3e-06 0 0 0.0002 0 0 0 0 0 0 0 0 0 
0 0 0 0 0 0 
##$DATE= 1771328622
##$DBL= (0..7)
120 120 120 11 120 120 24 19 
##$DBP= (0..7)
150 150 150 150 150 150 150 150 
##$DBP07= 0
##$DBPNAM0= <>
##$DBPNAM1= <>
$$ [...]
##$SUBNAM3= <"">
##$SUBNAM4= <"">
##$SUBNAM5= <"">
##$SUBNAM6= <"">
##$SUBNAM7= <"">
##$SUBNAM8= <"">
##$SUBNAM9= <"">
##$SW= 400.765351723535
##$SWIBOX= (0..15)
0 1 3 0 0 0 0 0 0 0 0 0 0 0 0 0 
##$SW_h= 32467.5324675325
##$TD= 32768
##$TD0= 1
##$TE= 0
##$TE2= 300
##$TE3= 300
##$TEG= 300
##$TL= (0..7)
0 120 53 12 22 120 120 120 
##$TP= (0..7)
150 150 150 150 150 150 150 150 
##$TP07= 0
##$TPNAME0= <>
##$TPNAME1= <>
##$TPNAME2= <>
##$TPNAME3= <>
##$TPNAME4= <>
##$TPNAME5= <>
##$TPNAME6= <>
##$TPNAME7= <>
##$TPOAL= (0..7)
0.5 0.5 0.5 0.5 0.5 0.5 0.5 0.5 
##$TPOFFS= (0..7)
0 0 0 0 0 0 0 0 
##$TUNHIN= 0
##$TUNHOUT= 0
##$TUNXOUT= 0
##$USERA1= <user>
##$USERA2= <user>
##$USERA3= <user>
##$USERA4= <user>
##$USERA5= <user>
##$V9= 5
##$VALIST= <valist>
##$VCLIST= <CCCCCCCCCCCCCCC>
##$VD= 0
##$VDLIST= <DDDDDDDDDDDDDDD>
##$VPLIST= <PPPPPPPPPPPPPPP>
##$VTLIST= <TTTTTTTTTTTTTTT>
##$WBST= 1024
##$WBSW= 4
##$XGAIN= (0..3)
0 0 0 0 
##$XL= 0
##$YL= 0
##$YMAX_a= 66229
##$YMIN_a= -75256
##$ZGOPTNS= <>
##$ZL1= 120
##$ZL2= 120
##$ZL3= 120
##$ZL4= 120
##$ABSF1= 198.0616
##$ABSF2= -202.7028
##$ABSG= 5
##$ABSL= 3
##$ALPHA= 0
##$AQORDER= 0
##$ASSFAC= 0
##$ASSFACI= 0
##$ASSFACX= 0
##$ASSWID= 0
##$AUNMP= <proc_1d>
##$AZFE= 0.1
##$AZFW= 0.5
##$BCFW= 0
##$BC_mod= 2
##$BYTORDP= 0
##$COROFFS= 0
##$CY= -3
##$DATMOD= 1
##$DC= 0
##$DFILT= <>
##$DTYPP= 0
##$F1P= 0
##$F2P= 0
##$FCOR= 1
##$FTSIZE= 65536
##$FT_mod= 6
##$GAMMA= 0
##$GB= 0
##$INTBC= 1
##$INTSCL= 9.790993e-09
##$ISEN= 30
##$LB= 1.5
##$LEV0= 0
##$LPBIN= 0
##$MAXI= 10000
##$MC2= 0
##$MEAN= 0
##$ME_mod= 0
##$MI= 50
##$NCOEF= 0
##$NC_proc= -5
##$NLEV= 6
##$NOISF1= 182.463
##$NOISF2= 159.3651
##$NSP= 0
##$NTH_PI= 0
##$NZP= 0
##$OFFSET= 198.0616
##$PC= 4
##$PHC0= 1441.124
##$PHC1= -10.89932
##$PH_mod= 1
##$PKNL= yes
##$PPARMOD= 0
##$PSCAL= 0
##$PSIGN= 0
##$REVERSE= no
##$SF= 81.0140089999434
##$SI= 65536
##$SIGF1= 159.3651
##$SIGF2= -187.1042
##$SINO= 113.3802
##$SIOLD= 16384
##$SREGLST= <1H.CDCl3>
##$SSB= 0
##$STSI= 65536
##$STSR= 0
##$SW_p= 32467.5324675325
##$SYMM= 0
##$S_DEV= 0
##$TDeff= 32768
##$TDoff= 0
##$TI= <>
##$TILT= no
##$TM1= 0
##$TM2= 0
##$TOPLEV= 0
##$USERP1= <user>
##$USERP2= <user>
##$USERP3= <user>
##$USERP4= <user>
##$USERP5= <user>
##$WDW= 1
##$XDIM= 65536
##$YMAX_p= 447369570
##$YMIN_p= -9164011
$$ End of Bruker specific parameters
$$ ---------------------------------
##NTUPLES= NMR SPECTRUM
##VAR_NAME=  FREQUENCY,     SPECTRUM/REAL,   SPECTRUM/IMAG
##SYMBOL=    X,             R,               I
##VAR_TYPE=  INDEPENDENT,   DEPENDENT,       DEPENDENT
##VAR_FORM=  AFFN,          ASDF,            ASDF
##VAR_DIM=   65536,         65536,           65536
##UNITS=     HZ,            ARBITRARY UNITS, ARBITRARY UNITS
##FACTOR=    0.49542278885378, 1,            1
##FIRST=     16045.7642231865, 0,            0
##LAST=      -16421.768244346, 0,            0
##MIN=       -16421.768244346, -9164011,     0
##MAX=       16045.7642231865, 447369570,    0
$$ Real data points
##PAGE= N=1
##DATA TABLE= (X++(R..R)), XYDATA
$$ [...]
41105G019076j85556j03789k17834l83616l24994r9728p919j31471k63811k64350
$$ 7019076 6833520 6729731 6511897 6128281 5803287 5703559 5695640 5564169 5300358 5036008
41095E036008k23523k61696l58020m04768l15924j01794Q8865Q5450p2934j64855
$$ 5036008 4812485 4550789 4192769 3788001 3472077 3370283 3459148 3544598 3471664 3306809
41085C306809j26846j46799k83541k85635l5575J33656o3076l16866j57745K54675
$$ 3306809 3179963 3033164 2749623 2463988 2428413 2562069 2498993 2182127 2024382 2279057
41075B279057L40004J8251j97375q0310k2549k79558m81592k56341J36420K20335
$$ 2279057 2619061 2637312 2439937 2359627 2337078 2057520 1575928 1319587 1456007 1676342
41065A676342M920j59329j66277j61374j47116p837J69001J77668N3918K0854
$$ 1676342 1681262 1521933 1355656 1194282 1047166 1039329 1208330 1385998 1439916 1460770
41055A460770J05179J09857l7535j84976k21673k07543k10097k05845j66113r0070
$$ 1460770 1565949 1675806 1638271 1453295 1231622 1024079 813982 608137 442024 351954
41045C51954L5622J75511J99648N4843r0123m9122J04456J59650Q9401K8155m786
$$ 351954 387576 563087 762735 817578 727455 678333 782789 942439 1031840 1059995 1055209
41034A055209j06158k42776k60181j39490j1692Q2862K10082L19985K70737R6399
$$ 1055209 949051 706275 446094 306604 294912 377774 587856 907841 1178578 1274977
41024A274977j6049m9381j67219l45591l17368j4404K43835J92571j6086j10060
$$ 1274977 1258928 1209547 1042328 696737 379369 364965 608800 801371 785285 675225
41014F75225j08429j69700k31533j17178J07423J86580N1953j04629j30207o9144
$$ 675225 566796 397096 165563 48385 155808 342388 394341 289712 159505 90361
41004I0361j1526L5113R1879J52759J96186J75904M8146j14631j44486l0140m790
$$ 90361 78835 113948 205827 358586 554772 730676 778822 664191 519705 489565 484775
40993D84775k01430l74079k22452J25725K78072J54987L7255M3054l0080k47474
$$ 484775 283345 -90734 -313186 -187461 90611 245598 282853 325907 295827 48353
40983D8353l36010j38117R6113J23081Q8112J98495L15229K31579J04169J82811
$$ 48353 -287657 -425774 -329661 -206580 -118468 80027 395256 626835 731004 913815
40973I13815K97728Q9460l47680n41910l50626j12747n4263k6819N7086K5905
$$ 913815 1211543 1301003 953323 411413 60787 -51960 -106223 -133042 -75956 -50051
40963e0051j24873r2667J75713K50716r7186m08195j91163K75110L50376J3299
$$ -50051 -174924 -267591 -91878 158838 61652 -346543 -537706 -262596 87780 101079
40953A01079j71173K5146K14350R7074j04202r4515M9617J09095O4352q39p4727
$$ 101079 -70094 -44948 169402 266476 162274 67759 117376 226471 290823 289984 215257
40942B15257j22284m9932R1924J08127j4466m0720J14341K07838P4282p8617k4864
$$ 215257 92973 43041 134965 243092 228626 187906 302247 510085 584367 505750 480886
40931D80886Q0683m1732l17768m09832j98807R4146K25833J59320O226r0307m3958
$$ 480886 561569 519837 202069 -207763 -406570 -312424 -86591 72729 78955 -11352 -55310
40920e5310Q5315J40179P3544j58j5950m5455r5723m9342P5335P1302q1177q8310
$$ -55310 30005 170184 243728 243570 227620 182165 86442 37100 112435 183737 102560 14250
40908A4250J68434L40423J41211j40979q8889J46008J07131j84706k90776j22681
$$ 14250 182684 523107 664318 523339 434450 580458 687589 502883 212107 89426
40898H9426m7282j90083k32723m2218O2675j04888k56959j41781N8886J42118
$$ 89426 42144 -147939 -380662 -422880 -360205 -465093 -722052 -863833 -804947 -662829
40888f62829K58210N19434O32960L45979n9283j58461k4263k5190j88106k33667
$$ -662829 -404619 114815 747775 1093754 1034471 876010 851747 826557 638451 404784
40878D04784j14338l8461j9735J27432L36117K83407p3917l55945k91748p1261
$$ 404784 290446 251985 232250 359682 695799 979206 905289 549344 257596 186335
40868A86335r511j26210k24067j79266n898K08600L20646K27569K7162o3383L175
$$ 186335 176824 50614 -173453 -352719 -358617 -150017 170629 398198 425360 361977 365152
40857C65152O4334L4165J6577O3564N5591n4277r8073L9602J97102J64768q364
$$ 365152 429486 463651 480228 543792 599383 545106 447033 486635 683737 848505 840141
40846H40141j23997j28812j12079j09390r4774r2648j29295j44463j00224p7084
$$ 840141 716144 587332 475253 365863 271089 178441 49146 -95317 -195541 -272625
40836b72625r9518p406K65537M25384J61943l04291m11909m3256K84234J71403
$$ -272625 -372143 -379549 -114012 311372 473315 169024 -242885 -286141 -1907 169496
40826A69496j05340p8711J80593K24695m5523k52992j37369J11095K09043J62524
$$ 169496 64156 -14555 166038 390733 345210 92218 -45151 65944 274987 437511
40816D37511J33330J46776J16582K6886o7297j38635j75392j47442p0866k6553
$$ 437511 570841 717617 834199 861085 793788 655153 479761 332319 261453 234900
40806B34900m3058n3371l3553o6674j82801k62942k16817j35018j28917j34280
$$ 234900 191842 138471 104918 38244 -144557 -407499 -624316 -759334 -888251 -1022531
40796a022531l5515J12808J69742J36995J15132R8509K6315j3310J17702L05875
$$ -1022531 -1058046 -945238 -775496 -638501 -523369 -424860 -398545 -411855 -294153 11722
40786A1722K58457m9167k54582q1763K64318L56816P4362l06528m70780l54109
$$ 11722 270179 221012 -33570 -115333 148985 505801 580163 273635 -197145 -551254
40776e51254j03318J11122K15621K35017K07043J13400o0611k18088k06305j3868
$$ -551254 -654572 -543450 -327829 -92812 114231 227631 167020 -51068 -257373 -271241
40766b71241J78861J95058L7908j56303k58470k13505o3977N6346M6539j6926
$$ -271241 -92380 102678 140586 -15717 -274187 -487692 -551669 -495323 -448784 -465710
40756d65710K9694J79710K34366R2164r7422j53844q5396J3595J25139K29648
$$ -465710 -436016 -256306 -21940 70224 -27198 -181042 -266438 -252843 -127704 101944
40746A01944K18157N8156p5948l4317M3143q8465l85673n38215l83209r1654R0905
$$ 101944 320101 378257 302309 267992 311135 222670 -163003 -701218 -1084427 -1176081 -1085176
40735a085176J11104O2758K8633M3113J07214J71941J70949J04534L7008P455
$$ -1085176 -974072 -911314 -882681 -839568 -732354 -560413 -389464 -284930 -247922 -240467
40725b40467R987N1213J38345K10878J78899M6219q2080j27000j03274o1647l7611
$$ -240467 -230480 -179267 -40922 169956 348855 395074 312994 185994 82720 21073 -16538
40714a6538n5850j09039j29462n2683Q7457J87120J88029J13262J8596l0532J5257
$$ -16538 -72388 -181427 -310889 -363572 -276115 -88995 99034 212296 230892 200360 215617
40703B15617J00323N9275j78943m24630m07385j11187K05611L20036K34795O1623
$$ 215617 315940 375215 196272 -228358 -635743 -746930 -541319 -221283 13512 75135
40693G5135j18627k37383k32361j33594m6370K105Q3793J93253J94623L3925j25506
$$ 75135 -43492 -280875 -513236 -646830 -693200 -691095 -607302 -414049 -219426 -185501 -311007
40682c11007j04012M9338J44497J18760P1675N6371p812j68103l01550k46564
$$ -311007 -415019 -365681 -221184 -102424 -30749 25622 17810 -150293 -451843 -698407
40672f98407l0587J38342J30549N6253Q9757J94043J62838n1045k13252j12051
$$ -698407 -728994 -590652 -460103 -403850 -314093 -120050 42788 -8257 -221509 -333560
40662c33560J43833K77909K09745R4714N0302L9773L5226R9012K29977K80352
$$ -333560 -189727 88182 297927 392641 442943 482716 517942 616954 846931 1127283
40652A127283J30050j41885l39199l43896j85144J7381J30876R2096l6145j24974
$$ 1127283 1257333 1115448 776249 432353 247209 264590 395466 487562 451417 326443
40642C26443j15714n9567k4640j8629n581M6684J24342J42557K3274j49316j58911
$$ 326443 210729 151162 126522 107893 102312 148996 273338 415895 439169 289853 130942
40631A30942M3718J94675N7963j90252j77265J12179L01086J69387p5199j73803
$$ 130942 174660 369335 427298 237046 59781 171960 473046 642433 567234 393431
40621C93431j55009j27918k5630J92985L05213Q9916k89888m54528k98133o0316
$$ 393431 238422 110504 84874 277859 583072 672988 383100 -71428 -369561 -429877
40611d29877N2699O7868O6914N3080N1381J36249K70908K81597R8145j03944j23947
$$ -429877 -377178 -309310 -242396 -189316 -137935 -1686 269222 550819 648964 545020 421073
40600D21073j5158l071j50943k58523j54289L0333K2694j90505l09459j34774
$$ 421073 405915 402844 251901 -6622 -160911 -130578 -107884 -298389 -607848 -742622
40590g42622J42237K16965R7802K7672N9956n675k48030m54627m09958j37011
$$ -742622 -600385 -383420 -285618 -257946 -197990 -203665 -451695 -906322 -1316280 -1453291
40580a453291K22454N45189O66437M44895K7546j94616o6951J17782O5831j09136
$$ -1453291 -1230837 -685648 -19211 425684 453230 258614 191663 309445 375276 266140
40570B66140j56412j20569j91220l01249k23153K9922K22676K61502K48648K22829
$$ 266140 109728 -10841 -202061 -503310 -726463 -696541 -473865 -212363 36285 259114
40560B59114J32489L2860L0841N7571l7717j97982k33613j48469j00635p8269
$$ 259114 391603 424463 455304 512875 475158 277176 43563 -104906 -205541 -283810
40550b83810N7803K27251J90641j7454r4214K6356O7784p6699j40510J6116J05883
$$ -283810 -226007 1244 191885 174431 80217 106573 174357 97658 -42852 -26736 79147
40539G9147j01842l41537k47141O6104J89882L0669j31104j00997L3405J28035
$$ 79147 -22695 -364232 -611373 -545269 -355387 -324718 -455822 -556819 -523414 -395379
40529c95379J32432L6968j01323j13379Q5708K97036K58916L4009o4727O7814
$$ -395379 -262947 -225979 -327302 -440681 -354973 -57937 200979 234988 170261 238075
40519B38075J93392J03284r8790j90127j39424r5500j52283k32557j90384R734
$$ 238075 431467 534751 435961 245834 106410 10910 -141373 -373930 -564314 -554580
40509e54580K19493K46198R2128j9446P0629K33230K33310O5117n7342j6491P5842
$$ -554580 -335087 -88889 3239 -16207 54422 287652 520962 586079 528737 512246 588088
40498E88088P7489j2798j29056k38666k94361k03131N2218L19554L98028K42619
$$ 588088 665577 652779 523723 285057 -9304 -212435 -160217 159337 557365 799984
40488G99984N055j17744n6490Q7298J51009P1144o7014j43307j34041j02202r7853
$$ 799984 805039 687295 630805 718103 869112 940256 873242 729935 595894 493692 395839
40477C95839j23280j67970k09225j88870o2852J12475K01735J26719m7431j79154
$$ 395839 272559 104589 -104636 -293506 -356358 -243883 -42148 84571 37140 -142014
40467a42014j86604j09083m4722l7633m0224K978O4028P0761K1077n967M4960
$$ -142014 -328618 -437701 -482423 -520056 -560280 -557302 -493274 -422513 -401436 -407403 -362443
40456c62443J49594K47194K69921J50685r0434k77725k38454m6112N4557J08q174
$$ -362443 -212849 34345 304266 454951 364517 86792 -151662 -197774 -143217 -143109 -151283
40445a51283J46513K80602J94740j7957j41418j48042j21510k5691J80632L21500
$$ -151283 -4770 275832 470572 452615 311197 163155 41645 15954 196586 518086
40435E18086K07162j3355l7101Q6584Q076l20444m90064k38094J43215K35233
$$ 518086 725248 711893 674792 761376 769452 449008 -41056 -279150 -135935 99298
40425I9298N3760r1963q7534n4554l6774M3527J62438J95535J37773J00428Q9218
$$ 99298 153058 61095 -26439 -80993 -117767 -74240 88198 283733 421506 521934 611152
40414F11152n25j49015j85202n4024P5455N7258k7230j8555Q2707J45657J06398
$$ 611152 610627 461612 276410 222386 297841 355099 327869 309314 392021 537678 644076
40403F44076K4606k4161k3364N194K8234P049p2567j66707j98325j25452K1773
$$ 644076 668682 644521 621157 626351 654585 661634 589067 422360 224035 98583 120356
40392A20356J62670K15691J46586n554j48273j98329j37287j3577J00422J50149
$$ 120356 283026 498717 645303 639749 491476 293147 155860 142283 242705 392854
40382C92854J11968o203j52625k30467j60920J4375J30349O7166q4050j06384
$$ 392854 504822 498619 345994 115527 -45393 -31018 99331 166497 82447 -23937
40372b3937O6939K48905K33154N4353q7367j11674j28068k12287k61156j55259
$$ -23937 43002 291907 525061 579414 492047 380373 252305 40018 -221138 -376397
40362c76397L3560J17604L7429q2019j12764n4595L4154J29179K04526J90613
$$ -376397 -342837 -225233 -187804 -269823 -382587 -437182 -403028 -273849 -69323 121290
40352A21290N9926q9124j27601n9138R70P567M8243J89542L43755L58364K03778
$$ 121290 181216 92092 -35509 -94647 -93677 -86110 -37867 151675 495430 853794 1057572
40341A057572J3024o4174j9621P441j08904l09886l88578k44786l7815K3448j4057
$$ 1057572 1070596 1006422 986801 994242 885338 575452 186874 -57912 -95727 -72279 -86336
40330h6336O3655K43787K30688r8721m19828l67321n3381J04008j9937j49759
$$ -86336 -22681 221106 451794 353073 -66755 -434076 -487457 -383449 -403386 -553145
40320e53145r3036J1021K0656M9814K05251L17654J88856n8691j49953p7428p7494
$$ -553145 -646181 -635160 -614504 -564690 -359439 -41785 147071 88380 -61573 -139001 -216495
40309b16495k17367k76005q6892K15513L76449K94431M6645k14941l21392j84055
$$ -216495 -433862 -709867 -796759 -581246 -204797 89634 136279 -78662 -400054 -584109
40299e84109P0189J82918Q3004k230J22992L12496K83723M7258j04298k9702Q2476
$$ -584109 -513920 -331002 -247998 -250228 -127236 185260 468983 516241 411943 382241 464717
40288D64717M0233p3736r6029o9116j23761j93762r8896J23474K24415J16796
$$ 464717 504950 431214 335185 266069 142308 -51454 -150350 -26876 197539 314335
40278C14335M469M6339J10937J8962j48544j85658q9264l6930r6516j59949j39611
$$ 314335 318804 365143 476080 495042 346498 160840 71576 34646 -61870 -221819 -361430
40267c61430m4269J21084L34938M41495K69674q6421l08961k47836q1031p364
$$ -361430 -405699 -284615 50323 491818 761492 675071 366110 118274 37243 29879
40257B9879R236O1908P8335k4174j14307j1593K06002K83875J44970m2235j35890
$$ 29879 39115 101023 179358 155184 40877 29284 235286 519161 664131 621896 486006
40246D86006j57292j35553j7716J86211L19461K47566L3404j33419j35891j8599
$$ 486006 328714 193161 175445 361656 681117 928683 962087 828668 692777 674178
40236F74178P7698M8874o7049j23869n0283M7110M8255K1678J08149K37697J77911
$$ 674178 751876 800750 733701 609832 559549 606659 654914 676592 784741 1022438 1200349
40225A200349r0297k68408j36857J31447K26922J20396R025m2252j36817k57914
$$ 1200349 1110052 841644 704787 836234 1063156 1183552 1192577 1150325 1013508 755594
40215G55594k33276m9513N9484l2994j29274k8246J26193O8765j34221j56065
$$ 755594 522318 472805 532289 499295 370021 341775 467968 536733 402512 246447
40205B46447Q3015K80736K01887o033r4389q3515j35366k13978j34465J06916
$$ 246447 329462 610198 812085 806052 711663 628148 492782 278804 144339 251255
40195B51255K93412K85270J61263M3788l6492o5933j0592Q6499J14704N5748j982
$$ 251255 544667 829937 991200 1034988 998496 932563 921971 1008470 1123174 1178922 1176940
40184A176940m4633j57337l05827k89009l1701K43454K88269J38982J758m3628
$$ 1176940 1132307 974970 669143 380134 348433 591887 880156 1019138 1020896 977268
40174I77268n4463n3370l8204p7460j99044k53392r3022J62221K50098J20982
$$ 977268 922805 869435 831231 753771 554727 301335 208313 370534 620632 741614
40164G41614m5630j46425k31450k79136j68606O0211J73742P6005n1631n6693
$$ 741614 695984 549559 318109 38973 -129633 -69422 104320 180325 128694 72001
40154G2001l5978r6777j14277N6468K80891L00313J09556m4328j6360P5656O0961
$$ 72001 36023 -60754 -175031 -118563 162328 462641 572197 527869 511509 587165 648126
40143F48126o0200j45289q6392O2900J19664k6074k33686k49979o5535L5199j08617
$$ 648126 587926 442637 356245 419145 538809 512735 279049 29070 -36465 -1266 -109883
40132a09883k53947r5795K55410M09022K39856J2400l9771K2041N2263L1926k9048
$$ -109883 -363830 -459625 -204215 204807 444663 457063 417292 439333 491596 523522 494474
40121D94474j61887k84162j97963R6793K92531J74169n4354q1245L5065K024j84912
$$ 494474 332587 48425 -149538 -52745 239786 413955 359601 278356 313421 315445 130533
40110A30533k12578L3709K69539K52434J25251J18198J52108J6189k10630k36128
$$ 130533 -82045 -48336 221203 473637 598888 717086 869194 885383 674753 438625
40100D38625j5926J64528J17891l345n702L9433k7729j44156j24993M140K1452
$$ 438625 422699 587227 705118 701773 696071 735504 707775 563619 438626 442766 464218
40089D64218j35331k46918j28173R8899J75441N5495m9920M4400K72817L93292
$$ 464218 328887 81969 -46204 52695 228136 283631 233711 278111 550928 944220
40079I44220K39517j05449l63384l08503L285K69822K45854m454k01748j82783
$$ 944220 1183737 1078288 714904 406401 409686 679508 925362 920908 719160 536377
40069E36377o5910n8740j69957k02837l4658J96787K60991J35686K4729O7344
$$ 536377 470467 411727 241770 38933 4275 201062 462053 597739 622468 689812
40059F89812J54747J11705l7552j11268l7527N5411L0874q3093j53431j01887
$$ 689812 844559 956264 918712 807444 769917 825328 856202 773109 619678 517791
40049E17791L2977J44593J49829P2819L1269Q5614J31777L7338j39339j99031
$$ 517791 550768 695361 845190 918009 949278 1034892 1166669 1204007 1064668 865637
40039H65637q2672M3917L4865n0456q6272o8901n6462l4287K7859O7290J2411
$$ 865637 782965 826882 861747 811291 725019 656118 599656 565369 593228 660518 672929
40028F72929q0237r6520k7828M7627R7694J35576J35573P4430J6839L1696N9976
$$ 672929 592692 496172 468344 515971 613665 749241 884814 959244 976083 1007779 1067755
40017A067755K971r0648q3921J1845K9407r8283k33567k42303j68779j25874j21894
$$ 1067755 1070726 980078 896157 908002 937409 839126 605559 363256 194477 68603 -53291
40006e3291q8356p781P3065J22362J52502J78946J78077R4099q4768k45130k16323
$$ -53291 -141647 -149428 -76363 45999 198501 377447 555524 649623 564855 319725 103402
39995A03402J5468K35394K41573Q8262l6533r7203j95068l14058l01126j16722
$$ 103402 118870 354264 595837 684099 647566 550363 355295 41237 -259889 -376611
39985c76611R7353K36310L23350L43322K06365l9842j74596r6747L2794N2268
$$ -376611 -279258 -42948 280402 623724 830089 790247 615651 518904 551698 603966
39975F03966Q633j6379p2377j64872j30612R0001K44026R3706j89350k41541k0620
$$ 603966 612599 596220 523843 358971 228359 318360 562386 656092 466742 225201 204581
39964B04581J87313K07264J21860Q878j52410k81655k02797O2185K47850J90483
$$ 204581 391894 599158 721018 729896 577486 295831 93034 155219 403069 593552
39954E93552J3173j13517j80755k10195j26757Q7389K67257K43294M6526j64259
$$ 593552 606725 493208 312453 102258 -24499 62890 330147 573441 619967 455708
39944D55708k79765k73004j75199r0079j08641j52520m8500J85543L11042K07056
$$ 455708 175943 -97061 -272260 -362339 -470980 -623500 -672000 -486457 -175415 31641
39934C1641L7811k9157n3388j14609j04627N1769J69366O9111q6903l4942J34159
$$ 31641 69452 40295 -13093 -127702 -232329 -180560 -11194 57917 -28986 -63928 70231
39923G0231J05530j30108k51788j34614k3711p7333r4026J06219L22356K59428
$$ 70231 175761 45653 -206135 -340749 -364460 -441793 -535819 -429600 -107244 152184
39913A52184j7898j91776j38294j5749L3033L3043M4216P3760J34344K28960K66103
$$ 152184 134286 -57490 -195784 -211533 -178500 -145457 -101241 -27481 106863 335823 601926
39902F01926J41831p5656j94616j63981j30907j75604j58472M2258K71883K60671
$$ 601926 743757 668101 473485 309504 178597 2993 -155479 -113221 158662 419333
39892D19333l968k46125k57079j24739m9965p2726r0466n6012j7685K953L7367
$$ 419333 415365 169240 -87839 -212578 -262543 -335269 -425735 -481747 -499432 -496479 -459112
39881d59112O8974K9566p0640j19732o2436J7426L7407M2031R8173J50936J04093
$$ -459112 -390138 -360572 -431212 -550944 -613380 -595954 -558547 -516516 -418343 -267407 -163314
39870a63314o701m7614K4221J16096J36774P8167k9482j38605j65667o3784P9583
$$ -163314 -170015 -217629 -193408 -77312 59462 137629 108147 -30458 -196125 -259909 -180326
39859a80326J27084P8101M9908O8282L3395o4449p0326R0465K40702J70121p1980
$$ -180326 -53242 24859 74767 143049 176444 111995 41669 132134 372836 542957 470977
39848D70977k54721k69557j98180j13307J3112J72883K39857J16674j00724j93733
$$ 470977 216256 -53301 -251481 -364788 -351676 -178793 61064 177738 77014 -116719
39838a16719o5227J28096J32355r9281l13617k44769M2337K26120J51658R291
$$ -116719 -181946 -53850 78505 -20776 -334393 -579162 -536825 -310705 -159047 -149756
39828a49756J8409J16822J19844L7881J7358N4675J8539o5605j2481J93976L07107
$$ -149756 -131347 -14525 105319 143200 160558 215233 233772 168167 155686 349662 656769
39817F56769J62520p4387j45390l8624O2781O4735K7219j153n4696j54669k52035
$$ 656769 819289 744902 599512 560888 623669 688404 715623 714470 659774 505105 253070
39806B53070k81449k08805l7541J67142K79540K17859N2236n4248k6315M7217
$$ 253070 -28379 -237184 -274725 -107583 171957 389816 442052 387804 361489 408706
39796D08706L2944q4902j87777j66166o1435k6903j22186j97318o9979J94878
$$ 408706 441650 356748 168971 2805 -58630 -85533 -207719 -405037 -475016 -280138
39786b80138L06557J04536k10377k99061q0705J97336K62558R0228j34367k38423
$$ -280138 26419 130955 -79422 -378483 -459188 -261852 706 90934 -43433 -281856
39776b81856j98260r4481O966R9695J79872K05334J57878J00054Q7347N5375q5295
$$ -281856 -480116 -574597 -567631 -467936 -288064 -82730 75148 175202 262549 317924 232629
39765B32629k46134k14109L1583K17400J11687j63738l08410k28912p2342N3792
$$ 232629 -13505 -227614 -196031 21369 133056 -30682 -339092 -568004 -640346 -586554
39755e86554J81364L07633L29142K04794L0022j06607k04710k46282j66213o539
$$ -586554 -405190 -97557 231585 436379 466401 359794 155084 -91198 -257411 -263950
39745b63950N2186p0507k09151j76597k7053O1430Q1236J71951L24099L21685
$$ -263950 -211764 -282271 -491422 -668019 -695072 -633642 -552406 -380455 -56356 265329
39735B65329N4109k74245l68497j93304J9742P6910K2366K3043J37037K44769
$$ 265329 319438 45193 -323304 -516608 -496866 -419956 -397590 -374547 -237510 7259
39725G259J89924l4892k47924k42032p066K38023K74237J17459l5770p1981o5034
$$ 7259 197183 162291 -85633 -327665 -334731 -96708 177529 294988 259218 187237 122203
39714A22203j01086j33726j03658r0167j93017l21532k75366l2451K11716L17147
$$ 122203 21117 -112609 -216267 -306434 -499451 -820983 -1096349 -1128800 -917084 -599937
39704e99937L37764L31673K26001l795j83111j45796O922L6922r9576k23294j98770
$$ -599937 -262173 69500 295501 291706 108595 -37201 -30279 6643 -92933 -316227 -514997
39693e14997o2734R8698K38197L03319K47329J06869l5239j54041k44753k32889
$$ -514997 -577731 -479033 -240836 62483 309812 416681 381442 227401 -17352 -250241
39683b50241p4790J00163J38430J16054K08982L25805J74498k31840m62093k43802
$$ -250241 -325031 -224868 -86438 29616 238598 564403 738901 507061 44968 -198834
39673a98834J26254K04961J8731n9596Q2568J69671J3214k01039k02602l914J46845
$$ -198834 -72580 132381 151112 91516 174084 343755 356969 155930 -46672 -50586 96259
39662I6259P2582j59837l21506k46156p617J51821J13760K4474N3344J21637M5665
$$ 96259 168841 9004 -312502 -558658 -566275 -414454 -300694 -276220 -222876 -101239 -55574
39651e5574j25591j48477L6114J89744J09893j12567k60058k53387j47232O12
$$ -55574 -181165 -329642 -293528 -103784 6109 -106458 -366516 -619903 -767135 -766523
39641g66523J32933J67829R1679J2219K3310P7816P7779K4961n407J8587P9460
$$ -766523 -633590 -465761 -374082 -361863 -338553 -260737 -182958 -157997 -163404 -144817 -65357
39630f5357J61913K23592J75334p422k01144k69451k43333k48773k83104k09514
$$ -65357 96556 320148 495482 488060 286916 17465 -225868 -474641 -757745 -967259
39620i67259Q181K11597K59233K16357K27071K73257K00627k4809k24099k26023
$$ -967259 -959078 -747481 -488248 -271891 -44820 228437 429064 404255 180156 -45867
39610d5867q2741K6334M4515P0355J52203J88681R2495n4663j09677o5021l0355
$$ -45867 -128608 -102274 -57759 12596 164799 353480 445975 391312 281635 216614 186259
39599A86259n4888q3918q1972q0651q4284l7412P0535J60056J74579J58603J60416
$$ 186259 131371 47453 -34519 -115170 -199454 -236866 -166331 -6275 168304 326907 487323
39588D87323J31225P639j51627k09172j24109n762K4496l0920p5991n0388J2448
$$ 487323 618548 626187 474560 265388 141279 135517 160013 129093 53102 2714 15162
39577A5162N3399P8244J47891K78369L83497L45014J35812j34521k88089k07049
$$ 15162 68561 146805 294696 573065 956562 1301576 1437388 1302867 1014778 807729
39567H07729N5730K86919K99705J35542R21k6331r6834l01993m40258k74809O2939
$$ 807729 863459 1150378 1450083 1585625 1586546 1560215 1463381 1161388 721130 446321 509260
39556E09260J91378N628j82808j14461O8725J00938j150l6340K5276M5171P683
$$ 509260 700638 706266 523458 408997 477722 578660 577510 541170 566446 611617 619300
39545F19300M8709J85940K50213J47664N592l3394j8291p9961k13412k89655k39345
$$ 619300 668009 853949 1104162 1251826 1257418 1224024 1205733 1125772 912360 622705 383360
39534C83360j24638m0468j7966k8710l0913L177P1147J30551J23434L9449m3892
$$ 383360 258722 218254 200288 171578 140665 143842 214989 345540 468974 508423 464531
39523D64531k0453J09738J91346P2030j74956k70637m5902L09556M14622J24560
$$ 464531 444078 553816 745162 817192 642236 371599 325697 635253 1049875 1174435
39513A174435k91107m45341k52952K0487J09065L9440J2522Q0810R4936k3411
$$ 1174435 883328 437987 185035 205522 314587 354027 366549 447359 542295 518884
39503E18884j28779p5530M2583L7417q0754j51572j51384j95882k54846j30565
$$ 518884 390105 314575 357158 394575 313821 162249 10865 -185017 -439863 -570428
39493e70428J92441M24290L48788J22767J5924K8783r431r7490p4658P9740J95072
$$ -570428 -377987 46303 395091 517858 533782 562565 553134 455644 380986 460726 655798
39482F55798J52632m871j96782l62923m05693k48881K4840K31250K85217K33698
$$ 655798 808430 803559 606777 243854 -161839 -410720 -385880 -154630 130587 364285
39472C64285J31188K5094R089J07379J47809l6472l01364l33096j10647M3269
$$ 364285 495473 520567 529656 637035 784844 748372 447008 113912 3265 46534
39462D6534n0588j61974k6600K37402L02095Q7241j60945j94628j4995J78974
$$ 46534 -4054 -166028 -192628 44774 346869 434110 273165 78537 63542 242516
39452B42516J95130K4182j39480j01294Q8758J87287Q0065p2264o9284P4678J92710
$$ 242516 437646 461828 322348 221054 309812 497099 577164 504900 435616 510294 703004
39441G03004J73779K8238j56230k51928j82743l9069M945o7882r9066k2959L0543
$$ 703004 876783 905021 748791 496863 314120 275051 279996 212114 113048 90089 120632
39430A20632j0317r538J25099K32825J36958o3496j52179j18724r8908r8513k4870
$$ 120632 110315 100777 225876 458701 595659 532163 379984 261260 162352 63839 38969
39419C8969P4635O3636j6364K3420K07662L38988K88206J45460L4941m0373j06957
$$ 38969 113604 177240 160876 184296 391958 730946 1019152 1164612 1199553 1159180 1052223
39408A052223j31942j01042o5992n3721k4532M2140J12882J71255K26120K38149
$$ 1052223 920281 819239 753247 699526 674994 717134 830016 1001271 1227391 1465540
39398A465540J46488j2283j14794j01080k5438M3518P4668L3044r4451k19623
$$ 1465540 1612028 1599745 1484951 1383871 1358433 1401951 1476619 1509663 1415212 1195589
39388A195589k11320n8671J08197J66469R7822l3599j11507k6321J81728K99275
$$ 1195589 984269 925598 1033795 1200264 1298086 1264487 1152980 1126659 1308387 1607662
39378A607662J99580N2154Q9423K35321K11855r856j50541n9062P8582P5336K2904
$$ 1607662 1807242 1859396 1948819 2184140 2395995 2386139 2235598 2176536 2255118 2330454 2353358
39367B353358O7236J24089L3564j43747k00589q2902O0362R6845M8183J4909M5542
$$ 2353358 2420594 2544683 2578247 2434500 2233911 2151009 2211371 2308216 2356399 2371308 2416850
39356B416850Q5418M5121n4738n8268J06304K48156J35904j36912k44770j00923
$$ 2416850 2502268 2547389 2492651 2434383 2540687 2788843 2924747 2787835 2543065 2442142
39346B442142L6494j964m7876P8746K58315K75315J18396j02456l28561m64080
$$ 2442142 2478636 2476672 2428796 2507542 2765857 3041172 3159568 3057112 2728551 2264471
39336B264471l46202j7332J96654J10992m5409l1998l182j81125l80665k90868
$$ 2264471 1918269 1900937 2097591 2208583 2163174 2131176 2127994 1946869 1566204 1275336
39326A275336m5380k8637k17839k29226K448J14807m5000j80089q7727K3229l3636
$$ 1275336 1229956 1201319 983480 754254 756702 871509 826509 646420 558693 581922 548286
39315E48286r0913J6056J27763P6173M013P6964J61536R4140Q247O4371R6529
$$ 548286 457373 473429 601192 677365 681378 758342 919878 1014018 1022265 1086636 1183165
39304A183165r7273l08330j83891J69639K82968P717k95185l01885j03998N9109
$$ 1183165 1085892 777562 593671 763310 1046278 1053995 758810 456925 352927 412036
39294D12036J32301J58749J11787p295p0984J0737J36740J50185M0469q6854j55631
$$ 412036 544337 703086 814873 807578 736594 747331 884071 1034256 1074725 987871 832240
39283H32240j41478k7501J58698L06995L11739J84280L0071o7238j03009j13679
$$ 832240 690762 663261 821959 1128954 1440693 1624973 1655044 1587806 1484797 1371118
39273A371118j17746r8398m1131J9063K3379j9906k2844N5957J23811O4095j02097
$$ 1371118 1253372 1154974 1113843 1132906 1156285 1136379 1113535 1169492 1293303 1357398 1255301
39262A255301k41115k66110j96287q6387J8809P7537P3337K6480o5444k29676
$$ 1255301 1014186 748076 551789 465402 484211 561748 635085 661565 596121 366445
39252C66445l85632l23796K4144L82107M11311J56694k8650j758J3909j35562
$$ 366445 -19187 -342983 -318839 63268 474579 631273 602623 600865 614774 479212
39242D79212k50036j16745J13041J51588J5727m4212L5188P1274k5955j29310
$$ 479212 229176 112431 225472 377060 392787 348575 383763 455037 429082 299772
39232B99772j42974j37304j69863j77678j27151q4468n0820Q3558L08658M06499
$$ 299772 156798 19494 -150369 -328047 -455198 -539666 -590486 -506928 -198270 208229
39222B08229K51143L6276J3011J28682J45381K7221l8212L0142J08199J14977
$$ 208229 459372 495648 508659 637341 782722 809943 771731 801873 910072 1025049
39212A025049J16446J26633M4892j09922j36667K5841J28315l0287k51358k06850
$$ 1025049 1141495 1268128 1313020 1203098 1066431 1092272 1220587 1190300 938942 732092
39202G32092N4329J73447K6673j07817M467K12260K26344J8438j93491k38818
$$ 732092 786421 959868 986541 878724 883191 1095451 1321795 1340233 1146742 907924
39192I07924j22823N7719J90883J87624N5721q5294j31995j05646q5890r8039
$$ 907924 785101 842820 1033703 1221327 1277048 1191754 1059759 954113 868223 770184
39182G70184j23397j52948j65234j20154m1892l1083j18554j89556j42346l7235
$$ 770184 646787 493839 328605 208451 166559 135476 16922 -172634 -314980 -352215
39172c52215J4425K0842M7119P3167O9613J36300L64696N92543N16828R4083l52685
$$ -352215 -337790 -316948 -269829 -196662 -127049 9251 373947 966490 1483318 1577401 1224716
39161A224716m92539l07057o23K44072L28224K11820k0378j53540n4718J42404
$$ 1224716 732177 425120 424497 668569 996793 1208613 1188235 1034695 979977 1122381
39151A122381J86592K4483j51652j77031j10858r9663j42377j12695R842P6918
$$ 1122381 1308973 1333456 1181804 1004773 893915 794252 651875 539180 549022 625940
39141F25940L163o8146K2478J55595P3095j85355k57692J1366K84417K06330n6810
$$ 625940 629103 560957 583435 739030 812125 626770 369078 380444 664861 871191 814381
39130H14381q7510J11444J32163j52480l55017j75099J42271K06551N6988K1628
$$ 814381 726871 838315 970478 817998 462981 287882 430153 636704 693692 715320
39120G15320J74981K69818J50836n5437j80174k14962k21808j99831j08788N1415
$$ 715320 890301 1160119 1310955 1255518 1075344 860382 638574 438743 329955 381370
39110C81370K08796K38352O9740j72131k36256n2833J40658J14693k9281l6369
$$ 381370 590166 828518 898258 726127 489871 437038 577696 692389 663108 626739
39100F26739R8675J42214j260j65820j96665j29474n7310j3182k5840r7761q8842
$$ 626739 725414 867628 866368 700548 503883 374409 317099 303917 278077 180316 91474
39089I1474J52927M72999M75037M9747l90379m08525q9100J53580J55413Q8432
$$ 91474 244401 717400 1192437 1242184 851805 443280 354180 507760 663173 751605
39079G51605N1049o7970k63912k89472l1181K28511J64957j14288k08272J8964
$$ 751605 802654 734684 470772 181300 150119 378630 543587 429299 221027 239991
39069B39991K81372L02544J57762O8341N4503j6327j51983k20693j74526r0570
$$ 239991 521363 823907 981669 1050010 1104513 1088186 936203 715510 540984 450414
39059D50414P498J73347L54128L82617K25604N3674k8799j21748k62676k46617
$$ 450414 457912 631259 985387 1368004 1593608 1647282 1618483 1496735 1234059 987442
39049I87442N1372L47709K57790j43291l92959k74119n1084m254n1410K943J06470
$$ 987442 1038814 1386523 1644313 1501022 1108063 833944 782860 778606 727196 730139 836609
39038H36609Q0836o1930j55965j38930p6968n021P7280J07431L2923n7066m0972
$$ 836609 917445 855515 699550 560620 483652 478631 555911 663342 696265 639199 598227
39027E98227K3657k5961j76295k11145j1519K65310L73457K41886k736j84456
$$ 598227 621884 595923 419628 208483 196964 462274 835731 1077617 1074881 890425
39017H90425j97254o0945P9073O6011j02601k63537k65426j04058J27761L33464
$$ 890425 693171 632226 711299 777310 674709 411172 145746 41688 169449 502913
39007E02913M18696L13118P7719q5486m1370J03005J36903K1151j01900j48793
$$ 502913 921609 1234727 1312446 1226960 1185590 1288595 1425498 1446649 1344749 1195956
38997A195956j78578k08967j36925N3508J72235P9788o4775k8628J07428N7261
$$ 1195956 1017378 808411 671486 724994 897229 977017 912242 883614 991042 1048303
38987A048303j87876k94685r6422J34628J09012m5340l5715J04213J03854o5674
$$ 1048303 860427 565742 469320 603948 712960 667620 631905 736118 839972 774298
38977G74298j48482l1350J03486J02370L6932O91l4779o5704K27J31776J34795
$$ 774298 625816 594466 697952 800322 837254 837945 803166 737462 737689 869465 1004260
38966A004260m0771j69302p6747J01345J55083J01538O4164L1136n0942r2372
$$ 1004260 963489 794187 717440 818785 973868 1075406 1139570 1170706 1119764 1027392
38956A027392q0J10653O6417r2841j96666k03494j72732q5243P4735J53400N465
$$ 1027392 1027312 1137965 1204382 1111541 914875 711381 538649 453406 528141 681541 687006
38945F87006k21065k42372m5590J22139J43881J35700J61387J34441M8439L1431
$$ 687006 465941 223569 177979 300118 443999 579699 741086 875527 923966 955397
38935I55397R6682Q5088o2564k04423k44937k51973k45062j14286J32086K75794
$$ 955397 1052079 1137167 1074603 870180 625243 373270 128208 13922 146008 421802
38925D21802J92922M6365K6701R4914J34982J64447K12518J71448k0111j92184
$$ 421802 614724 661089 687790 782704 917686 1082133 1294651 1466099 1445988 1253804
38915A253804j63719l8120n3842k08776k54950n6508K25490L32620J88620l8071
$$ 1253804 1090085 1051965 998123 789347 534397 477889 703379 1035999 1224619 1186548
38905A186548j12268L184P2438j21609m31664m84574j90515J38415K65475L23272
$$ 1186548 1074280 1077464 1149902 1028293 596629 112055 -78460 59955 325430 648702
38895F48702M48173M40727J09740k86469l38065r0423M4422q1134k03478j28352
$$ 648702 1096875 1537602 1647342 1360873 1022808 932385 976807 895673 692195 563843
38885E63843K8740J37115K23783K56054R2824k06764l30758j38632J23459J95055
$$ 563843 592583 729698 953481 1209535 1302359 1095595 764837 626205 749664 944719
38875I44719J31854Q6687K9039q2316q9963J06831K72764J37699j42948j72137
$$ 944719 1076573 1163260 1192299 1109983 1020020 1126851 1399615 1537314 1394366 1222229
38865A222229R4101K82541J59761p8235j75764j76382k26070k50315q4292J91073
$$ 1222229 1316330 1598871 1758632 1680397 1504633 1328251 1102181 851866 767574 958647
38855I58647L04699J75540K0728L5741J41062J41801J2877j02275j09389m8454
$$ 958647 1263346 1438886 1459614 1495355 1636417 1778218 1791095 1688820 1579431 1530977
38845A530977J7178P5139J14994J07244O0960K1235j1754p3673j28646q6108L0823
$$ 1530977 1548155 1623294 1738288 1845532 1906492 1927727 1915973 1842300 1713654 1627546 1658369
38834A658369O3011n7522j82927j64628p7653q4170j66125j68813n9156L5053
$$ 1658369 1721380 1663858 1480931 1316303 1238650 1154480 988355 819542 760386 795439
38824G95439K6333m3660j00583q6417N0740K63877L52608J85625o3569j18468
$$ 795439 821772 778112 677529 591112 641852 905729 1258337 1443962 1380393 1261925
38814A261925r619k5165k36613l64158k05766O9997K00033J60126O0745p5004
$$ 1261925 1252306 1227141 990528 626370 420604 490601 690634 850760 911505 836501
38804H36501k34811k90608j51845P3528K29976K98368K94043J56073q5791k12412
$$ 836501 601690 311082 159237 232765 462741 761109 1055152 1211225 1125434 913022
38794I13022r9680N5603K3461j04199j07870l3437p1145j58557p2686J30342J55800
$$ 913022 813342 868945 892406 788207 680337 646900 575755 417198 344512 474854 630654
38783F30654k5313r4946R6338K90065K46079Q7031K3261J6683m3873o6007P0517
$$ 630654 605341 510395 606733 896798 1142877 1229908 1253169 1269852 1225979 1159972 1230489
38772A230489K21348J47830j00869k36380j35582L0065Q1253N0445N7729J09487
$$ 1230489 1451837 1599667 1498798 1262418 1126836 1156901 1238154 1288599 1346328 1455815
38762A455815J09347J2337r7452r0818M9838J83377J67984M8461k028P1893J35967
$$ 1455815 1565162 1577499 1480047 1389229 1439067 1622444 1790428 1838889 1836861 1908754 2044721
38751B044721P0982p5436j93755k40331j93922k8536J71042K09926L3647j45454
$$ 2044721 2115703 2040267 1846512 1606181 1412259 1383723 1554765 1764691 1798338 1652884
38741A652884j22477J5971N9246K0052Q8463K81808L77760K32483k2019j66259
$$ 1652884 1530407 1546378 1605624 1625676 1714139 1995947 2373707 2606190 2584171 2417912
38731B417912j49997r7925j40862k76789l51659j99292J38079L89395L50550J24804
$$ 2417912 2267915 2169990 2029128 1752339 1400680 1201388 1339467 1728862 2079412 2204216
38721B204216n5373j44050k34826k97422k21356p7869m0477l9226J68925N10811
$$ 2204216 2148843 2004793 1769967 1472545 1251189 1173320 1132843 1093617 1262542 1773353
38711A773353N49333J13061l63355m04156j21565M9854J9645L7722J56776J48221
$$ 1773353 2322686 2435747 2072392 1668236 1546671 1596525 1616170 1653892 1810668 1958889
38701A958889m0969j57696o0951P4092R3104R0076J40307J00457j09227k67716
$$ 1958889 1917920 1760224 1699273 1773365 1866469 1956545 2096852 2197309 2088082 1820366
38691A820366j57010P4889J28250O380l1430Q6372J40055j0700k00219j96431
$$ 1820366 1663356 1738245 1866495 1872875 1841445 1927817 2067872 2057172 1856953 1660522
38681A660522n72J96545K54616J91880J11461Q2374P3527k406j53209k50290j77456
$$ 1660522 1659950 1856495 2111111 2302991 2414452 2496826 2570353 2567947 2414738 2164448 1986992
38670A986992p697O2973m5513k10778k61530j40782P4361K32866K08064L5021
$$ 1986992 1979295 2042268 1996755 1785977 1524447 1383665 1458026 1690892 1898956 1933977
38660A933977o9352N7313K79930L07299Q7300j11556p1935R0403J25912p968j47668
$$ 1933977 1864625 1921938 2201868 2509167 2596467 2484911 2412976 2503379 2629291 2621323 2473655
38649B473655j72072j06217l2265k4525j31314l01516l61957j89138J08908K89004
$$ 2473655 2301583 2195366 2163101 2138576 2007262 1705746 1343789 1154651 1263559 1552563
38639A552563K45464R2461j3873l0939j523K8474L2371Q949j2278j4976l1139
$$ 1552563 1798027 1890488 1876615 1845676 1844153 1872627 1904998 1913947 1901669 1886693 1855554
38628A855554p3394o4644O8464K47036L01802J96239O7222R417m7065j66450k42745
$$ 1855554 1782160 1717516 1785980 2033016 2334818 2531057 2598279 2607696 2560631 2394181 2151436
38617B151436j44649M5322J01307l3816j54190o5932J54403K68286J76913P792
$$ 2151436 2006787 2052109 2153416 2119600 1965410 1899478 2053881 2322167 2499080 2506872
38607B506872p8702o2578k6815m1073j25962k52201l15968j95200P9608K78721
$$ 2506872 2428170 2365592 2338777 2297704 2171742 1919541 1603573 1408373 1487981 1766702
38597A766702K20247K3336l2960J03140J80552N204k86551m12606k78548j4680
$$ 1766702 1986949 2010285 1977325 2080465 2261017 2266221 1979670 1567064 1288516 1273836
38587A273836K16000L19511K60340Q8314o2105j05755r5945r2594k8289J58964
$$ 1273836 1489836 1809347 2069687 2158001 2095896 1990141 1894196 1801602 1773313 1932277
38577A932277L37272L05462Q0056j16048j49793r5779m9529l433M5663L6484k7449
$$ 1932277 2269549 2575011 2655067 2539019 2389226 2293447 2243918 2240485 2286148 2322632 2295183
38566B295183k7758R4709K22413K09262O3032r7432j88254j89508j05826J6032
$$ 2295183 2267425 2362134 2584547 2793809 2856841 2759409 2571155 2381647 2275821 2291853
38556B291853Q4085N3577j1185j9751L8447J11611J59753J64932J10514j151j29693
$$ 2291853 2375938 2429515 2418330 2398579 2437026 2548637 2708390 2873322 2983836 2982685 2852992
38545B852992k13104j85552j0798K31163L27257J35832j75006k45511M1148L69668
$$ 2852992 2639888 2454336 2443538 2674701 3001958 3137790 2962784 2717273 2758421 3128089
38535C128089L56681K0960k47626j61694J49301L26418J93718q5560k39107j87106
$$ 3128089 3484770 3505730 3258104 3096410 3245711 3572129 3765847 3680287 3441180 3254074
38525C254074n7593M2527J36770K33307K28412P1179r7930j25808o7372o0549
$$ 3254074 3196481 3239008 3375778 3609085 3837497 3908676 3810746 3684938 3617566 3557017
38515C557017q1453l0476L3288q28l1673J00763K45917R8518k55935l64364p8752
$$ 3557017 3475564 3445088 3478376 3477548 3445875 3546638 3792555 3891073 3635138 3270774 3192022
38504C192022K14287K09226R7153J12951J01500r9756k34655m7444J81425M9203
$$ 3192022 3406309 3615535 3712688 3825639 3927139 3827383 3592728 3545284 3726709 3775912
38494C775912k40597j51617K88121M74929J47017k62815l31338j89626j44010
$$ 3775912 3535315 3383698 3671819 4146748 4293765 4030950 3699612 3509986 3365976
38485C365976j84650j51669o7589k2123M2227J86235K99305K70313J71773J09391
$$ 3365976 3181326 3029657 2962068 2939945 2982172 3168407 3467712 3738025 3909798 4019189
38475D019189N1931m0309q8091m5667j8367p9899j27525o4896K0037N598p1307
$$ 4019189 4071120 4030811 3942720 3897053 3878686 3798787 3671262 3606366 3626403 3632001 3560694
38464C560694j09912j06792j03667r9556j11556j80099k31626j14590J32345K54214
$$ 3560694 3450782 3343990 3240323 3140767 3029211 2849112 2617486 2502896 2635241 2889455
38454B889455J45091K1645P8231J91687J61125L1091m5341p6173j25869j15288
$$ 2889455 3034546 3056191 3134422 3326109 3487234 3518325 3472984 3396811 3270942 3155654
38444C155654K0407J30994P4626l517R8096K61544K25413L8609j2538J09071J36394
$$ 3155654 3176061 3307055 3381681 3378164 3476260 3737804 3963217 4001826 3989288 4098359 4234753
38433D234753m0749j95515j38411N112J7820j11227k26960k03429k6459J99174
$$ 4234753 4194004 3998489 3860078 3865190 3883010 3771783 3544823 3341394 3314935 3514109
38423C514109K96874J91639K6720k4413j0340q7303k19415k34990j43746j13791
$$ 3514109 3810983 4002622 4029342 4004929 3994589 3907286 3687871 3452881 3309135 3195344
38413C195344j29795R378K89779M06160K20848R29J2370J34880J01804q5449k22526
$$ 3195344 3065549 3074927 3364706 3770866 3991714 3992643 4005013 4139893 4241697 4156248 3933722
38402C933722k25112j50107q568K13454M15258M55537L21067Q8075j91711m24170
$$ 3933722 3708610 3558503 3549935 3763389 4178647 4634184 4955251 5043326 4851615 4427445
38392D427445m23337j34998J84673K39329Q1464N293R9321J65813R0667J8933
$$ 4427445 4004108 3869110 4053783 4293112 4374576 4379869 4479190 4645003 4735670 4754603
38382D754603P6958J53639R5690n0030j38502j49248j58832j71003j15146K4119
$$ 4754603 4831561 4985200 5080890 5030860 4892358 4743110 4584278 4413275 4298129 4322248
38372D322248J84237L03654L42260K68278J15461P647K0289N5489j9185j33706
$$ 4322248 4506485 4810139 5152399 5420677 5536138 5543785 5564074 5619563 5600378 5466672
38362E466672q4732J30187K35527M9373k21812k42719j3077J52603R5253J3124
$$ 5466672 5381940 5512127 5747654 5797027 5575215 5332496 5319419 5472022 5567275 5580399
38352E580399J06876K48059J90499k6506j21852J6060J81539J53810l2445j99716
$$ 5580399 5687275 5935334 6125833 6099327 5977475 5993535 6175074 6328884 6296439 6096723
38342F096723k71645k90853k78867k02362n5856J11667K51172L36384L39560K42673
$$ 6096723 5825078 5534225 5255358 5052996 4997140 5108807 5359979 5696363 6035923 6278596
38332F278596Q3692m8303q3009k0650Q3165J59756J55434N9713n9225p3292Q5047
$$ 6278596 6362288 6313985 6230976 6210326 6293491 6453247 6608681 6668394 6609169 6535877 6620924
38321F620924L04771L69610K08148J1542N807J46150J74874j1832k14858k10840
$$ 6620924 6925695 7295305 7503453 7514995 7520802 7666952 7841826 7829994 7615136 7404296
38311G404296k7233J64424K87198L42590K78412P3380j11545q3201R1668J51004
$$ 7404296 7377063 7541487 7828685 8171275 8449687 8523067 8411522 8328321 8419989 8570993
38301H570993J7899r1253r249J27504R9098o4573j35351o232J91338K80592K31400
$$ 8570993 8588892 8497639 8488390 8615894 8714992 8650419 8515068 8508836 8700174 8980766 9212166
38290I212166J30357M1819l4769r0569o8980M5668J48537J26400M5174Q8661K65631
$$ 9212166 9342523 9384342 9349573 9259004 9190024 9235692 9384229 9510629 9555803 9644464 9910095
38279I910095L42881J82200k3762l4665O7104M2477o9966n675K51407L85762K30272
$$ 9910095 10252976 10435176 10411414 10376749 10443853 10486330 10416364 10410689 10662096 11047858 11278130
38268A1278130K5200M4023K13777K99011K60291K14271J85017J17131M9678P9189
$$ 11278130 11303330 11347353 11561130 11860141 12120432 12334703 12519720 12636851 12686529 12765718
38258A2765718J89479K63781K32445J10783m4299j25786j9321K33227M00470L10597
$$ 12765718 12955197 13218978 13451423 13562206 13517907 13392121 13372800 13606027 14006497 14317094
38248A4317094O2403j11112j04571K7914J95017L08252L04921K50173L08434M94229
$$ 14317094 14379497 14268385 14163814 14191728 14386745 14694997 14999918 15250091 15558525 16052754
38238A6052754N83257M19483J70340Q8667J52255J70858J45218K38835M31525
$$ 16052754 16636011 17055494 17225834 17314501 17466756 17637614 17782832 18021667 18453192
38229A8453192M96923L69682K75364L92368N87644O21467M73375L20791K73177
$$ 18453192 18950115 19319797 19595161 19987529 20575173 21196640 21670015 21990806 22263983
38220B2263983K70757K43787K58164M19129O52244P03961M61473J81930K08073
$$ 22263983 22534740 22778527 23036691 23455820 24108064 24812025 25273498 25455428 25663501
38211B5663501M78527N80951L57974J62414L30680O83004Q26309P30136O54650
$$ 25663501 26142028 26722979 27080953 27243367 27574047 28257051 29083360 29813496 30468146
38202C0468146O60957N88443M52140M54655N82575N76315L84862K98296M96892
$$ 30468146 31129103 31717546 32169686 32624341 33206916 33783231 34168093 34466389 34963281
38193C4963281P79247Q96675Q79480Q51877P80936O30912N57521O96663Q98552
$$ 34963281 35742528 36639203 37518683 38370560 39151496 39782408 40339929 41036592 41935144
38184D1935144R18407P89040P67805R38284J086251J027841R00311R96353J349073
$$ 41935144 42853551 43642591 44410396 45348680 46434931 47462772 48363083 49359436 50708509
38175E0708509J622432J511988J181002J100458J418053J734354J675798J445389
$$ 50708509 52330941 53842929 55023931 56124389 57542442 59276796 60952594 62397983
38167F2397983J496045J830209K032564J940551J836203J917183K018207K010162
$$ 62397983 63894028 65724237 67756801 69697352 71533555 73450738 75468945 77479107
38159G7479107K071889K339595K630850K772130K895297L134811L321947L301225
$$ 77479107 79550996 81890591 84521441 87293571 90188868 93323679 96645626 99946851
38151I9946851L296037L589701M030617M243292M211331M262512M531477M815436
$$ 99946851 103242888 106832589 110863206 115106498 119317829 123580341 128111818 132927254
38143A32927254M977690N157284N502886N952108O353387O629115O788579O932657
$$ 132927254 137904944 143062228 148565114 154517222 160870609 167499724 174288303 181220960
38135A81220960P224764P692780Q118246Q320928Q473765Q875845R471655R913078
$$ 181220960 188445724 196138504 204256750 212577678 221051443 229927288 239398943 249312021
38127B49312021J0101978J0327447J0778908J1250026J1483057J1527917J1559158
$$ 249312021 259413999 269741446 280520354 291770380 303253437 314781354 326340512
38120C26340512J1568736J1477080J1371185J1358618J1276842J0820059R953674
$$ 326340512 337909248 349386328 360757513 372116131 383392973 394213032 404166706
38113D04166706Q979357Q140742P343764O352344N120072L792940K452802J020843
$$ 404166706 413146063 421286805 428630569 434982913 440102985 443895925 446348727 447369570
38105D47369570n52767k132399l532969m749460n925088p102136q138909q913644
$$ 447369570 446816803 444684404 441151435 436401975 430476887 423374751 415235842 406322198
38097D06322198r492218j0022814j0555174j1036766j1407678j1629425j1697248
$$ 406322198 396829980 386807166 376251992 365215226 353807548 342178123 330480875
38090C30480875j1683798j1678008j1625320j1357413j0863988j0383000j0092649
$$ 330480875 318797077 307119069 295493749 284136336 273272348 262889348 252796699
38083B52796699r866238r503612r060967q727421q481504q133278p664808p267366
$$ 252796699 242930461 233426849 224365882 215638461 207156957 199023679 191358871 184091505
38075A84091505p028788o820103o539081o262078o081538n946335n731647n366466
$$ 184091505 177062717 170242614 163703533 157441455 151359917 145413582 139681935 134315469
38067A34315469m873743m379775m058823l951169l882089l695052l487195l432352
$$ 134315469 129441726 125061951 121003128 117051959 113169870 109474818 105987623 102555271
38059A02555271l458575l348083l106182k946941k915923k824880k602333k410333
$$ 102555271 99096696 95748613 92642431 89695490 86779567 83954687 81352354 78942021
38051G8942021k332455k239152k080487k026497k149443k217242k006814j636433
$$ 78942021 76609566 74370414 72289927 70263430 68113987 65896745 63889931 62253498
38043F2253498j394742j384642j495204j585520j551000j344282j066596r13533
$$ 62253498 60858756 59474114 57978910 56393390 54842390 53498108 52431512 51517979
38035E1517979r28685r59182r34558r82770j153122j254882j141746r49541q65775
$$ 51517979 50589294 49630112 48695554 47712784 46559662 45304780 44163034 43213493 42347718
38026D2347718q57753q19328p87306q02381p54762n98868n26163o73077q46765
$$ 42347718 41489965 40670637 39883331 39080950 38326188 37727320 37201157 36528080 35681315
38017C5681315q11530o57486n90858n61853m50636m23475o68473r16157p26102
$$ 35681315 34869785 34212299 33621441 33059588 32608952 32185477 31517004 30600847 29874745
38008B9874745k18607q645l40586p65625q20506n92420m14600l85957m29697n09615
$$ 29874745 29656138 29647493 29306907 28541282 27720776 27128356 26713756 26327799 25898102 25388487
37998B5388487n48956m08139j63533j38116m29544o84556n98599l65156l24534
$$ 25388487 24839531 24431392 24267859 24129743 23700199 23015643 22417044 22051888 21727354
37989B1727354m24149m00091k95780l70579n88640o29332m07994k00949j95684
$$ 21727354 21303205 20903114 20607334 20236755 19648115 19018783 18610789 18409840 18214156
37980A8214156k58891k43479k15330k45168k44421j64232j33838k36376l37344
$$ 18214156 17955265 17711786 17496456 17251288 17006867 16842635 16708797 16472421 16135077
37971A6135077l05241k34372k65652l31949k87260j80441j75880k57867k40812
$$ 16135077 15829836 15595464 15329812 14997863 14710603 14530162 14354282 14096415 13855603
37962A3855603p7875M4221k5277j92741k64554j98590j25222j64493k84664l37147
$$ 13855603 13777728 13821949 13796672 13603931 13339377 13140787 13015565 12851072 12566408 12229261
37952A2229261k21776j8813Q5907L6798j2796N7096J10472n5789l54305m67135
$$ 12229261 12007485 11988672 12074579 12111377 12098581 12155677 12266149 12210360 11856055 11388920
37942A1388920k91750r1710j04234k19619k10332q4286K305L1581P4614O4071
$$ 11388920 11097170 11005460 10901226 10681607 10471275 10386989 10389294 10420875 10495489 10559560
37932A0559560j03575k92013k46977L96J42155N1774n6871j8535L1219n0748j39512
$$ 10559560 10455985 10163972 9916995 9917391 10059546 10111320 10054449 10035914 10067133 10016385 9876873
37921I876873p6784L2791L398j16325j57245j28636j45367j57425k8158J68630
$$ 9876873 9800089 9832880 9836278 9719953 9562708 9434072 9288705 9131280 9103122 9271752
37911I271752K01933L0728j44036j89301j78411j93249k01132j77426j67526j80758
$$ 9271752 9473685 9504413 9360377 9171076 8992665 8799416 8598284 8420858 8253332 8072574
37901H072574j80524j94859k64169k83329j12589J37188J78296l3894k07436j39093
$$ 8072574 7892050 7697191 7433022 7149693 7037104 7174292 7352588 7318694 7111258 6972165
37891F972165J6149L6901m2837q0732q2867j09726j04987l1344j7095j43829k38274
$$ 6972165 6988314 7025215 6982378 6901646 6818779 6709053 6604066 6572722 6555627 6411798 6173524
37880F173524j21906O6843P4210n6555q1022J5297K5516n8554p062K02725K69506
$$ 6173524 6051618 6118461 6192671 6136116 6055094 6070391 6095907 6037353 6030291 6233016 6502522
37869F502522M9456j71784j12603O4683K3231k28669l88961l22878j72531m9157
$$ 6502522 6551978 6380194 6267591 6332274 6355505 6126836 5737875 5414997 5242466 5193309
37859E193309R2466K46384K83394J70589N6504L2167k1578k20829m47667m82038
$$ 5193309 5285775 5532159 5815553 5986142 6042646 6074813 6053235 5832406 5384739 4902701
37849D902701k87556l2860J22802J48623R0278K2188L1328J31008J97841J09931
$$ 4902701 4615145 4582285 4705087 4853710 4943988 4966176 4997504 5128512 5326353 5436284
37839E436284n5731r9415P414O4948m2278j40877l4604J44841Q5168k24115m04030
$$ 5436284 5380553 5281138 5288552 5353500 5311222 5170345 5135741 5280582 5365750 5141635 4737605
37828D737605j84055K02075L01191K5690k53418j97707J01959K97428K17526M817
$$ 4737605 4553550 4755625 5056816 5082506 4829088 4631381 4733340 5030768 5248294 5253111
37818E253111j20507j00331l0736j0337m9410r6843j16369j25225j50186j55033
$$ 5253111 5132604 5032273 5001537 4991200 4941790 4844947 4728578 4603353 4453167 4298134
37808D298134o7327Q7941J53285L3191j24591q8954J10770J81227j8255k37062
$$ 4298134 4230807 4318748 4472033 4505224 4380633 4291679 4402449 4583676 4565421 4328359
37798D328359j70830J04383K59950J97857J34023J87738J75930n6077l29299l59781
$$ 4328359 4157529 4261912 4521862 4719719 4853742 5041480 5217410 5161333 4832034 4472253
37788D472253j60403n154m7347j57996j45326K344J22811N9550j67835l41775
$$ 4472253 4311850 4306696 4259349 4101353 3956027 3958371 4081182 4140732 3972897 3631122
37778C631122k47707O0245K81188K24533L5848m1753p381k9149j23057j33439
$$ 3631122 3383415 3443660 3724848 3949381 3985229 3943476 3936095 3906946 3783889 3650450
37768C650450j9597O1495M666r9885j45369j69354k35906k76822j65637J04551
$$ 3650450 3630853 3692348 3697014 3597129 3451760 3282406 3046500 2769678 2604041 2708592
37758B708592L91832N24094M24635J72613m7212j10670p2396o6620j24326j73474
$$ 2708592 3100424 3624518 4049153 4221766 4174554 4063884 3991488 3924868 3800542 3627068
37748C627068j74011j30128q508K00298L61342L15904J25675P974J5349j344p3262
$$ 3627068 3453057 3322929 3314421 3514719 3876061 4191965 4317640 4325614 4340963 4339619 4266357
37737D266357k2405J92629K99128Q4106k44265l08978o4673J82539J92711K2518
$$ 4266357 4243952 4436581 4735709 4819815 4575550 4266572 4201899 4384438 4577149 4599667
37727D599667j35820j67267q0199L0261N7431k82k7401M3088J24308J12058L5413
$$ 4599667 4463847 4296580 4216381 4246642 4304073 4303791 4276390 4319478 4443786 4555844 4591257
37716D591257k0173l5580j644J30980L11162L37878J32095p0977k0017J71363
$$ 4591257 4571084 4535504 4533860 4664840 4976002 5313880 5445975 5374998 5354981 5526344
37706E526344J97785L6826m9110L0840N5588j23735l40614l75724k39552o4603
$$ 5526344 5724129 5760955 5711845 5742685 5798273 5674538 5333924 4958200 4718648 4654045
37696D654045R1413J99635J90454P9405K0447Q5428J18606k9641k34565k45204
$$ 4654045 4745458 4945093 5135547 5214952 5235399 5320827 5439433 5409792 5175227 4930023
37686D930023l7799J55225J48019j8265j94932k87667k75632j80996o3830J8552
$$ 4930023 4892224 5047449 5195468 5177203 4982271 4694604 4418972 4237976 4174146 4192698
37676D192698O8835J10902R8991m1580k56299l47640k01674L9065J38646P1486
$$ 4192698 4261533 4372435 4471426 4429846 4173547 3825907 3624233 3663298 3801944 3873430
37666C873430K7814J01380J36560r487j94189j65453N9944K14236J72682R7903
$$ 3873430 3901244 4002624 4139184 4129697 3935508 3770055 3829999 4044235 4216917 4314820
37656D314820J31293J72455R0467n1362j47947k48349m00297m58332k85932l2385
$$ 4314820 4446113 4618568 4709035 4657673 4509726 4261377 3861080 3402748 3116816 3084431
37646C084431M6650l8121p5491k1253j0979m4033K6511J69547J61608l3981j78880
$$ 3084431 3131081 3092960 3017469 2996216 2985237 2941204 2967715 3137262 3298870 3264889 3086009
37635C086009j51495j21836j88769j48492J43621M21806L08034j62799n62909
$$ 3086009 2934514 2812678 2623909 2475417 2619038 3040844 3348878 3186079 2623170
37626B623170n59223k07490J79269L15664J59428n2198n2270J20304J77940K3326
$$ 2623170 2063947 1856457 2035726 2351390 2510818 2458620 2406350 2526654 2704594 2727920
37616B727920j03612l6467L8833o5588j81241q9689L6805j01363l65172l19946
$$ 2727920 2624308 2587841 2626674 2561086 2379845 2290156 2326961 2225598 1860426 1540480
37606A540480Q6017M24922M20682K54036J28116m0682k85031l33276k0002L33255
$$ 1540480 1626497 2051419 2472101 2726137 2854253 2813571 2528540 2195264 2175262 2508517
37596B508517L19391M9262k7735J86821L24902J42259j42615k21909j19312n1146
$$ 2508517 2827908 2877170 2849435 3036256 3361158 3503417 3360802 3138893 3019581 2968435
37586B968435p2100p6301l3345q768J905O5715J41107R0677r0463k05645r8474
$$ 2968435 2896335 2820034 2786689 2777921 2779826 2845541 2986648 3077325 2986862 2781217 2682743
37575B682743J33925K55182J53246q0617k74085l01766j52045M6659J10798n746
$$ 2682743 2816668 3071850 3225096 3144479 2870394 2568628 2416583 2463242 2574040 2568294
37565B568294j48945j68462j09076r2438r8508k9922P1179P7805K2467N3570J39678
$$ 2568294 2419349 2250887 2141811 2049373 1950865 1920943 1992122 2069927 2092394 2145964 2285642
37554B285642Q4755r7505j18647J27273L23860J81730j06925j56978L6105J45871
$$ 2285642 2370397 2272892 2154245 2281518 2605378 2787108 2680183 2523205 2559310 2705181
37544B705181M4051p3008p7355q6325j73780k00731o5780J00542J36902P9686
$$ 2705181 2749232 2676224 2598869 2512544 2338764 2138033 2072253 2172795 2309697 2389383
37534B389383N6340Q2970R4085P3418M5679J2297k6000n1908q6414j74138k71478
$$ 2389383 2445723 2528693 2622778 2696196 2741875 2754172 2728172 2676264 2589850 2415712 2144234
37523B144234k53277q6205J01955J77317J29569J3591j17776j79920r6367N7023
$$ 2144234 1890957 1804752 1906707 2084024 2213593 2227184 2109408 1929488 1833121 1890144
37513A890144Q3433p5427k39545k34219r6351N2581J79359K61102K03183Q784
$$ 1890144 1973577 1898150 1658605 1424386 1328035 1380616 1559975 1821077 2024260 2033044
37503B033044j12654q171J63558J55079R42q3998q9226j85678l39443k84912L8086
$$ 2033044 1920390 1912219 2075777 2230856 2231798 2147800 2058574 1872896 1533453 1248541 1286627
37492A286627L21756L02878Q5163j05808k43007l65672l50154r5951J96678K34780
$$ 1286627 1608383 1911261 1996424 1890616 1647609 1281937 931783 835832 1032510 1267290
37482A267290N5713m3593K4534M0137j14330k43444j60539K7600J25502J41659
$$ 1267290 1323003 1279410 1303944 1344081 1229751 986307 825768 853368 978870 1120529
37472A120529J82028K06032J13696k0828l9273J5250o4959l06370m51429k82980
$$ 1120529 1302557 1508589 1622285 1601457 1562184 1577434 1512475 1206105 754676 471696
37462D71696R0613L67217L81817K30313J12420J04640Q3112j11545m15001n34899
$$ 471696 562309 929526 1311343 1541656 1654076 1758716 1841828 1730283 1315282 780383
37452G80383l07077L5081J24123n7358j76754l9887J70221K19356J43967J03368
$$ 780383 473306 508387 632510 575152 398398 358511 528732 748088 892055 995423
37442I95423J10988R2451N9335M3424j6020j40891j90812o1840J02036J03194
$$ 995423 1106411 1198862 1258197 1301621 1285601 1144710 953898 892058 994094 1097288
37432A097288k171j7036O0789P2944J8270N2266J67509J62692j0345j37646q5348
$$ 1097288 1095117 1078081 1138870 1211814 1230084 1282350 1449859 1612551 1602206 1464560 1379212
37421A379212j1157q9941k24416k03620j9787J36967J26153j9398j57156j44465
$$ 1379212 1368055 1278114 1053698 850078 830291 967258 1093411 1074013 916857 772392
37411G72392L9839K23030J86166n1254k10286j00886J29427K08599R3798l2552
$$ 772392 812231 1035261 1221427 1170173 959887 859001 988428 1197027 1290825 1258273
37401A258273n0308k4325m9001j06325j19847p2846k0110j801J5225Q1016J55907
$$ 1258273 1207965 1183640 1134639 1028314 908467 835621 815511 813710 828935 909951 1065858
37390A065858J29350j1112j13004n9957L4642j6208j69838j95146k0586J55071
$$ 1065858 1195208 1184096 1071092 1011135 1045777 1029569 859731 664585 643999 799070
37380G99070J47948P301j16662j57273j10246J0838J16328R1040k0728m2821M8525
$$ 799070 947018 954319 837657 680384 570138 580976 697304 788344 767616 724795 773320
37369G73320O4551o9361j46313J093K11954K34217R2967K463L0325O7767M7190
$$ 773320 837871 768510 622197 623290 835244 1069461 1162428 1164891 1195216 1262983 1310173
37358A310173j1590r9485j85249j67064k5148P8548K6539n4915k2708Q241j20048
$$ 1310173 1298583 1199098 1013849 846785 821637 900185 926724 871809 849101 857342 737294
37347G37294k55744j31528J61460K58459Q1659m7505P2568K34710J89022N015
$$ 737294 481550 350022 511482 769941 851600 804095 876663 1111373 1300395 1305410
37337A305410j09556j23162j27287j38380j23515r8982p2288l395P6422M7636
$$ 1305410 1195854 1072692 945405 807025 683510 584528 512240 508845 585267 632903
37327F32903r0110j46056k289J93440K42915J71693J21684Q7223l4166j84762
$$ 632903 542793 396737 394448 587888 830803 1002496 1124180 1211403 1177237 992475
37317I92475j60098Q8041L24992K90645K247k72968l14651j53277L1545J48214
$$ 992475 832377 920418 1245410 1536055 1538302 1265334 950683 797406 828951 977165
37307I77165K39130L02992K21582l9033k78305k78322j00634J8553K2254O3576
$$ 977165 1216295 1519287 1740869 1701836 1423531 1145209 1044575 1063128 1085382 1148958
37297A148958J92921K63654K05306J49489J77100J57959j2249j98254k17131j04873
$$ 1148958 1341879 1605533 1810839 1960328 2137428 2295387 2283138 2084884 1867753 1762880
37287A762880k7285l8842q7430j55027k27190k03513j2060K24505K84410J01264
$$ 1762880 1735595 1696753 1609323 1454296 1227106 1023593 1011533 1236038 1520448 1621712
37277A621712j70286l21616k61723p2108N7260J1555r8301o9475R0392J60294
$$ 1621712 1451426 1129810 868087 795979 853239 864794 766493 697018 787410 947704
37267I47704N6100l3908J8924N4897p0669j75287k1724K51305K91602N0642j77545
$$ 947704 1003804 969896 988820 1043717 973048 797761 776037 1027342 1318944 1369586 1192041
37256A192041k08485j50224j19598p8803k0808m0590j19648q3542J04966K32868
$$ 1192041 983556 833332 713734 634931 614123 573533 453885 370343 475309 708177
37246G08177J59402N1129J20632K90747L17954J49308l8388j07759r6675r1650
$$ 708177 867579 918708 1039340 1330087 1648041 1797349 1758961 1651202 1554527 1462877
37236A462877j07850j25377j49374j86880k06386j60529n1334M2407L4516n5330
$$ 1462877 1355027 1229650 1080276 893396 687010 526481 475147 517554 552070 496740
37226D96740j01701l1680O6448O5007k0891p2399n0197j7138J355M4322J05173
$$ 496740 395039 363359 429807 494814 473923 401524 351327 334189 335544 379866 485039
37215D85039J33208J50316K17204K71522J72100n6101k02155j59341n1434J3994
$$ 485039 618247 768563 985767 1257289 1429389 1373288 1171133 1011792 960358 974352
37205I74352J11535K79666L39545J38801j69881l20834k99787k76016k52883p5953
$$ 974352 1085887 1365553 1705098 1843899 1674018 1353184 1053397 777381 524498 448545
37195D48545K08656L01084O3905k30220k27501O3671L13220K78533L2631j89956
$$ 448545 657201 958285 1022190 791970 564469 628140 941360 1219893 1252524 1062568
37185A062568k54485k05199j49044j14445m1494R9146K24783K21000Q1056p9984
$$ 1062568 808083 602884 453840 339395 297901 397047 621830 842830 923886 843902
37175H43902j33528k7341J83361L34912K52087m6222k88119k36319p448O9124
$$ 843902 710374 683033 866394 1201306 1453393 1407171 1119052 882733 875285 944409
37165I44409q2983j76590Q27K50616K38957l7091k77072k99897k13201j60180
$$ 944409 861426 684836 685663 936279 1175236 1138145 861073 561176 347975 187795
37155A87795j13234k291J05104Q1334o0779j48826m0847K05367L71355K95600
$$ 187795 74561 72270 177374 258708 197929 49103 8256 213623 584978 880578
37145H80578M8889j42134j50913o2810p620J1138M0534M8496P006P705J15426
$$ 880578 929467 787333 636420 573610 565990 577128 617662 666158 673164 680869 796295
37134G96295J82441L1671k17667k70829j05644n07n7696m1035J58571K50268J4143
$$ 796295 978736 1010407 792740 521911 416267 415760 358064 317029 475600 725868 740011
37123G40011k51618j31893K47998L82565J15951k01321k73663j77167o0369Q7010
$$ 740011 488393 356500 604498 987063 1103014 901693 628030 450863 390494 477504
37113D77504K36743K23852J6963j70086j86614j30455j02258l7061P6562R1365
$$ 477504 714247 938099 955062 784976 598362 467907 365649 328588 405150 496515
37103D96515m470K2553K42151L35362P1249k61178k58222k0332M9936q1558p6492
$$ 496515 492045 514598 756749 1092111 1163360 902182 643960 623628 673564 592006 515514
37092E15514J55200K98134J61232m4517q6072k1630J8713O6090J51845J65897
$$ 515514 670714 968848 1130080 1085563 999491 977861 996574 1062664 1214509 1380406
37082A380406O0259j4448M5243R6639k0857k14579k81190j98987r9164l6615L8504
$$ 1380406 1440665 1426217 1471460 1568099 1547242 1332663 1051473 852486 753322 716707 755211
37071G55211J30278J61341P7821q4153k14415j95422l0714Q7954l1234l00570
$$ 755211 885489 1046830 1124651 1040498 826083 630661 599947 687901 656667 356097
37061C56097m14232k32468O5327K65893L55995L77093K74942N9594q1795l3971
$$ 356097 -58135 -290603 -225276 40617 396612 773705 1048647 1108241 1026446 992475
37051I92475M6041j1315q5226K3240J99557J42577j54968l53198k34315K5269
$$ 992475 1038516 1027201 941975 965215 1164772 1307349 1152381 799183 564868 590137
37041E90137J35112M5252q4275j24805p5967K134O4396J05221J31503J11365J727
$$ 590137 725249 770501 686226 561421 485454 487588 551984 657205 788708 900073 901800
37030I01800j36375j42039L3986K10821J95047L8181o5697n9287k5994J3560R6836
$$ 901800 765425 623386 657372 868193 1063240 1101421 1035724 976437 950443 964003 1060839
37019A060839J49953N6977j00055j08342L5793R5987k9763j49266r8535J4855
$$ 1060839 1210792 1267769 1167714 1059372 1095165 1191152 1161389 1012123 913588 928443
37009I28443M6398P1945J96062K72717Q0695k96853n16578l99384j18330O0133
$$ 928443 974841 1046786 1242848 1515565 1596260 1299407 782829 383445 265115 325248
36999C25248O3695J166j2089M6563J15255J17345N3941J3413M5530P3692J7152
$$ 325248 388943 390109 378020 424583 539838 657183 711124 724537 770067 843759 860911
36988H60911m7213K0981J75274J84506n0519l15854l35528j19230Q0711J20816
$$ 860911 813698 834679 1009953 1194459 1143940 828086 492558 373328 454039 574855
36978E74855J09680J68418K12087R2380j39176k72250k19418j04941n5726n1016
$$ 574855 684535 852953 1065040 1157420 1018244 745994 526576 421635 365909 314893
36968C14893k7261J4760Q3763K25352L61698K68971j00363m11801l19427L2906
$$ 314893 287632 302392 386155 611507 973205 1242176 1141813 730012 410585 443491
36958D43491J73390m1081k49268j47690R0176J41178J5747m3944K7032R0720R1254
$$ 443491 616881 575800 326532 178842 269018 410196 425943 381999 409031 499751 591005
36947E91005Q9294N3205j14178l23095l19998l8119K71121L50483K24318P7723
$$ 591005 680299 733504 619326 296231 -23767 -61886 209235 559718 784036 861759
36937H61759q163p1591j19403j06700l7407K7296O3134J05934J63882J65300M0268
$$ 861759 853596 782005 662602 555902 518495 545791 608925 714859 878741 1044041 1084309
36926A084309j53188k33339q0814J83313K87882J29248q2450q8985O9887J18430
$$ 1084309 931121 697782 616968 800281 1088163 1217411 1134961 1045976 1115863 1234293
36916A234293o5634k86646k98471r5839J35897K46306K03913N2343j03677j30395
$$ 1234293 1168659 882013 583542 487703 623600 869906 1073819 1126162 1022485 892090
36906H92090K139J49174J49709L2490l0811L5141J17832Q3672m4434j21610n9828
$$ 892090 894229 1043403 1193112 1225602 1194791 1229932 1347764 1431436 1387002 1265392 1205564
36895A205564O2875Q2260n2692j81845j03957J45062K90013J59136q1423j59962
$$ 1205564 1268439 1350699 1298007 1116162 1012205 1157267 1447280 1606416 1524993 1365031
36885A365031p4069m9083j58101k04854l9727K02111K92370K00935P0663M568
$$ 1365031 1290962 1241879 1083778 878924 839197 1041308 1333678 1534613 1605276 1609844
36875A609844O719N8734J26326J37145O0701l0127o0243m5717R37J45878L67863
$$ 1609844 1616563 1675297 1801623 1938768 1999469 1969342 1909099 1863382 1864319 2010197 2378060
36864B378060M32284J56980k48525l68631j25713J17526P3996j02907j17311K0642
$$ 2378060 2810344 2967324 2718799 2350168 2224455 2341981 2415977 2313070 2195759 2216401
36854B216401N9089j02092k92568l09129j26608J05724J91915O9927p2760K5043
$$ 2216401 2275490 2173398 1880830 1571701 1445093 1550817 1742732 1812659 1739899 1764942
36844A764942L23584M42888J48440k85358m16740k13740j6733m29L069J23012
$$ 1764942 2088526 2531414 2679854 2394496 1977756 1764016 1747283 1746854 1749923 1872935
36834A872935K09785R6794j36931l12085l79985l70623k59765l5676J99592L16022
$$ 1872935 2082720 2179514 2042583 1730498 1350513 979890 720125 684449 884041 1200063
36824A200063K77882J19978r9756k72701k91361j96069j42927j64906j17467O2409
$$ 1200063 1477945 1597923 1498167 1225466 934105 738036 595109 430203 312736 375145
36814C75145K21042K25922J62834J53160J46357O6568R45L4413M2817j07092k66606
$$ 375145 596187 822109 984943 1138103 1284460 1351028 1351973 1386386 1429203 1322111 1055505
36803A055505j88079O4449J70273J0209j93167k21848j11421l325M0339J1170
$$ 1055505 867426 931875 1102148 1112357 919190 697342 585921 582596 622935 634105
36793F34105p4587j23801m9146O3711M9038n8259n0337R9779J59427J6197j06362
$$ 634105 559518 435717 386571 450282 499320 441061 390724 490503 649930 666127 559765
36782E59765J5383K45622K71885K7487k58916l62485k56136o3453N4684J4862
$$ 559765 575148 820770 1092655 1120142 861226 498741 242605 179152 233836 248698
36772B48698r6355j06660R139R1783N3010N513L7386N1040j1817J3705K37417
$$ 248698 152343 45683 54822 146605 199615 205128 242514 293554 281737 295442 532859
36761E32859M20516K63339j11469k91725j60100j1457n6918j48984j11236l6134
$$ 532859 953375 1216714 1105245 813520 653420 641963 585045 436061 324825 288691
36751B88691p1253j41959r6747L2585J14266J39681J76597J90232R1793q6101
$$ 288691 217438 75479 -21268 11317 125583 265264 441861 632093 723886 637785
36741F37785k12879k21748j34184J5601J59278J66438j5884k35775k84577j43553
$$ 637785 424906 203158 68974 84575 243853 410291 394407 158632 -125945 -269498
36731b69498L6474J53384K10648K00696J02308j3808m3366k0631o6948j53861
$$ -269498 -233024 -79640 131008 331704 434012 420204 376838 356207 289259 135398
36721A35398j09221Q6363K10078J15326l7343k4766J02228J22162J219o6750K7999
$$ 135398 26177 112540 322618 437944 400601 375835 478063 600225 601444 534694 562693
36710E62693J53603J43756J5420j01639j50073j61973j45373n6915J02849K32621
$$ 562693 716296 860052 875472 773833 623760 461787 316414 259499 362348 594969
36700E94969K16115N9705r3009j12757k6963L9798M7806P0778J26947J11160j6985
$$ 594969 811084 870789 777780 665023 638060 677858 725664 796442 923389 1034549 1017564
36689A017564r6504K9167K40318K65224O2456j24461j32724q7167j35271j78000
$$ 1017564 921060 950227 1190545 1455769 1518225 1393764 1261040 1173873 1038602 860602
36679H60602n7850J21125J08116r8880k17506q5061J15311J38161J5821m1019
$$ 860602 802752 923877 1031993 933113 715607 630546 745857 884018 899839 858820
36669H58820K6965Q5276N6335J9770K4717k4329j86074l12479k20870J6011J25303
$$ 858820 885785 971061 1027396 1047166 1071883 1047554 861480 549001 328131 344142 469445
36658D69445o607j90863k11643r3800J2110P8651J70885K49367J99613M3591n9553
$$ 469445 462838 271975 60332 -33468 -21358 57293 228178 477545 677158 720749 661196
36647F61196m3253M53J1271M2322J01223R3134N912l0249K0083j0816k08547l63443
$$ 661196 617943 618396 629667 671989 773212 866346 872258 842009 862092 851276 642729 279286
36635B79286k55406j0118P7530k0956p7847j084P0439O1705O4809J01070N5838
$$ 279286 23880 13762 91292 70336 -7511 -8595 61844 123549 188358 289428 345266
36624C45266o4690p7483N6357J13945k0657j18337L3478K35745J39568k11410
$$ 345266 280576 203093 259450 373395 352738 234401 267879 503624 643192 431782
36614D31782m14719k70699k4040K3444r0227j12170M1729J84746J15858j24731
$$ 431782 17063 -253636 -277676 -254232 -344459 -456629 -414900 -230154 -114296 -239027
36604b39027k96038k27886j628J75687K27143K33438K24818J13496r8906k10603
$$ -239027 -535065 -762951 -764579 -588892 -361749 -128311 96507 210003 111097 -99506
36594i9506n9243K30772L88675L17093J40644O184k7123L4980J07967N0382j57588
$$ -99506 -158749 72023 460698 777791 918435 924619 897496 932476 1040443 1090825 933237
36583I33237l26990l03785k07714k36450l30861k87731j31634o3232o0504J05108
$$ 933237 606247 302462 94748 -141702 -472563 -760294 -891928 -955160 -1015664 -910556
36573i10556L96658M47993J39795j29908j7750K36550K00510p2349j73072j8536
$$ -910556 -513898 -65905 73890 -56018 -73768 162782 363292 290943 117871 99335
36563I9335N2473j23649k66539j16121J69474K81257J85929O5820l919q8817j88376
$$ 99335 151808 28159 -238380 -354501 -185027 96230 282159 347979 344060 255243 66867
36552F6867k04865j09039J2196Q4236J15338J28770J10630M6903m0337j04907
$$ 66867 -137998 -247037 -234841 -150605 -35267 93503 204133 251036 210699 105792
36542A05792r3383L1794K33741L74687L12097M7172k52182l96826l35877j74085
$$ 105792 12409 44203 277944 652631 964728 1011900 759718 362892 27015 -147070
36532a47070n3533k7915m2233k1119L9646Q3401P9328N8676N5150N4375L4050
$$ -147070 -200603 -228518 -270751 -291870 -252224 -168823 -89495 -30819 24331 78706 112756
36521A12756J5009K3790L4224J0060j1470M0218J38135J57360M3710j02348j69434
$$ 112756 127765 151555 185779 195839 184369 224587 362722 520082 563792 461444 292010
36510B92010j76128j79380j31544K6859J85995J65156k965q3237J2071Q4588l3654
$$ 292010 115882 -63498 -195042 -168183 17812 182968 180003 96766 108837 193425 159771
36499A59771k19964k74384k13922j48012k4339K29619M31342L39589P6221p296
$$ 159771 -60193 -334577 -548499 -696511 -720850 -491231 -59889 279700 355921 348625
36489C48625J03969N5123k45743l92330j17690K20693J58843j57494k16097O6751
$$ 348625 452594 507717 261974 -130356 -248046 -27353 131490 -26004 -242101 -175350
36479a75350K65956J28368j11366j65860o2890N1837J58534K43809J97351R828
$$ -175350 90606 218974 107608 -58252 -121142 -69305 89229 333038 530389 540217
36469E40217j27153q7423p827o6281k17747l00275k62089j42880K8024J73719
$$ 540217 413064 325641 317814 251533 33786 -266489 -528578 -671458 -643434 -469715
36459d69715J60078J181p4643N9476J96112Q8735j51391k10133m3546Q1160P166
$$ -469715 -309637 -308456 -383099 -323623 -127511 -38776 -190167 -400300 -443846 -362686 -355520
36448c55520j13103r3293L0487J11110J07795R8167J53933K52469K70779J00392
$$ -355520 -468623 -561916 -531429 -420319 -312524 -214357 -60424 192045 462824 563216
36438E63216j62462k34417K234K59874J76357j74454l73787k53943r0691j22788
$$ 563216 400754 166337 168571 428445 604802 430348 56561 -197382 -288073 -410861
36428d10861k02031j04314Q0242J20745K6376j1222N5588J09429J04194R6474
$$ -410861 -612892 -717206 -636964 -516219 -489843 -501065 -445477 -336048 -231854 -135380
36418a35380Q6169L1635j3020K8977Q6485M3909k8414K2722J27665O0876j62276
$$ -135380 -49211 -17576 -30596 -1619 84866 128775 100361 123083 250748 311624 149348
36407A49348k42295m1194J96010K07485O4199k3417l3680n1751m0225N4749J01768
$$ 149348 -92947 -134141 61869 269354 333553 310136 276456 224705 184480 239229 340997
36396C40997l4264j95673j13797J45867K30123K1533j88808j48587J9459Q7811
$$ 340997 306733 111060 -2737 143130 373253 394786 205978 57391 76850 164661
36386A64661Q1304J38435J97527R2331j21023j90885k5390J80467K09212O8486
$$ 164661 245965 384400 581927 674258 553235 362350 336960 517427 726639 795125
36376G95125o2885l7835J24232K36331J14279j65924k65492P870L68695L62543
$$ 795125 732240 694405 818637 1054968 1169247 1003323 737831 745701 1114396 1476939
36366A476939k0186l21584k62900j05192j93788m19602m19806j45333J01160J35507
$$ 1476939 1456753 1135169 872269 767077 573289 153687 -266119 -411452 -310292 -174785
36356a74785Q1203O4283J7374j02773j45936J1560K33720K89025J56422Q948m8503
$$ -174785 -93582 -29299 -11925 -114698 -260634 -249074 -15354 273671 430093 439041 390538
36345C90538o9549j14851j53948j41875q9995k5683M4177R7432Q9652K4753j8538
$$ 390538 320989 206138 52190 -89685 -179680 -205363 -161186 -63754 25898 50651 32113
36334C2113J4127N6180j1169j87403l09634k25062K0158K18183K26266J06401
$$ 32113 46240 102420 91251 -96152 -405786 -630848 -610690 -392507 -166241 -59840
36324e9840K3753N6664J40377J57386M3984j55712l01156k64722p9451P2007P4847
$$ -59840 -36087 20577 160954 318340 362324 206612 -94544 -359266 -438717 -366710 -291863
36313b91863K1272M4719R7995M8321n7751k8952J53990K70795J94072Q9234J41081
$$ -291863 -270591 -225872 -127877 -79556 -137307 -166259 -12269 258526 452598 541832 682913
36302F82913K47902J79822o5528k73081l23565k96634k73848k29410j46193p8878
$$ 682913 930815 1110637 1045109 772028 448463 151829 -122019 -351429 -497622 -576500
36292e76500m9879q702N8136R0408P3077Q2033J55616K18125J92769J07931L1711
$$ -576500 -626379 -635081 -576945 -486537 -413460 -331427 -175811 42314 235083 343014 374725
36281C74725k4936q0337j21678j27832j00404l4720P8149J88110K02708J13465
$$ 374725 349789 269452 147774 19942 -80462 -115182 -37033 151077 353785 467250
36271D67250L0456L9087R4775J11379P6838K4080l1097n9359j3335P1576O6108
$$ 467250 497706 536793 631568 742947 819785 843865 812768 753409 740074 811650 877758
36260H77758p1726k01622j99040j47321j84048k43165j42967J04859K75634K35737
$$ 877758 806032 604410 405370 258049 74001 -169164 -312131 -207272 68362 304099
36250C04099Q7431k3528p4846q6740l4493P2213J44486J27937O1840k4706j51031
$$ 304099 391530 368002 293156 206416 171923 244136 388622 516559 578399 553693 402662
36239D02662k64080k30250m0845J17525J10888L8588L9422O7770L3237J8882J30386
$$ 402662 138582 -91668 -132513 -14988 95900 134488 173910 241680 274917 293799 424185
36228D24185K29354R2370j93957k81772m9758K16021K22773K8622j28465j69695
$$ 424185 653539 745909 551952 270180 220422 436443 659216 687838 559373 389678
36218C89678j80639k07330k09969j50408j2634J95419L79116L93233K31057P1666
$$ 389678 209039 1709 -208260 -358668 -371302 -175883 203233 596466 827523 899189
36208H99189M1872N1020k2231j15293j11840o2675q2338j20620n4935N3487L0617
$$ 899189 941061 992081 969850 854557 742717 680042 597704 477084 422149 475636 506253
36197E06253j10368j78823j20599q0900j18920j07874n51M3621p0975j78002q4231
$$ 506253 395885 217062 96463 15563 -103357 -211231 -211782 -168161 -239136 -417138 -501369
36186e01369J44664K96078K98285K42643K00377J60458J02075K3132o2562r7937
$$ -501369 -356705 -60627 237658 480301 680678 841136 943211 966343 903781 805844
36176H05844k9464P3685O7824l8041n9998O0741J17743m6584k60388k65987j08454
$$ 805844 776380 850065 917889 879848 819850 880591 998334 951750 691362 425375 316921
36165C16921l4468q8819p7118Q9056K55227K63138J37177K2n0686K1286J39959
$$ 316921 282453 193634 116516 205572 460799 723937 861114 861136 810450 831736 971695
36154I71695J29531p5468k84984k89454j65377j26572j51820m9872J45716J89885
$$ 971695 1101226 1025758 740774 451320 285943 159371 7551 -42321 103395 293280
36144B93280O0462J6819J32652J40393r4310l01588k46628j15466j65696k70873
$$ 293280 353742 370561 503213 643606 549296 247708 1080 -114386 -280082 -550955
36134e50955j65573O7852J42851N8163N0004J36375J13071j0128K2816K41574
$$ -550955 -716528 -648676 -505825 -447662 -397658 -261283 -148212 -158340 -135524 106050
36124A06050L24417R1312k01929k59446j68559j84087k84314k27297K9789K32966
$$ 106050 430467 521779 319850 60404 -108155 -292242 -576556 -803853 -774064 -541098
36114e41098J78144l0589j39583n4121R1273J26277L6253n3008m2872L2058O9643
$$ -541098 -362954 -393543 -533126 -587247 -495974 -369697 -333444 -386452 -429324 -397266 -327623
36103c27623K5796n5242j03783q6154k8329L176k2094l9117L1430J42353J63357
$$ -327623 -301827 -357069 -460852 -547006 -575335 -572159 -594253 -633370 -601940 -459587 -296230
36092b96230Q2513K5707L0493k0247j39754j18429J51944M14867L62473R0989
$$ -296230 -213717 -188010 -157517 -177764 -317518 -435947 -284003 130864 493337 584326
36082E84326l5881R3434K44831K30260R4859q8116l00669m14139k49313J00592
$$ 584326 548445 641879 886710 1116970 1211829 1123713 823044 408905 159592 260184
36072B60184K84808J48392q3189j80608j94215k16705j51980O4097K52087K36658
$$ 260184 544992 693384 610195 429587 235372 18667 -133313 -69216 182871 419529
36062D19529J13654M5134j8124j61238k39453q3204J64777K22331R0706Q479M4890
$$ 419529 533183 578317 560193 398955 159502 76298 241075 463406 554112 562591 607481
36051F07481M2873m9927q7367Q052J33495J97383K05889J41802j8670j50477p9539
$$ 607481 650354 600427 513060 521112 654607 851990 1057879 1199681 1181011 1030534 950995
36040I50995J24094J92354N1031q1366n9529j0689m5881l8295J14555K27176P6422
$$ 950995 1075089 1267443 1318474 1237108 1177579 1166890 1121009 1082714 1197269 1424445 1500867
36029A500867k19974l31815j62521O4043J48629J38345J64540K27664K28827J22733
$$ 1500867 1280893 949078 786557 850600 999229 1137574 1302114 1529778 1758605 1881338
36019A881338m0757j88721k81601l03185k33226o6671J28069K15655J25445l5782
$$ 1881338 1840581 1651860 1370259 1067074 833848 767177 895246 1110901 1236346 1200564
36009A200564q3855J9982J30025J18544J7479q4752j77997k75742l12995k16040
$$ 1200564 1116709 1136691 1266716 1385260 1402739 1317987 1139990 864248 551253 335213
35999C35213l6002R3988J23345J16528J23661J06678J9742r9049j55823r7848
$$ 335213 299211 393199 516544 633072 756733 863411 883153 784104 628281 530433
35989E30433L5898J46619J52214M9135q9083j74146j67307r4452j2321M4051Q9516
$$ 530433 566331 712950 865164 914299 825216 651070 483763 389311 376990 421041 510557
35978E10557J52119K05045J80959Q5495L1802Q3241J17295k6635k81871l95578
$$ 510557 662676 867721 1048680 1134175 1165977 1249218 1366513 1339878 1058007 662429
35968F62429k73559j20562j36712k17642j19197J63435L73638L42157J81255Q4323
$$ 662429 388870 268308 131596 -86046 -205243 -41808 331830 673987 855242 939565
35958I39565P9397O8803M686q8594k00522l16366l38062j59774J44878L27845
$$ 939565 1018962 1087765 1092451 1003857 803335 486969 148907 -10867 134011 461856
35948D61856K35780l048j49089j45319j24309j61160j74713r8926j655M0923O0860
$$ 461856 697636 694588 545499 400180 275871 114711 -60002 -158928 -160583 -119660 -58800
35937e8800R0976N7698q4664k03397j36558N2705J38293L6821j05261j35031m9735
$$ -58800 32176 89874 5210 -198187 -334745 -282040 -143747 -106926 -212187 -347218 -396953
35926c96953Q7861K30121K94434J86824m6826k14909k01387q8734p11N4461J05565
$$ -396953 -309092 -78971 215463 402287 355461 140552 -60835 -149569 -150280 -95819 9746
35915I746J09763L3784n2968p9026q4391j22784j25681R874K40538L96375L60631
$$ 9746 119509 153293 100325 21299 -63092 -185876 -311557 -301683 -61145 335230 695861
35904F95861J55170j09083k91631k92165j55220n7731j03131j81196j30326K0044
$$ 695861 851031 741948 450317 158152 2932 -54799 -157930 -339126 -469452 -449408
35894d49408R4339K6959n6325j9779J17217K11431J32817j16632l70514m25241
$$ -449408 -355069 -328110 -384435 -404214 -286997 -75566 57251 -59381 -429895 -855136
35884h55136k58994o3979P187L2007J42308K65946K31775P5496J6595J16820J80765
$$ -855136 -1114130 -1178109 -1170922 -1138915 -996607 -730661 -498886 -423390 -406795 -289975 -109210
35873a09210O9730p6636n3691J11826K18386J61831K5612n7537l3393O0257J31958
$$ -109210 -39480 -116116 -169807 -57981 160405 322236 347848 290311 256918 317175 449133
35862D49133J05193M63p5879o3720k6737m7879r6464p5204K6182J08290R8186
$$ 449133 554326 554789 478910 415190 388453 340574 244110 168906 195088 303378 401564
35851D01564L5470m999j8194m7529r3359j09415q9403q5587j06539o3156J06991
$$ 401564 437034 432035 413841 366312 272953 163538 74135 -11452 -117991 -181147 -74156
35840g4156K98149L17399J11727j68268l38335l28764j64784P6302K53694K43662
$$ -74156 223993 541392 653119 484851 146516 -182248 -347032 -270730 -17036 226626
35830B26626J04204L7912J08315J28380n0655k76278k91790r9938O3967P0825
$$ 226626 330830 368742 477057 605437 554782 278504 -13286 -113224 -49257 21568
35820B1568J6963J9741P1368J09184Q9459j3609j57056j94792l2826J97067K60873
$$ 21568 38531 58272 129640 238824 328283 314674 157618 -37174 -70000 127067 387940
35809C87940J06242j09809k40271k45208j23628O4892J53540M7938q9581n9278
$$ 387940 494182 384373 144102 -101106 -224734 -159842 -6302 41636 -47945 -107223
35799a07223L3982n2513k34672j77964J21581K46862j441k70652j94483Q4492
$$ -107223 -73241 -125754 -360426 -538390 -416809 -169947 -171388 -442040 -636523 -552031
35789e52031K22719K02508K06520K05415N2589j61108k14288j25142q8001j17378
$$ -552031 -329312 -126804 79716 285131 337720 176612 -37676 -162818 -250819 -368197
35779c68197o8329N3885J12648J14988J66392K05084R5692n8996l8175R1249N1869
$$ -368197 -436526 -382641 -269993 -155005 11387 216471 312163 253167 214992 306241 358110
35768C58110j54287k21663o7242K0355j11875k10031m9451J93855K48534J44575
$$ 358110 203823 -17840 -85082 -64727 -176602 -386633 -436084 -242229 6305 150880
35758A50880N5312o070o5701L802K48337L88996J55484k49268l64815j11902J19297
$$ 150880 206192 200122 134421 138223 386560 775556 931040 681772 316957 205055 324352
35747C24352M3944j68676k23541j16196m6248p6303p7899K5163J21555O7790j01340
$$ 324352 368296 199620 -23921 -140117 -186365 -262668 -340567 -315404 -193849 -126059 -227399
35736b27399k01537j39680m0148n6582j21261k6580K41325M21306L10440L7193
$$ -227399 -428936 -568616 -608764 -665346 -786607 -813187 -571862 -150556 159884 197077
35726A97077j21760r7289n8116j37857k67474k79887j01344J61816K98725J96332
$$ 197077 75317 -21972 -80088 -217945 -485419 -765306 -866650 -704834 -406109 -209777
35716b09777k0004j26977r2057q6894j75935j82907J1297K20356J97037J755q9489
$$ -209777 -229781 -356758 -448815 -535709 -711644 -894551 -883254 -662898 -465861 -464106 -553595
35705e53595K8567K06889K96324K73518J37248j01732l05314k78321j4440K61083
$$ -553595 -525028 -318139 -21815 251703 388951 287219 -18095 -296416 -310856 -49773
35695d9773L30235J60949j35342l85530m11499j74163J20567K07496O8686q2244
$$ -49773 280462 441411 306069 -79461 -490960 -665123 -544556 -337060 -268374 -350618
35685c50618j09395p6427n9314l4272Q587K0225Q671L7445Q2571P0801P0034K12601
$$ -350618 -460013 -536440 -595754 -630026 -621439 -601214 -592543 -555098 -472527 -401726 -331692 -119091
35673a19091L95744L32570p157k88158k78054j42527r6675o3819O0016Q7238j59692
$$ -119091 276653 609223 602066 313908 35854 -106673 -203348 -267167 -207151 -119913 -279605
35662b79605m33036l51500O335K11813J39847Q4654J92519K18784P96k09620j30746
$$ -279605 -712641 -1064141 -1057806 -845993 -706146 -621492 -428973 -210189 -209393 -419013 -549759
35651e49759J06975J73266J2678j50442j69458j01215k8639L9351R5772J08846
$$ -549759 -442784 -269518 -256840 -407282 -576740 -677955 -706594 -667243 -571471 -462625
35641d62625P8696L7576P876J2676P8112J71067K02998J53151J03565R0135L0841
$$ -462625 -383929 -346353 -338477 -325801 -247689 -76622 126376 279527 383092 473227 504068
35630E04068j07881j97824j32606j0689K5270K7411J18505K08180R1829j70914
$$ 504068 396187 198363 65757 55068 80338 107749 226254 434434 526263 355349
35620C55349k53046k5665K12620J31165j82770l63543k49265k0593R8633Q1699
$$ 355349 102303 76638 289258 420423 237653 -125890 -375155 -395748 -297115 -215416
35610b15416K0787k5599l8411K3P2234J13658Q8823L1201k9950j16307k17350
$$ -215416 -194629 -220228 -258639 -258616 -186382 -72724 16099 47300 17350 -98957 -316307
35599c16307k29790p7503J41075K36411J62946O1337L6946J9616p2272j41699
$$ -316307 -546097 -623600 -482525 -246114 -83168 -21831 15115 34731 -37541 -179240
35589a79240m2356J49743J82093k0111k19490j90212l5493j6473j45029j59215
$$ -179240 -221596 -71853 110240 90129 -129361 -319573 -355066 -371539 -516568 -675783
35579f75783P6405L42502L41850P3436k05997l16229k95176k33672j38585j0915
$$ -675783 -599378 -256876 84974 158410 -47587 -363816 -658992 -892664 -1031249 -1042164
35569a042164P4863O7962L6748O4094J05358O8725p9L6929J66497J88181K569
$$ -1042164 -967301 -899339 -862591 -798497 -693139 -624414 -624493 -587564 -421067 -232886 -230317
35558b30317k04454k03410n2891j1600j48981k37104q0731K05624L53645K72174
$$ -230317 -434771 -638181 -691072 -702672 -851653 -1088757 -1169488 -963864 -610219 -338045
35548c38045J07614K5989L9488M0531n7510k12876k68744j17401J25897J96281
$$ -338045 -230431 -204442 -164954 -124423 -181933 -394809 -663553 -780954 -655057 -458776
35538d58776o266k57494k69898n2538J24899R9719j0178k6735M6187Q6406N5072
$$ -458776 -465042 -722536 -992434 -1044972 -920073 -820354 -830532 -857267 -811080 -724674 -669602
35527f69602K7441P0456J76622K91732L38870K45770L0277j52771j38021N3849
$$ -669602 -642161 -571705 -395083 -103351 235519 481289 511566 358795 220774 274623
35517B74623K13690J76345M036j12636r6591n1014q8204j76621k04189j34849
$$ 274623 488313 664658 668694 556058 459467 408453 320249 143628 -60561 -195410
35507a95410l0742N2057J08065J26428P7382j8921q2715p0240j5728N3524J60194
$$ -195410 -226152 -174095 -66030 60398 137780 118859 36144 -34096 -49824 3700 163894
35496A63894K77147K75464P6648j97189l38771k96881j97959j44632j05692j3885
$$ 163894 441041 716505 793153 595964 257193 -39688 -237647 -382279 -487971 -501856
35486e01856J26727K49526K67413J18853j31391k60021r6562K16887L30821J05599
$$ -501856 -375129 -125603 141810 260663 129272 -130749 -227311 -10424 320397 425996
35476D25996k23755l69501l15225k03098o4354J40058L10229K77669Q1312l6040
$$ 425996 202241 -167260 -482485 -685583 -749937 -609879 -299650 -21981 59331 23291
35466B3291M1478J45280P5576j25318k57465k22287q1378P9349K19338K96755
$$ 23291 64769 210049 285625 160307 -97158 -319445 -400823 -321474 -102136 194619
35456A94619K66849J49351K1709p6472j68596k53236k69979k00167j28785j27576
$$ 194619 461468 610819 632528 556056 387460 134224 -135755 -335922 -464707 -592283
35446e92283j31444l8876R3999J02187k1402o6402Q8956K45821J27963k05074
$$ -592283 -723727 -762603 -668604 -566417 -587819 -654221 -565265 -319444 -191481 -396555
35436c96555l83688j90958J65952L24945J93041j972k6100R4851J33154n6424
$$ -396555 -780243 -971201 -805249 -480304 -287263 -289235 -315335 -220484 -87330 -143754
35426a43754l36728m08829j52612K16785M01061L54179K45462J57774K1343j52430
$$ -143754 -480482 -889311 -1041923 -825138 -424077 -69898 175564 333338 354681 202251
35416B02251k02607p5242M5318l826j25018j31341l2359J9884j6141m2638jP1794
$$ 202251 -356 -75598 -30280 -34106 -159124 -290465 -322824 -302940 -319081 -361719 -361720 -289926
35404b89926J19467J12350L5258n8849n8408M2613Q3399l6096j74687j57617n3790
$$ -289926 -170459 -58109 -22851 -81700 -140108 -97495 -14096 -50192 -224879 -382496 -436286
35393d36286l8375o9396M0827K64854L46519J83575k5188q7767n1760l3067j2100
$$ -436286 -474661 -544057 -503230 -238376 108143 291718 266530 178763 127003 93936 81836
35382H1836O8481J49934J32647J5494j22663k00491j56853n473J11049O1195n9470
$$ 81836 150317 300251 432898 448392 325729 125238 -31615 -37088 73961 135156 75686
35371G5686k4427J74444K80340J51785l4282r0385j09929k55550m29789l93985
$$ 75686 51259 225703 506043 657828 623546 533161 423232 167682 -262107 -656092
35361f56092j20352J87869L64707L79661K29400n8244l21973l57772j50195J04361
$$ -656092 -776444 -588575 -223868 155793 385193 326949 4976 -352796 -502991 -398630
35351c98630K17438J59529J3191j12745j27998k1236J13603J68889J23421J7317
$$ -398630 -181192 -21663 -8472 -121217 -249215 -270451 -156848 12041 135462 152779
35341A52779j02844j60759p7411Q7158J32170j8966j64917r6451Q3699J08357
$$ 152779 49935 -110824 -188235 -101077 31093 12127 -152790 -249241 -165542 -57185
35331e7185n9896k02580j78870n9780O7983K01932K90178K15797o672j92389k18730
$$ -57185 -117081 -319661 -498531 -558311 -490328 -288396 1782 217579 210907 18518 -200212
35320b00212j45300m7680R2414K47942K75121J11513q2089j07217L4212J86059
$$ -200212 -345512 -393192 -300778 -52836 222285 333798 251709 144492 178704 364763
35310C64763K26753J18153j24791l90010m80128l05385k1067J36311J09900K8104
$$ 364763 591516 709669 584878 194868 -285260 -590645 -611712 -475401 -365501 -337397
35300c37397M185L8153P8156O9181l3428j92827k55161j04702J42053K17903K0318
$$ -337397 -333212 -295059 -216903 -147722 -181150 -373977 -629138 -733840 -591787 -373884 -353566
35289c53566k51111l29228j73236M6197J91000K65237K85354J84303n4850k53939
$$ -353566 -604677 -933905 -1107141 -1060944 -869944 -604707 -319353 -135050 -189900 -443839
35279d43839j89614J00850L14799K52874N9046j2383N9773J12648Q8775O2639
$$ -443839 -633453 -532603 -217804 35070 94116 81733 141506 254154 342929 405568
35269D05568K6370j08175k80257l00372j61244q1690j37379j10666J16572K79716
$$ 405568 431938 323763 43506 -256866 -418110 -499800 -637179 -747845 -631273 -351557
35259c51557J14914j70829j61686J34234K95360J31181p3337o7626j8983j53646
$$ -351557 -236643 -407472 -569158 -434924 -139564 -8383 -81720 -149346 -168329 -321975
35249c21975l09725j82855J44716K86412J30451r275J02395K67874J84517q6035
$$ -321975 -631700 -814555 -669839 -383427 -252976 -262251 -159856 108018 292535 206500
35239B06500k15742q4177P9908L6578j69665l13056k64625r1169N8633J04093
$$ 206500 -9242 -93419 -13511 23067 -146598 -459654 -724279 -815448 -756815 -652722
35229f52722R0763J17997J92705J92670M4636j08005n3401J70411K72865R2539
$$ -652722 -561959 -443962 -251257 -58587 -13951 -121956 -175357 -4946 267919 360458
35219C60458j78096k63028j57236n6767m6195m6900j6521o97K698N3140J32389
$$ 360458 182362 -80666 -237902 -294669 -340864 -387764 -404285 -404982 -402284 -349144 -216755
35208b16755J54471J14126P4141J7457j05717j88110n0538K35218L47109J43424
$$ -216755 -62284 51842 125983 143440 37723 -150387 -200925 34293 381402 524826
35198E24826j23184j64993l8680J0535p6732j57241j33272k8259J04308J84030
$$ 524826 401642 236649 197969 208504 131772 -25469 -158741 -187000 -82692 101338
35188A01338J03017j17857k68814k12986r4197r2944j11168M1217K56855K52760
$$ 101338 204355 86498 -182316 -395302 -489499 -582443 -693611 -652394 -395539 -142779
35178a42779M0620p2815J8104P6345l1426j01835J9475J41571N9065q7865p1650
$$ -142779 -102159 -174974 -156870 -80525 -111951 -213786 -194311 -52740 6325 -81540 -153190
35167a53190J2454q2251l06491l71815j93720L0808J65191K55477L04240K22262
$$ -153190 -140736 -222987 -529478 -901293 -1095013 -1064205 -899014 -643537 -339297 -117035
35157a17035O2100J9540J12754J24159k4564j09484J6355J38694J7716j94217
$$ -117035 -54935 -35395 77359 201518 176954 67470 83825 222519 240235 46018
35147D6018j64356J09253L03208K43251Q3104q263o9303j79487k88469l14945
$$ 46018 -118338 -9085 294123 537374 620478 612215 542912 363425 74956 -239989
35137b39989k57022j25238P7604K36436J63186j27004l39880k50766M42J23064
$$ -239989 -497011 -622249 -544645 -308209 -145023 -272027 -611907 -862673 -862231 -739167
35127g39167P0771L0200Q5909J15072K4763r1929j00145k724R3626J21362J04172
$$ -739167 -668396 -638196 -552287 -437215 -412452 -504381 -604526 -607250 -513624 -392262 -288090
35116b88090R4356R0518K9251j14897k32892j70301N5655K32096K11578R0364
$$ -288090 -193734 -103216 -73965 -188862 -421754 -592055 -536400 -304304 -92726 -2362
35106b362L2643L4484K07n0619k9332L8114O0723O8624J52383K43298J68181o4230
$$ -2362 30281 64765 64972 14353 -14979 23135 83858 152482 304865 548163 716344 652114
$$ [...]
##END NTUPLES=NMR SPECTRUM
##END=
