##TITLE=31Pdec_DE-128rm1
 , 24 sc
 17.2.2026
##JCAMPDX= 6.0         $$ Bruker NMR JCAMP-DX V2.0
##DATA TYPE= NMR SPECTRUM
##DATA CLASS= NTUPLES
##ORIGIN= UXNMR, Bruker Analytische Messtechnik GmbH
##OWNER= root
$$ XWIN-NMR		Version 3.5
$$ Tue Feb 17 13:37:20 2026 Russian Standard Time (UT+4h)  she@DPX200
##.OBSERVE FREQUENCY= 81.013821
##.OBSERVE NUCLEUS= ^31P
##.ACQUISITION MODE= SIMULTANEOUS
##.ACQUISITION SCHEME= undefined
##.AVERAGES= 24
##.DIGITISER RES= 17
##SPECTROMETER/DATA SYSTEM= spect
##.PULSE SEQUENCE= zgpg30
##.SOLVENT NAME= DMSO
##.SHIFT REFERENCE= (INTERNAL, DMSO, 0, 198.062)
##AUDIT TRAIL= $$ (NUMBER, WHEN, WHO, WHERE, WHAT)
$$ ##TITLE= Audit trail, XWIN-NMR		Version 3.5
$$ ##JCAMPDX= 5.01
$$ ##ORIGIN= Bruker BioSpin GmbH
$$ ##OWNER= she
$$ F:/spectra/data/she/nmr/P31/2/pdata/1/auditp.txt
$$ ##AUDIT TRAIL=  $$ (NUMBER, WHEN, WHO, WHERE, WHAT)
(   1,<2026-02-17 13:33:18.06 +0400>,<she>,<DPX200>,
      <created by zg, POWCHK disabled, PULCHK disabled
       configuration hash MD5:
       00 E9 B6 7A A2 85 ED C7 34 08 36 98 17 FE 4E 26
       data hash MD5: 32K
       A8 2A 62 92 C9 92 B5 DD 87 E0 4D 56 1D C3 34 86>)
(   2,<2026-02-17 13:35:11.39 +0400>,<she>,<DPX200>,
      <Start of raw data processing
       efp BC_mod = 2 LB = 1.5 FT_mod = 6 PKNL = 1 PHC0 = 1352.765 PHC1 = 129.1007 SI = 64K 
       data hash MD5: 64K
       BD 3E D1 36 C2 06 03 A0 18 03 7D 8F 37 A6 83 93>)
(   3,<2026-02-17 13:35:41.65 +0400>,<she>,<DPX200>,
      <pk PHC0 = 96.4834 PHC1 = -148.4 
       data hash MD5: 64K
       78 A9 67 AF 71 72 A9 9A 2E 18 93 49 9E 0F 95 12>)
(   4,<2026-02-17 13:36:04.64 +0400>,<she>,<DPX200>,
      <abs ABSG = 5 
       data hash MD5: 64K
       1F 65 2B E1 C3 58 20 27 4B F0 12 D5 76 64 77 DF>)
$$ ##END=
$$ 
$$ hash MD5
$$ DA 18 17 27 A3 27 3D 73 60 76 2D 9F 4A 43 E8 BC
##$RELAX= 
##$RELAX= 
##$RELAX= 
##$RELAX= 
##$RELAX= 
##$RELAX= 
##$RELAX= 
##$RELAX= 
$$ Bruker specific parameters
$$ --------------------------
##$DU= <F:/spectra>
##$EXPNO= 2
##$NAME= <P31>
##$PROCNO= 1
##$TYPE= <nmr>
##$USER= <she>
##$AMP= (0..31)
100 100 100 100 100 100 100 100 100 100 100 100 100 100 100 100 100 100 
100 100 100 100 100 100 100 100 100 100 100 100 100 100 
##$AQSEQ= 0
##$AQ_mod= 1
##$AUNM= <au_zg>
##$AUTOPOS= <>
##$BF1= 81.014009
##$BF2= 200.13
##$BF3= 200.13
##$BF4= 200.13
##$BF5= 200.13
##$BF6= 200.13
##$BF7= 200.13
##$BF8= 200.13
##$BYTORDA= 1
##$CFDGTYP= 0
##$CFRGTYP= 5
##$CHEMSTR= <none>
##$CNST= (0..31)
1 1 145 1 1 1 1 1 1 1 1 1 1 1 1 1 1 1 1 1 1 1 1 1 1 1 1 1 1 1 1 1 
##$CPDPRG= <waltz16>
##$CPDPRG1= <>
##$CPDPRG2= <waltz16>
##$CPDPRG3= <>
##$CPDPRG4= <mlev>
##$CPDPRG5= <mlev>
##$CPDPRG6= <mlev>
##$CPDPRG7= <mlev>
##$CPDPRG8= <mlev>
##$CPDPRGB= <>
##$CPDPRGT= <>
##$D= (0..31)
0 1 0 0 0 0 0 0 0 0.06 0 0.03 2e-05 3e-06 0 0 0.0002 0 0 0 0 0 0 0 0 0 
0 0 0 0 0 0 
##$DATE= 1771320797
##$DBL= (0..7)
120 120 120 11 120 120 24 19 
##$DBP= (0..7)
150 150 150 150 150 150 150 150 
##$DBP07= 0
##$DBPNAM0= <>
##$DBPNAM1= <>
##$DBPNAM2= <>
$$ [...]
##$SUBNAM3= <"">
##$SUBNAM4= <"">
##$SUBNAM5= <"">
##$SUBNAM6= <"">
##$SUBNAM7= <"">
##$SUBNAM8= <"">
##$SUBNAM9= <"">
##$SW= 400.765351723535
##$SWIBOX= (0..15)
0 1 3 0 0 0 0 0 0 0 0 0 0 0 0 0 
##$SW_h= 32467.5324675325
##$TD= 32768
##$TD0= 1
##$TE= 0
##$TE2= 300
##$TE3= 300
##$TEG= 300
##$TL= (0..7)
0 120 53 12 22 120 120 120 
##$TP= (0..7)
150 150 150 150 150 150 150 150 
##$TP07= 0
##$TPNAME0= <>
##$TPNAME1= <>
##$TPNAME2= <>
##$TPNAME3= <>
##$TPNAME4= <>
##$TPNAME5= <>
##$TPNAME6= <>
##$TPNAME7= <>
##$TPOAL= (0..7)
0.5 0.5 0.5 0.5 0.5 0.5 0.5 0.5 
##$TPOFFS= (0..7)
0 0 0 0 0 0 0 0 
##$TUNHIN= 0
##$TUNHOUT= 0
##$TUNXOUT= 0
##$USERA1= <user>
##$USERA2= <user>
##$USERA3= <user>
##$USERA4= <user>
##$USERA5= <user>
##$V9= 5
##$VALIST= <valist>
##$VCLIST= <CCCCCCCCCCCCCCC>
##$VD= 0
##$VDLIST= <DDDDDDDDDDDDDDD>
##$VPLIST= <PPPPPPPPPPPPPPP>
##$VTLIST= <TTTTTTTTTTTTTTT>
##$WBST= 1024
##$WBSW= 4
##$XGAIN= (0..3)
0 0 0 0 
##$XL= 0
##$YL= 0
##$YMAX_a= 49498
##$YMIN_a= -55508
##$ZGOPTNS= <>
##$ZL1= 120
##$ZL2= 120
##$ZL3= 120
##$ZL4= 120
##$ABSF1= 198.0616
##$ABSF2= -202.7028
##$ABSG= 5
##$ABSL= 3
##$ALPHA= 0
##$AQORDER= 0
##$ASSFAC= 0
##$ASSFACI= 0
##$ASSFACX= 0
##$ASSWID= 0
##$AUNMP= <proc_1d>
##$AZFE= 0.1
##$AZFW= 0.5
##$BCFW= 0
##$BC_mod= 2
##$BYTORDP= 0
##$COROFFS= 0
##$CY= -3
##$DATMOD= 1
##$DC= 0
##$DFILT= <>
##$DTYPP= 0
##$F1P= 0
##$F2P= 0
##$FCOR= 1
##$FTSIZE= 65536
##$FT_mod= 6
##$GAMMA= 0
##$GB= 0
##$INTBC= 1
##$INTSCL= 9.790993e-09
##$ISEN= 30
##$LB= 1.5
##$LEV0= 0
##$LPBIN= 0
##$MAXI= 10000
##$MC2= 0
##$MEAN= 0
##$ME_mod= 0
##$MI= 50
##$NCOEF= 0
##$NC_proc= -5
##$NLEV= 6
##$NOISF1= 182.463
##$NOISF2= 159.3651
##$NSP= 0
##$NTH_PI= 0
##$NZP= 0
##$OFFSET= 198.0616
##$PC= 4
##$PHC0= 1449.248
##$PHC1= -19.2993
##$PH_mod= 1
##$PKNL= yes
##$PPARMOD= 0
##$PSCAL= 0
##$PSIGN= 0
##$REVERSE= no
##$SF= 81.0140089999434
##$SI= 65536
##$SIGF1= 159.3651
##$SIGF2= -187.1042
##$SINO= 113.3802
##$SIOLD= 16384
##$SREGLST= <1H.CDCl3>
##$SSB= 0
##$STSI= 65536
##$STSR= 0
##$SW_p= 32467.5324675325
##$SYMM= 0
##$S_DEV= 0
##$TDeff= 32768
##$TDoff= 0
##$TI= <>
##$TILT= no
##$TM1= 0
##$TM2= 0
##$TOPLEV= 0
##$USERP1= <user>
##$USERP2= <user>
##$USERP3= <user>
##$USERP4= <user>
##$USERP5= <user>
##$WDW= 1
##$XDIM= 65536
##$YMAX_p= 547954404
##$YMIN_p= -7015586
$$ End of Bruker specific parameters
$$ ---------------------------------
##NTUPLES= NMR SPECTRUM
##VAR_NAME=  FREQUENCY,     SPECTRUM/REAL,   SPECTRUM/IMAG
##SYMBOL=    X,             R,               I
##VAR_TYPE=  INDEPENDENT,   DEPENDENT,       DEPENDENT
##VAR_FORM=  AFFN,          ASDF,            ASDF
##VAR_DIM=   65536,         65536,           65536
##UNITS=     HZ,            ARBITRARY UNITS, ARBITRARY UNITS
##FACTOR=    0.49542278885378, 1,            1
##FIRST=     16045.7642231865, 0,            0
##LAST=      -16421.768244346, 0,            0
##MIN=       -16421.768244346, -7015586,     0
##MAX=       16045.7642231865, 547954404,    0
$$ Real data points
##PAGE= N=1
##DATA TABLE= (X++(R..R)), XYDATA
$$ [...]
40939c42721K76338L78100L30043M0005l06282l75482r6408K44746L59432K35122
$$ -342721 -66383 311717 641760 681765 375483 1 -96407 148339 507771 742893
40929G42893J8890j79529k78468k00789M012J40073R0935l7808r7691r1915p9529
$$ 742893 761783 582254 303786 102997 107009 247082 338017 300209 202518 110603 31074
40918C1074l1988N6415M7761j43585l21699k10627J36387L54409K26260o6537
$$ 31074 -914 55501 103262 -40323 -362022 -572649 -436262 -81853 144407 77870
40908G7870k08108r6286J44897L43010L61734J38218k18561m31877l01115O3170
$$ 77870 -130238 -226524 -81627 261383 623117 761335 542774 110897 -190218 -127048
40898a27048L40614L32671J14726j26844k93189l65067l03057p7906K10510L54370
$$ -127048 213566 546237 660963 534119 240930 -124137 -427194 -505100 -294590 59780
40888E9780K37818k4295j94634j43648N3406K19118K35889J28573K6272L3671
$$ 59780 297598 273303 78669 -64979 -11573 207545 443434 572007 598279 631950
40878F31950J26617K06773K59105L67970N42102O49443O24752O06940O96734O95150
$$ 631950 758567 965340 1224445 1592415 2134517 2783960 3408712 4015652 4712386 5407536
40868E407536L44861k07829m98426l47952q3358l2212r4451k5833J21975J50866
$$ 5407536 5752397 5544568 5046142 4698190 4614832 4582620 4488169 4462336 4584311 4735177
40858D735177J23777K64890N22740N83514L40232L6213j33835k82217n52493q18387
$$ 4735177 4858954 5123844 5646584 6230098 6570330 6606543 6472708 6190491 5637998 4819611
40848D819611q50975o51297m33566l42654l35666l15173k58854k08045k01111
$$ 4819611 3968636 3317339 2883773 2541119 2205453 1890280 1631426 1423381 1222270
40839A222270k35706k63698k16405n4325J88200L90481L97210J54426j78787l36396
$$ 1222270 986564 722866 506461 452136 640336 1030817 1428027 1582453 1403666 1067270
40829A067270k27374l9349R717p0012j32127j35249j30962r3656L3563J59144
$$ 1067270 839896 800547 810264 740252 608125 472876 341914 248258 281821 440965
40819D40965J25321k7554r2980j9877J9069o4896j28425n2547O7310J17858J57225
$$ 440965 566286 538732 445752 425875 444944 380048 251623 199076 266386 384244 541469
40808E41469K45987K63236R0411j43806k08478q9829J5334k2663j53902k72052
$$ 541469 787456 1050692 1141103 997297 788819 698990 714324 691661 537759 265707
40798B65707l01557j96519Q996J78809K24086K27432K87382L07519J26023j70891
$$ 265707 -35850 -232369 -223373 -44564 179522 406954 694336 1001855 1127878 956987
40788I56987k79210p1726K15029K81346J21905k9910l1487K6030n776j20444j81009
$$ 956987 677777 606051 821080 1102426 1224331 1194421 1162934 1188964 1183188 1062744 881735
40777H81735j21317m1314n9843j34975j29240k9517L2616J297j6764M3761P4578
$$ 881735 760418 719104 659261 524286 395046 365529 398145 399442 382678 426439 501017
40766E01017j2957j08279q1811k1953q4500j92419j30813Q7535K06869J10021
$$ 501017 488060 379781 297970 276017 191517 -902 -131715 -44180 162689 272710
40756B72710k3463j6181O5029P6399K2269k2357o3838j14828q5828Q7218K85930
$$ 272710 249247 233066 298095 374494 396763 374406 310568 195740 109912 197130 483060
40745D83060L35400K37536J34661P4689l4711k29650l85822l67654k02092m4674
$$ 483060 818460 1055996 1190657 1265346 1230635 1000985 615163 247509 45417 743
40735G43n072m4244l8856O4321J67678J21316q9925k96884l12879j21151J31163
$$ 743 -4329 -48573 -87429 -23108 144570 265886 175961 -120923 -433802 -554953 -423790
40724d23790K88623K95457J84188K5962j00057j36963q3378M277N0831J6799o5570
$$ -423790 -135167 160290 344478 370440 270383 133420 50042 54319 105150 121949 56379
40713E6379j09339n0273Q0831J76928J52346J6542j34326j79140n2197J86566
$$ 56379 -52960 -103233 -22402 154526 306872 323414 189088 9948 -42249 144317
40703A44317L65212L36217J16701j32150k60034k34011j18922j1861J6661j9097
$$ 144317 509529 845746 962447 830297 570263 336252 217330 205469 222130 203033
40693B03033k7450L6296Q1179N243j21869j35224l6148j5677j60968k97534k29558
$$ 203033 175583 211879 293058 298301 176432 41208 5060 -10617 -171585 -469119 -698677
40682f98677o643J78334K48838K51913J93529M6840j13620j63950j15346q5377
$$ -698677 -705320 -526986 -278148 -26235 167294 214134 100514 -63436 -178782 -264159
40672b64159p7509L4833K56206L75742K32654m8795k12953j80116q0626m1345
$$ -264159 -341668 -306835 -50629 325113 557767 508972 296019 115903 35277 -6068
40662f068o8399j19821j65261j53552k9266J65340K76641J95326l096j27314p2922
$$ -6068 -74467 -194288 -359549 -513101 -542367 -377027 -100386 94940 91844 -35470 -108392
40651a08392Q1137J76869J41952L6696l3361j4237Q2920K11948K91048K06860
$$ -108392 -27255 149614 291566 328262 294901 280664 363584 575532 866580 1073440
40641A073440q6689m40166n70354l50732P34J48709N3239L644J85082L86379K99194
$$ 1073440 986751 546585 -23769 -374501 -373767 -225058 -171819 -168175 16907 403286 702480
40630G02480j9928k26818j89994j34020k15828k42264o539L06186L33623O2088
$$ 702480 682552 455734 265740 131720 -84108 -326372 -332911 -26725 306898 368986
40620C68986j56725j11919K3416K9272l3799R493J34590J66741O1104m8302o0953
$$ 368986 212261 100342 123758 153030 119231 128724 263314 430055 491159 442857 381904
40609C81904l0015n4986j52480k60813l10544k66249j40320N168Q3724M2637p3776
$$ 381904 351889 296903 144423 -116390 -426934 -693183 -833503 -828335 -744611 -701974 -775750
40598g75750j22622J3351K56390L58367J88111o0068q0732J39670K95672J65185
$$ -775750 -898372 -885021 -628631 -270264 -82153 -142221 -222953 -83283 212389 377574
40588C77574j22362k85938k19736l6779R2228N9042j10103k25261r8647J81542
$$ 377574 255212 -30726 -250462 -287241 -195013 -135971 -246074 -471335 -569982 -388440
40578c88440K89464P7432k04025k37032k9449J87458K94911L11937K26568N1718
$$ -388440 -98976 -21544 -225569 -462601 -492050 -304592 -9681 302256 528824 580542
40568E80542n2820K1456R2782o6607l14637l02501l6128J03117l4978j33383N1822
$$ 580542 527722 549178 641960 575353 260716 -41785 -77913 25204 -9774 -143157 -91335
40557i1335K73183J84240j18735k67052j63952l7437l2700n2968J44P7293J09923
$$ -91335 181848 366088 247353 -19699 -183651 -221088 -253788 -306756 -306612 -229319 -119396
40546a19396J04953P3729P435n3438m7049j051m230o3344r8303p9361m9781l646
$$ -119396 -14443 59286 66721 13283 -33766 -34817 -39047 -102391 -200694 -280055 -329836 -333482
40534c33482J26905L20072M17160L04903P6732o5709m7646k94r5729l25204m74211
$$ -333482 -206577 113495 530655 835558 912290 846581 798935 798641 702912 377708 -96503
40523i6503l53999m6408J56148Q5677j06960j57825j4401J46294J71535P8621
$$ -96503 -450502 -496910 -340762 -255085 -362045 -519870 -534271 -387977 -216442 -137821
40513a37821l9877j24189j27824m782K05173L38920K46848k8759k63961k73727
$$ -137821 -177698 -301887 -429711 -434493 -229320 109600 356448 327689 63728 -209999
40503b09999j09191O034m9658j46081r4463O7136J22289Q051q3209j0940Q6444
$$ -209999 -319190 -313156 -362814 -508895 -603358 -536222 -413933 -405882 -489091 -500031 -413587
40492d13587K7914r2046m2510J62107K66449J60917K5517K4206O8433L594j32795
$$ -413587 -385673 -477719 -520229 -358122 -91673 69244 94761 118967 187400 190994 58199
40481E8199j87899j23309k1826P0461J68402K43535K27108J29892N9441Q1197
$$ 58199 -129700 -253009 -274835 -204374 -35972 207563 434671 564563 624004 705201
40471G05201J23615O4741j09761k67805k57325o6794J52041K32696J55065M1368
$$ 705201 828816 893557 783796 515991 258666 191872 343913 576609 731674 773042
40461G73042P711N2213Q5180L8837n5801r1451p869R7416M6858j77376l49620
$$ 773042 780753 832966 918146 956983 901182 809731 801862 899278 946136 768760 419140
40450D19140k62347j5961R7925j4128j44679j06597J9523N7749Q463n084K4884
$$ 419140 156793 140832 238757 224629 79950 -26647 -7124 50625 59088 54004 78888
40439G8888j9328j62041k53957j60547N4196J90738J30423m5160j44231o1450
$$ 78888 59560 -102481 -356438 -516985 -462789 -272051 -141628 -186788 -331019 -392469
40429c92469J18025K10426J14220j12627l19465l61574j77114J36215L31707K24357
$$ -392469 -274444 -64018 50202 -62425 -381890 -743464 -920578 -784363 -452656 -228299
40419b28299p2757k37224j19950P5965Q3395p7874j73355j00015O025n5q1009
$$ -228299 -301056 -538280 -658230 -582265 -498870 -576744 -750099 -850114 -844089 -844144 -925153
40408i25153j03485k2532P9389J06047O5395O1094J44102J95253N0241k33271
$$ -925153 -1028638 -1051170 -971781 -865734 -800339 -739245 -595143 -399890 -349649 -582920
40398e82920l64313j71031J51072K85521J97352J08771J33224J55230P9905k0940
$$ -582920 -947233 -1118264 -967192 -681671 -484319 -375548 -242324 -87094 -7189 -28129
40388b8129p6402j34193k12356k02189m4381J32185J80125J32513J00639P8023
$$ -28129 -104531 -238724 -451080 -653269 -697650 -565465 -385340 -252827 -152188 -74165
40378g4165Q20p8014n0712M7429P1413r114p3339m7714O831L7902R1229J92267
$$ -74165 -73345 -151359 -202071 -154642 -83229 -92343 -165682 -213396 -206565 -168663 -77434 114833
40366A14833K47530J48740q0147k95560l57451k25343Q181J69520J65969J06884
$$ 114833 362363 511103 430956 135396 -222055 -447398 -439217 -269697 -103728 3156
40356C156J70737L38533L87768K01015o2172j97524k21809k59174k77918j49977
$$ 3156 173893 512426 900194 1101209 1039037 841513 619704 360530 82612 -67365
40346f7365O9258J45939q538k05552k44955j55655p4924k4635O2608J85726K76756
$$ -67365 1893 147832 139294 -66258 -311213 -466868 -541792 -566427 -503819 -318093 -41337
40335d1337L09089K94214K17194Q0074l7194p0329q1105j53718k25925j72903
$$ -41337 267752 561966 779160 859234 822040 751711 670606 516888 290963 118060
40325A18060l3546K3868k7536l0752P0735J08139l3186j87556j38166N3945J51912
$$ 118060 84514 108382 80846 50094 120829 228968 195782 8226 -129940 -75995 75917
40314G5917R6018L8242N3881M2822n2424j35745j35589j16022j12127j6201K31313
$$ 75917 171935 210177 264058 306880 254456 118711 -16878 -132900 -245027 -261228 -29915
40303b9915M51984L94592M8537l29695m79504l44122o7522J24203R2071o6841
$$ -29915 422069 816661 865198 535503 55999 -288123 -355645 -231442 -139371 -206212
40293b06212r7120Q5728K31139P8445k28845k85738J3678L08350K53488m6545
$$ -206212 -303332 -217604 13535 91980 -136865 -422603 -408925 -100575 152913 106368
40283A06368k37377j75614n444J10443J36673R5616K9213J1282O0375P2013l1198
$$ 106368 -131009 -306623 -312067 -201624 -64951 30665 59878 71160 131535 203548 172350
40272A72350j35450q3457O1286R5548K851k6389P2684J26713K8215p4966k9759
$$ 172350 36900 -46557 14729 110277 113128 86739 159423 286136 314351 239385 209626
40261B09626P6990Q7977K5536j1731n9973j85352k74360j62562P9430K09652J44375
$$ 209626 286616 374593 400129 388398 328425 143073 -131287 -293849 -214419 -4767 139608
40250A39608K5810k1229J549Q7724K34454L11960J59054j33700k66214j45862
$$ 139608 165418 144189 145738 233462 467916 779876 938930 805230 539016 393154
40240C93154l6024j52578l27046k70513j1490J67593J43248N8426L5138O599j04009
$$ 393154 357130 204552 -122494 -393007 -404497 -236904 -93656 -35230 -92 6507 -97502
40229i7502k05795j53127L4833J63933P7890j57687l11752k36845k9060J07542
$$ -97502 -303297 -456424 -421591 -257658 -179768 -337455 -649207 -886052 -915112 -807570
40219h07570J20748J33716K11768K44420J24304p1399j74366j26045n003P8883
$$ -807570 -686822 -553106 -341338 -96918 27386 -44013 -218379 -344424 -349427 -270544
40209b70544N0597r1041k33187k33103j02734K61K5381J10119K97313L66633J51293
$$ -270544 -219947 -310988 -544175 -777278 -880012 -879751 -854370 -744251 -446938 -80305 70988
40198G0988j35906j59425N0893J59558L7002r3363n0985N2228N7244Q171K1830
$$ 70988 -64918 -224343 -173450 -13892 23110 -70253 -121238 -69010 -11766 -3595 18235
40187A8235Q8002J27171J10856L3257j02628k05437j58623k4313o41j03478j09526
$$ 18235 106237 233408 344264 377521 274893 69456 -89167 -113480 -114121 -217599 -327125
40176c27125O9318J94499O5130j44533j49812J3148Q8965J4702n2492m6634m7435
$$ -327125 -257807 -63308 1822 -142711 -292523 -279375 -190410 -175708 -228200 -274834 -322269
40165c22269n0987M0216J89983K46902K13004K38064L04533J95752j21904l53888
$$ -322269 -373256 -333040 -143057 103845 316849 554913 859446 1055198 933294 579406
40155E79406k79335p7006m8734j89002k54114j41719K9555J48971J97864J42935
$$ 579406 300071 223065 174331 -14671 -268785 -410504 -380949 -231978 -34114 108821
40145A08821k7711j60013n2801K25784L49069J52978j38640k37821j71637j55591
$$ 108821 81110 -78903 -131704 94080 443149 596127 457487 219666 48029 -107562
40135a07562k19089k00277o8025J4319p469M2251K58291M28702L20717N9813k1177
$$ -107562 -326651 -526928 -594953 -580634 -588103 -545852 -287561 141141 461858 521671 500494
40124E00494J33805K23520L5676k50722l26123j52745M2003P7134k4764j42536
$$ 500494 634299 857819 893495 642773 316650 163905 205908 283042 258278 115742
40114A15742j84232j22713j0034M3175j5829r2536n1840R2286J82459J25234M653
$$ 115742 -68490 -191203 -201237 -158062 -173891 -266427 -318267 -225981 -43522 81712 86365
40103H6365m8617k5972j3572m0338l6949M5026J43099J64233J19204J01973J36517
$$ 86365 37748 11776 -1796 -42134 -79083 -34057 109042 273275 392479 494452 630969
40092F30969J36778O0618L311M4241Q8790O144j35827j61188r2422j36919l17742
$$ 630969 767747 828365 831676 875917 964707 970851 835024 673836 581414 444495 126753
40081A26753l65616j18234J90042K42773Q1578j3959K2989k225j68256k87423
$$ 126753 -238863 -357097 -167055 75718 157296 143337 166326 164101 -4155 -291578
40071b91578j95984J5220J53762J62978J18990R2780Q7582N6391m0508j49226
$$ -291578 -487562 -472342 -318580 -155602 -36612 56168 143750 200141 159633 10407
40061A0407j35914K4486J47954Q1437l0310O1204K80721K75945n5506l70436l45776
$$ 10407 -125507 -101021 46933 128370 98060 159264 439985 715930 660424 289988 -55788
40050e5788r1909Q3311J11509J31660J74689J44499M5925o188J2891K3772J7349
$$ -55788 -147697 -64386 47123 178783 353472 497971 543896 537708 550599 574371 591720
40039E91720N9085J15620N7347j30133k90888l07214k37145j84651j38244j5054
$$ 591720 650805 766425 823772 693639 402751 95537 -141608 -326259 -464503 -479557
40029d79557J91975L68514L63431J23440k12309l79670k39432M4314J75722R1238
$$ -479557 -287582 80932 444363 567803 355494 -24176 -263608 -219294 -43572 47666
40019D7666L3613K01285M36143L96130J2725l66056l58325O397L35060L46474
$$ 47666 81279 282564 718707 1114837 1127562 761506 403181 409578 744638 1091112
40009A091112J60625N1218N3740m686j55882k17536j16579m5152j48987k55890
$$ 1091112 1251737 1302955 1356695 1352009 1196127 978591 862012 816860 667873 411983
39999D11983j29534J34571K19723M3692j49575j63950p6622k8627r982L5506O9861
$$ 411983 282449 417020 636743 680435 530860 366910 290288 261661 251679 287185 357046
39988C57046O1679Q7177J83326K14956N9087j52493j61837N8668K48179J83921
$$ 357046 418725 505902 689228 904184 963271 810778 648941 707609 955788 1139709
39978A139709p4076l12492m10390l71307k14785K8718K43820K85012J47922K452
$$ 1139709 1065633 753141 342751 -28556 -243341 -214623 29197 314209 462131 464583
39968D64583m266P6430Q4415k2441j22299j08604k0639M0369M5980L3337K3584
$$ 464583 460317 536747 621162 598721 476422 367818 347179 387548 433528 466865 490449
39957D90449J6610K4817M1669J1155r6775k09361k30722j72990j15181n4226P8374
$$ 490449 507059 531876 573545 584700 487925 278564 47842 -125148 -240329 -294555 -216181
39946b16181K42874K82055J53930M1784J10219K42153J79079j05756l46594l35854
$$ -216181 26693 308748 462678 504462 614681 856834 1035913 930157 583563 247709
39936B47709j77802r0427q1768L912J69461K08135K0674j96547k16792j03903
$$ 247709 69907 -20520 -102288 -98376 71085 279220 299894 103347 -113445 -217348
39926b17348q4177j78809j93518o7994J6123l9769n2136J50392M08939M29964
$$ -217348 -301525 -480334 -673852 -741846 -725723 -765492 -817628 -667236 -258297 171667
39916A71667J98463l1852j13437j36600j80209j65049l8007Q2514O9939j8804
$$ 171667 370130 338278 224841 88241 -91968 -257017 -295024 -212510 -142571 -161375
39906a61375l5388M8741J29181J23371M9836k6818o3008n4956l2208k8965m5291
$$ -161375 -196763 -148022 -18841 104530 154366 127548 64540 9584 -22624 -51589 -96880
39895i6880n1965l8040k3066j4808R913O7762J37456J76120J55076Q7328K8773
$$ -96880 -148845 -186885 -209951 -224759 -214846 -147084 -9628 166492 321568 408896 437669
39884D37669K3099L2134k5225j36271j74785p9611L0144J0398j12936k13711k52707
$$ 437669 460768 492902 467677 331406 156621 77010 107154 117552 4616 -209095 -461802
39873d61802k56788j81133L2454K90987M17555L70721K39988O1742j66005l21641
$$ -461802 -718590 -899723 -867269 -576282 -158727 211994 451982 513724 347719 26078
39863B6078k55657n3070N4451N9727J73864L94240M17469J26288j69543j94799
$$ 26078 -229579 -282649 -228198 -168471 5393 399633 817102 943390 773847 579048
39853E79048j06145j58147k54846j75287j8364k7450j25800m8954J44934J40185
$$ 579048 472903 314756 59910 -115377 -133741 -161191 -286991 -335945 -191011 -50826
39843e0826o8774j25819Q4913K14468P222k83165k84292k8236J91968K74654L19025
$$ -50826 -119600 -245419 -160506 53962 61184 -221981 -506273 -534509 -342541 -67887 251138
39832B51138L21164J77322m0644r0548J03225L09467K70535N683k45342l10173
$$ 251138 572302 749624 708980 618432 721657 1031124 1301659 1307342 1062000 751827
39822G51827k32916j55161j26356q4690j587M6947M091n1979j8530N2841J9969
$$ 751827 518911 363750 237394 152704 151117 198064 202155 150176 131646 184487 204456
39811B04456j16354j85589q5347Q4749J82172J97901J98056J85128J12745j2384
$$ 204456 88102 -97487 -182834 -98085 84087 281988 480044 665172 777917 765533
39801G65533j22251j59806j17959l3028L5294M5170P620l7789o2571l6513O8647
$$ 765533 643282 483476 365517 332489 367783 412953 420573 382784 320213 283700 352347
39790C52347J99401K16434P1363q7951j19986j10146k06647l21487k48410l8094
$$ 352347 551748 768182 839545 751594 631608 521462 314815 -6672 -255082 -293176
39780b93176M7066l1432l4477R6821J03733r9314j78392Q9345L72952K56638j03060
$$ -293176 -246110 -277542 -312019 -215198 -111465 -210779 -389171 -299826 73126 329764 226704
39769B26704k32509q4921l5079j91047k31291l389K00046J49147M6028J28805
$$ 226704 -5805 -90726 -125805 -316852 -548143 -551532 -351486 -202339 -156311 -27506
39759b7506K47817J54215m0549m4983J26366J95542P9640k1491O907M0724j0702
$$ -27506 220311 374526 333977 288994 415360 610902 690542 669051 675958 716682 705980
39748G05980m4557J1598L6181p1885j82747j26705J4478J8967j16882j59169j3824
$$ 705980 661423 673021 709202 637317 454570 327865 342343 361310 244428 85259 71435
39737G1435R4388m7501k92242l16471p9638J28150J09088J868O576O5417K426
$$ 71435 165823 118322 -173920 -490391 -570029 -441879 -332791 -330923 -324347 -258930 -256504
39726b56504j38585j25975R9264K93358K07957r9256l24697k34091J13367M11057
$$ -256504 -395089 -521064 -421800 -128442 79515 -19741 -344438 -578529 -465162 -54105
39716e4105L76516L6284k75668k77905o6431L6837o6111j34377K3853K43212K39212
$$ -54105 322411 358695 83027 -194878 -261309 -224472 -290583 -424960 -401107 -157895 81317
39705H1317K9538r7848j5219O3189q8039l55921m28949k17664M4832J41059J32821
$$ 81317 110855 13007 -2212 60977 -27062 -382983 -811932 -1029596 -984764 -843705 -710884
39694g10884J84099K65275K23942Q5983N2252J65183K08281M1577j70217k23088
$$ -710884 -526785 -261510 -37568 48415 100667 265850 474131 515708 345491 122403
39684A22403j82003k08655k31247o2643K28432L61106K52155J00047K9057o0213
$$ 122403 -59600 -268255 -499502 -562145 -333713 27393 279548 379595 408652 348439
39674C48439k00111k06876J1272K29214J94226j9023j40117p3834M2575O8784
$$ 348439 148328 -58548 -47276 181938 376164 357141 217024 143190 185765 254549
39664B54549j1005j27761j74317q2566N7944O4870p1770j42363m0259O6673M5670
$$ 254549 243544 115783 -58534 -141100 -83156 -18286 -90056 -232419 -272678 -206005 -160335
39653a60335N1767K23254L38941J26674k23827k62412M3082K42786P3239k05278
$$ -160335 -108568 114686 453627 580301 356474 94062 137144 379930 453169 247891
39643B47891k71716j81737j34827j07067J5486J45222J13320l3870r5058o866
$$ 247891 -23825 -205562 -340389 -447456 -431970 -286748 -173428 -207298 -302356 -309222
39633c09222J03563J06790j9017j95313k56729o7994K57664L92374J88578j02461
$$ -309222 -205659 -98869 -117886 -313199 -569928 -637922 -380258 12116 200694 98233
39623I8233j73891o7439j4728k3514Q2269K82792L41991J79803j8281j10592j55836
$$ 98233 -75658 -143097 -157825 -181339 -99070 183722 525713 705516 687235 576643 420807
39612D20807j90252j08826J07315K63638K00492J125j74712k92333l39419k10767
$$ 420807 230555 121729 229044 492682 693174 694299 519587 227254 -112165 -322932
39602c22932J00852L38522K44835p3302k64053j86096l1249J3790Q802Q5315K03502
$$ -322932 -222080 116442 361277 287975 23922 -162174 -193423 -179633 -170831 -85516 117986
39591A17986K12799O6985j34940k79396l16378k31479m1708J51716J86363J628
$$ 117986 330785 397770 262830 -16566 -332944 -564423 -606131 -454415 -268052 -266424
39581b66424k31765k41692L1154L20099L25415P4035j34442j18054Q156O3944
$$ -266424 -498189 -739881 -708727 -388628 -63213 10822 -123620 -241674 -233518 -169574
39571a69574L5373q523o1217j09279o2635Q2926J40449j3285j81455q7088J86974
$$ -169574 -134201 -142724 -203941 -313220 -375855 -292929 -152480 -165765 -347220 -434308 -247334
39560b47334K69132K0979k79341l41795k00789l6327J03402K29053K46557P8090
$$ -247334 21798 42777 -236564 -578359 -779148 -815475 -712073 -483020 -236463 -158373
39550a58373j55755k56184j83405l8637J01541J87244J31045p3187k30849j40923
$$ -158373 -314128 -570312 -753717 -792354 -690813 -503569 -372524 -445711 -676560 -817483
39540h17483J16038K63972J88859K9039q1171j47393j59833k4112K40937M09236
$$ -817483 -701445 -437473 -248614 -219575 -300746 -448139 -607972 -632084 -391147 18089
39530A8089L04111M6884r4820m4016L6624K069j02089j42837p5673L5173J21268
$$ 18089 322200 369084 274264 230248 266872 268941 166852 24015 -51658 -16485 104783
39519A04783J71594J88007J30366l7444k45037l27602j97097L4469J67732J30943
$$ 104783 276377 464384 594750 557306 312269 -15333 -212430 -177961 -10229 120714
39509A20714J8039o2220q6293o9834k1174K9712L2880j4349n5787n0752n549P1164
$$ 120714 138753 76533 -9760 -79594 -100768 -71056 -38176 -52525 -108312 -159064 -164613 -93449
39497i3449J67086K12271J23603o3171j99745k11186j84143k08483k25738j32223
$$ -93449 73637 285908 409511 346340 146595 -64591 -248734 -457217 -682955 -815178
39487h15178L1398J09727L9591o5411n7451P0213J75893J26247m8116j71851j21499
$$ -815178 -783780 -674053 -634462 -699873 -757324 -687111 -511218 -384971 -433087 -604938 -726437
39476g26437K7303J03297N8207q037k1547q277K1258J16235K53040K93215J68109
$$ -726437 -699134 -595837 -537630 -545667 -567214 -575491 -554233 -437998 -184958 108257 276366
39465B76366m002q4510r2700j06837r9292k0249M1801l4482j75338j71766K4337
$$ 276366 272364 187854 95154 -11683 -110975 -131224 -89423 -123905 -299243 -471009 -446672
39454d46672K21513K38834J04297l8377j07747j12527q6122n8913n7259q8760
$$ -446672 -225159 13675 117972 79595 -28152 -140679 -226801 -285714 -342973 -431733
39444d31733j35740j60236j12126K0051J43823J29531k635o4359L7767J35704
$$ -431733 -567473 -727709 -839835 -819784 -675961 -546430 -549065 -613424 -575657 -439953
39434d39953M5831j21932j10492Q3234J96148R6815m8181o8877k4940l4529o8310
$$ -439953 -394122 -516054 -626546 -543312 -347164 -250349 -298530 -367407 -392347 -426876 -495186
39423d95186n6423m2311p5021p5358K9221J36917J05816j7313p0919l4970m0221
$$ -495186 -551609 -593920 -668941 -744299 -715078 -578161 -472345 -489658 -560577 -595547 -635768
39412f35768j27938j64796m1908J59601K66622K11203P6048j9543l2093m97K2730
$$ -635768 -763706 -928502 -970410 -810809 -544187 -332984 -256936 -276479 -308572 -309069 -286339
39401b86339J9965l315l2947k9855L9673J14111O4415r8321j50846M1314K48986
$$ -286339 -266374 -269689 -302636 -332491 -292818 -178707 -114292 -212613 -363459 -322145 -73159
39390g3159J60336j07488j16522K10906M03911J40763k28071j99489J17321K05549
$$ -73159 87177 -20311 -136833 74073 477984 618747 390676 191187 308508 514057
39380E14057l8948j98283m8480J11720J861j90934j59815L6632J38143J21598
$$ 514057 475109 276826 228346 340066 341927 150993 -8822 27810 165953 287551
39370B87551J62882K74663K78908J14261o7930j29812r2185l8562j9371o1914
$$ 287551 450433 725096 1004004 1118265 1050335 920523 828338 789776 770405 708491
39360G08491j45867j62143k5047J59604J69294n1172k92611l27162j64406M463
$$ 708491 562624 400481 375434 535038 704332 653160 360549 33387 -131019 -126556
39350a26556N3721L2930M8608J06742J10257O534j05480p7435P5063J53752L6042
$$ -126556 -72835 -39905 8703 115445 225702 232236 126756 49321 124384 278136 314178
39339C14178j38116j56590m4174o708q3517p6690R8865K15571N6725k24205l05229
$$ 314178 176062 19472 -24702 -31410 -114927 -191617 -92752 122819 179544 -44661 -349890
39328c49890j65354p5619j32119j04861J44034L73520L09300Q1771N0199K84270
$$ -349890 -515244 -590863 -722982 -827843 -683809 -310289 -989 80782 130981 415251
39318D15251M88938M22397J42182j75511m10462m35685j42304L25658N65057L40416
$$ 415251 904189 1326586 1468768 1293257 882795 447110 304806 630464 1195521 1535937
39308A535937r8380l01424j39654J21515J99540O9640j13223k08423j86255j27519
$$ 1535937 1437557 1136133 996479 1117994 1317534 1387174 1273951 1065528 879273 751754
39298G51754j32402j81070j41030K5487J63890J42824N0024K1534p89j26883k35535
$$ 751754 619352 438282 297252 322739 486629 629453 679477 701011 700222 573339 337804
39287C37804j17081J33055J76573o4252k71346k08864m3822j5014m7151N7663
$$ 337804 220723 353778 530351 466099 194753 -14111 -57933 -72947 -120098 -62435
39277f2435K39742K79963J69142J00280J33722J21113l1076k30648l51758l43574
$$ -62435 177307 457270 626412 726692 860414 981527 950451 719803 368045 24471
39267B4471j82479R7460L06883K37349l8831j91993n7500J35771R7019j14076
$$ 24471 -158008 -60548 246335 483684 444853 252860 195360 331131 428150 314074
39257C14074k00733p2726N1900K975r6526m7054J17205J96961J34509O9207Q2513
$$ 314074 113341 40615 92515 95490 -1036 -48090 69115 266076 400585 469792 552305
39246E52305O6233p7517k47992k81311j79270o8822n392L8233N1182K5035O3473
$$ 552305 618538 541021 293029 11718 -167552 -236374 -241766 -203533 -152351 -127316 -63843
39235f3843K40760L76017K07849j73415l56730j77120M7318K4017p1420N2933
$$ -63843 176917 552934 760783 587368 230638 53518 100836 124853 53433 106366
39225A06366K67550K25033m8180j97766j36762j46590l19039l40707k4891L18875
$$ 106366 373916 598949 550769 353003 216241 69651 -249388 -590095 -614986 -296111
39215b96111L28951J25707P7007K18810K61776R2390p3699n7007M7695P1896j378
$$ -296111 32840 158547 235554 454364 716140 808530 734831 677824 725519 797415 796037
39204G96037j02453j96001k36782j39978Q6885K70106K41320L8056j50956j97465
$$ 796037 693584 497583 260801 120823 207708 477814 719134 757190 606234 408769
39194D08769j06986P5094L07556M88293M66126K10067q2236j49942M2215K54536
$$ 408769 301783 376877 684433 1172726 1638852 1848919 1766683 1616741 1658956 1913492
39184A913492K44513K5995j92561k67669k30960j66474q8225K3236J35975J78379
$$ 1913492 2158005 2184000 1991439 1723770 1492810 1326336 1238111 1261347 1397322 1575701
39174A575701J13692k5030j54012j81864p1005J16171K52762K52135J36585J0105
$$ 1575701 1689393 1664363 1510351 1328487 1257482 1373653 1626415 1878550 2015135 2025240
39164B025240k2744O2103J68007J47645k1020j51526m1143K39583L61045J07118
$$ 2025240 2002496 2064599 2232606 2380251 2359231 2207705 2166562 2406145 2767190 2874308
39154B874308l41356n83477m26508o2670J66570J10978r3192k08411j32690L5567
$$ 2874308 2532952 1949475 1522967 1460297 1626867 1737845 1644653 1436242 1303552 1339119
39144A339119J27274O6680q2310j87284j49969J1280J47230J00657j01118k30791
$$ 1339119 1466393 1533073 1450763 1263479 1113510 1124790 1272020 1372677 1271559 1040768
39134A040768j14064J49548L06459K38422K4766k21703m19638m52875k45175O1440
$$ 1040768 926704 1076252 1382711 1621133 1645899 1424196 1004558 551683 306508 367948
39124C67948J93037P8930o8762q1269m5426p8833r7734Q127J30119R2257n3577
$$ 367948 560985 639915 571153 489884 444458 365625 267891 276018 406137 498394 444817
39113D44817j07601l5395J7670o105r987N5113J19357J43373J56545J25121k5378
$$ 444817 337216 301821 319491 313386 303399 358512 477869 621242 777787 902908 877530
39102H77530k11460k18239k0270J04940p1681l93215m96967k68472M5351J69992
$$ 877530 666070 447831 427561 532501 460820 67605 -429362 -697834 -652483 -482491
39092d82491J08818N9041J12993J52785N5218r0229o9593J62198L93845M11663
$$ -482491 -373673 -314632 -201639 -48854 6364 -83865 -153458 8740 402585 814248
39082H14248K36924L4858j06914j96012k25909j96077j76024j95666j34489J00238
$$ 814248 1051172 1086030 979116 783104 557195 361118 185094 -10572 -145061 -44823
39072d4823L37674L08727M1250j45389q0078N7627N1305o0534j22768r6429j6743
$$ -44823 292851 601578 642828 497439 417361 474988 526293 465759 342991 246562 229819
39061B29819J08037K12741J55444n8275j85130n8932J42261J44988k3482j18391
$$ 229819 337856 550597 706041 647766 462636 403704 545965 690953 667471 549080
39051E49080p1775m4500j05720j16697J6084J81364K41117K10460J66136R6486
$$ 549080 477305 432805 327085 210388 226472 407836 648953 859413 1025549 1122035
39041A122035m5687k02963k33603q5125J01334J12931p7755k26548r3894K05615
$$ 1122035 1076348 873385 639782 554657 655991 768922 691167 464619 370725 576340
39031E76340K97977N0674k18724j75319Q2024K21613J75850J44762J86147J38475
$$ 576340 874317 924991 706267 530948 612972 834585 1010435 1155197 1341344 1479819
39021A479819l1578j27366n6362J6718k6155o0815R353L0218j38306l21873k52107
$$ 1479819 1448241 1320875 1264513 1281231 1255076 1194261 1203614 1233832 1095526 773653 521546
39010E21546K1241J89532J12598l9237p6833l2806n2297j65678k42772j41325
$$ 521546 542787 732319 844917 805680 728847 696041 643744 478066 235294 93969
39000I3969J14279L08019K45403L817j37479o1026M1257j8733j28767o9136J25586
$$ 93969 208248 516267 761670 765487 628008 566982 608239 589506 460739 391603 517189
38989E17189K25519J61221Q1342O7544K6740r5882k04496k16538j68222j03829
$$ 517189 742708 903929 985271 1052815 1079555 983673 779177 562639 394417 290588
38979B90588k4584J4912m4516p0105J68090N86740P27143L18286k93243n41616
$$ 290588 266004 280916 236400 166295 334385 921125 1648268 1966554 1673311 1131695
38969A131695l40673r6937j00592k27062k61765k03591j29916j7485J31721J74493
$$ 1131695 791022 694085 593493 366431 104666 -98925 -228841 -246326 -114605 59888
38959E9888K7671j41089j14756O0856J50340O8202l7748l8381J1423L06p5727
$$ 59888 87559 -53530 -168286 -107430 42910 111112 73364 34983 46406 46712 -29015
38948b9015j33585j01398M0334K36611L49384K58698J4198j89998k29770j62661
$$ -29015 -162600 -263998 -223664 12947 362331 621029 635227 445229 215459 52798
38938E2798r1218k0369P2370J21389M9244q6823j42531o8679N2951J47124K14192
$$ 52798 -38420 -58789 13581 134970 184214 97391 -45140 -113819 -60868 86256 300448
38927C00448K49360J98077M1985j37705k32396k03226q2499P0858J87058K08042
$$ 300448 549808 747885 789870 652165 419769 216543 134044 204902 391960 600002
38917F00002J37901M0951l6150j00430j47567j24725j9123O5341J1564j37202
$$ 600002 737903 778854 742704 642274 494707 369982 350859 416200 427764 290562
38907B90562j99648q6487O6245O2472r7189k16170j61183j8472O2616Q2153J24090
$$ 290562 90914 4427 70672 133144 35955 -180215 -341398 -359870 -297254 -215101 -91011
38896i1011J41752j244k50042l27340j08827J46341J40156j7140K9120L18991
$$ -91011 50741 49497 -200545 -527885 -636712 -490371 -350215 -367355 -338235 -19244
38886a9244M96447L45063R9829O5072J76201J71860J5909j21148j84008k52248
$$ -19244 477203 822266 922095 987167 1163368 1335228 1351137 1229989 1045981 793733
38876G93733k96929k09512p5056j24239l44904m14839j53827J89665K82542J54408
$$ 793733 496804 287292 212236 87997 -256907 -671746 -825573 -635908 -353366 -198958
38866a98958Q4798J66404K25797J43396K1777q516K5003L1374K3331Q4423K11487
$$ -198958 -114160 52244 278041 421437 443214 434698 459701 491075 514406 598829 810316
38855H10316K79531J83523j9677j48718r4543M4304P1415o8085k28092k59271
$$ 810316 1089847 1273370 1253693 1104975 1010432 1054736 1126151 1058066 829974 570703
38845E70703j78943q9321j4443Q1836J70495J70982Q1015j0592m7626n2211l8645
$$ 570703 391760 302439 287996 369832 540327 711309 792324 781732 734106 681895 643250
38834F43250J8796R8371J01875k8126k19890l51187l66909k76806j03062R4396
$$ 643250 662046 760417 862292 834166 614276 263089 -103820 -380626 -483688 -389292
38824c89292J90593J03943o2218q7839J04276L30337L62168K12410R5915J15347
$$ -389292 -198699 -94756 -156974 -244813 -140537 189800 551968 764378 860293 975640
38814I75640J26127j2293j78773j45748N9830J51152k2498k60220k98463j62139
$$ 975640 1101767 1089474 910701 764953 824783 975935 953437 693217 394754 232615
38804B32615o3975n8858o460J48191K62899K12123N4639p8095j36478j28443n6480
$$ 232615 168640 109782 103322 251513 514412 726535 781174 703079 566601 438158 381678
38793C81678L4451L9076p7117j85976j28465Q8794K92359L14254J29740j32201
$$ 381678 416129 455205 378088 192112 63647 152441 444800 759054 888794 756593
38783G56593k78777k07496j1074J25530J56349K09652L44421L98105J99032j54019
$$ 756593 477816 270320 259246 384776 541125 750777 1095198 1493303 1692335 1538316
38773A538316l75907l31297j55217m4900n2009r6273q6628l106Q0429N8111o8876
$$ 1538316 1162409 831112 675895 630995 578986 482713 396085 392979 473408 531519 462643
38762D62643j54962r5019Q489j0357j12570j01336N9782J66244P4230q6368j06955
$$ 462643 307681 212662 221151 210794 98224 -3112 56670 222914 297144 210776 103821
38751A03821K1460J42897J49332M2439j28554k61534k07189O7534L50616L66846
$$ 103821 125281 268178 417510 459949 331395 69861 -137328 -69794 280822 647668
38741F47668J00683j80640k49487j54124q5909j06262j01388J5527J48082J14509
$$ 647668 748351 567711 318224 164100 78191 -28071 -129459 -113932 34150 148659
38731A48659j18156l55519l65308j18084J98104L72611L28860J25910j01969k14052
$$ 148659 30503 -325016 -690324 -808408 -610304 -237693 91167 217077 115108 -98944
38721i8944j67690o3865j2054J9694J02174J48559L0903j16666J694L53114N02513
$$ -98944 -266634 -330499 -342553 -322859 -220685 -72126 -41223 -157889 -156195 196919 699432
38710F99432K25239j13135r2170J17070N7664k41860l13664l2451J86012P9942
$$ 699432 924671 811536 719366 836436 894100 652240 338576 306125 492137 572079
38700E72079p0135J9709J54874N3357j34432r6697R4570J28497j0638p3378k6314
$$ 572079 501944 521653 676527 729884 595452 498755 593325 721822 711184 637806 611492
38689F11492q3365k57411k80965n4680J72328J96816J37509J58152J73436L6758
$$ 611492 528127 270716 -10249 -64929 107399 304215 441724 599876 773312 810070
38679H10070j62726k08980o7154R2752J24456L1211q8319j24912l8636P6904P1365
$$ 810070 647344 438364 371210 463962 588418 619629 531310 406398 367762 444666 516031
38668E16031o6569j69779j04383P0729K14142K63861K16443O6456j26343k16101
$$ 516031 449462 279683 175300 246029 460171 724032 940475 1006931 880588 664487
38658F64487j41076k7739l660j350J03538K45303K47124J05352j273J1494L6981
$$ 664487 523411 495672 492012 490662 594200 839503 1086627 1191979 1190706 1202200 1239181
38647A239181l131k3938N1148J27125O5012j11888k51767k68382k04211j21468
$$ 1239181 1236050 1212112 1263260 1390385 1455397 1343509 1091742 823360 619149 497681
38637D97681k0305J14711K38437K57154J27524o4571j58838q6678M2336O9783
$$ 497681 477376 592087 830524 1087678 1215202 1150631 991793 905115 947451 1017234
38627A017234j4338p3557k4295N2047L6069n7517j03233l7802N3135M1131p8374
$$ 1017234 1002896 929339 905044 957091 993160 935643 832410 794608 847743 888874 810500
38616H10500j63301r2307P0499J43727O7378k5414l1133m9063j92385l18355j68928
$$ 810500 647199 554892 625391 769118 836496 811082 779949 730886 538501 220146 51218
38605E1218K16363M62089L24227J019j59639r7968q899J320L930M8158Q6258R5347
$$ 51218 267581 729670 1053897 1054916 895277 797309 788410 789730 793660 841818 928076 1023423
38593A023423R7275N7851o0496j49567o1743J09830Q7433j73800l58401k27396
$$ 1023423 1120698 1178549 1118053 968486 906743 1016573 1104006 930206 571805 344409
38583C44409K9764Q9817k7788m7395R8658J97923J47555J16716K26953L18654
$$ 344409 374173 463990 436202 388807 487465 685388 832943 949659 1176612 1495266
38573A495266J94918p1262k47881k56322k08461j97203k06595k03229j79406j06853
$$ 1495266 1690184 1618922 1371041 1114719 906258 709055 502460 299231 119825 12972
38563A2972L6683J83508K19224J34283N0029O2158J26506J40787Q7272L9146M2708
$$ 12972 49655 233163 452387 586670 636699 698857 825363 966150 1053422 1092568 1135276
38552A135276M5625l0414j60384k07562q3131J18434K16476J69134J06317J19539
$$ 1135276 1180901 1150487 990103 782541 699410 817844 1034320 1203454 1309771 1429310
38542A429310J36748P0407k7467o5589p1691j17455j63159j30906p1232p8931
$$ 1429310 1566058 1636465 1608998 1543409 1471718 1354263 1191104 1060198 988966 910035
38532I10035q5226N5039K71647L09718J08453q0734o0586M1973K2630p6957r2548
$$ 910035 824809 879848 1151495 1461213 1569666 1488932 1428346 1470319 1492949 1415992 1323444
38521A323444l5642l5231p1706j2391J19536J46283K6332o1973J1316J38178J31673
$$ 1323444 1287802 1252571 1180865 1168474 1288010 1434293 1460625 1398652 1409968 1548146 1679819
38510A679819l3447k03842k01710K4013L22674M24292K03076j42315k91456j85329
$$ 1679819 1646372 1442530 1240820 1264833 1587507 2011799 2214875 2072560 1781104 1595775
38500A595775o2980r7014j65887o9315J75377L67425L62832J83818m2161j75643
$$ 1595775 1532795 1435781 1269894 1200579 1375956 1743381 2106213 2290031 2247870 2072227
38490B072227j60622q6228r0187j70475j90190r9078j2180q940j5158J8427k745
$$ 2072227 1911605 1825377 1735190 1564715 1374525 1275447 1263267 1254327 1239169 1257596 1254851
38479A254851j08713j16002R4713K93444J72462j67441l07572r5672J62748J75133
$$ 1254851 1146138 1030136 1124849 1418293 1590755 1423314 1115742 1020070 1182818 1357951
38469A357951L8842l581N4442O1901P834K725M3618K4478l8301M433J81423K99643
$$ 1357951 1396793 1393212 1447654 1509555 1517389 1520114 1563732 1588210 1549909 1554342 1735765 2035408
38457B035408J78653j04566k85053j92524P5927K50023J43346j60721l76186k87494
$$ 2035408 2214061 2109495 1824442 1631918 1707845 1957868 2101214 1940493 1564307 1276813
38447A276813M5148L56950M22005K08020j47662m38560m93758k85234L0192K26739
$$ 1276813 1321961 1678911 2100916 2308936 2161274 1722714 1228956 943722 973914 1200653
38437A200653K05527O1315m3084l1415N4027J15494P1463p8428k15775j78854
$$ 1200653 1406180 1467495 1424411 1392996 1447023 1562517 1633980 1555552 1339777 1160923
38427A160923N3997K80102K62034J8011j70862j03321P9172Q9074r7031j95806
$$ 1160923 1214920 1495022 1757056 1775067 1604205 1500884 1580056 1669130 1572099 1376293
38417A376293j9397K52809L20774J48906n9778j80887k49317k57964j22319R6026
$$ 1376293 1356896 1609705 1930479 2079385 2019607 1838720 1589403 1331439 1209120 1305146
38407A305146J54505n2193l02331l22307j27159O3229J38217J54332J55871J23137
$$ 1305146 1459651 1407458 1105127 782820 655661 718890 857107 1011439 1167310 1290447
38397A290447P3081N3941N1690L1008L6825J15755J76635R3631p6329j55285j13079
$$ 1290447 1363528 1417469 1469159 1500167 1536992 1652747 1829382 1923013 1846684 1691399 1578320
38386A578320q8227j36931j61537j13431n7721N996J58715L24578K63668o7626
$$ 1578320 1490093 1353162 1191625 1078194 1020473 1026469 1185184 1509762 1773430 1705804
38376A705804l71744l84914j96437k7466R0605J99557J89638j6840k07570j27000
$$ 1705804 1334060 949146 752709 725243 815848 1015405 1205043 1188203 980633 853633
38366H53633J08043J64971J9370k1258J68496L36389K59399M9900p1927o8450
$$ 853633 961676 1126647 1146017 1124759 1293255 1629644 1889043 1938943 1867016 1798566
38356A798566j5622M7073P1894k370r8584l7452J65940K56353J20336j8265L9336
$$ 1798566 1782944 1830017 1901911 1899541 1800957 1763505 1929445 2185798 2306134 2287869 2327205
38345B327205J42044O3770r7472q6741P9515J66129J23731J19253J76765J07771
$$ 2327205 2469249 2533019 2435547 2348806 2428321 2594450 2718181 2837434 3014199 3121970
38335C121970j38384l35508l07863j72202j12760r5433K1962K08694K70062J06834
$$ 3121970 2983586 2648078 2340215 2168013 2055253 1959820 1981782 2190476 2460538 2567372
38325B567372j61843l33453k97129q2655J75951L00013J71809j29898l18843j44553
$$ 2567372 2405529 2072076 1774947 1692292 1868243 2168256 2340065 2210167 1891324 1746771
38315A746771K89003N49602L47356r3658l07680j80193k4709n7745j09004J2900
$$ 1746771 2035774 2585376 2932732 2839074 2531394 2351201 2326492 2268747 2159743 2172643
38305B172643J68336J38806m870o5268n7848q7258o1705J18124K32970K1436l03802
$$ 2172643 2340979 2479785 2474915 2409647 2351799 2264541 2202836 2320960 2553930 2575366 2271564
38294B271564k75051J01407L15057J26412j10978o7954Q6040P9337n875L865l617
$$ 2271564 1996513 2097920 2412977 2539389 2428411 2360457 2446497 2525834 2519959 2523824 2520207
38283B520207j81201l62739l04496q2658P4582J52729K26775J85801m8333k16173
$$ 2520207 2339006 1976267 1671771 1589113 1663695 1816424 2043199 2229000 2180667 1964494
38273A964494n0451K26421J76253j66098l38148j65879L1910J1038p5821n2186
$$ 1964494 1914043 2140464 2316717 2150619 1812471 1646592 1678502 1689540 1613719 1561533
38263A561533p309l1861j2011J04147J28173o0317k68217k66827j14198l551K4735
$$ 1561533 1554224 1522363 1510352 1614499 1742672 1682355 1414138 1147311 1033113 1029562 1054297
38252A054297K8144o710p7947o2389J03484K54634J97922j1875j61082j55094
$$ 1054297 1082441 1075731 997784 935395 1038879 1293513 1491435 1479560 1318478 1163384
38242A163384n9305M8757J20963J07858K1736l0231K0835J10210J52914J47895
$$ 1163384 1104079 1152836 1273799 1381657 1403393 1373162 1393997 1504207 1657121 1805016
38232A805016R6831l9225k06569k41742j09431O788j1154k3066J05336K37681
$$ 1805016 1901847 1862622 1656053 1414311 1304880 1311668 1300514 1277448 1382784 1620465
38222A620465J93839P1246O7589J15240k22k33090l05759j27958R9260K02733
$$ 1620465 1814304 1885550 1953139 2068379 2068157 1835067 1529308 1401350 1500610 1703343
38212A703343J90097P9037j34752k95350j68710J90929M12252K68875m4983k17366
$$ 1703343 1893440 1972477 1837725 1542375 1373665 1564594 1976846 2245721 2200738 1983372
38202A983372j86815p7634K9561J00938Q8042K7064O4862K34842L34862J84750
$$ 1983372 1796557 1718923 1748484 1849422 1937464 1964528 2029390 2264232 2599094 2783844
38192B783844j05527k78155k38612p9946R5922K14061J77125k7428k18510j98213
$$ 2783844 2678317 2400162 2161550 2081604 2177526 2391587 2568712 2541284 2322774 2124561
38182B124561j5867R9458M8290n2941q2518m6745J5088J04319J88208J72093J9550
$$ 2124561 2108694 2208152 2256442 2203501 2120983 2074238 2089326 2193645 2381853 2553946 2573496
38171B573496j66686k37692j39744N0381J96479K15280J52748J22537J38731Q4957
$$ 2573496 2406810 2169118 2029374 2079755 2276234 2491514 2644262 2766799 2905530 2990487
38161B990487p6481j66824j6565K31746K50999k7405l02416l06101j28650j5437
$$ 2990487 2914006 2747182 2730617 2962363 3213362 3185957 2883541 2577440 2448790 2433353
38151B433353K372Q7398K83225M20589L53490J49827n504k0729L3941K8644q1134
$$ 2433353 2435725 2523123 2806348 3226937 3580427 3730254 3724750 3704021 3737962 3766606 3685472
38140C685472k00222j93917n6008O2367K9632j07314k02349k00987j59297j02481
$$ 3685472 3485250 3291333 3235325 3297692 3327324 3220010 3017661 2816674 2657377 2554896
38130B554896P838J42747J67508R788k13277l18628k55981j10420L6490J50927
$$ 2554896 2562734 2705481 2872989 2882777 2669500 2350872 2094891 1984471 2020961 2171888
38120B171888J91505J33579N4306P4672J80306K11398R5241j9521L0192J62524
$$ 2171888 2363393 2496972 2551278 2625950 2806256 3017654 3112895 3093374 3123566 3286090
38110C286090J52048l2865j65670q2055R0626J34655N9009N5677J84092K74236
$$ 3286090 3438138 3405273 3239603 3157548 3248174 3382829 3441838 3497515 3681607 3955843
38100C955843J77678k7779j59552j49881n1802Q4891K17896K47774J05818q7836
$$ 3955843 4133521 4105742 3946190 3796309 3744507 3829398 4047294 4295068 4400886 4313050
38090D313050j07367Q0368K35814J61487k2069o2427M5196O9086p0513j53646
$$ 4313050 4205683 4286051 4521865 4683352 4661283 4598856 4644052 4713138 4642625 4488979
38080D488979r767J78212J24685j06628j61372P9727K93588J69724j28261j87534
$$ 4488979 4479212 4657424 4782109 4675481 4514109 4593836 4887424 5057148 4928887 4741353
38070D741353O3716K67493J64696n5328q1643M6865M1617j51821k46440l5649
$$ 4741353 4805069 5072562 5237258 5181930 5100287 5147152 5188769 5036948 4790508 4754859
38060D754859L01758M41506L13091J18558M3317R0622J57977J49112K6251j43925
$$ 4754859 5056617 5498123 5811214 5929772 5973089 6063711 6221688 6370800 6397051 6253126
38050F253126k07717p9781J32472K45267K13046J31392O5953J2481N655R9314
$$ 6253126 6045409 5965628 6098100 6343367 6556413 6687805 6753758 6766239 6771894 6871208
38040F871208K14820J84472J4316o1936J01900L40515M04779K91532J80252J32139
$$ 6871208 7086028 7270500 7284816 7222880 7324780 7665295 8070074 8361606 8541858 8673997
38030H673997N3196p3534j25070m6074M9397N9252M8021J23001K47393K96395
$$ 8673997 8727193 8653659 8528589 8482515 8531912 8591164 8639185 8762186 9009579 9305974
38020I305974K62245K79975M19801N47584M78229K37906O5332J14000K54823K75094
$$ 9305974 9568219 9848194 10267995 10815579 11293808 11531714 11597046 11711046 11965869 12240963
38010A2240963J96063K28566M27670N85190N27485L44677K18331J78796J71810
$$ 12240963 12437026 12665592 13093262 13678452 14205937 14550614 14768945 14947741 15119551
38001A5119551K20046L35739L83896K45328N1668M1231K10339L22977K63814J64996
$$ 15119551 15339597 15675336 16059232 16304560 16356228 16397459 16607798 16930775 17194589 17359585
37991A7359585J54644J90792K07165K35490L00637L49428L57709L67203L61694
$$ 17359585 17514229 17705021 17912186 18147676 18448313 18797741 19155450 19522653 19884347
37982A9884347K67053J35546J48557L44278N24387N49160N43605O54870P74037
$$ 19884347 20151400 20286946 20435503 20779781 21304168 21853328 22396933 23051803 23825840
37973B3825840P05810N01889M04404N09197O83783Q01398Q76035R49932R98718
$$ 23825840 24531650 25033539 25437943 25947140 26630923 27432321 28308356 29258288 30257006
37964C0257006R96178R80186J012378J111582J229329J274588J205544J115107
$$ 30257006 31253184 32233370 33245748 34357330 35586659 36861247 38066791 39181898
37956C9181898J145247J285102J369831J340945J365441J585426J887632K074514
$$ 39181898 40327145 41612247 42982078 44323023 45688464 47273890 49161522 51236036
37948E1236036K148293K249287K410085K568478K748448L011132L272827L399159
$$ 51236036 53384329 55633616 58043701 60612179 63360627 66371759 69644586 73043745
37940G3043745L463432L681249M078949M457562M719794M998612N397803N840654
$$ 73043745 76507177 80188426 84267375 88724937 93444731 98443343 103841146 109681800
37932A09681800O279403O828472P540094Q244489Q802160R365533J0179331J1216865
$$ 109681800 115961203 122789675 130329769 138574258 147376418 156741951 166921282 178138147
37924A78138147J2228594J3107933J4006444J5083325J6318057J7609751J8914802
$$ 178138147 190366741 203474674 217481118 232564443 248882500 266492251 285407053
37917B85407053K0216291K1456346K2570311K3521530K4235231K4542005K4252383
$$ 285407053 305623344 327079690 349650001 373171531 397406762 421948767 446201150
37910D46201150K3269260K1578577J9153474J5942188J1969717P396013K444025
$$ 446201150 469470410 491048987 510202461 526144649 538114366 545510379 547954404
37903E47954404k673374p706153j2317454j6201226j9256355k1556587k3152363
$$ 547954404 545281030 537574877 525257423 509056197 489799842 468243255 445090892
37896D45090892k4019062k4217337k3954090k3405436k2597483k1539588k0338300
$$ 445090892 421071830 396854493 372900403 349494967 326897484 305357896 285019596
37889B85019596j9072734j7708500j6286374j5039282j4103697j3243626j2145934
$$ 285019596 265946862 248238362 231951988 216912706 202809009 189565383 177419449
37882A77419449j0928772j0035576r598455r224111q521162p567206o695486o049188
$$ 177419449 166490677 156455101 146856646 137632535 129111373 121544167 114848681 108799493
37874A08799493n550777n147366m855954m631301m368931m026509l646585l296932
$$ 108799493 103248716 98101350 93245396 88614095 84245164 80218655 76572070 73275138
37866G3275138l047636k931252k862959k690670k388925k100968j924265j779656
$$ 73275138 70227502 67296250 64433291 61742621 59353696 57252728 55328463 53548807
37858E3548807j579359j390027j311425j311542j309732j313640j336446j286358
$$ 53548807 51969448 50579421 49267996 47956454 46646722 45333082 43996636 42710278
37850D2710278j104694r36361r81190j201098j332161j200524r22611p77062r25585
$$ 42710278 41605584 40669223 39688033 38486935 37154774 35954250 35031639 34254577 33328992
37841C3328992j238508j381235j150374p39055n40405o56981p91033p01593n40672
$$ 33328992 32090484 30709249 29558875 28819820 28279415 27622434 26831401 26129808 25589136
37832B5589136n65848p31735q07631p41474o41732n20619l37845k07437k61758
$$ 25589136 25023288 24291553 23483922 22742448 22100716 21580097 21242252 21034815 20773057
37823B0773057l70357l04521j44673j85775m28538n26150l20729q8850j06135
$$ 20773057 20402700 20098179 19953506 19767731 19339193 18813043 18492314 18403464 18297329
37814A8297329k69909l42205l08662k77801k33234j24657n7529j62379l69199
$$ 18297329 18027420 17685215 17376553 17098752 16865518 16740861 16683332 16520953 16151754
37805A6151754n03229n23833m99389m34328l06739k13602k84289m64991n52678
$$ 16151754 15648525 15124692 14625303 14190975 13884236 13670634 13386345 12921354 12368676
37796A2368676m50065k57414j06068k4356M514m2328j88529l75005m72310l99484
$$ 12368676 11918611 11661197 11555129 11530773 11535287 11492959 11304430 10929425 10457115 10057631
37786A0057631k26364j20987j66705k74404l21307l03490k61596j53782K8915
$$ 10057631 9831267 9710280 9543575 9269171 8947864 8644374 8382778 8228996 8257911
37777H257911J00732j16894m44665m86537j86248N8858k1149j76505n8836K23269
$$ 8257911 8358643 8241749 7797084 7310547 7124299 7183157 7162008 6985503 6926667 7149936
37767G149936K84123L7059k37323l20907k50414j14127M9714J37468L1809j75261
$$ 7149936 7434059 7471118 7233795 6912888 6662474 6548347 6598061 6735529 6767338 6592077
37757F592077k31895o3033J25865J34063j5154j84587k82097k58493j11252M7534
$$ 6592077 6360182 6297149 6423014 6557077 6541923 6357336 6075239 5816746 5705494 5753028
37747E753028P2283j4631m4115L8207R3795K6717p6274j18341j34801j64866j46784
$$ 5753028 5825311 5810680 5766565 5804772 5898567 5925284 5849010 5730669 5595868 5431002 5284218
37736E284218o2608l1972j12057j42443K5553K42139K13572q2760l32033k66480
$$ 5284218 5221610 5189638 5077581 4935138 4960691 5202830 5416402 5333642 5001609 4735129
37726D735129K5397K33747J78749m2409k16096k47271k05794j66455r0467N9515
$$ 4735129 4760526 4994273 5173022 5130613 4914517 4667246 4461452 4294997 4204530 4264045
37716D264045J56429K6444k53441l61734j40560J56396J80640n6197k32454j60845
$$ 4264045 4420474 4446918 4193477 3831743 3691183 3847579 4028219 3972022 3739568 3578723
37706C578723K4647J25837J20664Q2097K2186p2764j50255j42316o0749K8714
$$ 3578723 3603370 3729207 3849871 3931968 3954154 3881390 3731135 3588819 3528070 3556784
37696C556784Q2405P5101j8422j64111k42196j73356m6041j7650q9370r1363O1330
$$ 3556784 3639189 3714290 3695868 3531757 3289561 3116205 3070164 3052514 2963144 2871781 2933111
37685B933111J99380R0056k42661n05407m62093j81357Q5469J90171J73157J23589
$$ 2933111 3132491 3222547 2979886 2474479 2012386 1831029 1916498 2106669 2279826 2403415
37675B403415P1146K2043L558K6281N4017M7888Q808l8250o3406l0794O3805J41404
$$ 2403415 2474561 2496604 2500162 2526443 2580460 2628348 2637156 2598906 2535500 2504706 2568511 2709915
37663B709915R9664l8679j08939K621K01256K87763J86847P048j04460j05224
$$ 2709915 2809579 2770900 2661961 2664582 2865838 3153601 3340448 3347496 3243036 3137812
37653C137812o6446q7712j97073l08154l00853j69489m5689l5151q6972q1633
$$ 3137812 3071366 2983654 2786581 2478427 2177574 2008085 1962396 1927245 1840273 1758640
37643A758640P686J12796J73452J58991M6678j14960j75452m6562J41125J91310
$$ 1758640 1766326 1879122 2052574 2211565 2258243 2143283 1967831 1921269 2062394 2253704
37633B253704J15433P3503O8548n2749k51934k41488O6753L17963J73889j77160
$$ 2253704 2369137 2442640 2511188 2458439 2206505 1965017 2031770 2349733 2523622 2346462
37623B346462k85483r6006K8167q3332j71786l3043J29075N8376j28866j67740
$$ 2346462 2060979 1964973 1993140 1909808 1738022 1704979 1834054 1892430 1763564 1595824
37613A595824r5820j43930k81031k29366N9668K80956K19734L5127m2683m7245
$$ 1595824 1500004 1356074 1075043 845677 905345 1186301 1406035 1441162 1398479 1351234
37603A351234j05480j35059J8284K44215K53655L181k08392j31034J35921L19298
$$ 1351234 1245754 1110695 1128979 1373194 1626849 1630030 1421638 1290604 1426525 1745823
37593A745823K93643J21542r5213k58491k45434o373L01167M04021J93299j48547
$$ 1745823 2039466 2161008 2065795 1807304 1561870 1555497 1856664 2260685 2453984 2305437
37583B305437l39297k75528r0747K5337J5353l5151l2025K3610P5801J23349K27904
$$ 2305437 1966140 1690612 1599865 1625202 1640555 1605404 1573379 1596989 1672790 1796139 2024043
37572B024043L88840M66438L10695k8041k92784k74949l5888J82069K34521J86691
$$ 2024043 2412883 2879321 3190016 3161975 2869191 2594242 2558354 2740423 2974944 3161635
37562C161635J58589J71553J95936K40223K85527K13227m4781l12902l14732m5644
$$ 3161635 3320224 3491777 3687713 3927936 4213463 4426690 4381909 4069007 3754275 3708631
37552C708631J80350J42281q724k1488P7650R7547M9088J13019K67414K47182
$$ 3708631 3888981 4031262 4022538 4001050 4078700 4176247 4225335 4338354 4605768 4852950
37542D852950m8908l64193m24386k70503j10935k0416M4765P5238L6379l0579
$$ 4852950 4804042 4439849 4015463 3744960 3634025 3613609 3658374 3733612 3769991 3739412
37532C739412r3580k14344l92257m46441k50673K1090J10289M7707N6554J47162
$$ 3739412 3645832 3431488 3039231 2592790 2342117 2363207 2473496 2521203 2577757 2724919
37522B724919J10873q2305j93352q6595R4454K12914L12042L79226K38033j24864
$$ 2724919 2835792 2753487 2560135 2473540 2567994 2780908 3092950 3472176 3710209 3585345
37512C585345l89741l11761q9565n9873k02634k44760j18451K450L7727N4168
$$ 3585345 3195604 2883843 2794278 2734405 2531771 2287011 2168560 2171010 2208737 2262905
37502B262905L3045r6131k07792r3958J55315K17451L9300o8581N5345J68057
$$ 2262905 2295950 2199819 1992027 1898069 2053384 2270835 2310135 2241554 2296899 2464956
37492B464956N8990q7823k6584J27473J19362j271K439J14001Q7581j25266k89046
$$ 2464956 2523946 2436123 2409539 2537012 2656374 2655103 2657542 2771543 2859124 2733858 2444812
37481B444812k43307p9162P7852K10594K80588J98849K0880m6083M7160P0408
$$ 2444812 2201505 2122343 2200195 2410789 2691377 2890226 2911106 2865023 2912183 2982591
37471B982591j36716l57897k61057J09149L32062J38346k42764l72157j38113
$$ 2982591 2845875 2487978 2226921 2336070 2668132 2806478 2563714 2191557 2053444
37462B053444J42709J54330m5096j75404j39476q4637r4179o3965L6754K7315
$$ 2053444 2196153 2350483 2305387 2129983 1990507 1905870 1811691 1747726 1784480 1811795
37452A811795j83932l64515k68748l1824L8862m1293M534J96250K31513M096j96727
$$ 1811795 1627863 1263348 994600 962776 1001638 960345 964879 1161129 1392642 1396738 1200011
37441A200011j57277n6855r7281j39654j758J50635O1758j50940j66053J8760
$$ 1200011 1042734 985879 888598 748944 747186 897821 959579 808639 642586 661346
37431F61346J08254Q493o5205O152Q4770Q9916J42161K74110K93026R6596j21078
$$ 661346 769600 778093 712888 719040 803810 893726 1035887 1309997 1603023 1699619 1578541
37420A578541j62557j15522j48496k01234j12865O6883J37932N6968l6387o5631
$$ 1578541 1415984 1300462 1151966 950732 837867 904750 1042682 1099650 1063263 997632
37410I97632p8603p1857K7219J58891J18468j44526l69336k78059N7788L02555
$$ 997632 919029 847172 874391 1033282 1151750 1007224 637888 359829 417617 720172
37400G20172K77024J31438P1707P8042J3345r9858r6626M8400J43724N6078r0463
$$ 720172 997196 1128634 1200341 1278383 1291728 1191870 1095244 1143644 1287368 1343446 1252983
37389A252983j09935l0914j7960q6251p8100P8172K46510K57227Q9584j43564
$$ 1252983 1143048 1112134 1094174 1007923 929823 1007995 1254505 1511732 1601316 1457752
37379A457752k93515k52503m7223J34290J26244j092m2411L5926O9249n247m1711
$$ 1457752 1164237 911734 864511 998801 1125045 1123953 1081542 1117468 1186717 1181470 1139759
37368A139759L8146Q8297O133n0523P4728K21857J27374j35907k19583j240K38900
$$ 1139759 1177905 1266202 1272335 1221812 1296540 1518397 1645771 1509864 1290281 1289041 1527941
37357A527941K15314l543j50402j15546k868P8001J21579J43858J15658K8903
$$ 1527941 1743255 1739712 1589310 1473764 1470896 1548897 1670476 1814334 1929992 1958895
37347A958895l4692J8123J39866J47853m7716k71190k54549J7722K70006K80652
$$ 1958895 1924203 1942326 2082192 2230045 2182329 1911139 1656590 1674312 1944318 2224970
37337B224970J25206n90n2887j03738j51033j29206m2580O0317J85835L26132
$$ 2224970 2350176 2349586 2296699 2192961 2041928 1912722 1870142 1930459 2116294 2442426
37327B442426L63787K14319L193q5323q3311j53008k67067k29944l0238R7894
$$ 2442426 2806213 3020532 3023725 2938402 2855091 2702083 2435016 2205072 2174834 2272728
37317B272728L6057n1512k4986p3j10185k45278k29165j05605m2776o4423p4059
$$ 2272728 2308785 2257273 2232287 2232214 2122029 1876751 1647586 1541981 1499205 1434782 1360723
37306A360723n8458o9351o7078K0619J22916R9474k5452p9715L259J07069J17319
$$ 1360723 1302265 1232914 1165836 1186455 1309371 1408845 1383393 1303678 1306937 1414006 1531325
37295A531325L8136q0417j84944j87419n2186P5553P061j93687k50127p3633R6495
$$ 1531325 1569461 1489044 1304100 1116681 1064495 1140048 1147109 953422 703295 629662 726157
37284G26157P7444L8604J94533L84785K72960j02554l19322j68779N3828J7260
$$ 726157 803601 842205 1036738 1421523 1694483 1591929 1272607 1103828 1157656 1174916
37274A174916j56319j29991R3734J85993J9453j44338p9270O5760J9921k04366
$$ 1174916 1018597 888606 982340 1168333 1187786 1043448 964178 1029938 1049859 845493
37264H45493l60253l12499j44237J9206J17547J24241P0314P3123J88227K67952
$$ 845493 485240 172741 28504 47710 165257 289498 359812 432935 621162 889114
37254H89114J40861j02019k12381j66270j84273l23289l35151p3592K19438K49498
$$ 889114 1029975 927956 715575 549305 365032 41743 -293408 -367000 -147562 101936
37244A01936Q7675K205L2026J6672n0142j2862J24257J70758P7614J5624O4599
$$ 101936 189611 191816 223842 240514 190372 177510 301767 472525 550139 565763 630362
37233F30362Q8733J4654k7567K4798J0390j53723k47011p6275J53937J12379j28756
$$ 630362 719095 733749 706182 730980 741370 587647 340636 264361 418298 530677 401921
37222D01921j84427M0707K02698O1167j63917j71494m3846n3290j77503j38081
$$ 401921 217494 258201 460899 522066 358149 186655 142809 89519 -87984 -226065
37212b26065J22504L20743K50353N7802k2744J293j6005q4168j04637p7884p4452
$$ -226065 -103561 217182 467535 525337 502593 503886 487881 403713 299076 221192 146740
37201A46740m9501R6986K79736K75144O5766p6023L5310K20490J98985n929j29715
$$ 146740 97239 194225 473961 749105 814871 738848 774158 994648 1193633 1187704 1057989
37190A057989o3536K8470p380j05588j16384r426J34852K41152K72630K19259
$$ 1057989 994453 1022923 1015543 909955 793571 784145 918997 1160149 1432779 1652038
37180A652038J24508P7210J15839J71739J55775P5169J7837L3563P0697L7575
$$ 1652038 1776546 1853756 1969595 2141334 2297109 2372278 2390115 2423678 2494375 2531950
37170B531950q8133k20180k44141j42048j6166K6348j7620p7752j06117r4993
$$ 2531950 2443817 2223637 1979496 1837448 1821282 1847630 1830010 1752258 1646141 1551148
37160A551148m2654K7985M4806m0767j70184k38071k16427j46905n0532N0388
$$ 1551148 1508494 1536479 1581285 1540518 1370334 1132263 915836 768931 718399 768787
37150G68787O4920n9128j73598o3423K17489L39581J26418j84251k49306m7370
$$ 768787 833707 774579 600981 537558 755047 1094628 1221046 1036795 787489 740119
37140G40119J69070K32579J76038O1826r0360k12560k08847r3316K3052Q3122
$$ 740119 909189 1141768 1317806 1379632 1289272 1076712 867865 774549 797601 880723
37130H80723R2103L673k24264m55363m55859k04290O1688J76004K28052L12818
$$ 880723 972826 976499 752235 296872 -158987 -363277 -301589 -125585 102467 415285
37120D15285L09452J01664j37614j32914Q2621J87895K1821k01828k02358K905
$$ 415285 724737 826401 688787 555873 638494 826389 848210 646382 444024 446929
37110D46929J51149O6486j61101l04923k49472r9784m3340j07241j14202O7024
$$ 446929 598078 664564 503463 198540 -50932 -150716 -194056 -301297 -415499 -348475
37100c48475L02623L42987J53699m7240q6027j7460K1418q098p6951j55781j61673
$$ -348475 -45852 297135 450834 403594 317567 300107 321525 313427 236476 80695 -80978
37089h0978K1107L38182N04410L13283o9802k97312k71232j93333k01351j77648
$$ -80978 -59871 278311 782721 1096004 1026202 728890 457658 264325 62974 -114674
37079a14674N089K26899K48938K0403k54457l32601j60517Q7893J76025M1185
$$ -114674 -109585 117314 366252 386655 132198 -200403 -360920 -273027 -97002 -55817
37069e5817j32649j31506K2578J23575Q5550L9834Q7519J28870N2539n0746k6181
$$ -55817 -188466 -319972 -297394 -173819 -88269 -48435 39084 167954 220493 169747 143566
37058A43566Q6707J11400N557r4208q3442J1815J45748K97819L80100K64011k6441
$$ 143566 230273 341673 347230 253022 169580 181395 327143 624962 1005062 1269073 1242632
37047A242632k72116k93601j42083M750M2289l0254j70954k88699k63221q8453
$$ 1242632 970516 676915 534832 539582 581871 551617 380663 91964 -171257 -259710
37037b59710O3905M1302p6689q8540M1479J54399J52528J19710J36707J33696
$$ -259710 -195805 -154503 -231192 -319732 -278253 -123854 28674 148384 285091 418787
37027D18787L2713q1033p2125K6258N6547k1727q3915n2237j3337o0875j35773
$$ 418787 451500 370467 298342 324600 381147 359420 275505 223268 209931 149056 13283
37016A3283j18694j1215P0904M8281n2040j42828j33240J0095J90374K33129J01138
$$ 13283 -105411 -116626 -45722 2559 -49481 -192309 -325549 -315454 -125080 108049 209187
37005B09187j5511N2717J87882J37611j04136k79148k39648j16897n5760j4235
$$ 209187 193676 246393 434275 571886 467750 188602 -51046 -167943 -223703 -237938
36995b37938N5484N4018n7626r5549P1873K43056J49544j00746j50584P2412K62562
$$ -237938 -182454 -128436 -186062 -281611 -209738 33318 182862 82116 -68468 3944 266506
36984B66506K11392P1865M1110N0924m5943j75281j38494Q3910K95264L07652
$$ 266506 477898 549763 590873 641797 595854 420573 282079 365989 661253 968905
36974I68905J01507j83662l38598k37101J8459J73481J12563r228K67J08993J41790
$$ 968905 1070412 886750 548152 311051 329510 502991 615554 606326 606593 715586 857376
36963H57376L9050r5188j58947j47404r8613l7340K5093Q2738J13576O0706r3366
$$ 857376 896426 801238 642291 494887 396274 358934 384027 466765 580341 641047 547681
36952E47681k19647j31878J54361L77034L35184J19337p3312k09880l43578l96785
$$ 547681 328034 196156 350517 727551 1062735 1182072 1108760 898880 555302 158517
36942A58517k54441j1773J12242R6200J14346J98137J60303n6710k08167r3378
$$ 158517 -95924 -107697 4545 100745 215091 413228 573531 516821 308654 215276
36932B15276J15410J10849r6489k05856p6250R1659Q0512l8775n8638L9988Q8694
$$ 215276 330686 441535 345046 139190 62940 154599 235111 196336 137698 177686 266380
36921B66380J3470n9145r949R9697J37918Q2943L757n5151o5184L0397K14973
$$ 266380 279850 220705 210756 310453 448371 531314 535071 479920 414736 445133 660106
36910F60106L11434J62916j20635k67356j91025n3201K2000P0652Q5519m8006
$$ 660106 971540 1134456 1013821 746465 555440 502239 524239 594891 680410 632404
36900F32404k91263l73403j53480J41775K35937J63300R4582R978j65834k71506
$$ 632404 341141 -32262 -185742 -43967 191970 355270 449852 459830 293996 22490
36890B2490r8864K16337L39939K26152J12346O1056j00279l47198l81070j20280
$$ 22490 -76374 139963 479902 706054 818400 879456 779177 431979 50909 -69371
36880f9371J01703K5735j61063j66411k7582N0745N9256J01259J22850J6902j18426
$$ -69371 32332 58067 -102996 -269407 -296989 -246244 -186988 -85729 37121 54023 -64403
36869f4403r8287M3570J11998O0213J6100L6988N6767O3053J20561K02726J79981
$$ -64403 -162690 -119120 -7122 53091 69191 106179 162946 225999 346560 549286 729267
36858G29267J7273j49196j73253n2314R1621J22022l557j83034k67407k38852
$$ 729267 746540 597344 424091 371777 463398 585420 581863 398829 131422 -107430
36848a07430k01119j62301M918K87554M14660K05099j26491k42124j29575j9107
$$ -107430 -308549 -470850 -465932 -178378 236282 441381 314890 72766 -56809 -75916
36838g5916L2508J48661K74881J85206r7043k33729o5518J28117N4541j55001
$$ -75916 -43408 105253 380134 565340 468297 234568 169050 297167 351708 196707
36828A96707j76933J0277J35026N4780q9697j44688j49382j97951k43574j56941
$$ 196707 19774 30051 165077 219857 130160 -14528 -163910 -361861 -605435 -762376
36818g62376O9204K72148K94405J55451R810l4359R179R1802J84300K17158R9560
$$ -762376 -693172 -421024 -126619 28832 38642 4283 13462 105264 289564 506722 606282
36807F06282j15979k12934q0589J07589J35890M9617K2664L8537l4580j29216
$$ 606282 490303 277369 196780 304369 440259 489876 512540 551077 516497 387281
36797C87281o0332R0233K5384k63656m02999j84853J32091K63523K96775L76431
$$ 387281 326949 417182 442566 178910 -224089 -408942 -276851 -13328 283447 659878
36787F59878L26138k4489l77384k99706Q9883K44641m233k32471j15800J00128
$$ 659878 986016 961527 584143 284437 374320 618961 614728 382257 266457 366585
36777C66585M4544k10495l23591j99583k5541P8969J56308K08426J63852N9940
$$ 366585 411129 200634 -122957 -322540 -348081 -269112 -112804 95622 259474 319414
36767C19414M1110J23747J39817n612j65151j53154k1926J5545q5640j12510R2578
$$ 319414 360524 484271 624088 618476 453325 300171 278245 293790 208150 95640 188218
36756A88218L45445L04726o7878m00015l49196k6310J67808N8764j38023j74840
$$ 188218 533663 838389 770511 370496 21300 -5010 162798 221562 83539 -91301
36746i1301q8865n8700r6259n2676J21580K84644K92565J69200M0824k6385o4256
$$ -91301 -180166 -238866 -335125 -387801 -266221 18423 310988 480188 521012 494627 430371
36735D30371j11561j46165j22223m6065J9551L6640M8415J16995K16037K41372
$$ 430371 318810 172645 50422 4357 23908 60548 108963 225958 441995 683367
36725F83367J47319J9886k8898l580m174p4955j37907r9373K0136J05181Q3610
$$ 683367 830686 850572 821674 818094 813920 738965 601058 501685 521821 627002 710612
36714G10612L592m3544m3101n4941j02812j31211j00773o3957q2144j08997m1833
$$ 710612 714204 670660 627559 572618 469806 338595 237822 173865 91721 -17276 -59109
36703e9109J21847K63343K85580K03843R1804K0216M9734J75539K60135J52116
$$ -59109 62738 326081 611661 815504 907308 927524 977258 1152797 1412932 1565048
36693A565048q0289j80961n5908O8227k4194k01580j89249l06R6242l162j20556
$$ 1565048 1484759 1303798 1247890 1316117 1291923 1090343 901094 900788 997030 993868 873312
36682H73312j21978q9836r9593q1437j4953j7239r3684m0686K18039M25746L51347
$$ 873312 751334 661498 561905 480468 465515 448276 354592 313906 531945 957691 1309038
36671A309038J45645P3474R0130J6260l5993J67690M66394M23698P836k99408
$$ 1309038 1454683 1528157 1618287 1634547 1598554 1766244 2232638 2656336 2664172 2364764
36661B364764k04299J4382K7000m5045M8142J92552J16511j28212k65749k38108
$$ 2364764 2160465 2174847 2201847 2156802 2204944 2397496 2514007 2385795 2120046 1881938
36651A881938k00754j80292p9244M4090L9084k5631N4554K29797K26186P131j28191
$$ 1881938 1681184 1500892 1421648 1465738 1504822 1479191 1533745 1763542 1989728 1996859 1868668
36640A868668l999J74499J57915r782j43993j90203j78111r1345M3428Q1307o0052
$$ 1868668 1864669 2039168 2197083 2187301 2043308 1853105 1674994 1583649 1627077 1708384 1648332
36629A648332k48257l00868k09515q4854K5062J39429K37388K53260J48213n3447
$$ 1648332 1400075 1099207 889692 804838 829900 969329 1206717 1459977 1608190 1554743
36619A554743k49830k98711j78647q3641j88591l44443k42872J01031L23238K49290
$$ 1554743 1304913 1006202 827555 743914 555323 210880 -31992 69039 392277 641567
36609F41567J34662K01650K64681Q5438j76257k09529n7505r864j12653j55846
$$ 641567 776229 977879 1242560 1327998 1151741 942212 884707 874843 762190 606344
36599F06344q8882p8951j50818j17164O8087J89557J00898p2534j60285j62686
$$ 606344 517462 438511 287693 170529 238616 428173 529071 456537 296252 133566
36589A33566j47372j24926j20119j88351k70050j99111M3672K39874K06132L4725
$$ 133566 -13806 -138732 -258851 -447202 -717252 -916363 -872691 -632817 -426685 -391960
36579c91960m1499O7891K42110K90872J25258j35397k27418k7300K40106K34187
$$ -391960 -433459 -365568 -123458 167414 292672 157275 -70143 -97443 142663 376850
36569C76850n9179l07512k84031j26456o7133j18082j51741j14296j0051J75174
$$ 376850 317671 10159 -273872 -400328 -467461 -585543 -737284 -851580 -861631 -686457
36559f86457L79482M27575K54374N2296K0157O6503l1950k41649k83259n4787
$$ -686457 -306975 120600 374974 427270 447427 513930 481980 240331 -42928 -97715
36549i7715J76806J21380j36203k42334m0779K23634K26630k1903k21262j96695
$$ -97715 79091 200471 64268 -178066 -218845 4789 231419 209516 -11746 -208441
36539b08441q6563n9640m7935P4750K07172J59697J365o669J75671K87695J57823
$$ -208441 -295004 -354644 -402579 -327829 -120657 39040 40405 33736 209407 497102 654925
36528F54925o8393j79820j64837j17006o5561j8969k1444o3812p6079o7993j08092
$$ 654925 586532 406712 241875 124869 59308 40339 18895 -44917 -120996 -188989 -297081
36517b97081j26975K3504K49054K38291n9264k80938j71148M2967N2078m4309
$$ -297081 -424056 -400552 -151498 86793 27529 -253409 -424557 -381590 -329512 -373821
36507c73821J8247J67742J36961l7089o6872R2081J90581J24166O0715R6003J16874
$$ -373821 -355574 -187832 -50871 -87960 -154832 -62751 127830 251996 312711 408714 525588
36496E25588P4363Q4929J64386J38076o3140k51108k51134j31354m3969n880M5774
$$ 525588 599951 684880 849266 987342 924202 673094 421960 290606 246637 240757 286531
36485B86531J12999J54475J49048Q4992k5051j05878j05098j01445j88580k80278
$$ 286531 399530 554005 703053 788045 762994 657116 552018 450573 261993 -18285
36475a8285k13764l1596N4709j231j4136J07808J97571R4403j07245j94208r6328
$$ -18285 -232049 -263645 -208936 -210167 -224303 -116495 81076 175479 68234 -125974 -222302
36464b22302P7269J70558J08666j7059o161J89840L24897J62675j43199k26895
$$ -222302 -145033 25525 134191 117132 110971 300811 625708 788383 645184 418289
36454D18289l1561J49190J52340J22826J48654Q8776r3958j79620o8823N021j26350
$$ 418289 386728 535918 688258 811084 959738 1048514 954556 774936 706113 711134 584784
36443E84784k50462j30328P8946P9312r7589j79478p9181N8125J33587J59375
$$ 584784 334322 203994 282940 362252 264663 85185 6004 64129 197716 357091
36433C57091J19694p790j50820k28744k49744k01705j5693K19903K41638J0299
$$ 357091 476785 468995 318175 89431 -160313 -362018 -377711 -157808 83830 94129
36423I4129j29979M2197K30378P8875k25420k48688k3317L9409j33804j78150
$$ 94129 -35850 6347 236725 315600 90180 -158508 -181825 -142416 -276220 -454370
36413d54370N7660K54067J47441r4501j92095j23003j2734P6245J13224Q3296
$$ -454370 -396710 -142643 4798 -89703 -281798 -404801 -417535 -341290 -228066 -144770
36403a44770Q3257K08926L21049J97818o4778j37992J4331P4807p4114j49860
$$ -144770 -61513 147413 468462 666280 601502 463510 477841 552648 478534 328674
36393C28674J0146J38825p55k08160j96405m6134Q333q433N8691J63663J76170
$$ 328674 338820 477645 476890 268730 72325 26191 34524 26091 84782 248445 424615
36382D24615J53126J85376J40407j23374m28315m88175l33627k12048j69688o9006
$$ 424615 577741 763117 903524 780150 351835 -136340 -469967 -682015 -851703 -920709
36372i20709N8368L7942q4697n2951J87127L76824L11170P2843j48152k45953
$$ -920709 -862341 -824399 -909096 -962047 -774920 -398096 -86926 -14083 -162235 -408188
36362d08188j74387M5183K42960K30211N5497n0287m230N1177J7738l2031m1526
$$ -408188 -582575 -537392 -294432 -64221 -8724 -59011 -63241 -12064 5674 -26357 -67883
36351f7883o6072j18054j15408n1516k6650m9013l984J08786J20780k4168j40001
$$ -67883 -133955 -252009 -367417 -418933 -445583 -494596 -498580 -389794 -269014 -293182 -433183
36340d33183p5496O4298J12818Q8733R2633J03601M7113m4146r3250j10274j21502
$$ -433183 -508679 -444381 -331563 -242830 -150197 -46596 517 -43629 -136879 -247153 -368655
36329c68655o4447R6967K36389K03195M3865n5215n084J26057K41446K83546K18852
$$ -368655 -433102 -336135 -99746 103449 147314 92099 87015 213072 454518 738064 956916
36318I56916P4047n0157j03300j66776l01485l90594k84522m7857J08834J16692
$$ 956916 1030963 980806 877506 710730 409245 18651 -265871 -313728 -204894 -88202
36308h8202R2031J01112P7296P998O713J08521J61564N0783r8087r1520L7505
$$ -88202 3829 104941 182237 190235 196948 305469 467033 517816 419729 328209 365714
36297C65714P8566l7829j40206p6048O3241P3266p7309k05162j56868k009O7666
$$ 365714 444280 406451 266245 190197 253438 326704 249395 44233 -112635 -114644 -46978
36286d6978k3151j68854k37645k03793j09004J1971J03935P6470p0282j57400
$$ -46978 -70129 -238983 -476628 -680421 -789425 -777454 -673519 -597049 -667331 -824731
36276h24731j2816K59803L65660K19665P9975J61119K91307J76068j06217j71388
$$ -824731 -837547 -577744 -212084 7581 87556 248675 539982 716050 609833 438445
36266D38445R4679L33909K21413q9360k44903k12627k31001l51899l70330k13672
$$ 438445 533124 867033 1088446 999086 754183 541556 310555 -41344 -411674 -625346
36256f25346p7469p8097m9748J54052L80448L93487K08098J2704j11510j94046
$$ -625346 -702815 -780912 -830660 -676608 -296160 97327 305425 318129 206619 12573
36246A2573k07363j14976j9191m4791j11871k9762J98898L60660L13258J10992
$$ 12573 -194790 -309766 -328957 -373748 -485619 -515381 -316483 44177 357435 468427
36236D68427j30512l03392k65341L9860L97822M85251K62873q05j27263j99913
$$ 468427 337915 34523 -230818 -190958 206864 692115 954988 954183 826920 627007
36226F27007k80240k45483n6637P3707j8502j89699k32731j84684j69051j21019
$$ 627007 346767 101284 44647 118354 99852 -89847 -322578 -507262 -676313 -797332
36216g97332N8353K22665J60678l0228n8595J08582K06853R7215n6064q3007k8100
$$ -797332 -738979 -516314 -355636 -385864 -444459 -335877 -129024 -31809 -87873 -170880 -198980
36205a98980J1031M4574Q5857O7424k6677q6364l3263O2007J02326R9829J15765
$$ -198980 -187949 -143375 -57518 9906 -16771 -103135 -136398 -74391 27935 127764 243529
36194B43529J53165J70300J34765L9184p0669j01119l8144k0588j42511k43184
$$ 243529 396694 566994 701759 740943 670274 569155 531011 510423 367912 124728
36184A24728j06025J63146K22114j3897k47268k48850j42790j05677p4512M1481
$$ 124728 18703 181849 403963 390066 142798 -106052 -248842 -354519 -429031 -387550
36174c87550J19837M8245k7139N2869J57850J01772K557P7075K25623J96084N5980
$$ -387550 -267713 -219468 -246607 -193738 -35888 65884 68441 145516 371139 567223 623203
36163F23203P7524J95739N3813l48281n30213k40892J34068J47842p6742j29492
$$ 623203 700727 896466 950279 601998 71785 -169107 -35039 112803 36061 -93431
36153i3431L7912J26680P955j38691j51334n1425R5141K31903K46531Q2781r9565
$$ -93431 -55519 71161 79116 -59575 -210909 -262334 -167193 64710 311241 394022 294457
36142B94457r7889K1221J6244j34115j89583l6628J40419J60108Q2969L3151j5951
$$ 294457 196568 217789 234033 99918 -89665 -126293 14126 174234 257203 290354 274403
36131B74403j29893k39607k31052j10250L3057J38559J75024J34904R5639J54112
$$ 274403 144510 -95097 -326149 -436399 -403342 -264783 -89759 45145 140784 294896
36121B94896K33576J27124j67238l51853k24086K4778J05208M2817M0496Q1849
$$ 294896 528472 655596 488358 136505 -87581 -62803 42405 85222 125718 207567
36111B07567n103j70711j83045m1484o37j20950j42717N7990K13288P6649j71012
$$ 207567 202464 31753 -151292 -192776 -193413 -314363 -457080 -399090 -185802 -109153 -280165
36100b80165j93328N472J35110O2826o2906q6575j2459R4330J82617J84756O7022
$$ -280165 -473493 -468021 -332911 -270085 -332991 -419566 -432025 -337695 -155078 29678 96700
36089I6700q2934j40567r8089k2689P9369K07119K37865N9397j88866k26754j9419
$$ 96700 13766 -126801 -224890 -247579 -168210 38909 276774 336171 147305 -79449 -98868
36078i8868J52828P8258j20734k03724j30999m0525k5289o2427r2071o8231J1509
$$ -98868 53960 132218 11484 -192240 -323239 -363764 -389053 -451480 -543551 -611782 -600273
36067f00273O4141j3118j79088k50678j38107L3993J26670J79652K76903L41046
$$ -600273 -536132 -549250 -728338 -979016 -1117123 -1083130 -956460 -776808 -499905 -158859
36057a58859K43287M8159m9593j4101k259q7079j33469k6069J28396J43119J1522
$$ -158859 84428 132587 82994 68893 66634 -20445 -153914 -179983 -51587 91532 103054
36046A03054q8611k3835J41886K22812J03795j37489k91929k26299k8666R2663
$$ 103054 14443 -9392 132494 355306 459101 321612 29683 -196616 -225282 -132619
36036a32619M8487n5286q0751q461J02998K08102K60296J97946M0235p4617o2176
$$ -132619 -84132 -139418 -220169 -228630 -125632 82470 342766 540712 580947 506330 444154
36025D44154m1530j63621l30227k84670r026J94005J29545Q196J10510L17419
$$ 444154 402624 239003 -91224 -375894 -384920 -190915 -61370 -53174 57336 374755
36015C74755K69194o4309k98593j80029Q0751J61761N9254l7304q5431j42524
$$ 374755 643949 579640 281047 101018 181769 343530 402784 365480 280049 137525
36005A37525j27239O8479K91887K57072k9587k43054j84787n601Q1617O5281J2749
$$ 137525 10286 78765 370652 627724 598137 355083 170296 164695 246312 311593 324342
35994C24342p5269j49373o9790J49359K50927Q9616r9646k7197J95010K01926
$$ 324342 249073 99700 29910 179269 430196 519812 420166 392969 587979 789905
35984G89905q5328l51361l25117q0021J50262K42914J98231N8190q8987j42347
$$ 789905 704577 353216 28099 -51922 98340 341254 539485 597675 508688 366341
35974C66341j01363n0517N780J61963M00531N02253K93767r1626l33248k86150
$$ 366341 264978 214461 220241 382204 782735 1284988 1578755 1487129 1153881 867731
35964H67731j18278o6176j42957j67766n9291K1818q6912k52850j82972J26709
$$ 867731 749453 683277 540320 372554 313263 335081 248169 -4681 -187653 -60944
35954f0944L08592J31336j21166l5436K98293L76050J790m22660m49445j42074
$$ -60944 247648 378984 257818 222382 520675 896725 898515 475855 26410 -115664
35944a15664J14552J47564R1078O9792N3262J1846m80K9585J8450p5070j53047
$$ -115664 -1112 146452 237530 307322 360584 372430 371950 401535 419985 344915 191868
35933A91868j00549M6126J28039N1812j08789k17298k28560j81194p3905J32472
$$ 191868 91319 137445 265484 317296 208507 -8791 -237351 -418545 -492450 -359978
35923c59978L57163L79856J00351k62265l74278j58514J60947L40227L02506R4628
$$ -359978 -2815 377041 477392 215127 -159151 -317665 -156718 183509 486015 580643
35913E80643j61051k86529k04614p3569q2610j40938j5137K31908K62392L964
$$ 580643 419592 133063 -71551 -145120 -227730 -368668 -383805 -151897 110495 114459
35903A14459j77619k4740K18252K17529P1663Q4930K30785K28385M0422r1934
$$ 114459 -63160 -87900 130352 347881 419544 504474 735259 963644 1004066 912132
35893I12132p6569p5663j70177k46266k58132k94521l17276j39731K22535M60223
$$ 912132 835563 759900 589723 343457 85325 -209196 -526472 -666203 -443668 16555
35883A6555L80256J69012Q1577Q4342M994j35694j71417p1982L1906O2519O4359
$$ 16555 396811 565823 647400 731742 736736 601042 429625 357643 389549 452068 516427
35872E16427P8356Q4441O7208L4266k8103j31229k19558k11330j16472m6929p5379
$$ 516427 594783 679224 746432 780698 752595 621366 401808 190478 74006 27077 -48302
35861d8302j24144n0420J53478L09828K69146J24070Q4257J50453J01732j29439
$$ -48302 -172446 -222866 -69388 240440 509586 633656 717913 868366 970098 840659
35851H40659k92790j92664j5250l5545j67103j23504Q1015J64112P1403M1191
$$ 840659 547869 355205 339955 304410 137307 13803 94818 258930 330333 371524
35841C71524J38113J34654l0659q6959Q9136K11803N6884j49894j15083N4744
$$ 371524 509637 644291 613632 526673 615809 827612 884496 734602 619519 674263
35831F74263J00967O1061J00138J25708j9265j56876j1108K65322K53659q1938
$$ 674263 775230 836291 936429 1062137 1042872 885996 874888 1140210 1393869 1311931
35821A311931l46379l20952j90170j12176Q624K00289K66144J22810k6561k8106
$$ 1311931 965552 644600 454430 342254 350878 551167 817311 940121 913560 885454
35811H85454K592m3390o3708J166o904j68272k72449j42564N0008N2214p9967
$$ 885454 888046 844656 780948 782114 775210 606938 334489 191925 241933 294147 214180
35800B14180j23918o1769k9878k3242N9480J55694J09136l3938o3153O3238J64167
$$ 214180 90262 28493 -1385 -24627 34853 190547 299683 265745 202592 265830 429997
35789D29997J33841O9444N3140J2808j08901k04391j40032L5667J27705K6764
$$ 429997 563838 633282 686422 699230 590329 385938 245906 281573 409278 436042
35779D36042j48179j67142M0345K69477K70492P3684m8722L5198J45967Q2087
$$ 436042 287863 120721 161066 430543 701035 774719 725997 761195 907162 989249
35769I89249r9718k22419k37656j77613k6874J59304J72992o1228k58080j20350
$$ 989249 889531 667112 429456 251843 224969 384273 557265 496037 237957 117607
35759A17607J89952K60655M3698j19124q6653j14414l42432m86066k73855J04239
$$ 117607 307559 568214 611912 492788 406135 291721 -50711 -536777 -810632 -706393
35749g06393K59286J11415j14906k38932k20696m4141K38499M20907L34556R2422
$$ -706393 -447107 -335692 -450598 -689530 -910226 -954367 -715868 -294961 39595 132017
35739A32017m3102M856R1452R8489M5835r829k7030L4592J31439R5786j45523
$$ 132017 88915 93771 185223 283712 329547 319718 292688 327280 458719 554505 408982
35728D08982l63782k52215J49105M61956M30892J79641l7813j41994j90434k01986
$$ 408982 45200 -207015 -57910 404046 834938 1014579 976766 834772 644338 442352
35718D42352j51190n1027N3557J20133R9650k1599j42115j19270L1280J25958
$$ 442352 291162 240135 293692 413825 513475 491876 349761 230491 261771 387729
35708C87729N6752p8734j54723j86145k23622k15921j12144N486L9005L7661Q6480
$$ 387729 444481 365747 211024 24879 -198743 -414664 -526808 -521322 -482317 -444656 -358176
35697c58176J13259O00j55113j22875J02159K36971R9283j24426j35987P6970
$$ -358176 -244917 -244317 -399430 -522305 -420146 -183175 -83892 -208318 -344305 -267335
35687b67335K58272K25457L6363j59757k81920l01317j95642L390J83635K49036
$$ -267335 -9063 216394 252757 93000 -188920 -490237 -685879 -682489 -498854 -249818
35677b49818K18518J76990J47990P6355n4770j51486j07543M4238J45778J03707
$$ -249818 -31300 145690 293680 370035 315265 163779 56236 100474 246252 349959
35667C49959P502m004M4399j1570k21662m01679l47624r5524J38045K29152K30129
$$ 349959 357461 353457 397856 386286 164624 -237055 -584679 -680203 -542158 -313006 -82877
35656h2877J94028Q1225r5797j84793q3825P1871O8562q2149j62908p4447L5197
$$ -82877 111151 192376 96579 -88214 -172039 -100168 -31606 -113755 -276663 -351110 -315913
35645c15913K3859k6907K8120J36047J13950n9311j86398j17989N0674J17330
$$ -315913 -292054 -318961 -290841 -154794 -40844 -100155 -286553 -404542 -353868 -236538
35635b36538K8016q4137q2715K0254J06476J06776P8624J13447J89626J79565
$$ -236538 -208522 -292659 -375374 -355120 -248644 -141868 -63244 50203 239829 419394
35625D19394L0090j33831j61899q5276n8085j10275j03650K5764J30285O3734
$$ 419394 449484 315653 153754 68478 10393 -99882 -203532 -177768 -47483 16251
35615A6251p5551o4453J27704K90287K39767Q441k51434m25518m58348l39383
$$ 16251 -59300 -123753 3951 294238 534005 542446 291012 -134506 -592854 -932237
35605i32237j45740q506M3271J21960K76698L45738J61294j47929k44050m954
$$ -932237 -1077977 -1086483 -1043212 -921252 -644554 -298816 -137522 -285451 -529501 -534455
35595e34455K94395L13125M8043k02829k13642m6153R2491R6125K6057o953K6727
$$ -534455 -240060 73065 121108 -81721 -295363 -341516 -249025 -152900 -126843 -133796 -107069
35584a07069O0986K8001n4741j07583q2517J475J01178J68742J39726n629j51627
$$ -107069 -46083 -18082 -72823 -180406 -262923 -261448 -160270 8472 148198 142569 -9058
35573i058j30465M8374J68407R3853l2849j1870J06571J17465j0151j12772j11004
$$ -9058 -139523 -91149 77258 171111 138262 126392 232963 350428 340277 227505 116501
35562A16501q1861m7995O0872J88765J53554l3652j08631L1253J09644j00967
$$ 116501 34640 -13355 47517 236282 389836 356184 247553 278806 388450 287483
35552B87483l60392k85626M6889J88072k0015k20164o5087L14989N18297L62413
$$ 287483 -72909 -358535 -311646 -123574 -143589 -363753 -428840 -113851 404446 766859
35542G66859K1290k22660k46161j51236j19882j84469j80925m71J98664J86875
$$ 766859 788149 565489 319328 168092 48210 -136259 -317184 -317655 -118991 67884
35532F7884O301q9079j1740P4415O1044L6794O0541L7033q1508j86108k04162
$$ 67884 74185 -14894 -26634 47781 108825 145619 206160 243193 161685 -24423 -228585
35521b28585j90829j38931N2643L02329L22415N4283j56821o0997J00491M882
$$ -228585 -419414 -558345 -505702 -203373 119042 173325 16504 -44493 55998 60880
35511F0880k03091j64718P1274J26276q8286k70101k40534j38227n4606J07738
$$ 60880 -142211 -306929 -235655 -109379 -197665 -467766 -708300 -846527 -901133 -793395
35501g93395L09857L10487Q9816k6113J25060K42160L5436k81785k95874N613
$$ -793395 -483538 -173051 -83235 -109348 15712 257872 293308 11523 -284351 -278738
35491b78738K61109K55954J18773M1190N1669O9762R676j59977l34663l11403
$$ -278738 -17629 238325 357098 398288 449957 519719 529395 369418 34755 -276648
35481b76648m1696K31331K41936L4186j33303j36093n8716R121M8988K6304p0470
$$ -276648 -318344 -87013 154923 189109 55806 -80287 -139003 -129882 -80894 -54590 -125060
35470a25060j18991J3267K36173L16364J95622M2343k6012o8877j33374j46635
$$ -125060 -244051 -230784 5389 321753 517375 559718 533706 464829 331455 184820
35460A84820p6298j9848m1675p6659q3911j35580k43430k54471o6373J71901K31505
$$ 184820 108522 88674 46999 -29660 -113571 -249151 -492581 -747052 -813425 -641524 -410019
35449d10019R5560o1904j20396r5724l3924L1124M2411k5698r3244o7420J9249
$$ -410019 -314459 -376363 -496759 -592483 -626407 -595283 -552872 -578570 -671814 -739234 -719985
35438g19985Q2796J56542L21166M77464L93276N0802k27875j38709K21644M66133
$$ -719985 -637189 -480647 -159481 317983 711259 762061 534186 395477 617121 1083254
35428A083254L54744L623l04388l96253k99552j61974j08969j30580j10840m769
$$ 1083254 1437998 1441621 1137233 740980 441428 279454 170485 39905 -70935 -75704
35418g5704O8674l320j22783r6258N4608Q0092j35917l70443l44095q7806J23943
$$ -75704 -7030 -10350 -133133 -229391 -174783 -94691 -230608 -601051 -945146 -1032952 -909009
35407i09009J27319M2j11238j29684l1125J50328K83037K43462Q7170o902K1289
$$ -909009 -781690 -781648 -892886 -1022570 -1053695 -903367 -620330 -376868 -289698 -296600 -275311
35396b75311N7534J8769l6813n0012n8980q5526o0647N0838J69540K20632K12000
$$ -275311 -217777 -199008 -235821 -285833 -344813 -430339 -490986 -440148 -270608 -49976 162024
35385A62024J31881o8329k94176k99505j4916K81013L08482J56351R0192J36306
$$ 162024 293905 225576 -68600 -368105 -383021 -102008 206474 362825 453017 589323
35375E89323J29119O3761P4632J05337m2801k96133l09205r181K03231K1314k79209
$$ 589323 718442 782203 856835 962172 919371 623238 314033 304852 508083 529397 250188
35364B50188k23336J65740L93613J80182j87048k60288J4577K78259K05323j34775
$$ 250188 26852 192592 586205 766387 579339 319051 333628 611887 817210 682435
35354F82435l71391k54541O4829K29896J15933n6903o6308L3119P8181P5245J20821
$$ 682435 311044 56503 121332 351228 467161 410258 343950 377069 455250 530495 651316
35343F51316J56351M3003j49253j77520OJ14582l0707k55605k56240m3961Q4277
$$ 651316 807667 850670 701417 523897 523903 638485 607778 352173 95933 51972 136249
35332A36249j7249j51978q6982J25141K58895K40553J92140J86048J36916j3660
$$ 136249 119000 -32978 -119960 5181 264076 504629 696769 882817 1019733 1006073
35322A006073j55818j60681p2768l1161o0701p2770m0678l4146p4666q4488j0891
$$ 1006073 850255 689574 616806 585645 524944 452174 411496 377350 302684 218196 207305
35311B07305R7042J61914J46156M6359q0077r5207P1790K51102J82288j14070
$$ 207305 304347 466261 612417 658776 578699 483492 555282 806384 988672 874602
35301H74602l06842j95696R856J0547j51040j97251m9274R1220O8254m7495j32822
$$ 874602 567760 372064 381920 392467 241427 44176 -5098 86122 154376 106881 -25941
35290b5941j75277j98353j73333q8056k803L3619N2239R6394J47090J59979J28945
$$ -25941 -201218 -399571 -572904 -660960 -663763 -630144 -577905 -481511 -334421 -174442 -45497
35279d5497Q0599M2374K9447K6291j3673r9965j52185q9870K7587M2850q7418
$$ -45497 35102 77476 106923 133214 119541 19576 -132609 -222479 -194892 -152042 -239460
35268b39460k05429j37967Q0066K41379K19720J18831J20329K17854K07008r178
$$ -239460 -444889 -582856 -502790 -261411 -41691 77140 197469 415323 622331 613153
35258F13153k18259j58097P5403J10640j63036l91572k43731J13454K59451Q3283
$$ 613153 394894 236797 312200 422840 259804 -131768 -375499 -262045 -2594 80689
35248H0689j74062l30601l92063l12514L797L91035M64424J42897j59865q4388
$$ 80689 -93373 -423974 -816037 -1128551 -1124754 -733719 -269295 -126398 -286263 -370651
35238c70651J76438J97988m0560j72629k6534J45829Q1054j22723j83433k1606
$$ -370651 -194213 3775 -36785 -209414 -235948 -90119 -9065 -131788 -315221 -336827
35228c36827J83168K43294J42030p109p2750K2003K42213M15729L42105J0569
$$ -336827 -153659 89635 231665 224556 151806 173809 416022 831751 1173856 1184425
35218A184425l23304l80202j81145j7047o0644j50468o4323J27909J67875k682
$$ 1184425 861121 480919 299774 282727 222083 71615 7292 135201 303076 300394
35208C00394j61804j15947Q5500K60199K64673N6366k46607l70306j50537J87775
$$ 300394 138590 22643 108143 368342 633015 689381 442774 72468 -78069 109706
35198A09706K38319n8322l33959l02097p6312J21399K63136L49845K53086j7924
$$ 109706 348025 289703 -44256 -346353 -422665 -301266 -38130 311715 564801 546877
35188E46877j60275O08J67804J0846k59236j88283J75760L27352Q2875j72103
$$ 546877 386602 387210 555014 565860 306624 118341 294101 621453 704328 532225
35178E32225j12259R3676J53082P2708q729r2393j80071j31179Q1445J94838P282
$$ 532225 419966 513642 666724 739432 730703 638310 458239 327060 408505 603343 610625
35167F10625k66781k69289l508J98991J39855n8174j82909j48284m941J02913
$$ 610625 343844 74555 71047 270038 409893 351719 168810 20526 15585 118498
35157A18498L2180j70450k50439o6816J65889J47230q3891k20427j35899j6620
$$ 118498 150678 -19772 -270211 -337027 -171138 -23908 -107799 -328226 -464125 -480745
35147d80745l7019j33025j57785q1007L9551J50182K05547J86012J47114J65388
$$ -480745 -517764 -650789 -808574 -889581 -850030 -699848 -494301 -308289 -161175 4213
35137D213K31113K78901K88527K48101Q9097j79008l43836k24047J4786M4845
$$ 4213 235326 514227 802754 1050855 1139952 960944 617108 393061 407847 452692
35127D52692j30522j81823l654J01102n3048j84041k771K67580K14153j02319
$$ 452692 322170 140347 136693 237795 184747 706 -2065 265515 479668 377349
35117C77349k34290m5097J07840l8134k57989k17823L6452K09478J98988J53539
$$ 377349 143059 97962 205802 167668 -90321 -308144 -271692 -62214 136774 290313
35107B90313J64202J37088k880j51831j51941j094J33790J01831o6499j92254
$$ 290313 454515 591603 588723 436892 284951 283857 417647 519478 452979 260725
35097B60725j47470n308L9396r8391k79676k86472o6775J95247K68616J25787
$$ 260725 113255 107947 147343 48952 -230724 -517196 -583971 -388724 -120108 5679
35087E679k9362o154J41900K00238Q3237p4390j39208j52649j96018k11026j02638
$$ 5679 -23683 -29837 112063 312301 395538 321148 181940 29291 -166727 -377753 -480391
35076d80391O1180J24280Q0590O6270J20913J29161K6552r5377j37163j07853
$$ -480391 -419211 -294931 -214341 -148071 -27158 102003 128555 33178 -103985 -211838
35066b11838m6716L8640J06130Q4126j080l2721R034J2478n2707o1326K9931N4776
$$ -211838 -258554 -219914 -113784 -29658 -30738 -63459 -54425 -41947 -94654 -155980 -126049 -71273
35054g1273r8886k57919j97289Q263Q8863k1801j15658l6482J22026J88886J35777
$$ -71273 -170159 -428078 -625367 -617104 -528241 -550042 -665700 -702182 -580156 -391270 -255493
35043b55493N9816L9879O5360O7315K864q4000j23475j39694k04050k47164r1898
$$ -255493 -195677 -155798 -90438 -23123 -20259 -104259 -227734 -367428 -571478 -818642 -910540
35032i10540K31258M03627K33224l3911o0642Q2257P1477j28284k44126j74541
$$ -910540 -679282 -275655 -42431 -76342 -136984 -54727 16750 -111534 -355660 -530201
35022e30201r8227p3293O6858L09701L59543J29166l7311J04527K77598J22406
$$ -530201 -628428 -701721 -634863 -325162 34381 163547 126236 230763 508361 630767
35012F30767k14874l24514j77377j00629j92669j91581M0000K74515K79106J29495
$$ 630767 415893 91379 -85998 -186627 -379296 -570877 -530877 -256362 22744 152239
35002A52239K8125K7957P4919J49799K22856J93516J7734j77078k20075j04824
$$ 152239 180364 208321 283240 433039 655895 849411 867145 690067 469992 365168
34992C65168Q977j6038j50133k31772j37143P3824K01129J22235p0911j91749
$$ 365168 374145 358107 207974 -23798 -160941 -87117 114012 236247 165336 -26413
34982b6413j59940k3708J42030K57678K23743K3201j81044j85337P861J88334
$$ -26413 -186353 -210061 -68031 189647 413390 436591 255547 70210 78071 266405
34972B66405J88786M0748j15895j72525r4017P1298J93295J49742n1357k69997
$$ 266405 455191 495939 380044 207519 113502 184800 378095 527837 476480 206483
34962B06483l45123j93425J25669L88472L57253N9337j83123j31942O5900J15154
$$ 206483 -138640 -332065 -206396 182076 539329 598666 415543 283601 349501 464655
34952D64655j5491j41307k06367k77258k49058P0490N22771O14976J56332m09577
$$ 464655 449164 307857 101490 -175768 -424826 -354336 168435 783411 939743 530166
34942E30166n35834k24762Q5600J24544J8208p000Q7002J69237J09212q3877k34392
$$ 530166 -5668 -230430 -144830 -20286 -2078 -9078 77924 247161 356373 272496 38104
34931C8104j62724P9897K32314J39873o1278j50494r2456j1252j1827j16704k62849
$$ 38104 -124620 -44723 187591 327464 266186 115692 23236 11984 157 -116547 -379396
34920c79396k86754o2911K57466L32631P8720j70983j20621Q8096J52243P6937
$$ -379396 -666150 -729061 -471595 -138964 -60244 -231227 -351848 -263752 -111509 -34572
34910c4572P3716J45694J15723j1674n9026j6840m1133j07591j4449K13706K71207
$$ -34572 39144 184838 300561 288887 229861 213021 171888 64297 49848 263554 534761
34899E34761M4304j73870j18789N8773N9600j09721j88474n2370J58451K47200
$$ 534761 579065 405195 286406 345179 404779 295058 106584 54214 212665 459865
34889D59865J46338o0315j97328j34995N7639J68492J00316l6770j33251k13838
$$ 459865 606203 545888 348560 213565 271204 439696 540012 503242 369991 156153
34879A56153k76492j96997M4098K17060J41182j0840M1060K30620K30285l3550
$$ 156153 -120339 -317336 -273238 -56178 85004 74164 115224 345844 576129 542579
$$ [...]
##END NTUPLES=NMR SPECTRUM
##END=
