##TITLE=31Pdec_DE-128HK
D2O, 24 sc
 25.2.2026
##JCAMPDX= 6.0         $$ Bruker NMR JCAMP-DX V2.0
##DATA TYPE= NMR SPECTRUM
##DATA CLASS= NTUPLES
##ORIGIN= UXNMR, Bruker Analytische Messtechnik GmbH
##OWNER= root
$$ XWIN-NMR		Version 3.5
$$ Wed Feb 25 15:24:42 2026 Russian Standard Time (UT+4h)  she@DPX200
##.OBSERVE FREQUENCY= 81.013821
##.OBSERVE NUCLEUS= ^31P
##.ACQUISITION MODE= SIMULTANEOUS
##.ACQUISITION SCHEME= undefined
##.AVERAGES= 24
##.DIGITISER RES= 17
##SPECTROMETER/DATA SYSTEM= spect
##.PULSE SEQUENCE= zgpg30
##.SOLVENT NAME= D2O
##.SHIFT REFERENCE= (INTERNAL, D2O, 0, 197.392)
##AUDIT TRAIL= $$ (NUMBER, WHEN, WHO, WHERE, WHAT)
$$ ##TITLE= Audit trail, XWIN-NMR		Version 3.5
$$ ##JCAMPDX= 5.01
$$ ##ORIGIN= Bruker BioSpin GmbH
$$ ##OWNER= she
$$ F:/spectra/data/she/nmr/P31/2/pdata/1/auditp.txt
$$ ##AUDIT TRAIL=  $$ (NUMBER, WHEN, WHO, WHERE, WHAT)
(   1,<2026-02-25 15:23:38.65 +0400>,<she>,<DPX200>,
      <created by zg, POWCHK disabled, PULCHK disabled
       configuration hash MD5:
       00 E9 B6 7A A2 85 ED C7 34 08 36 98 17 FE 4E 26
       data hash MD5: 32K
       5C E5 8D B6 C5 B5 12 AA 56 E6 1D 3F A9 50 D8 18>)
(   2,<2026-02-25 15:23:42.28 +0400>,<she>,<DPX200>,
      <Start of raw data processing
       efp BC_mod = 2 LB = 1.5 FT_mod = 6 PKNL = 1 PHC0 = 1386.315 PHC1 = 66.30067 SI = 64K 
       data hash MD5: 64K
       E1 92 02 CF 81 5C CD DC 6C 66 0A 86 EB B0 B3 0A>)
(   3,<2026-02-25 15:24:01.70 +0400>,<she>,<DPX200>,
      <pk PHC0 = -12.58836 PHC1 = 30.8 
       data hash MD5: 64K
       D3 BA 90 6B A8 16 B8 64 B2 F5 8B B6 98 2B 55 EA>)
(   4,<2026-02-25 15:24:05.28 +0400>,<she>,<DPX200>,
      <abs ABSG = 5 
       data hash MD5: 64K
       CE 06 65 53 20 79 62 D5 AF E8 E0 29 48 4C 6A DE>)
$$ ##END=
$$ 
$$ hash MD5
$$ A2 80 0F 1B B3 A1 39 F5 5F 4E 42 A5 1B 7D C2 1E
##$RELAX= 
##$RELAX= 
##$RELAX= 
##$RELAX= 
##$RELAX= 
##$RELAX= 
##$RELAX= 
##$RELAX= 
$$ Bruker specific parameters
$$ --------------------------
##$DU= <F:/spectra>
##$EXPNO= 2
##$NAME= <P31>
##$PROCNO= 1
##$TYPE= <nmr>
##$USER= <she>
##$AMP= (0..31)
100 100 100 100 100 100 100 100 100 100 100 100 100 100 100 100 100 100 
100 100 100 100 100 100 100 100 100 100 100 100 100 100 
##$AQSEQ= 0
##$AQ_mod= 1
##$AUNM= <au_zg>
##$AUTOPOS= <>
##$BF1= 81.014009
##$BF2= 200.13
##$BF3= 200.13
##$BF4= 200.13
##$BF5= 200.13
##$BF6= 200.13
##$BF7= 200.13
##$BF8= 200.13
##$BYTORDA= 1
##$CFDGTYP= 0
##$CFRGTYP= 5
##$CHEMSTR= <none>
##$CNST= (0..31)
1 1 145 1 1 1 1 1 1 1 1 1 1 1 1 1 1 1 1 1 1 1 1 1 1 1 1 1 1 1 1 1 
##$CPDPRG= <waltz16>
##$CPDPRG1= <>
##$CPDPRG2= <waltz16>
##$CPDPRG3= <>
##$CPDPRG4= <mlev>
##$CPDPRG5= <mlev>
##$CPDPRG6= <mlev>
##$CPDPRG7= <mlev>
##$CPDPRG8= <mlev>
##$CPDPRGB= <>
##$CPDPRGT= <>
##$D= (0..31)
0 1 0 0 0 0 0 0 0 0.06 0 0.03 2e-05 3e-06 0 0 0.0002 0 0 0 0 0 0 0 0 0 
0 0 0 0 0 0 
##$DATE= 1772018618
##$DBL= (0..7)
120 120 120 11 120 120 24 19 
##$DBP= (0..7)
150 150 150 150 150 150 150 150 
##$DBP07= 0
##$DBPNAM0= <>
##$DBPNAM1= <>
##$DBPNAM2= <>
$$ [...]
##$SUBNAM3= <"">
##$SUBNAM4= <"">
##$SUBNAM5= <"">
##$SUBNAM6= <"">
##$SUBNAM7= <"">
##$SUBNAM8= <"">
##$SUBNAM9= <"">
##$SW= 400.765351723535
##$SWIBOX= (0..15)
0 1 3 0 0 0 0 0 0 0 0 0 0 0 0 0 
##$SW_h= 32467.5324675325
##$TD= 32768
##$TD0= 1
##$TE= 0
##$TE2= 300
##$TE3= 300
##$TEG= 300
##$TL= (0..7)
0 120 53 12 22 120 120 120 
##$TP= (0..7)
150 150 150 150 150 150 150 150 
##$TP07= 0
##$TPNAME0= <>
##$TPNAME1= <>
##$TPNAME2= <>
##$TPNAME3= <>
##$TPNAME4= <>
##$TPNAME5= <>
##$TPNAME6= <>
##$TPNAME7= <>
##$TPOAL= (0..7)
0.5 0.5 0.5 0.5 0.5 0.5 0.5 0.5 
##$TPOFFS= (0..7)
0 0 0 0 0 0 0 0 
##$TUNHIN= 0
##$TUNHOUT= 0
##$TUNXOUT= 0
##$USERA1= <user>
##$USERA2= <user>
##$USERA3= <user>
##$USERA4= <user>
##$USERA5= <user>
##$V9= 5
##$VALIST= <valist>
##$VCLIST= <CCCCCCCCCCCCCCC>
##$VD= 0
##$VDLIST= <DDDDDDDDDDDDDDD>
##$VPLIST= <PPPPPPPPPPPPPPP>
##$VTLIST= <TTTTTTTTTTTTTTT>
##$WBST= 1024
##$WBSW= 4
##$XGAIN= (0..3)
0 0 0 0 
##$XL= 0
##$YL= 0
##$YMAX_a= 6194
##$YMIN_a= -6527
##$ZGOPTNS= <>
##$ZL1= 120
##$ZL2= 120
##$ZL3= 120
##$ZL4= 120
##$ABSF1= 197.3918
##$ABSF2= -203.3724
##$ABSG= 5
##$ABSL= 3
##$ALPHA= 0
##$AQORDER= 0
##$ASSFAC= 0
##$ASSFACI= 0
##$ASSFACX= 0
##$ASSWID= 0
##$AUNMP= <proc_1d>
##$AZFE= 0.1
##$AZFW= 0.5
##$BCFW= 0
##$BC_mod= 2
##$BYTORDP= 0
##$COROFFS= 0
##$CY= -3
##$DATMOD= 1
##$DC= 0
##$DFILT= <>
##$DTYPP= 0
##$F1P= 0
##$F2P= 0
##$FCOR= 1
##$FTSIZE= 65536
##$FT_mod= 6
##$GAMMA= 0
##$GB= 0
##$INTBC= 1
##$INTSCL= 9.790993e-09
##$ISEN= 30
##$LB= 1.5
##$LEV0= 0
##$LPBIN= 0
##$MAXI= 10000
##$MC2= 0
##$MEAN= 0
##$ME_mod= 0
##$MI= 50
##$NCOEF= 0
##$NC_proc= -7
##$NLEV= 6
##$NOISF1= 182.463
##$NOISF2= 159.3651
##$NSP= 0
##$NTH_PI= 0
##$NZP= 0
##$OFFSET= 197.3918
##$PC= 4
##$PHC0= 1373.727
##$PHC1= 97.10066
##$PH_mod= 1
##$PKNL= yes
##$PPARMOD= 0
##$PSCAL= 0
##$PSIGN= 0
##$REVERSE= no
##$SF= 81.014063255964
##$SI= 65536
##$SIGF1= 159.3651
##$SIGF2= -187.1042
##$SINO= 113.3802
##$SIOLD= 16384
##$SREGLST= <1H.CDCl3>
##$SSB= 0
##$STSI= 65536
##$STSR= 0
##$SW_p= 32467.5324675325
##$SYMM= 0
##$S_DEV= 0
##$TDeff= 32768
##$TDoff= 0
##$TI= <>
##$TILT= no
##$TM1= 0
##$TM2= 0
##$TOPLEV= 0
##$USERP1= <user>
##$USERP2= <user>
##$USERP3= <user>
##$USERP4= <user>
##$USERP5= <user>
##$WDW= 1
##$XDIM= 65536
##$YMAX_p= 430069224
##$YMIN_p= -23574905
$$ End of Bruker specific parameters
$$ ---------------------------------
##NTUPLES= NMR SPECTRUM
##VAR_NAME=  FREQUENCY,     SPECTRUM/REAL,   SPECTRUM/IMAG
##SYMBOL=    X,             R,               I
##VAR_TYPE=  INDEPENDENT,   DEPENDENT,       DEPENDENT
##VAR_FORM=  AFFN,          ASDF,            ASDF
##VAR_DIM=   65536,         65536,           65536
##UNITS=     HZ,            ARBITRARY UNITS, ARBITRARY UNITS
##FACTOR=    0.49542278885378, 1,            1
##FIRST=     15991.5117654749, 0,            0
##LAST=      -16476.0207020576, 0,           0
##MIN=       -16476.0207020576, -23574905,   0
##MAX=       15991.5117654749, 430069224,    0
$$ Real data points
##PAGE= N=1
##DATA TABLE= (X++(R..R)), XYDATA
$$ [...]
43327 1115857 1048230 722494 -71615 -738151 -476113 601243 1478830 1473286 1005623 893386
43317 893386 1270465 1651121 1814236 2040108 2494464 2965327 3349407 3825634 4263013 4035110
43307 4035110 2950442 1947129 2151869 3368817 4185670 3682331 2451583 1659875 1562225
43298 1562225 1408921 640073 -343981 -790121 -658625 -653335 -1152791 -1587536 -1273966 -517155
43288 -517155 -197418 -350257 -22052 1201283 2378487 2481755 1746456 1006341 332759
43279 332759 -652832 -1533771 -1384059 -281832 577468 484543 -44352 -411324 -839277 -1631873
43269 -1631873 -2372907 -2537038 -2322377 -2224748 -2189048 -1763640 -807339 416472 1563084
43260 1563084 2244328 2100563 1262644 425028 54081 -151078 -618913 -1120051 -1113812 -552485
43250 -552485 159511 701138 836892 268410 -862743 -1625132 -1222028 -143265 364038
43241 364038 -34312 -358551 314575 1775786 3174488 3946599 3963922 3323111 2385191
43232 2385191 1645087 1212828 719007 292 -477311 -244907 386853 591590 -16427
43223 -16427 -992072 -1566463 -1323549 -463484 378853 647207 419846 411180 1207091 2519667
43213 2519667 3413528 3280824 2374523 1332937 454519 -333695 -973518 -1138303 -715841
43204 -715841 -155177 -65581 -539580 -1073562 -1120272 -547276 366517 1109581 1116860 107448
43194 107448 -1584546 -3175592 -4013068 -3887164 -2902163 -1421472 -109449 513070 718664
43185 718664 1233867 1996477 1898659 270470 -1977368 -3405046 -3765164 -3811412 -3760780 -3078236
43175 -3078236 -1787322 -825313 -706453 -776900 -332370 317532 555272 587223 1094179 2114158
43165 2114158 2971106 3116501 2515537 1461079 547447 535076 1574281 2725279 2906479
43156 2906479 2216018 1641547 1544219 1255653 326838 -655294 -933748 -648899 -498040 -724455
43146 -724455 -986726 -1000371 -803974 -493392 -131150 99106 14184 -256589 -368387 -223326
43136 -223326 -98311 -236416 -503918 -565735 -294049 98825 302558 226023 55404 4145
43126 4145 73488 144711 235148 477698 871640 1310232 1883638 2798407 3817941 4151149
43116 4151149 3253747 1509931 -235226 -1587267 -2623669 -3267956 -3303584 -2980558 -2895874
43107 -2895874 -3064717 -2746372 -1557746 -239185 150559 -578478 -1817080 -3036105 -4003496
43098 -4003496 -4356042 -3671298 -2096104 -454114 452032 452924 -28055 -360837 -140948 420578
43088 420578 573479 -175913 -1385795 -2138941 -2117101 -1795185 -1595701 -1393359 -1027561 -806259
43078 -806259 -1126674 -1833966 -2281818 -1986889 -1106464 -322221 -228263 -695699 -925470 -341998
43068 -341998 695991 1373552 1438536 1312723 1337593 1495428 1837813 2490180 3084427 2878365
43058 2878365 1747136 488603 -164390 -303323 -348925 -421985 -579937 -1044367 -1700410
43049 -1700410 -1932856 -1476408 -881374 -608553 -285942 470328 1122080 941040 179284
43040 179284 -392535 -687872 -1063199 -1245178 -642595 421083 940101 716436 531694
43031 531694 747422 861721 682966 788649 1365951 1632626 1002821 -43893 -859848
43022 -859848 -1557122 -2330467 -2625768 -1903341 -762624 -395620 -1094089 -2007059 -2311376
43013 -2311376 -2090665 -2074749 -2834522 -4144098 -4984261 -4479535 -3010369 -1946220 -1996562
43004 -1996562 -2356446 -1900331 -663582 460829 1030919 1311847 1481317 1335833 772837
42995 772837 12459 -661414 -986116 -684561 195505 1032205 1216107 928610 868947 1238649
42985 1238649 1473343 1044537 121519 -696222 -1029139 -969162 -838393 -821177 -877594 -1038394
42975 -1038394 -1567683 -2497430 -3172939 -2875912 -1924056 -1402997 -1612866 -1675031 -1123052 -876849
42965 -876849 -1782747 -3048001 -3309134 -2705051 -2561831 -3248932 -3701984 -3163093 -2161788
42956 -2161788 -1474774 -1191877 -1213489 -1682966 -2362007 -2384513 -1307555 106938 728720
42947 728720 323359 -428119 -826603 -704435 -365966 -291024 -700093 -1250960 -1368379 -899253
42937 -899253 -176780 475342 934525 1159868 1396413 2252086 3837761 5037369 4596758
42928 4596758 2909259 1665404 1648706 2071470 2324948 2956534 4222094 4988957 4140475
42919 4140475 2138423 180778 -1337142 -2480893 -2786157 -1923604 -748981 -350249 -436356
42910 -436356 70299 1190088 1937202 1939988 1648881 1109957 12351 -1026205 -777436
42901 -777436 679237 1775732 1623944 999792 634599 -22721 -1447913 -2699656 -2583968
42892 -2583968 -1300170 129576 1318208 2334048 2756767 2127017 923372 -10247 -654287
42883 -654287 -1375857 -1746440 -1109409 -84925 -20091 -855302 -1076637 -222863 106938 -1333589
42873 -1333589 -3295813 -3607000 -2066628 -350077 524869 1068973 1644077 1531246 364338
42864 364338 -730875 -524827 475806 749481 20482 -442662 79954 588426 -48515
42855 -48515 -1226022 -1354286 -98941 1198345 1370616 727356 187947 -11854 -104868
42846 -104868 72925 806927 1571473 1325205 -39801 -1276298 -1262085 -422651 -111319
42837 -111319 -817579 -1645505 -1644519 -1051237 -782183 -1016562 -911245 163710 1633429 2402323
42827 2402323 2285218 2177818 2727284 3387503 3164402 1932835 489615 -552627 -1329514
42818 -1329514 -2081518 -2503523 -2131094 -1115858 -223582 -112791 -842252 -1972590 -2858801
42809 -2858801 -2919405 -2022350 -751545 -4334 -93816 -407676 -169665 602758 1197612 1226184
42799 1226184 1167914 1696184 2702710 3330604 2954633 1841383 769045 267813 406265
42790 406265 1055058 1978627 2721259 2820958 2318461 1801922 1750055 2032158 2262259 2393164
42780 2393164 2570836 2538191 1744617 241649 -967359 -874572 392616 1703889 2108797
42771 2108797 1576296 612009 -444572 -1545495 -2611186 -3380142 -3590732 -3196818 -2400652
42762 -2400652 -1514386 -740341 -30539 793908 1736311 2503182 2781840 2602054 2283775
42753 2283775 1975966 1392254 215422 -1226167 -1976023 -1441448 -274074 148638 -728232
42744 -728232 -1950572 -2196154 -1305295 -246803 229762 288114 317958 241744 -110058 -424435
42734 -424435 -268042 196717 392904 150100 -167195 -384548 -839763 -1736098 -2576383 -2644721
42724 -2644721 -1908131 -1094982 -881326 -1244780 -1650358 -1635743 -1088035 -136132 961231
42715 961231 1818971 2084681 1785815 1391497 1293641 1274332 778728 -228234 -1019929 -968225
42705 -968225 -401612 -246039 -907525 -1891547 -2542468 -2744292 -2695903 -2347945 -1469477 -194286
42695 -194286 882841 1310620 1297503 1435917 1964315 2485936 2478832 1946276 1422197 1402271
42685 1402271 1943585 2788345 3618610 4102909 3978296 3333552 2630370 2162984 1641452
42676 1641452 659160 -528373 -1169814 -1037262 -771512 -923643 -1092973 -521810 691989
42667 691989 1598460 1641995 1305637 1237009 1243838 705366 -265874 -757484 -255141 689985
42657 689985 1315393 1654751 2123820 2443609 1812427 229149 -1153685 -1404070 -920414
42648 -920414 -596712 -385709 462418 1897605 2741348 2135256 649546 -468073 -691109
42639 -691109 -424488 -183409 -132727 -334188 -883525 -1595044 -1872160 -1249129 -97443 467884
42629 467884 -284105 -1629171 -1858770 -194123 2063421 2883317 1881401 589079 265151
42620 265151 391034 -119005 -1078318 -1382322 -742018 36726 399863 598342 757225 465260
42610 465260 -238439 -388053 646965 2027916 2401587 1651044 892359 892190 1301357 1510746
42600 1510746 1493870 1484204 1384883 968307 393282 106585 286357 640441 765337 571573
42590 571573 328438 304949 363893 22016 -932223 -1972099 -2247288 -1481778 -227944 762744
42580 762744 1112536 748921 -268693 -1578486 -2500513 -2546191 -1792552 -552857 1019463
42571 1019463 2674158 3761852 3764948 3023267 2367366 2011835 1359081 23044 -1486087
42562 -1486087 -2360099 -2360485 -1801013 -1023285 -239660 349809 647702 781783 947098 1247101
42552 1247101 1758224 2452015 2911584 2517973 1202259 -333934 -1444543 -2184100 -2763817
42543 -2763817 -2890100 -2311267 -1648523 -1826208 -2765061 -3439965 -3249903 -2539462 -1688909
42534 -1688909 -596624 615678 1258543 1019779 615140 855650 1525071 1788469 1313130
42525 1313130 359202 -866060 -2196944 -3079959 -2978142 -2247587 -1933539 -2525833 -3415517
42516 -3415517 -3730800 -3267158 -2419189 -1571033 -776584 155223 1335969 2400101 2565108
42507 2565108 1474226 -83577 -804204 -330046 378528 312870 -390376 -822546 -510723
42498 -510723 153054 548866 558496 617730 1132922 1846297 1902847 803761 -766194 -1463405
42488 -1463405 -736186 618114 1460199 1427189 836080 8753 -819320 -1274249 -1132294
42479 -1132294 -738373 -660479 -966397 -1238970 -1238987 -1121084 -1021406 -890207 -778067 -840556 -961464
42468 -961464 -815357 -456198 -382224 -753013 -972625 -454814 484593 937912 456178 -598467
42458 -598467 -1633504 -2350424 -2730072 -2901362 -3074073 -3265421 -3070518 -2108302 -792458
42449 -792458 -189048 -824187 -2020141 -2795095 -3076854 -3476302 -4065763 -4128440 -3295508 -2301415
42439 -2301415 -2156760 -2896147 -3592301 -3456477 -2543156 -1472538 -862568 -1029930 -1835878
42430 -1835878 -2656707 -2764526 -1934317 -587229 687079 1560582 1909493 1654567 877631
42421 877631 -96451 -975375 -1757649 -2527835 -3115038 -3208170 -2781235 -2181488 -1781243 -1717142
42411 -1717142 -1961146 -2416182 -2852206 -2912176 -2310249 -1002958 777388 2494859 3387918
42402 3387918 2954897 1564454 307000 -75392 39884 -231771 -1050035 -1698774 -1685704
42393 -1685704 -1445021 -1647343 -2227429 -2548079 -2280554 -1619091 -758793 250704 1090708
42384 1090708 1226751 636003 -18075 -276471 -473783 -967643 -1249836 -594897 597660
42375 597660 1020850 221485 -648140 -313721 965211 1849659 1686933 1124858 1045482 1539645
42365 1539645 2091209 2279039 2013380 1370639 479230 -535429 -1622075 -2715502 -3558088
42356 -3558088 -3834133 -3556532 -3063894 -2518460 -1716764 -621084 245321 337862 -142362
42347 -142362 -467632 -335126 -153313 -295138 -504633 -310372 247558 614427 358114 -370821
42337 -370821 -956402 -825784 19888 921829 1197951 907359 702134 845426 813125 133527
42327 133527 -844199 -1484914 -1755323 -1920232 -1671211 -471773 1240261 2196153 1991966
42318 1991966 1752222 2486686 3512472 3380258 1954712 615126 462509 1194085 1905911
42309 1905911 2248817 2402225 2415919 2074744 1259351 150201 -868463 -1425677 -1447653
42300 -1447653 -1286040 -1347625 -1524269 -1258719 -323694 727386 1134026 801805 357956
42291 357956 407492 958666 1578450 1900688 1875192 1636400 1303841 954519 675248 523304
42281 523304 478475 548934 864825 1489404 2189186 2650395 2907666 3216567 3473986 3239647
42271 3239647 2503670 1880878 1689840 1424941 728370 337985 1179995 2805432 3743517
42262 3743517 3412632 2689468 2383514 2141697 1344317 257949 -363891 -269347 312231
42253 312231 1209027 2205533 2792251 2683836 2357630 2473320 2909575 2926555 2176087 1029846
42243 1029846 -36465 -888323 -1550936 -2021453 -2349627 -2595672 -2631715 -2199742 -1217294
42234 -1217294 74822 1218649 1763433 1607536 1218801 1220279 1597235 1671425 1096483 467768
42224 467768 572556 1382455 2208950 2570772 2498571 2254828 2142591 2303261 2367021 1726108
42214 1726108 543966 -94090 381101 1097669 1092652 920712 1717420 3092987 3417993
42205 3417993 2167910 536962 -469903 -1059527 -1303168 -334250 2104523 4503244 5206822
42196 5206822 4444438 3603699 3112260 2288888 917998 -353710 -1188398 -1961316 -2749778
42187 -2749778 -2870599 -1870380 -360343 561701 379813 -560867 -1479803 -1675122 -973005
42178 -973005 62094 555108 151146 -667610 -1130096 -895458 -234555 284387 232511 -360468
42168 -360468 -1004838 -1162131 -755990 -272968 -326922 -1060490 -1904648 -2007137 -1075075 236584
42158 236584 968563 823895 225259 -460051 -1240919 -2019827 -2433879 -2468939 -2657511 -3228865
42148 -3228865 -3558455 -3014229 -1964707 -1321807 -1332081 -1445228 -1223308 -758998 -262846
42139 -262846 153961 256022 -188967 -909318 -1183593 -596760 471975 1188173 980666
42130 980666 56289 -638853 -240707 976393 1706329 1174233 205227 149245 1076215 1805592
42120 1805592 1569278 816533 330615 313046 508564 601102 314570 -334754 -782241 -448160
42110 -448160 426728 1039922 1087450 886065 495940 -386746 -1549023 -2230191 -2254390 -2276266
42100 -2276266 -2563473 -2520875 -1889927 -1363735 -1313510 -924192 459637 1986607 2402630
42091 2402630 1863010 1496088 1649822 1781538 1763838 2009191 2355197 2063345 1127701 558472
42081 558472 1063600 2254796 3393386 4152012 4379122 3849764 2640596 1257273 111012
42072 111012 -773760 -1469082 -1986424 -2389866 -2618496 -2349235 -1590745 -1123398 -1531630 -2053626
42062 -2053626 -1456245 51381 1017363 933455 808675 1191338 1135837 -55803 -1417154
42053 -1417154 -1740899 -1331268 -1127260 -1008131 -345615 457192 471684 -105883 -248067 158141
42043 158141 232860 -296267 -755378 -844430 -975048 -1097905 -515652 729363 1499044 1159224
42033 1159224 479720 305076 301846 -203243 -956809 -1227560 -950647 -588403 -241934 339788
42023 339788 1117518 1761064 2107717 2146812 1801539 1194881 873138 1265110 2067494 2546218
42013 2546218 2305398 1521123 680337 302515 548437 871610 522431 -323460 -500134
42004 -500134 703693 2613853 4111302 4835435 4913945 4286760 3135818 2313621 2334223
41995 2334223 2451886 1798285 938744 1041819 1851525 1941014 931764 -30336 -218164
41986 -218164 -265344 -708273 -1020876 -879252 -1139822 -2498050 -4062220 -4403735 -3513340
41977 -3513340 -2701012 -2842705 -3569311 -4012682 -3642807 -2447761 -837593 618701 1618896
41968 1618896 2191669 2344747 2097584 1877785 2164052 2587316 2301579 1551553 1718926
41959 1718926 3150853 4157566 3243022 1272454 65964 -261468 -887461 -1839730 -1944108
41950 -1944108 -1124658 -782612 -1485005 -2036709 -1542146 -821851 -831517 -1020217 -472279 312511
41940 312511 141505 -900153 -1457476 -714716 795753 2164687 3081225 3739936 4335095
41931 4335095 4773026 4613709 3391872 1267597 -824679 -1984960 -2147313 -1850349 -1494671
41922 -1494671 -1143252 -796154 -492610 -276159 -271301 -575693 -942331 -969483 -835558 -1340404
41912 -1340404 -2797369 -4324489 -4762103 -3983638 -2810863 -1953419 -1577063 -1625320 -1910696
41903 -1910696 -1997504 -1572512 -907569 -512217 -416400 -231943 189673 615334 843296 817639
41893 817639 448952 -207604 -676926 -428444 511587 1642527 2504518 2746279 2030675
41884 2030675 500566 -906180 -1344159 -1132168 -1172907 -1424295 -918431 576126 1944573
41875 1944573 2223662 1854050 1829921 2267545 2523905 2274504 1737897 1081889 293275 -429639
41865 -429639 -717515 -507033 -74831 448685 1245415 2357474 3296488 3321938 2160058
41856 2160058 401720 -940807 -1356075 -1175237 -886549 -428561 446721 1394321 1736026
41847 1736026 1479533 1361977 1696589 1860908 1271416 272252 -372245 -391115 -20371 408049
41837 408049 477514 -177555 -1216949 -1574969 -729492 412554 550359 -458770 -1746956
41828 -1746956 -2694377 -3169518 -2867093 -1527621 179667 1045819 808027 358922 279740
41819 279740 145170 -343222 -559056 16733 765584 776779 182564 -180838 -32416 290412
41809 290412 720039 1453538 2134400 1993476 1001217 103833 32288 543709 1147783 1860606
41799 1860606 2688083 2971328 2078424 519697 -452195 -430320 -343827 -1097966 -2300704
41790 -2300704 -2799875 -2131814 -911418 59606 530750 615958 376104 -145707 -734509
41781 -734509 -1095185 -1037238 -526660 202998 546043 -41833 -1244128 -1947134 -1562746 -923208
41771 -923208 -1188591 -2085947 -2149638 -854567 446920 273536 -1051889 -2040532 -2123876
41762 -2123876 -2084039 -2521324 -2969838 -2842170 -2340563 -1834447 -1026361 428944 1846664
41753 1846664 2012294 816053 -419103 -546814 72140 258133 -440086 -1402815 -1842283
41744 -1842283 -1499359 -615334 206091 158256 -1110657 -2829553 -3613279 -2894744 -1458014
41735 -1458014 -374745 69657 103797 -233243 -896355 -1369725 -1172855 -653979 -547921
41726 -547921 -823246 -715253 85443 1069747 1852198 2606328 3225675 2929317 1372247
41717 1372247 -442148 -1103061 -347248 883057 1616846 1537942 820048 -77350 -607432
41708 -607432 -637292 -566827 -571147 -178484 800285 1456201 815000 -667977 -1695928 -1981088
41698 -1981088 -2284407 -2664236 -2160082 -633555 488472 140689 -806273 -859140 81833
41689 81833 1042796 1579517 1909281 1941541 1384757 617883 391014 723828 988541 963579
41679 963579 911109 745521 104093 -798237 -1372157 -1707213 -2377005 -3145994 -3066664 -2124969
41669 -2124969 -1534908 -1876722 -2171884 -1607160 -1042730 -1663614 -2944001 -3276989 -2235579
41660 -2235579 -948344 -343180 -188405 -5004 120515 22254 -15701 302899 775962 992805
41650 992805 803486 249578 -628713 -1613608 -2178521 -1864761 -763046 512692 1310193
41641 1310193 1406522 1116740 950190 1054722 1043751 518937 -302632 -714335 -310730 525193
41631 525193 1010940 761670 142053 -169070 61309 406714 441409 430214 974307 1992414
41621 1992414 2588745 2178519 1283369 835774 1072799 1545402 1858758 1856618 1360644 401626
41611 401626 -387160 -264568 682058 1647201 2198999 2670705 3313252 3666246 3164925 2024833
41601 2024833 1136380 1201069 2163526 3358104 4058504 3980459 3367749 2608491 1854264 1060676
41591 1060676 173637 -905442 -2246761 -3457629 -3639016 -2318476 -278170 1106935
41583 1106935 1292044 800561 189805 -470914 -1041583 -1067888 -460246 194515 396092 324445
41573 324445 318228 241591 -197772 -875738 -1428158 -1719410 -1770231 -1493877 -867887 -126868
41563 -126868 562961 1390026 2489066 3429255 3518905 2608718 1326373 478106 326819
41554 326819 453124 310536 -73002 -116749 435112 965350 744921 3661 -354591 42488
41544 42488 809398 1665277 2651849 3488763 3752298 3898928 4958089 6774144 7809696
41535 7809696 7474663 7430567 9435649 12929580 16205481 19190372 23263711 28568968 33381975
41526 33381975 36534335 38926676 41892019 45121700 46985891 46180027 42420013 36206920
41518 36206920 28710017 21520535 15781180 11575205 8493716 6547867 6029807 6568072
41510 6568072 6904343 5966479 4012527 2350731 1834554 1997298 1976946 1834963 2172814
41501 2172814 2674384 2244096 893281 172408 898868 1660633 864306 -688298 -948333
41492 -948333 193661 766780 -251345 -1632879 -2048290 -1808669 -1692833 -1505195 -862591
41483 -862591 -313647 -490956 -844189 -309638 1143133 2479914 2825009 2072221 599222
41474 599222 -1028177 -2290388 -3055483 -3451419 -3296004 -2259182 -771789 91580 59690
41465 59690 78126 681120 938296 -92118 -1755867 -2756849 -2989981 -3172638 -3250979 -2664082
41455 -2664082 -1900840 -2159587 -3309348 -3729060 -2681285 -1493438 -1572285 -2343616 -2255696
41446 -2255696 -1136463 -321550 -640032 -1433405 -1821701 -1995963 -2606371 -3417982 -3460462
41437 -3460462 -2493234 -1505977 -1392112 -1748452 -1599776 -866796 -299009 -172514 -16658
41428 -16658 317443 335770 -19574 64521 1034183 2071907 2135066 1284403 294384 -476899
41418 -476899 -1054764 -1199310 -695851 -18872 109271 -334498 -812689 -1055830 -1091511 -766796
41408 -766796 -34724 504765 186785 -680712 -1129886 -865424 -595192 -1005715 -1977246 -2826825
41398 -2826825 -2923205 -2223106 -1550787 -1930380 -3160954 -3660886 -2460167 -698542 -164246
41389 -164246 -941081 -1679453 -1649603 -1098886 3184 1833831 3383285 3072618 1078986
41380 1078986 -544930 -547050 214972 613880 788719 1109162 1177915 870862 1000807 1832641
41370 1832641 2165073 1087338 -446114 -1035555 -808014 -653309 -462354 353832 1326436
41361 1326436 1505795 1115781 1150749 1683033 1997881 2082113 2493111 2971027 2720517 2000491
41351 2000491 1874392 2293377 2007302 681232 -435671 -475996 -178995 -443452 -895856
41342 -895856 -780644 -309392 -207589 -609700 -1172936 -1659351 -1699279 -627548 1607448
41333 1607448 3807593 4573797 3738948 2220884 836542 -149856 -692624 -877983 -957534
41324 -957534 -899519 -159930 1503590 3236352 3809490 3075483 2059350 1559139 1259647
41315 1259647 441341 -883616 -1885090 -1846638 -998448 -341469 -548255 -1112482 -935904
41306 -935904 159967 1020867 617997 -556609 -1150111 -697293 2033 131430 -267884
41297 -267884 -739920 -1025203 -1020150 -745482 -630408 -1257695 -2494136 -3417559 -3489471 -3229649
41287 -3229649 -3226765 -3095535 -2200984 -976299 -528870 -1068709 -1719028 -1951895 -2202489 -2778527
41277 -2778527 -3165347 -2957669 -2595844 -2450403 -1959856 -626800 725350 846490 -42772
41268 -42772 -396793 585901 2062504 2868983 2793049 2262330 1650606 1280675 1360439 1516252
41258 1516252 1065005 82415 -549807 -520284 -629750 -1424529 -2222044 -2286868 -2122678 -2568020
41248 -2568020 -3281836 -3323457 -2793704 -2593931 -2716113 -2108985 -439689 1155501 1489827
41239 1489827 662077 -386166 -947562 -866039 -411746 -149829 -412891 -728075 -346000
41230 -346000 545045 856758 77010 -1056422 -1713924 -2054916 -2638260 -3381425 -3716022
41221 -3716022 -3370791 -2519396 -1538074 -1003449 -1427848 -2507593 -3118445 -2615640 -1691673
41212 -1691673 -1337379 -1404409 -966602 198417 1339296 1841913 1823976 1617495 1416575
41203 1416575 1543354 2302058 3285377 3494863 2588404 1504366 1337765 1953698 2275654
41194 2275654 1725826 736890 -143193 -937404 -1708683 -1937837 -1099129 355642 1303679
41185 1303679 1323194 1118135 1356596 1772699 1886143 1946575 2380596 2769083 2387143 1596060
41175 1596060 1600624 2661502 3554112 3151385 1650823 -164172 -1913730 -3245437 -3400421
41166 -3400421 -2104760 -316654 806955 1223246 1455793 1317658 306380 -1083100 -1711367
41157 -1711367 -1423277 -1125484 -1126049 -632355 715876 1969825 2174174 1625905 1105542 644402
41147 644402 -81011 -736313 -697682 -124738 239192 189696 158495 274443 193396 -57734
41137 -57734 58902 596866 804294 330381 88710 1125633 2954237 3887394 3083360
41128 3083360 1520711 650731 679112 702085 194925 -312589 -99163 730751 1395169 1382605
41118 1382605 956997 718001 842658 910441 516159 -82389 -194192 373381 963471 940768
41108 940768 607358 741653 1372305 1655971 1047584 -71183 -1164956 -2232571 -3223174
41099 -3223174 -3417416 -2243549 -438567 502815 114002 -537411 -341446 492164 951472
41090 951472 650651 225192 434874 1279399 2076249 2223586 1778995 1297480 1153950 1144774
41080 1144774 834503 166708 -439949 -531991 -1046 871483 1544751 1503596 696689 -334706
41070 -334706 -999082 -1253140 -1375666 -1267495 -477964 956026 2186938 2421414 1833580
41061 1833580 1250852 1101780 1116281 1084381 1412857 2525087 3908177 4346193 3353283
41052 3353283 1936488 1418263 1750393 1717714 806382 -37440 99302 722379 818074 447025
41042 447025 423634 801208 872712 605606 816482 1646365 2052935 1392251 486150 341183
41032 341183 640781 448954 -204183 -500997 -273211 -220168 -759799 -1550233 -2168937 -2452410
41022 -2452410 -2124329 -971057 395593 808463 2935 -889340 -794399 -22919 449052
41013 449052 456634 581580 936361 973116 555726 346272 774879 1284874 1095952 267158
41003 267158 -533164 -988848 -1261443 -1338195 -942960 -160079 468880 690777 884492 1394646
40993 1394646 1982214 2273703 2334392 2387853 2350126 2117150 1949989 1997462 1766947 798718
40983 798718 -341682 -579109 219267 1192533 1930452 2914948 4176510 4616915 3459886
40974 3459886 1569992 378425 50051 -266782 -757201 -695165 126081 829892 648689
40965 648689 -136630 -802478 -1022957 -717642 251068 1651005 2644632 2630991 2053205 1782432
40955 1782432 1891872 1674896 860204 180828 499592 1770316 3144919 3870881 3833140
40946 3833140 3381448 2918295 2648665 2521992 2335876 1971804 1567232 1411821 1656276
40937 1656276 2146301 2525777 2468375 1873218 980938 332420 440468 1305291 2257846 2438073
40927 2438073 1516840 -76996 -1620042 -2677023 -3220575 -3368095 -3203609 -2846072 -2505373
40918 -2505373 -2342843 -2318704 -2266609 -2106845 -1913206 -1784217 -1738387 -1712697 -1514123 -792362
40908 -792362 639539 2313756 3292727 3206937 2801923 2891603 2999289 1897436 -424735
40899 -424735 -2353932 -2737893 -2454638 -2982305 -4066693 -4047135 -2319513 -238654 663138
40890 663138 353220 -202605 -393359 -270711 -50519 173475 482242 1111025 2048381 2645123
40880 2645123 2207577 1045625 177303 -185999 -941638 -2469504 -3673339 -3387851 -1970324
40871 -1970324 -634245 155382 661123 801852 277025 -455006 -482609 173453 432745
40862 432745 -343480 -1474892 -1892868 -1403493 -724284 -606294 -1130610 -1710352 -1750917 -1341552
40852 -1341552 -1039409 -910699 -374859 674611 1335981 934260 91917 -284716 -389545
40843 -389545 -767952 -832416 348632 2042597 2299998 579632 -1574363 -2771596 -3188938
40834 -3188938 -3303395 -2818308 -1707192 -947302 -1134204 -1439200 -994192 -311544 -192728
40825 -192728 -167884 631333 1734470 1899276 1035070 226390 38976 43143 -53147 15019
40815 15019 259172 235545 -153703 -474906 -521347 -556162 -737147 -958254 -1247157 -1650061
40805 -1650061 -1804437 -1370595 -798723 -839532 -1338455 -1411322 -846375 -392783 -545713 -1017319
40795 -1017319 -1607490 -2552205 -3615796 -3846063 -2835810 -1434680 -621100 -392687 -346192
40786 -346192 -560141 -1116014 -1391079 -748527 436032 1229898 1309302 934861 134086 -1166547
40776 -1166547 -2354293 -2460133 -1439463 -365819 -110359 -429987 -598608 -376652 -22343
40767 -22343 225995 311777 280942 326400 670009 1148426 1177184 457526 -463265 -716240
40757 -716240 -128926 659622 1121006 1433412 1917274 2265074 1863428 819656 118822
40748 118822 543078 1820712 3097828 3839588 3860782 2899652 909403 -1326352 -2647442
40739 -2647442 -2763230 -2428446 -2204863 -1774845 -873330 -157071 -400204 -1245896 -1569477
40730 -1569477 -955203 -121126 116220 -294111 -854283 -1071763 -704021 106731 845485
40721 845485 1117704 1115093 1205739 1196022 613120 -303428 -658161 -140947 555381 906267
40711 906267 1347852 2315669 3228032 3288817 2806191 2723257 3093057 3058324 2306851 1488897
40701 1488897 1012539 477901 -273835 -540236 139502 1065735 1377318 1330674 1661268 2177327
40691 2177327 2075527 1387251 947700 953575 741893 205524 197683 989140 1444119 591360
40681 591360 -826146 -1356065 -778513 -3134 506509 1021631 1474305 1359902 849335
40672 849335 858076 1660766 2433814 2609898 2704352 3172737 3387667 2668229 1623636 1372285
40662 1372285 1814159 1813960 965457 35122 -448907 -902333 -1572769 -1771825 -971927 64284
40652 64284 152274 -724983 -1566418 -1843468 -1909662 -1954243 -1555879 -626442 48036 -164004
40642 -164004 -721969 -627427 170675 810823 809776 574235 582611 779158 1012260 1423190
40632 1423190 1997117 2243645 1821025 1100748 599234 189946 -500152 -1173361 -1128684 -421277
40622 -421277 76268 7291 144068 1162195 2414008 2663006 1759314 825302 771733 1287298
40612 1287298 1482433 976696 8512 -1082163 -1932671 -1916012 -495478 1927421 3935153
40603 3935153 4295328 3148887 1697162 799362 291183 -268591 -716630 -554537 201604
40594 201604 960204 1300387 1345426 1350823 1338099 1288163 1327940 1454564 1309281 533195 -714617
40583 -714617 -1793724 -2137967 -1721111 -1045505 -695132 -776464 -783960 -178384 908170 1789325
40573 1789325 2079739 2114325 2377522 2838996 3089647 2857102 2100547 849657 -673125
40564 -673125 -1916834 -2388435 -2181991 -1876720 -1955051 -2506904 -3313302 -3878823 -3558947 -2174375
40554 -2174375 -525170 210047 -229697 -886580 -797934 -146425 125119 -412357 -1187823
40545 -1187823 -1359004 -712399 217519 760249 801793 926021 1793385 3295584 4477075
40536 4477075 4498676 3583321 2745701 2622856 2912777 3064770 3116866 3446614 3878577 3605726
40526 3605726 2200220 318707 -960160 -1321099 -1366547 -1671398 -2105936 -2173489 -1636043
40517 -1636043 -630123 497597 1230991 1099502 226191 -568735 -630829 -286304 -352606
40508 -352606 -969503 -1494244 -1569164 -1621484 -2046834 -2515701 -2552624 -2324775 -2275046 -2312854
40498 -2312854 -2028258 -1488684 -1069993 -569913 634704 2347592 3349848 2948663 2008679
40489 2008679 1711488 1818490 1093138 -776617 -2656999 -3442397 -3154429 -2301298 -1015737
40480 -1015737 558631 1614552 1221312 -569805 -2644183 -3816738 -3656102 -2541516
40472 -2541516 -1276738 -526162 -302727 -75554 446487 882859 778058 305547 -17239
40463 -17239 -55597 -66011 -205645 -485081 -989154 -1667529 -2137560 -2201651 -2261573 -2594911
40453 -2594911 -2573567 -1475660 144932 947170 660985 369972 777032 1335557 1480189
40444 1480189 1555865 1883125 1939191 1267530 306387 -531634 -1701850 -3416101 -4537369
40435 -4537369 -3934029 -2427420 -1941070 -2861646 -3618525 -2991515 -1575324 -616808 -468725
40426 -468725 -700591 -952506 -1154575 -1391027 -1860433 -2554246 -2880290 -2170337 -671878
40417 -671878 578425 1009463 1025781 1141838 1313244 1361155 1370228 1347893 1106227 786644
40407 786644 866385 1297036 1296897 465904 -476704 -603610 38214 680404 859217 634559
40397 634559 88792 -822620 -2009518 -3183302 -3971675 -3987917 -3115822 -1908419 -1291245
40388 -1291245 -1574046 -2088556 -2037493 -1341220 -477849 28852 -232631 -1303978 -2451747
40379 -2451747 -2670363 -1969293 -1445561 -1626234 -1640160 -796275 -39352 -599430 -1808642
40370 -1808642 -1769731 -77313 1591374 1852104 1266774 1097756 1550261 2062118 2501112
40361 2501112 3068317 3432367 2960553 1800940 953752 1046813 1575485 1677478 1291194
40352 1291194 1072790 1265135 1218359 362340 -706996 -735147 545510 1856052 1806683
40343 1806683 538682 -483693 -150303 1190706 2237911 2080350 1065305 446011 1055768
40334 1055768 2308703 2789570 1861588 246952 -1082392 -1939056 -2507119 -2609559 -2060159
40325 -2060159 -1266793 -771916 -548931 -412398 -662143 -1442443 -1846235 -787324 1277721
40316 1277721 2578830 2168383 912101 117931 56039 185976 62205 -451417 -1284900
40307 -1284900 -2057329 -2269255 -1805511 -837022 725732 2937784 4931010 5302054 3770052
40298 3770052 1598722 -46507 -1258241 -2383139 -2898069 -2234418 -988803 -244658 -119902
40289 -119902 34293 342497 335258 -19334 -220952 -154991 -189695 -297016 25815 750404
40279 750404 1048841 387080 -737480 -1505245 -1693487 -1531234 -1129719 -534030 -45588
40270 -45588 -18864 -411641 -832418 -991856 -916643 -764163 -579529 -248280 346171 1116676
40260 1116676 1804943 2307858 2817164 3402066 3595114 2806234 1206866 -193668 -561199
40251 -561199 -55419 563543 868897 1003242 1180895 1370179 1491710 1600191 1734692 1792074
40241 1792074 1675705 1421921 1098382 783650 772572 1502780 2937338 4209859 4343045
40232 4343045 3295755 1863248 585648 -613018 -1582997 -1591654 -393217 979068 1314597
40223 1314597 774217 502054 909088 1263650 963872 274474 -384456 -1024284 -1671253
40214 -1671253 -2133781 -2520474 -3253621 -4190192 -4483156 -3809292 -3030146 -3044543 -3593791 -3801353
40204 -3801353 -3296952 -2167227 -445835 1503020 2623217 2183228 888232 78517 29196
40195 29196 -48424 -491539 -733259 -467304 -258700 -587762 -1001369 -711620 353844 1472744
40185 1472744 1897220 1523591 942481 852671 1305543 1659495 1414219 769351 120721 -494403
40175 -494403 -990783 -869269 -38552 473766 -342041 -1848112 -2339616 -1229309 395097
40166 395097 1447314 1935461 2123570 1769982 788318 -234990 -834092 -1288059 -1885102
40157 -1885102 -2213244 -1790435 -877967 -116929 206483 127044 -235248 -486344 -164455 408267
40147 408267 186102 -1100473 -2237985 -2106751 -1323317 -1353289 -2433858 -3409409 -3398479
40138 -3398479 -2605674 -1538273 -423608 404622 381431 -632728 -2014437 -2893627 -2686359
40129 -2686359 -1197085 1204693 3389406 4041972 2797379 573196 -1363534 -2411968
40121 -2411968 -2684797 -2446054 -1799602 -835644 117715 541614 204042 -401114 -398768 515464
40111 515464 1759148 2670723 3207450 3517107 3324262 2349992 1019010 81230 -281435
40102 -281435 -350399 -122567 545466 1198333 1147139 684934 973944 2355572 3624911 3535924
40092 3535924 2340116 1188213 579075 188785 -142042 -178318 -28471 -289571 -1184093
40083 -1184093 -2112665 -2411509 -2166280 -1892799 -1693317 -1215165 -357230 514931 1195549
40074 1195549 1971240 2957227 3534348 3108630 2256943 2271039 3345138 4010079 2915255
40065 2915255 607973 -1131462 -1347772 -594483 156213 455877 282009 -191108 -551326
40056 -551326 -493609 -351804 -707797 -1360215 -1367890 -378365 765135 1152517 941276 826310
40046 826310 867151 535862 -285244 -1018067 -1133709 -723790 -231701 76808 257126 470658
40036 470658 729286 838070 606485 89292 -470256 -869649 -970293 -643406 -3990 450023
40026 450023 421413 467163 1402542 2934359 3661183 2828543 1373834 651252 772150 996082
40016 996082 1224447 2032219 3372353 4316236 4262462 3563762 2730081 1810876 892579 410588
40006 410588 428061 249063 -590833 -1431577 -1327680 -466712 59252 -205903 -592737 -472935
39996 -472935 -134247 -127699 -365923 -409397 -247119 -188228 -172845 207747 1012586 1784142
39986 1784142 2150973 2148911 1850591 1163466 209969 -546219 -873790 -1110589 -1608016 -2219869
39976 -2219869 -2717010 -3258457 -3891451 -4025056 -3224245 -2265329 -2378687 -3417283 -3875950
39967 -3875950 -3041803 -1996270 -1831330 -1956382 -1266054 -190776 -147319 -1247442 -2061705
39958 -2061705 -1826509 -1454782 -1784880 -2097902 -1353637 18935 780398 809799 1063959
39949 1063959 1731344 1759932 582288 -794729 -1095060 -391768 345771 747704 1182154
39940 1182154 1707932 1878528 1632872 1506340 1696578 1659833 1037402 364385 327982 778392
39930 778392 1054670 950935 730983 427723 -143454 -717355 -663190 78054 749104 768327
39920 768327 467042 446779 604120 335102 -448619 -1074191 -1018726 -663607 -781194 -1388551
39910 -1388551 -1556909 -611727 775402 1208705 269286 -1003895 -1572743 -1693045 -2177140
39901 -2177140 -2899218 -2955593 -2171821 -1480800 -1567934 -1914143 -1592890 -486256 692702
39892 692702 1223909 924685 177386 -378964 -463508 -514325 -1045841 -1702453 -1613788 -778244
39882 -778244 -280790 -814009 -1768052 -2241800 -2185846 -1960460 -1521458 -824753 -428458 -825110
39872 -825110 -1602572 -2057546 -2209331 -2393722 -2329702 -1568928 -507906 112780 475984 1337957
39862 1337957 2536076 3021752 2435543 1508912 754010 -65843 -866797 -881413 38226
39853 38226 808627 574239 -46908 8973 649300 952847 675468 531249 1094102 2110535
39843 2110535 2932101 3196196 3059764 2996170 3299105 3700018 3691335 3259111 2906108 2864367
39833 2864367 2788708 2417787 1995071 1754529 1532802 1239753 1175707 1463513 1676555 1506485
39823 1506485 1328247 1574711 1961900 1895126 1330554 738637 517107 864824 1822384 2919595
39813 2919595 3208051 2274060 895673 91847 -133287 -441066 -928595 -1083443 -773733
39804 -773733 -419124 -177891 264955 1005661 1678851 2033146 2201478 2303576 2260462 2039797
39794 2039797 1642126 932897 34096 -267601 720627 2392946 3236337 2691717 1869352
39785 1869352 1997800 2834086 3221993 2769593 2220407 2229110 2407377 1867541 440652 -1014340
39775 -1014340 -1596821 -1387019 -1159726 -1226038 -1128761 -590744 -53468 150659 462866 1234380
39765 1234380 1803148 1382809 454297 152875 473046 315182 -643747 -1419433 -1382888 -1220136
39755 -1220136 -1640748 -2182292 -2042464 -1254839 -285614 774110 1805165 2151131 1458288
39746 1458288 544885 507455 1273856 1870435 1845477 1601735 1521960 1587245 1782512 2162086
39736 2162086 2550639 2763965 2990132 3371600 3459245 2808532 1902584 1634385 1978725 2080245
39726 2080245 1632383 1166228 850859 128117 -1029296 -1557110 -741150 580506 1129734
39717 1129734 928204 972522 1535371 1846175 1435027 802462 497033 361969 142724 142336
39707 142336 604915 918585 291307 -886128 -1230276 -182891 1076688 1047693 -261815
39698 -261815 -1551197 -1936047 -1678080 -1339604 -1086215 -1018857 -1394481 -2085192 -2443949 -2216282
39688 -2216282 -2056062 -2559109 -3259241 -3281977 -2633425 -2042197 -1739884 -1279295 -538095 7984
39678 7984 211484 594957 1350001 1725694 1048138 -122618 -571228 21876 770178 849997
39668 849997 476527 328567 446680 277403 -240718 -297369 643877 1757744 1710401 566279
39658 566279 -73980 787435 2139163 2403350 1536690 664871 162511 -546427 -1392972
39649 -1392972 -1362749 -206620 838753 781679 319422 667648 1738380 2507072 2673598
39640 2673598 2871240 3415872 3822055 3612733 2870961 1895243 893560 105564 -253814
39631 -253814 -240033 -4428 546081 1469996 2259780 2136597 961248 -536520 -1466970
39622 -1466970 -1406465 -454586 848231 1714064 1741490 1399432 1438921 1855757 1967651 1521927
39612 1521927 1095562 1241186 1822397 2423798 2868645 3034225 2665702 1768132 825535
39603 825535 292070 149290 175586 256001 179610 -392796 -1380138 -2115697 -2139999 -1766176
39593 -1766176 -1427705 -918006 121743 1327384 1963127 1974650 1961929 2150911 2125586 1694069
39583 1694069 1345529 1557230 2109468 2381971 2070446 1477589 1300333 2043695 3286566
39574 3286566 3714680 2510531 647307 3011 1051063 2304066 2387807 1716444 1445282
39565 1445282 1631028 1458674 772399 238350 149941 114333 -49554 -44420 146283 101693
39555 101693 -233644 -401955 -312623 -437437 -837907 -899754 -483358 -403915 -1090950 -1643675
39545 -1643675 -1125839 -66135 440018 578196 1439646 2997466 3852544 3231277 2041801
39536 2041801 1483479 1587349 1697515 1567221 1312697 928639 533829 585759 1179147 1574156
39526 1574156 1137838 409392 453533 1328562 1950780 1477838 199519 -986397 -1428411
39517 -1428411 -1000658 -87231 553759 361989 -397208 -897502 -740933 -342917 -256020 -511221
39507 -511221 -792631 -901971 -833124 -675292 -642924 -927810 -1316411 -1241874 -496401 338569
39497 338569 507525 -7254 -534115 -629876 -582845 -876226 -1441482 -1744143 -1546246 -1262354
39487 -1262354 -1395492 -1836687 -2040396 -1838501 -1693662 -2020827 -2610037 -2949245 -2801850
39478 -2801850 -2186292 -1147232 18930 644110 405340 -22712 300694 1298539 2071119
39469 2071119 2333105 2692297 3261393 3077056 1591855 -136758 -729960 -395164 -463807
39460 -463807 -1320305 -1949388 -1560860 -552893 413104 1262435 1896339 1606832 -70731
39451 -70731 -2371102 -3924103 -4169245 -3592809 -2816585 -2119336 -1744444 -1927669 -2416689
39442 -2416689 -2500220 -1810739 -767146 15371 456989 867651 1272821 1235681 391703 -1005461
39432 -1005461 -2167077 -2439753 -1928107 -1368789 -1281357 -1387168 -1107210 -473370 -88285
39423 -88285 -181975 -285432 -62647 130118 -36132 -134843 324272 853686 534127 -513658
39413 -513658 -1183421 -1067336 -1084392 -1950879 -2921413 -2844899 -1865895 -1160529 -1297323 -1751630
39403 -1751630 -1920282 -1752748 -1317341 -528520 463159 1197469 1444573 1372409 1094637 586792
39393 586792 136486 224798 723262 835121 176130 -647326 -916079 -706227 -472749 -257200
39383 -257200 113671 451415 459666 297640 314368 448210 445108 434855 662062 822672 384914
39372 384914 -436627 -714308 23331 1165800 1716840 1211000 -127145 -1668385 -2677989
39363 -2677989 -2740814 -2088095 -1274454 -550333 101542 420602 -19439 -1007712 -1597802 -1163899
39353 -1163899 -177599 386321 132904 -527014 -973884 -950447 -720989 -810706 -1388796 -1881253
39343 -1881253 -1559364 -589127 5968 -317881 -826006 -489103 593241 1307979 947858
39334 947858 34907 -326533 375514 1611976 2410046 2373654 2092617 2409708 3335182 3983685
39324 3983685 3615795 2380630 945246 -168504 -694191 -561139 -78040 191921 88719
39315 88719 71555 490450 1041866 1298704 1347946 1469621 1602434 1595061 1537276 1327709 469034
39304 469034 -999011 -1930444 -1403159 -208056 111716 -537617 -824501 -177411 470228
39295 470228 440011 417881 1104002 1914562 1946422 1365688 883620 537400 -30492 -607325
39285 -607325 -707887 -471350 -358017 -271125 132140 558979 460301 60924 8954 146048
39275 146048 -278286 -1150702 -1394778 -567012 512319 1098813 1473539 2009410 2225164
39266 2225164 1520919 165778 -1193278 -2418967 -3510964 -3892254 -3006500 -1354083 -68160
39257 -68160 390263 332579 -166968 -1399445 -3040994 -3995548 -3642801 -2615753 -1932165
39248 -1932165 -1852228 -1972475 -1962021 -1718120 -1154481 -386476 64657 -209997 -819575 -874093
39238 -874093 -62685 933567 1265864 882647 454597 513140 956534 1415669 1823979 2389936
39228 2389936 3077070 3377016 2733423 1113513 -872209 -2298310 -2416014 -1175820 532276
39219 532276 1470499 1230654 611858 484482 590259 65866 -1043377 -1641405 -1108976
39210 -1108976 -175842 136698 -207047 -551812 -573155 -391124 -98122 146883 -110852 -998572
39200 -998572 -1662816 -1050892 654095 2102160 2361059 1787481 1243259 1135979 1417734
39191 1417734 1868173 2108751 1923411 1801665 2503855 3775317 4237450 3084106 1222525
39182 1222525 70944 -182562 -322604 -637855 -770951 -821618 -1436686 -2582821 -3191258
39173 -3191258 -2477859 -931064 480777 1497892 2396793 3083110 3091851 2408688 1688639
39164 1688639 1520501 1843182 2232613 2465335 2566361 2478918 2021209 1258584 699175 866953
39154 866953 1670776 2391910 2396181 1742149 1000589 598510 458419 190661 -462451 -1295455
39144 -1295455 -1717790 -1345717 -586224 -359203 -1051389 -1999780 -2251004 -1576951 -459276
39135 -459276 618651 1430682 1818014 1805554 1810495 2184783 2582898 2348130 1542808 968441
39125 968441 1017552 1131377 686878 -128513 -715814 -899730 -937281 -1013713 -1141928 -1322128
39115 -1322128 -1423211 -1106045 -230894 794793 1380325 1355179 1004570 704180 748047 1275696
39105 1275696 2028511 2364526 1870448 849268 -76212 -665077 -1031656 -1120697 -704027
39096 -704027 90000 683692 663306 254237 43676 349138 937900 1302506 1168873 726759
39086 726759 345905 167895 139786 320273 788803 1266565 1307683 1015723 1072449 1768191
39076 1768191 2471689 2458139 1864490 1384644 1383365 1793697 2535832 3462075 4148107 4313113
39066 4313113 4226948 4159908 3736882 2529815 1040527 270977 406441 744683 911079
39057 911079 1265033 1975846 2563123 2634021 2338765 1831208 1027480 211909 96249 816235
39047 816235 1557807 1682921 1586607 1888301 2400436 2580791 2512027 2686864 3134879 3442734
39037 3442734 3422461 3164597 2626887 1729437 695887 -185328 -942805 -1617639 -1868361
39028 -1868361 -1429652 -719974 -420389 -666606 -1207149 -2032804 -3106879 -3740895 -3190291
39019 -3190291 -1866580 -1024715 -1084044 -1167125 -617324 -55570 -323798 -1090485 -1312609 -723106
39009 -723106 -85701 -64487 -490550 -845560 -982811 -1127357 -1405373 -1616411 -1450521 -825577
38999 -825577 24111 745428 1053197 729105 -310127 -1701101 -2566600 -2188753 -834639
38990 -834639 414511 810959 668837 785122 1381942 1906262 1788473 1106475 386186
38981 386186 -109524 -657415 -1528670 -2347112 -2349820 -1374543 -237442 133674 -307041 -874420
38971 -874420 -1019952 -656820 131959 1153068 1918704 1920634 1164951 83580 -1013776
38962 -1013776 -1949224 -2261801 -1470084 109318 1407026 1702146 1214175 485791 -210354
38953 -210354 -655028 -606733 -363035 -733215 -1893380 -2843739 -2661936 -1808264 -1431632 -1763220
38943 -1763220 -2060816 -1926408 -1733446 -1713027 -1511524 -931212 -407963 -374058 -634246 -712408
38933 -712408 -438705 76445 665876 999881 623949 -490866 -1642470 -2028424 -1612652
38924 -1612652 -1087493 -1023695 -1298897 -1369049 -920531 -196601 265953 229057 78791 442985
38914 442985 1425998 2375916 2562072 1971888 1217092 697344 184025 -592637 -1236639 -1023263
38904 -1023263 44222 1009408 1097889 703626 765685 1419572 1932453 1940079 1974084 2497351
38894 2497351 3127229 3324964 3322004 3725757 4511783 4990160 4576357 3146527 958986
38885 958986 -1202750 -2156283 -1368670 261926 1404872 1939385 2774859 4130410 5047868
38876 5047868 4857238 4136909 3753377 3802899 4093373 4901401 6453670 8157285 9159549
38867 9159549 9445197 9769311 10720725 12356314 14440583 16439815 17561431 17519437 17160985
38858 17160985 17669916 19149032 20562499 21068048 20789950 20187194 19300251 17962274 16360957
38849 16360957 14996221 14169962 13716072 13246370 12634799 12192642 12179139 12157487 11248633
38840 11248633 9229525 6933615 5205235 3933962 2655612 1603309 1310289 1437157
38832 1437157 1002502 -146253 -996925 -749811 242214 1202572 1859368 2247673 2256177 1893883
38822 1893883 1519459 1317061 949866 171511 -632055 -988855 -1061731 -1309573 -1706447 -1800950
38812 -1800950 -1362113 -533356 474588 1435491 2015029 2024593 1698614 1490965 1736123 2571910
38802 2571910 3758406 4407382 3577314 1628555 316251 787401 2043978 2321899 1530415
38793 1530415 1136272 1830257 2685237 2853700 2772146 3062605 3333814 2949143 2215574 1864597
38783 1864597 1857900 1636402 1208732 1022833 902498 123564 -1291871 -2258355 -2034719 -1292128
38773 -1292128 -1203556 -1872760 -2314396 -1854209 -897568 -166477 270229 803310 1468349 1903939
38763 1903939 2075476 2444655 3206193 3874471 4024028 4007091 4355246 4753529 4357928 3124100
38753 3124100 2076356 2015309 2550429 2741846 2211599 1243379 216562 -571876 -797212
38744 -797212 -338611 406499 738755 185185 -1245327 -3077982 -4496120 -4796475 -4029237
38735 -4029237 -2977336 -2312709 -2084803 -2198922 -2814666 -3766229 -4097680 -2980522 -949774
38726 -949774 503898 618169 66096 -56507 598346 1552518 2064435 1622975 347382
38717 347382 -923542 -1336708 -982787 -776804 -1239960 -1836059 -1793420 -1222358 -1010708 -1723365
38707 -1723365 -2916040 -3602486 -3310812 -2595340 -2387538 -2855613 -3223864 -2893834 -2302194
38698 -2302194 -2201219 -2469742 -2341088 -1600113 -732521 49232 988538 1865581 1918019 1093096
38688 1093096 441656 671528 1162140 1148213 1047209 1604458 2367570 2254128 1338606 794929
38678 794929 1051158 1236504 760309 319115 751419 1754610 2466235 2734330 3053699
38669 3053699 3582236 3948774 3938530 3783105 3724604 3697735 3528759 3199538 2862857 2735403
38659 2735403 2931799 3264730 3285405 2669874 1505646 127057 -1153746 -2031796 -2205521
38650 -2205521 -1688479 -935765 -311057 414229 1589616 2818199 3172471 2423821 1450187
38641 1450187 1047743 873243 157657 -927195 -1427403 -1019240 -391209 -74666 216553
38632 216553 685200 792918 255535 -49359 743890 1827908 1522694 -264653 -1681696
38623 -1681696 -1418093 -368261 -101716 -666130 -924738 -449759 44776 -67548 -649390
38614 -649390 -1362264 -2125519 -2900810 -3562330 -4022466 -4108622 -3537963 -2531245 -2081592 -2775089
38604 -2775089 -3590205 -2962592 -1092012 8861 -819441 -2288204 -2477720 -1345394 -404732
38595 -404732 -460062 -815381 -633891 -42408 381306 470052 384397 124115 -388713 -885580
38585 -885580 -812645 91931 1467628 2691574 3455176 3817212 3778372 3162902 2066986
38576 2066986 1061015 603354 513830 418461 411560 687784 756962 -133506 -1727374 -2736608
38566 -2736608 -2374275 -1219786 -239614 360675 888437 1427381 1876252 2192962 2133763
38557 2133763 1335484 163587 -218875 648788 1593128 1268858 38537 -634907 -312919
38548 -312919 47694 -261186 -809979 -901812 -354363 762976 2262423 3477951 3636750
38539 3636750 2894266 2240615 2130795 2026906 1589297 1389267 1907059 2640808 2885578
38530 2885578 2764313 2808177 3047346 3208662 3369885 3705381 3907564 3546679 2801493 2256946
38520 2256946 2156898 2339334 2680489 3131700 3565104 4021606 4783150 5727372 6047916
38511 6047916 5267847 4146972 3805299 4223138 4448194 4094203 3714203 3741989 3997228
38502 3997228 4302137 4658988 4673171 3783706 2378199 1720202 2303252 3169735 3429200
38493 3429200 3544124 4306274 5336682 5668638 5320611 5136494 5273426 5010740 4149878
38484 4149878 3531371 3791943 4454551 4742891 4630726 4497796 4249859 3503371 2454422
38475 2454422 1883350 2181909 2822893 3017302 2659229 2370432 2646019 3145701 2976163
38466 2976163 1697958 -45494 -1003098 -407097 1430891 3469556 4715141 4767151 3925319
38457 3925319 2912228 2360934 2430866 2876484 3386719 3761277 3919793 4018836 4510097 5752121
38447 5752121 7486013 8945479 9550296 9266491 8314270 6928084 5518894 4635373 4486451
38438 4486451 4793971 5300539 6024127 6773973 6963747 6417685 5920745 6302327 7265863
38429 7265863 7848195 7822823 7810173 8082037 8228728 8187730 8633568 9906650 11372910 12403598
38419 12403598 13290440 14584824 16227370 18105339 20842030 25020272 29996715 34592724
38411 34592724 38883930 44285520 51805321 61197630 72011471 84441202 98738739 114753538
38403 114753538 132682648 153445864 177451376 203464083 229458075 254191107 277200810
38396 277200810 297770947 315151199 329945518 344262855 359952973 377131643 394579613
38389 394579613 410747545 423632124 430069224 426171218 409117878 378814740 338195814
38382 338195814 292224827 246301149 204747469 169919515 142196261 120621781 103703489
38375 103703489 90031166 78620830 68978840 60956380 54527862 49557158 45586757 41858712
38367 41858712 37766008 33415651 29594029 26982892 25452365 24249687 22788277 21062085
38359 21062085 19374361 17974294 17026939 16629388 16630004 16600146 16205383 15505282 14730906 13949607
38349 13949607 13193487 12707017 12662709 12751625 12562823 12348463 12774764 13733589 14111308 13213350
38339 13213350 11808991 11073636 10977911 10632549 9942279 9762205 10279428 10414289 9426964
38330 9426964 8201893 8063893 8903264 9458481 9178088 8764628 8798114 8780433 7994317 6668269
38320 6668269 5680244 5383355 5283849 4874448 4372439 4452349 5412754 6771744 7673713 7630216
38310 7630216 6884943 6148465 5994860 6377095 6619217 6032165 4758133 3867523 4233613
38301 4233613 5325810 5629147 4477075 2983608 2735825 3910350 5216332 5507831 4861302
38292 4861302 4064410 3603696 3355132 2906922 1969117 662360 -489167 -1009251 -924657
38283 -924657 -592861 -168429 446444 1182968 1758417 2100313 2396979 2611087 2397041 1747202
38273 1747202 1317812 1744587 2863661 3913764 4311645 3964567 3080622 2077049 1543496
38264 1543496 1848675 2708205 3403918 3483220 3075174 2577349 2298338 2410931 2945305 3667655
38254 3667655 4138298 4060903 3525841 2840896 2210723 1681503 1323766 1276788 1504827 1601635
38244 1601635 1053913 -185088 -1511453 -2239105 -2282025 -2047810 -1715021 -1003931 184593
38235 184593 1295665 1685131 1480523 1442012 1987114 2776144 3347246 3712777 4058146 4230794
38225 4230794 3988775 3566593 3436498 3464606 2872800 1349752 -236918 -745198 -179004
38216 -179004 332266 -49191 -1003330 -1712634 -1843638 -1555202 -971834 -134951 727376 1324839
38206 1324839 1620035 1703403 1503637 992796 531337 544367 904074 1111033 1102181 1365408
38196 1365408 2125657 2910410 3158305 2842758 2211254 1290913 54409 -1136837 -1653218
38187 -1653218 -1149263 171487 1734661 2888448 3179867 2584149 1489898 424664 -182447
38178 -182447 -114510 488358 1153049 1553291 1915104 2580429 3289836 3494087 3377667 3803865
38168 3803865 5002018 6080669 6237697 5676120 4819000 3533588 1976823 1328736 2408032
38159 2408032 4070434 4401230 3303981 2446982 2619455 2755121 2012675 1207324 1233092
38150 1233092 1396320 613065 -645673 -1026615 -394895 144523 124643 262177 1017986
38141 1017986 1806443 1989853 1740638 1552625 1677829 2362439 3805157 5423828 5964080
38132 5964080 4987336 3634302 3208886 3506333 3311187 2151783 681796 -462872 -1236040
38123 -1236040 -1584463 -1209887 -237092 610453 924119 1143635 1730822 2277353 1972240
38114 1972240 677421 -944114 -2155717 -2540754 -1892462 -333548 1402364 2324131 2064446
38105 2064446 1201345 623317 768769 1474555 2251572 2592742 2278380 1593490 1148540
38096 1148540 1339405 1978951 2476466 2381288 1819973 1408679 1578643 1961714 1736104 719784
38086 719784 -266911 -439262 -51538 109424 -139092 -398612 -564275 -844836 -1005712 -513340
38076 -513340 440466 938952 600623 -18663 -561570 -1423695 -2655363 -3280555 -2516795
38067 -2516795 -946070 364226 1282055 2278293 3225755 3482475 2806559 1395769 -487986
38058 -487986 -2094719 -2091351 -121719 2058943 2434599 1383299 920786 1492405 1415588
38049 1415588 -179400 -1798117 -1848315 -851099 -228651 -141526 163939 755607 1069636
38040 1069636 991862 773733 340749 -337916 -671623 -197378 555258 880474 1072715 1776917
38030 1776917 2665752 2925369 2689975 2769180 3197678 3328574 3225149 3590719 4256422 4145751
38020 4145751 3073216 2283435 2668822 3546875 3797392 3251460 2349405 1334572 475027
38011 475027 283734 798512 1333132 1590438 2239365 3607213 4629767 4200698 2979015
38002 2979015 2589680 3290435 3722471 3027659 1976152 1603696 1757465 1639538 1094332
37993 1094332 620427 466202 385086 181758 -26255 -138634 -289436 -585349 -817602 -603555
37983 -603555 192377 1246322 2028162 2275812 2189257 2162726 2407298 2839132 3166839 2993216
37973 2993216 2040969 520839 -838851 -1407027 -1247977 -840078 -289227 722234 2107885
37964 2107885 3053347 2968322 2412055 2438906 3126577 3494872 3079260 2793193 3595586 4869436
37954 4869436 5087502 3921418 2613740 2042134 1531828 276216 -1006712 -962922 341726
37945 341726 1494978 1755818 1744204 1906124 1570067 237367 -1150862 -1222064 41727
37936 41727 1415335 2050383 2154930 2174726 2113846 1834917 1480804 1366585 1702813 2429479
37926 2429479 3082633 2981438 1928382 590117 -241957 -617274 -1131765 -1808484 -1979824
37917 -1979824 -1369320 -569567 -132723 219585 1040150 2235214 3168708 3430662 3115739
37908 3115739 2556647 2149100 2252771 2868752 3481056 3506669 2843219 1793799 658384
37899 658384 -317153 -815710 -704630 -334259 -168648 -132603 278034 1206333 2152441 2569619
37889 2569619 2363725 1695745 752367 -11104 144866 1467204 3074370 3645623 2824224
37880 2824224 1522764 702461 272665 -465752 -1576779 -2218323 -1679467 -286909 972998
37871 972998 1511935 1519110 1408387 1296910 1151316 1100300 1282062 1535413 1578716 1448518
37861 1448518 1413848 1431177 1099005 350288 -196545 55983 891033 1632273 2101639 2647112
37851 2647112 3246878 3289759 2534142 1678798 1472850 1694518 1642470 1345009 1489991 2175987
37841 2175987 2567464 2108802 1422392 1481103 2297038 2993773 2975030 2491906 2104384 2042323
37831 2042323 2169286 2249931 2159248 2026310 2172578 2712489 3277664 3384104 2991964 2399759
37821 2399759 1703931 838061 144053 282806 1283418 2187084 2094469 1239179 549480
37812 549480 425831 542760 710256 1207117 2111389 2933246 3273787 3413806 3840319 4501135
37802 4501135 4964763 5085820 5008162 4626644 3639580 2269528 1426477 1806884 3060281
37793 3060281 4120986 4220524 3379335 2109723 964557 318077 260980 597930 1079196
37784 1079196 1645113 2297863 2767813 2571848 1531584 64237 -1207263 -2044338 -2640007
37775 -2640007 -3145690 -3373263 -3057417 -2285882 -1518789 -1185571 -1352511 -1770188 -2100382
37766 -2100382 -2042669 -1432329 -439484 402464 654752 531074 747971 1659363 2738084
37757 2738084 3152906 2761325 2274313 2408125 3042472 3312664 2530740 1020591 -32346
37748 -32346 259631 1471264 2271640 1940438 1135787 913164 1367699 1740741 1642045 1520485
37738 1520485 1870245 2537536 3037460 3154893 2989787 2704143 2434531 2217369 1857864
37729 1857864 1141516 308683 -6518 470147 1225372 1506927 1079856 261545 -520678
37720 -520678 -968033 -956909 -637318 -331735 -108027 399162 1530398 3069946 4305876
37711 4305876 4534913 3551028 1911433 675573 431745 540047 -104032 -1451768 -2185564
37702 -2185564 -1533929 -364919 144577 136306 458892 1043082 1029863 232875 -677834 -1382570
37692 -1382570 -2173450 -2901639 -2773677 -1551951 -58025 891461 1252563 1158651 486602
37683 486602 -482733 -850536 -243808 501429 500835 72994 93630 633030 1082439 1270449
37673 1270449 1569516 2050260 2326865 2217280 1904059 1468042 872452 395990 470075 1011348
37663 1011348 1445877 1497805 1487533 1730183 2060490 2131385 1903357 1706764 1965831 2819085
37653 2819085 3841443 4297354 3910704 3167802 2573424 1964866 1060662 318662 462605
37644 462605 1281490 1749905 1429579 942547 848523 870540 612073 281616 156371 -47361
37634 -47361 -616604 -1130638 -1006184 -421559 1011 184736 519185 930169 870024 347787
37624 347787 178374 855113 1791109 2159554 2039433 2144663 2650387 2923530 2473248 1648430
37614 1648430 1112849 910801 417947 -767173 -2114799 -2534199 -1498834 273826 1400819
37605 1400819 1127362 -85054 -1304157 -2169942 -2873541 -3316981 -2955548 -1724898 -573002
37596 -573002 -496073 -1264814 -1690122 -1129475 -193660 135952 -403721 -1343786 -2118345 -2418133
37586 -2418133 -2210321 -1693614 -1080160 -334625 605403 1363438 1409467 963026 951840 1675179
37576 1675179 2156193 1434022 -53563 -1128997 -1444182 -1486618 -1382509 -818426 -86475
37567 -86475 -26655 -679145 -1050301 -636895 -225471 -615652 -1399203 -1697138 -1401592 -933914
37557 -933914 -389669 217687 362410 -343374 -1143715 -783362 810817 2335456 2742401
37548 2742401 2338403 2025780 2087966 2115204 1740146 1072238 553987 552197 966910 1246242
37538 1246242 1019825 688601 1048307 2255038 3475152 3713307 2813812 1572889 1000406
37529 1000406 1451558 2313183 2594425 1984924 1168360 850891 761151 108973 -1136464
37520 -1136464 -2096430 -2162059 -1639132 -973411 -7279 1481194 2968552 3591089 3251542
37511 3251542 2787537 2966584 3658770 4115402 3846519 3084560 2453885 2288887 2342610 2151419
37501 2151419 1512607 475180 -887195 -2319301 -3168941 -2913240 -1972149 -1385555 -1432319
37492 -1432319 -1202509 -17879 1295025 1309181 -94220 -1525760 -1803973 -1164791 -597233
37483 -597233 -606495 -980266 -1330014 -1418866 -1143417 -545798 173969 799516 1200612 1296283
37473 1296283 1132706 1045721 1438220 2219727 2745614 2565312 1992130 1603664 1359036 652909
37463 652909 -745371 -2223946 -2990494 -2946396 -2663356 -2609345 -2634391 -2245573 -1243982 -1958
37453 -1958 854889 971025 453911 -368963 -1250864 -2066084 -2725031 -3213130 -3633043 -4014611
37443 -4014611 -4114148 -3637961 -2713939 -1892962 -1537098 -1417280 -1124732 -693357 -506662 -682339
37433 -682339 -920771 -1008880 -1120494 -1460772 -1909926 -2245870 -2477176 -2666699 -2605180 -2019209
37423 -2019209 -1053511 -214168 197463 319424 366466 322108 81629 -359750 -973220 -1692939
37413 -1692939 -2213905 -2098001 -1345511 -632628 -639753 -1249340 -1729944 -1650773 -1258395 -922793
37403 -922793 -587135 45729 1031821 2116002 2994463 3442616 3297239 2560375 1523312
37394 1523312 601449 2626 -324380 -421694 -196367 352579 956492 1301848 1340674 1189350
37384 1189350 797030 8885 -978345 -1536805 -1227154 -326263 517343 1018165 1339488
37375 1339488 1555231 1465073 1028900 577619 373440 268870 43435 -211837 -347547 -520360
37365 -520360 -894803 -1152987 -775057 217590 1234281 1872014 2287381 2719438 3070649
37356 3070649 3177479 3136743 3063577 2780110 2078621 1163704 538942 495346 901646 1422173
37346 1422173 1741929 1637060 1057482 224850 -411146 -384340 455524 1616884 2106291
37337 2106291 1356591 116139 -129673 1026482 2193601 1879879 528996 18240 1214689
37328 1214689 2969491 3795357 3655008 3490727 3653382 3654497 3186846 2516432 1811453 814537
37318 814537 -544921 -1735704 -2205059 -2094435 -2027074 -2291324 -2490697 -2011019 -753534
37309 -753534 562065 870437 -247884 -1992517 -3000876 -2698059 -1757186 -1101288 -826415
37300 -826415 -466946 7625 102191 -306418 -628528 -399893 28041 56987 -248970 -359599
37290 -359599 -207873 -301321 -822858 -1179638 -756800 220649 908261 735166 -162133 -1189552
37280 -1189552 -1714115 -1441682 -714020 -296616 -535539 -844068 -398735 762961 1795783
37271 1795783 2150996 2080088 1951350 1673449 1102126 505636 200044 102026 57638 218646
37261 218646 583092 565057 -258649 -1211454 -1166643 -111798 800986 911420 807709 984434
37251 984434 695482 -915180 -3051537 -3752677 -2202582 267187 1709875 1481858 366993
37242 366993 -624635 -1071045 -1050910 -816430 -643197 -721955 -1046404 -1449494 -1765456 -1934498
37232 -1934498 -1993922 -2026716 -2109410 -2268722 -2448984 -2477544 -2102766 -1242587 -283083 86874
37222 86874 -394193 -1093868 -1073120 -164374 825215 1043144 422308 -511048 -1293301 -1734237
37212 -1734237 -1775925 -1533079 -1364223 -1560146 -1980128 -2242164 -2200134 -1950992 -1468658 -647661
37202 -647661 260363 721125 638817 611520 1148559 1940858 2318399 2229596 2279766 2845479
37192 2845479 3641253 4250030 4610493 4754810 4486226 3703760 2789006 2230908 1957750
37183 1957750 1442209 473286 -537282 -1088080 -1103431 -797382 -337838 122700 301446
37174 301446 -8487 -584995 -822085 -224372 1108782 2431738 2846880 2076501 837543
37165 837543 273848 877421 2060856 2819952 2612389 1559541 195978 -686322 -322244
37156 -322244 1331329 3253666 4222091 4092835 3824291 4173822 4848169 5110540 4697954
37147 4697954 3753348 2311501 485605 -1040700 -1456509 -910804 -527826 -949258 -1328242
37138 -1328242 -373116 1802495 3561507 3607643 2376541 1234499 820219 777137 776769 935182
37128 935182 1146784 856309 -85019 -974417 -1216397 -1218342 -1675149 -2384393 -2606491 -2365651
37118 -2365651 -2416073 -2867285 -2829461 -1758136 -301664 654081 1001289 869430 -147530
37109 -147530 -2261964 -4425940 -5083776 -4008264 -2532116 -1814124 -1632071 -1168974 -336507
37100 -336507 155470 -302762 -1639421 -3211861 -4219307 -4175913 -3248450 -2110161 -1374739
37091 -1374739 -1212336 -1441890 -1757636 -1848846 -1573908 -1122531 -799862 -576950 -80354 873555
37081 873555 1946033 2606905 2655007 2316321 1928832 1577378 1001751 -23140 -1125279
37072 -1125279 -1446875 -652039 457363 868342 701222 917438 1746734 2295366 1925996
37063 1925996 1091865 327614 -668518 -2163942 -3366957 -3328035 -2443014 -1971603 -2244945
37054 -2244945 -2422766 -1997915 -1409162 -941424 -146243 1086847 1800715 1102993 -531686
37045 -531686 -1851817 -2374411 -2643103 -3157748 -3731353 -3910389 -3517471 -2704983 -1824652
37036 -1824652 -1286170 -1260149 -1468408 -1436444 -936412 -98089 730572 1051148 383060 -1301286
37026 -1301286 -3386461 -5075272 -5926950 -5824266 -4781456 -3177280 -1875539 -1535030 -1858436
37017 -1858436 -2001513 -1675172 -1352405 -1413009 -1638877 -1642695 -1275879 -486678 684895 1758186
37007 1758186 1994885 1277782 405993 182661 558230 967105 1091410 900308 350362
36998 350362 -413058 -838906 -542367 39299 106834 -432128 -848275 -557719 227201 854033
36988 854033 875024 321480 -334374 -514475 -156706 84601 -368254 -1179789 -1573420 -1496990
36978 -1496990 -1612173 -2108372 -2345432 -1914989 -1237492 -668936 187709 1603487 2823636
36969 2823636 2938807 2253082 1842064 1956591 1858692 1252716 839258 1093332 1360124 771672
36959 771672 -485548 -1444463 -1585931 -1241926 -961418 -993323 -1347712 -1914471 -2423239 -2562251
36949 -2562251 -2248773 -1683457 -1181516 -1070668 -1600301 -2639345 -3460943 -3159156 -1509170
36940 -1509170 655188 2051403 1967291 732439 -671784 -1394458 -1245501 -682441 -377041
36931 -377041 -693237 -1418210 -1952677 -1851015 -1231538 -601031 -261533 -20026 440638 1066070
36921 1066070 1486143 1461830 1042551 308719 -767168 -2073130 -3111141 -3171866 -1866578
36912 -1866578 386146 2387932 2952429 1972450 604085 99786 529495 974922 879012
36903 879012 668002 900762 1333320 1234607 365711 -747581 -1421839 -1416738 -993657 -604980
36893 -604980 -531398 -731923 -1072103 -1635751 -2566277 -3571028 -3931544 -3220000 -1789697
36884 -1789697 -401581 391945 373548 -426349 -1600282 -2404594 -2313814 -1473075 -447810
36875 -447810 277896 453606 107038 -313319 -239636 265808 492046 134230 -212208 -102627
36865 -102627 -78656 -617432 -889003 211461 2081495 2838605 1828599 395623 -181745
36856 -181745 -215580 -438730 -535262 127089 1116856 1427855 925342 309664 -106550 -645914
36846 -645914 -1355786 -1692501 -1295729 -548846 -162368 -411129 -810199 -521995 668494
36837 668494 1803381 1733289 749682 408860 1373200 2446620 2479090 2131157 2533863 3138989
36827 3138989 2604208 1314595 1042130 2014976 2300065 723559 -1337960 -2070270 -1672861
36818 -1672861 -1446963 -1557049 -1177793 -237505 422039 412981 162979 -22423 -284567 -591346
36808 -591346 -622879 -354402 -116385 -45895 16188 176782 514930 1220218 2157847 2629118
36798 2629118 2280608 1910002 2431443 3248948 2790957 756373 -1293984 -1941941 -1526843
36789 -1526843 -1280223 -1747564 -2711553 -3911665 -5001652 -5266288 -4233149 -2414258 -845621
36780 -845621 -47299 74278 -422112 -1544819 -2776903 -3149588 -2235522 -758167 83228
36771 83228 -160802 -781328 -765190 15869 686192 564590 138596 345359 1097217 1335431
36761 1335431 676558 97534 483513 1289412 1411166 793825 265474 183060 261711 537257
36751 537257 1381779 2492901 2950616 2595867 2389653 2924503 3439553 2968176 1780252
36742 1780252 920065 788211 965905 1126686 1322438 1517010 1602728 1860298 2679629 3732797
36732 3732797 4112367 3512789 2662523 2269132 2104576 1607881 939007 774875 1215706
36723 1215706 1529224 1069273 -35653 -1269486 -2348930 -3124682 -3201473 -2214865 -537397
36714 -537397 737817 844349 249568 225803 1437331 3090452 3612257 2183231 -432212
36705 -432212 -2564326 -3090617 -2188630 -754653 642452 1993391 3196494 3691533 3076710
36696 3076710 1846424 1035377 1052032 1223480 707878 -389493 -1122022 -842460 86964
36687 86964 810665 924939 647870 201525 -527846 -1532905 -2273452 -2211744 -1678914 -1668008
36677 -1668008 -2591387 -3708337 -4101575 -3810190 -3525709 -3477027 -3237353 -2529419 -1580451
36668 -1580451 -611376 433766 1469699 2111944 2199534 2038796 1868840 1519458 902397
36659 902397 403780 381597 611174 633665 364499 -12021 -406032 -640887 -276985 806016
36649 806016 1918996 2291983 2128626 2281337 2957936 3422979 3019576 1892539 657012
36640 657012 -84209 83977 1003765 1672090 1108960 -317141 -1173481 -801668 -69991
36631 -69991 29031 -383951 -792185 -1309334 -2125951 -2666937 -2352779 -1720516 -1707575 -2162916
36621 -2162916 -2215033 -1882710 -1985593 -2404672 -1889651 -116266 1348525 1017267 -493942
36612 -493942 -1373421 -887581 243196 1245546 1957077 2279509 2063783 1674304 1785960
36603 1785960 2370914 2614672 2127235 1568399 1676376 2232708 2454703 1984059 1019498
36594 1019498 -140480 -1137743 -1446608 -882754 -102481 45892 -339085 -382823 146144
36585 146144 341283 -498037 -1667483 -1898250 -1034441 -68888 382451 745030 1391621
36576 1391621 1750967 1190544 289630 355418 1696476 3112670 3338992 2459763 1537552
36567 1537552 1242199 1348866 1430594 1483800 1677244 1821042 1444184 401960 -819614
36558 -819614 -1552500 -1643243 -1552282 -1728452 -2049903 -2029986 -1452597 -565097 309885 1040695
36548 1040695 1500186 1477928 1041050 715053 923302 1374101 1426586 1040388 867911 1244789
36538 1244789 1595658 1263077 576318 477549 1150078 1684762 1366707 747435 914695 1971688
36528 1971688 2874211 2814555 2184198 1855087 1916257 1633626 565250 -784256 -1592695
36519 -1592695 -1659813 -1404054 -1102093 -593531 121880 424766 -275250 -1507727 -1962157
36510 -1962157 -1048563 206497 337656 -749478 -1785137 -1853926 -1329700 -934412 -710065
36501 -710065 -440360 -363965 -650278 -636861 425556 2036207 2863558 2579290 2270187 2699065
36491 2699065 3129296 2520407 1130390 83231 -180805 -119173 1283 443815 1156700
36482 1156700 1416265 703978 -528561 -1328260 -1216409 -481341 239806 429417 -64134
36473 -64134 -960813 -1737286 -2024735 -1855009 -1505586 -1143961 -666317 71834 830589 927970
36463 927970 -98801 -1737914 -2782486 -2581282 -1675655 -911511 -332533 524431 1550826
36454 1550826 2033586 1713733 1214086 1213134 1674432 2086016 2062968 1565801 910374 664977
36444 664977 1100134 1640749 1382313 308468 -583694 -604824 -165488 129651 474850 1310813
36434 1310813 2342881 2921419 3058483 3216733 3276441 2635077 1390318 532390 630918
36425 630918 1024851 789487 34267 -305300 244239 1110111 1408941 945032 298620 31679
36415 31679 68073 32485 -18817 300241 829775 750155 -228345 -1132569 -877504 245202
36405 245202 1079092 1346830 1814605 2669854 2931584 2000348 807916 595257 1185620
36396 1185620 1366621 615739 -447089 -1179487 -1629995 -2024402 -2232558 -2037364 -1523436
36387 -1523436 -942341 -429781 -14282 272826 412865 433713 415963 525009 910421 1425075
36377 1425075 1616152 1243054 660871 394192 459810 472121 318673 259472 317711 80919
36367 80919 -660952 -1498532 -1983450 -2331041 -3076041 -4135786 -4740385 -4450128 -3819470 -3703938
36357 -3703938 -4166031 -4527139 -4403123 -4111959 -3924518 -3548218 -2793781 -2200066 -2270124 -2439595
36347 -2439595 -1746708 -458860 36619 -748349 -1535357 -1074770 40483 262040 -733314
36338 -733314 -1706989 -1493023 -177496 1230231 1651112 662309 -944326 -1558102 -468259
36329 -468259 1043674 1215883 188802 -266362 594606 1436922 895835 -534161 -1427996
36320 -1427996 -1315612 -759007 -269322 -106902 -639803 -1871906 -2855626 -2525236 -1093435
36311 -1093435 136502 356553 -19086 -239308 -161767 -135515 -443844 -1091439 -1845139 -2358986
36301 -2358986 -2457625 -2282963 -1971504 -1352192 -288108 848111 1465628 1448105 1168994
36292 1168994 922451 781003 910671 1453362 2038975 1969064 1088380 53620 -472981
36283 -472981 -545461 -647996 -1003922 -1400719 -1467137 -912626 319799 1910489 3234701
36274 3234701 3725545 3232317 2118478 1055990 532663 405541 161705 -198771 54030
36265 54030 1275257 2542290 2617434 1622547 850012 864529 791889 -158248 -1427218 -2023786
36255 -2023786 -1960480 -1960263 -2241320 -2456975 -2519506 -2604481 -2502236 -1849417 -999772 -803818
36245 -803818 -1375365 -1883793 -1829150 -1711693 -1967543 -1976283 -876698 1044443 2564953 2991761
36235 2991761 2739241 2473640 2336519 2149357 1798158 1129532 -72987 -1628234 -2772284
36226 -2772284 -2823950 -1900534 -729110 45665 121174 -553136 -1628463 -2294706 -1950795
36217 -1950795 -981620 -394750 -625024 -1168356 -1465599 -1583134 -1803626 -2084053 -2240478
36208 -2240478 -2201030 -1753692 -566265 1108853 2271207 2275662 1645781 1173318 708452
36199 708452 -317201 -1569958 -2104317 -1875391 -1840818 -2380472 -2680949 -2104710 -1231178
36190 -1231178 -921577 -1059971 -914175 -287412 305183 316302 -409958 -1580750 -2482057
36181 -2482057 -2451139 -1654412 -968549 -793992 -571437 106971 611954 210732 -674071 -1007670
36171 -1007670 -613576 -241495 -351045 -650788 -785543 -744807 -600284 -477234 -712468 -1382453
36161 -1382453 -1800292 -1271853 -310379 -212905 -1294996 -2405280 -2449098 -1585359 -584170
36152 -584170 179139 594559 436686 -196788 -565917 -82038 899074 1616285 1874028 1889267
36142 1889267 1533987 505327 -857046 -1663193 -1482098 -694790 255689 1384970 2696147
36133 2696147 3694468 3796530 2995624 1801919 699294 -51063 -275667 -7079 269773
36124 269773 -63941 -1005428 -1796969 -1757871 -973696 70152 1153196 2147688 2522287
36115 2522287 1807469 557722 16307 534933 1079378 744637 13040 -160183 157678
36106 157678 212629 -59822 -63027 226977 129734 -567227 -1272288 -1595330 -1771412 -1844879
36096 -1844879 -1377968 -378705 354323 339426 100036 192564 300564 -29236 -434210 -312309
36086 -312309 206208 700188 1372625 2547770 3577281 3338417 1827269 309327 -269331
36077 -269331 -207945 -184174 -255937 -140414 102606 179685 43961 -150117 -398993 -820506
36067 -820506 -1326866 -1566099 -1255495 -523249 141939 376454 375177 653781 1324052 1884887
36057 1884887 1891320 1509948 1150824 887344 612737 444001 460471 262143 -636068 -2037701
36047 -2037701 -3183397 -3586397 -3331070 -2696582 -2016549 -1772517 -2177039 -2686740 -2576262
36038 -2576262 -1994922 -1738262 -1925976 -1771162 -918053 -108058 768 -124808 238097
36029 238097 784269 673613 -34431 -404296 -53386 318014 54584 -496228 -571991 -91477
36019 -91477 332965 295668 42750 -34808 8793 -155882 -533504 -717106 -464002 -45084
36009 -45084 188481 307864 534294 693549 439551 -69606 -299358 -190063 -247775 -585039
35999 -585039 -553996 222112 1047264 1028585 362134 36512 485605 1262518 1917704 2371865
35989 2371865 2348757 1341209 -424597 -1698007 -1546753 -621164 -414700 -1415223 -2607229
35980 -2607229 -2811109 -1928841 -692101 295855 893689 1143856 1142120 1097327 1127477 978171
35970 978171 269820 -902628 -1899700 -2192655 -1892210 -1549440 -1646608 -2326545 -3295877 -3850264
35960 -3850264 -3368175 -2077291 -1037859 -1017873 -1624696 -1906625 -1540331 -957696 -542366
35951 -542366 -306998 -263704 -470238 -678372 -543294 -258846 -367129 -810575 -838260 -99516
35941 -99516 808743 1205063 1118817 860437 447931 -45276 -197002 74695 62700 -763556
35931 -763556 -1778304 -1981903 -1440844 -1112905 -1466504 -2154247 -2920756 -3863056 -4726694
35922 -4726694 -4895872 -4342259 -3779572 -3594932 -3400414 -2961525 -2739347 -3011677 -3225006
35913 -3225006 -2886301 -2454432 -2542668 -2725252 -2092069 -792529 -66637 -618108 -1728906
35904 -1728906 -2277729 -2071679 -1803205 -2042066 -2636639 -2988793 -2709242 -2025111 -1548566
35895 -1548566 -1564326 -1682888 -1435144 -1033539 -1086852 -1592189 -1788385 -1219827 -429275 -237530
35885 -237530 -760012 -1571468 -2444790 -3318879 -3803090 -3482929 -2720850 -2418104 -2812745 -3206195
35875 -3206195 -3148506 -3131544 -3571638 -3795296 -2870763 -1054053 485412 1187901 1446092
35866 1446092 1506288 1068567 191985 -433161 -616898 -1174516 -2586987 -3883071 -3760873
35857 -3760873 -2377943 -1099714 -704754 -748413 -635426 -409993 -302308 -236849 -105030
35848 -105030 -20781 -49494 -66774 -39441 -76121 -113690 34826 247058 152209 -302258 -830357
35837 -830357 -1413239 -2305742 -3243140 -3322326 -2108957 -349769 897240 1439154 1792414
35828 1792414 2249733 2673539 2963915 3143377 3073024 2587369 1891484 1425508 1357214 1545193
35818 1545193 1926590 2535253 3120739 3138051 2273976 811319 -581450 -1311327 -1185794
35809 -1185794 -485879 270810 743865 930666 954682 951630 1226433 2104552 3323959 3946085
35799 3946085 3346378 2067083 1167398 867743 440278 -523358 -1359084 -1158556 6702
35790 6702 1055647 1032288 99012 -630212 -255842 936701 1832388 1808313 1331997 1076958
35780 1076958 969870 614910 213655 289527 710149 845793 670970 778617 1142163 884786
35770 884786 -235950 -1049352 -468971 896314 1548474 1111103 581852 765601 1413669
35761 1413669 1951919 2141042 1765112 512628 -1330014 -2687805 -2825834 -2302520 -2171609
35752 -2171609 -2447921 -2082585 -571398 1038019 1197518 -305340 -1997883 -2276402 -1049788
35743 -1049788 321662 563642 -288323 -1186985 -1293164 -679065 30214 379392 358418
35734 358418 192728 70435 16818 -125231 -585524 -1391862 -2164665 -2335205 -1714285 -791693
35724 -791693 -300173 -441144 -685631 -429374 293679 907706 994908 651269 142715 -505305
35714 -505305 -1387694 -2330481 -2845167 -2510596 -1355037 98267 1136644 1338146 895591
35705 895591 437568 430605 780449 1071861 1076302 845165 386147 -427858 -1472723 -2141564
35695 -2141564 -1851969 -801139 109723 296808 175148 454600 920788 548380 -947964
35686 -947964 -2307760 -2121525 -717707 173199 -350952 -1353089 -1617098 -1357759 -1604731
35677 -1604731 -2442048 -2905481 -2554060 -2138712 -2386851 -2882710 -2679431 -1558521 -165876
35668 -165876 799175 1053828 653670 3619 -162876 589619 1672183 1833248 484594
35659 484594 -1604456 -3103897 -3351567 -2624117 -1519846 -450890 385918 944942 1333596
35650 1333596 1653905 1776280 1467031 809262 272233 188625 310999 120126 -461100 -896641
35640 -896641 -673897 37357 532742 363877 -186233 -535998 -609619 -935551 -1810283 -2618886
35630 -2618886 -2386254 -1013971 453821 1025840 884475 937062 1485525 1886965 1564226
35621 1564226 833377 466478 759516 1334456 1680783 1626957 1379126 1302536 1597832 2057530
35611 2057530 2237864 1963151 1490789 1076635 657296 198693 60306 576729 1396455
35602 1396455 1705425 1167589 283243 -273635 -345650 -193164 -14891 206288 547925 1040468
35592 1040468 1649496 2255260 2692272 2837446 2602072 1898271 779366 -421122 -1316045
35583 -1316045 -1865853 -2351340 -2901388 -3261639 -3129366 -2561463 -1958417 -1727567 -1955429
35574 -1955429 -2304280 -2308815 -1927561 -1637233 -1718041 -1685471 -931579 209033 718028 290455
35564 290455 -265364 -294476 -202261 -586293 -1155893 -1300255 -1284219 -1939076 -3241154 -4033114
35554 -4033114 -3355370 -1515228 346801 1372543 1559751 1533629 1820413 2174506 1768110
35545 1768110 293751 -1413696 -2280022 -2211233 -1848365 -1440415 -791062 -163812 -218643
35536 -218643 -876534 -1187387 -669515 66915 438086 743719 1289518 1460048 544833 -1009018
35526 -1009018 -2054337 -2184162 -1933987 -1741113 -1496963 -1128465 -936190 -1190876 -1795505
35517 -1795505 -2405908 -2630950 -2258035 -1591605 -1328361 -1706421 -2070320 -1757397 -1067997
35508 -1067997 -714263 -629023 -171844 628825 1008881 758411 655794 1276117 2122580 2367440
35498 2367440 1850998 924524 -148742 -1157262 -1744474 -1747451 -1468006 -1256823 -1094382
35489 -1094382 -831051 -465808 97454 1119619 2441160 3233459 2848274 1652781 552120
35480 552120 -78574 -506122 -907013 -1102480 -1010338 -894837 -1056264 -1494823 -1876144 -1710346
35470 -1710346 -752508 590896 1511896 1681011 1535393 1403600 859728 -444849 -1728624
35461 -1728624 -1757944 -517042 669124 853040 521278 588262 1028600 1086878 430301 -533701
35451 -533701 -1340009 -1906267 -2201161 -1865628 -484745 1729030 3683320 4125504 2833769
35442 2833769 960563 -96908 -107261 21734 -409900 -1080970 -1315308 -1046633 -740573
35433 -740573 -668860 -694268 -643384 -496956 -206115 374690 1257700 2134662 2478696 1888980
35423 1888980 525442 -723286 -782530 596467 2464628 3592804 3725118 3654435 4063903
35414 4063903 4624317 4408723 3009036 1039021 -417496 -749848 -281904 92893 -224082
35405 -224082 -937847 -1147919 -308900 1146106 2233282 2387707 1840148 1107164 426934
35396 426934 -195682 -706709 -1043980 -1262918 -1324065 -935935 3519 938279 1132576 639834
35386 639834 276563 507957 901095 921479 705897 638239 656959 509554 286680 109665
35376 109665 -348515 -1308221 -2102016 -1796743 -571352 349472 273156 -206658 -261478 102415
35366 102415 402355 473089 411395 189941 -179277 -416785 -328022 -115055 -1955 143450
35356 143450 478617 812689 936367 985252 1054951 808107 6739 -831313 -945121 -404629
35346 -404629 -45445 -263466 -436032 200077 1428841 2105422 1279583 -794388 -2756456
35337 -2756456 -3347907 -2591769 -1617853 -1282507 -1331639 -1134692 -736343 -599158 -593254 -8525
35327 -8525 1334888 2588810 2764833 1797805 533906 -114228 115583 763805 1198442
35318 1198442 1324547 1655598 2503621 3305543 3159822 1980722 701179 272461 793655
35309 793655 1644928 2095842 1706802 534188 -837458 -1679533 -1693155 -1139780 -511211
35300 -511211 -281986 -770487 -1779495 -2456350 -2060152 -930830 -176795 -303436 -717311
35291 -717311 -777201 -726105 -1198794 -2271784 -3428735 -4136573 -4100325 -3284759 -2064335 -1068580
35281 -1068580 -532811 -73254 620067 1268018 1546690 1687295 2000931 2210868 1926349
35272 1926349 1485729 1561678 2074679 2310575 2115782 2121533 2578823 2797554 2192396 1245834
35262 1245834 857676 1164143 1604565 1908903 2384115 3188357 3779118 3305816 1489065
35253 1489065 -872338 -2286508 -1755221 188304 1825656 1889234 688480 -577097 -1237835
35244 -1237835 -1397924 -1098146 -116939 1226752 1875124 1175418 -252006 -1343362 -1900159
35235 -1900159 -2386736 -2707862 -2152607 -722838 380740 145927 -971716 -1784404 -1944405
35226 -1944405 -2034748 -2355351 -2505582 -2242380 -1945128 -1922024 -1881738 -1477629 -877701 -400304
35216 -400304 -42770 201005 38377 -526928 -713110 170220 1580860 2272126 1925891
35207 1925891 1458350 1604014 2042214 2227796 2236904 2214645 1705627 358287 -1154699 -1831919
35197 -1831919 -1750732 -1842477 -2274389 -2080873 -755981 709624 1083061 589352 546253 1592663
35187 1592663 3080919 4150210 4601792 4541007 3880800 2665634 1472145 965648 1137563
35178 1137563 1278413 702056 -568159 -1677254 -1484773 411744 3008876 4597848 4431294
35169 4431294 3416791 2871288 2979149 2987755 2598816 2387812 2803156 3439397 3577680 2997056
35159 2997056 2011693 1096535 717445 1151743 2142914 2960661 3064657 2536260 1713481
35150 1713481 706203 -465304 -1502367 -1927921 -1489643 -344860 986837 1800845 1672784
35141 1672784 916987 252333 -140265 -764119 -1758991 -2334813 -1851732 -970473 -873001 -1548950
35131 -1548950 -1794157 -995774 -4845 160201 -259088 -267274 361066 766219 184153 -1064390
35121 -1064390 -1926778 -1702533 -607352 617940 1440247 1783022 1691662 1075159 -39790
35112 -39790 -1190693 -1713422 -1323391 -351706 536580 775946 230968 -713987 -1526881 -2124007
35102 -2124007 -2844782 -3655037 -3818952 -2849592 -1440203 -769858 -1035337 -1389984 -1277327
35093 -1277327 -982241 -708941 -18431 1311924 2531907 2665117 1670605 372948 -471963
35084 -471963 -616041 -140346 645492 1254790 1368304 1076007 605641 50275 -438537 -539352
35074 -539352 -163781 328421 626233 859653 1199415 1486495 1658517 2070959 2836411 3287045
35064 3287045 2807709 1859847 1344467 1172196 444341 -920999 -1757652 -1196510 155458
35055 155458 1069259 1157132 983948 1122571 1590264 2018614 2034464 1595647 1107010 990130
35045 990130 1052415 635745 -443327 -1491084 -1745612 -1278377 -803851 -839032 -1310555 -1768969
35035 -1768969 -1750132 -1136427 -383634 -185812 -723436 -1472830 -1935517 -2255452 -2854954 -3741663
35025 -3741663 -4507530 -4821541 -4610180 -3906001 -2844846 -1763644 -1059547 -914388 -1157207
35016 -1157207 -1263974 -587421 1000063 2608491 2952050 1720416 -57709 -1229451 -1615210
35007 -1615210 -1633679 -1473165 -1180642 -1039370 -1148546 -985343 -110497 956811 1310413
34998 1310413 907761 497836 450989 457263 306678 116253 -246708 -1088332 -2066990 -2269533
34988 -2269533 -1374968 -47787 1025798 1748048 2051791 1591320 383685 -975762 -2082860
34979 -2082860 -2936339 -3110877 -1821513 535746 1999569 1222085 -772457 -2080108 -2425391
34970 -2425391 -2902468 -3799964 -4243813 -3874526 -3370413 -3092555 -2532176 -1489228 -636570
34961 -636570 -409664 -339258 -31081 109405 -268891 -736280 -897628 -1166094 -1915222 -2472585
34951 -2472585 -1869355 -256828 1223605 1789117 1594091 1176522 955213 1143505 1631563
34942 1631563 2059515 2354605 2872622 3607912 3802676 3029827 2138329 2137378 2488440 1739279
34932 1739279 -155610 -1488518 -1188601 -335044 -488096 -1466315 -1877086 -1329615 -926853
34923 -926853 -1573315 -2755558 -3285206 -2655481 -1398134 -518116 -779057 -2162952 -3780773
34914 -3780773 -4582910 -4370160 -3877617 -3705934 -3509601 -2586235 -1017608 294787 747467
34905 747467 703588 826557 1141847 1181835 873605 757476 1223395 1947336 2333605 2230395
34895 2230395 1904146 1508505 952282 225875 -498448 -1109753 -1589946 -1777745 -1464033
34886 -1464033 -844827 -514386 -766021 -1197080 -1305638 -1200102 -1295283 -1498971 -1277727 -583367
34876 -583367 -146046 -543942 -1370130 -1710741 -1216874 -313757 487403 1034288 1332003 1371084
34866 1371084 1291285 1351210 1542452 1516885 1098783 616555 487347 669638 778361 602172
34856 602172 278945 67986 129637 403982 564424 285544 -285307 -584378 -352204 50404
34846 50404 324058 765226 1616485 2323300 2188034 1515170 1260101 1613824 1814296 1428461
34836 1428461 919563 720204 602631 288705 -122180 -657695 -1526175 -2267625 -1859445
34827 -1859445 -313069 833973 513559 -270518 92400 1520773 2673259 3081958 3377554
34818 3377554 3672631 3293961 2242367 1497228 1511544 1617500 1346095 1184911 1466172
34809 1466172 1565075 952319 203777 132960 506024 415743 -444246 -1562427 -2398923 -2785936
34799 -2785936 -2670540 -1957641 -689853 747876 1606231 1167357 -442145 -1974709 -2168396
34790 -2168396 -1094477 173751 1064225 1800121 2261234 1764111 374630 -659258 -445425
34781 -445425 411489 794923 388039 -559250 -1833725 -2897555 -2879864 -1872957 -1381457
34772 -1381457 -2382336 -3668913 -3356665 -1467199 310567 1025243 1188711 1240799 777681
34763 777681 -393978 -1608389 -2207888 -2272872 -2173072 -2043496 -1912409 -1759930 -1321413 -382486
34753 -382486 672403 1123210 717693 -221072 -1262373 -1915088 -1629680 -554310 113947
34744 113947 -461146 -1331956 -951099 450555 1091614 273500 -744563 -832613 -418737
34735 -418737 -200602 112128 797627 1065309 189772 -1116865 -1621013 -1275888 -940804
34726 -940804 -859123 -524023 174486 721790 904678 1091876 1428080 1422357 632720 -622498
34716 -622498 -1527866 -1654277 -1421010 -1552198 -2060823 -2111227 -1225536 -232045 -306064 -1296821
34706 -1296821 -1949937 -1779536 -1616617 -2024638 -2308344 -1687415 -501243 446938 938574
34697 938574 1058247 663319 -128974 -672098 -750754 -1043227 -1844551 -2190037 -1234454 298845
34687 298845 1173781 1410012 1720197 1841742 965204 -512176 -1231760 -836422 -273621
34678 -273621 -97672 118596 488554 327994 -611926 -1628313 -2248504 -2839747 -3561561
34669 -3561561 -3790053 -3204780 -2492589 -2255753 -2002351 -956436 734445 2268796 3173921
34660 3173921 3451903 3204600 2636374 2037579 1361219 251677 -1170528 -2101594 -2027994
34651 -2027994 -1344739 -594876 255593 1250568 1839065 1595040 1024243 816445 656753
34642 656753 -327594 -2109057 -3627997 -4155624 -4026804 -3830317 -3494668 -2527612 -852213
34633 -852213 871118 1704343 1244175 105446 -554482 -225443 405518 370545 -341699
34624 -341699 -911025 -900945 -745037 -906055 -1112470 -802528 -3002 675620 832607 689157
34614 689157 658835 826450 1033094 1238233 1491010 1643034 1454039 1017649 708854 579855
34604 579855 217984 -533146 -1126612 -1015062 -472500 -180083 -214169 -37712 620978 1483073
34594 1483073 2248688 2791793 2851152 2204516 1232643 661614 627786 619674 396012 193882
34584 193882 -78745 -906671 -2098323 -2647513 -2220100 -1810293 -2122195 -2198701 -784040
34575 -784040 1528058 2768779 2056769 495114 -425251 -380499 -28623 -76892 -789870
34566 -789870 -1847275 -2496851 -2296782 -1766355 -1832860 -2635559 -3406899 -3536107 -3147218 -2559753
34556 -2559753 -1831328 -1038135 -414186 81611 839313 1911490 2658811 2424899 1276147
34547 1276147 -196994 -1526233 -2546553 -3216283 -3592139 -3830019 -3931379 -3589292 -2542963
34538 -2542963 -1071739 61732 265435 -291445 -804636 -655292 -84952 151726 -175843
34529 -175843 -460641 -184756 288958 306816 -57972 -213620 -60317 -33618 -145556 223239
34519 223239 1320029 2435538 2672149 1881121 610152 -455586 -814748 -401553 236101
34510 236101 450723 366982 700685 1513747 1865630 1122785 -87227 -801110 -916645 -731316
34500 -731316 30218 1655950 3307076 3658938 2667472 1608991 1257552 1122304 751999
34491 751999 615162 1086180 1598238 1638404 1722151 2373224 2856131 2188023 988088 867881
34481 867881 1982396 2654740 1854752 693928 636155 1329714 1370098 501647 -259438 -415656
34471 -415656 -591279 -1209827 -1676936 -1299819 -242112 850880 1553721 1625792 912992
34462 912992 -235926 -966136 -822622 -244313 257985 877369 1873723 2669440 2417305
34453 2417305 1253018 183630 -193702 -107054 207456 847391 1550496 1516876 452040
34444 452040 -793572 -1225039 -964823 -900797 -1307661 -1523107 -1062498 -422375 -393293 -922356
34434 -922356 -1181464 -758371 -285603 -568725 -1380422 -1633500 -757813 600046 1448567
34425 1448567 1550632 1277073 769670 -141553 -1307492 -2140933 -2248303 -1813510 -1280616
34416 -1280616 -959313 -960361 -1188408 -1349045 -1236033 -993190 -810953 -493008 233097 1064035
34406 1064035 1353248 1032220 685657 573099 257866 -470128 -972607 -618274 213699
34397 213699 623941 422040 257816 637179 1337505 1795745 1669265 1014004 248898 -77091
34387 -77091 189939 527571 292327 -440811 -903828 -558638 262091 732591 387542 -480088
34377 -480088 -1198141 -1475827 -1772906 -2748936 -4288597 -5369006 -5157643 -4030737 -3173797
34368 -3173797 -3311851 -4168983 -5027720 -5355190 -4900461 -3712164 -2294933 -1402795 -1392355
34359 -1392355 -1921057 -2403709 -2566042 -2442857 -2114818 -1693551 -1382953 -1279693 -1192064 -876434
34349 -876434 -389901 -7107 138875 95277 -166989 -718570 -1321977 -1474482 -1031329 -519956
34339 -519956 -502905 -794553 -725775 -155355 252850 -70201 -813929 -1193834 -873693 -174649
34329 -174649 411851 554610 82545 -915625 -1991039 -2675890 -2958678 -3153368 -3322718
34320 -3322718 -3157735 -2469648 -1522677 -835734 -850502 -1675923 -2816333 -3284689 -2508392
34311 -2508392 -1145697 -470267 -846670 -1364960 -1141415 -375465 158846 55716 -682700
34302 -682700 -1930553 -3183506 -3532665 -2640916 -1483696 -1396504 -2468737 -3482915 -3395784
34293 -3395784 -2322799 -1080935 -324642 -225300 -534344 -794581 -745595 -541681 -386593
34284 -386593 -168425 195580 349532 6959 -343435 35893 953952 1423683 1058242 506349
34274 506349 244612 -190902 -1244768 -2362872 -2703772 -2309833 -1777661 -1138275 8091
34265 8091 1352772 1858359 1156552 208827 96470 659113 889647 378503 -265876 -418304
34255 -418304 -289178 -517849 -1241361 -1920098 -2018877 -1598299 -1190329 -1240445 -1705683 -2081197
34245 -2081197 -1802935 -767145 486973 1228821 1241554 987008 1035511 1474074 1943615
34236 1943615 2084934 1805918 1237710 589568 -17603 -664433 -1470497 -2253430 -2566509
34227 -2566509 -2253627 -1766724 -1675343 -1995737 -2274089 -2222970 -1959620 -1642000 -1184289 -437170
34217 -437170 494333 1167957 1043952 -4080 -1306818 -1832740 -1315179 -678638 -886796
34208 -886796 -1561782 -1366091 228819 2190563 3149168 2813824 1833858 757278 -305027
34199 -305027 -1219255 -1662075 -1516320 -1041215 -488209 178993 981949 1558885 1425649 599043
34189 599043 -343882 -961303 -1437363 -2142312 -2954538 -3411794 -3357689 -2909757 -1894390 -67010
34179 -67010 1968014 2933769 2464366 1730966 1783243 1994015 1165667 -337265 -867237 142738
34169 142738 1332579 1241931 12539 -1132866 -1320957 -533016 633877 1310836 1049480
34160 1049480 490099 747140 1878687 2675850 2284271 1238549 447803 -15672 -513895
34151 -513895 -1010549 -1367605 -1789897 -2205367 -1894674 -670158 197534 -624483 -2571459
34142 -2571459 -3781557 -3475820 -2572800 -1968919 -1467901 -728266 -145674 -172102 -516802
34133 -516802 -658122 -656741 -912602 -1447216 -1890915 -1991258 -1811964 -1556429 -1377725 -1247980
34123 -1247980 -974422 -513758 -194165 -329472 -721171 -968873 -1192550 -1884473 -3002304
34114 -3002304 -3826836 -3922848 -3684223 -3647101 -3771169 -3745322 -3543783 -3251287 -2698132 -1748251
34104 -1748251 -733959 -156329 -46985 15007 290046 563285 460147 -76488 -630667
34095 -630667 -624657 84234 912984 1081494 482590 -224587 -442587 -238211 -12797 43370
34085 43370 -79206 -453229 -1073467 -1637568 -1764634 -1364785 -653446 37240 340746 11564
34075 11564 -783986 -1538646 -1951006 -2166925 -2315297 -2168389 -1584818 -958610 -790557 -1035024
34065 -1035024 -1307804 -1523836 -1796644 -1844532 -1142788 237344 1475492 1872818 1484670
34056 1484670 784650 165174 -70856 226600 647509 365982 -805666 -1884936 -1865045
34047 -1865045 -1137809 -987332 -1676587 -1939521 -777926 994015 1741134 1131091 411789
34038 411789 648440 1536779 2196112 2378336 2362987 2172231 1604092 893415 690112 1244691
34028 1244691 2006545 2195605 1567204 548721 -193357 -276764 156027 683072 1105460
34019 1105460 1524895 1832433 1533224 529908 -226676 402243 2191733 3539137 3244815
34010 3244815 1762667 398459 -175142 -176080 -12084 11938 -459004 -1567585 -2789971
34001 -2789971 -3282399 -2834794 -2122227 -1894432 -2235185 -2736664 -3057504 -3071088 -2727031 -2110601
33991 -2110601 -1550024 -1315234 -1133685 -311276 1404557 3225768 3934256 3159589 1779006
33982 1779006 923295 855062 1015607 856927 266422 -581461 -1313518 -1427527 -785174 26801
33972 26801 357862 438505 974953 1785479 1760349 553126 -583259 -366161 759245 1286459
33962 1286459 656589 -296734 -692679 -487172 -20509 492947 857939 912456 809629 799334
33952 799334 728138 340339 34019 528779 1640767 2242925 1811908 1215602 1407328 2040507
33942 2040507 2134806 1608393 1231168 1238300 910536 -263600 -1659504 -2150896 -1419790 -333212
33932 -333212 -10474 -602590 -1109837 -554769 789042 1746866 1826252 1787747 2272310 2566519
33922 2566519 1559922 -442871 -1869828 -1850930 -1110664 -660400 -494728 -131130 240573
33913 240573 -51532 -1051932 -1922018 -1842008 -813567 446524 1188110 1241055 1079760
33904 1079760 1178276 1316905 906740 83737 -173204 530428 1120515 461092 -774873
33895 -774873 -822710 556698 1448813 339023 -1761096 -2698002 -2010128 -1211696 -1469620
33886 -1469620 -2184212 -2144079 -1169697 -84005 370495 40039 -830547 -1726017 -1959482
33877 -1959482 -1156694 287426 1480995 1768486 1076642 -270921 -1775453 -2903998 -3377730
33868 -3377730 -3378863 -3254845 -3067150 -2727505 -2497052 -2834865 -3589669 -3866424 -3103284 -1891014
33858 -1891014 -1170943 -880936 -120242 1358148 2622006 2818521 2252427 1709985 1327433
33849 1327433 853971 558990 895415 1426956 1168056 142663 -468642 -165616 -45965
33840 -45965 -1071595 -2292982 -2001557 -243729 1096797 771315 -405190 -923288 -449981
33831 -449981 201082 319180 -82195 -545529 -615381 -210031 209630 114426 -304772 -242753
33821 -242753 617269 1600244 1954621 1764111 1525521 1333417 1076849 1021477 1434964 1834380
33811 1834380 1399013 171706 -827244 -850187 -246566 165364 88215 -171665 -283088 -235651
33801 -235651 -222391 -353299 -458884 -192275 569970 1502474 2152019 2355992 2157281 1538236
33791 1538236 593525 -248973 -690988 -1129267 -2138822 -3382872 -3769987 -2946655 -1917764
33782 -1917764 -1691093 -1904920 -1511591 -432953 358368 381537 394649 1250906 2647707
33773 2647707 3576140 3653782 3352252 3001709 2320094 1232563 529298 1010843 2208061
33764 2208061 2757299 2189565 1574704 1923931 2619813 2257780 719887 -578096 -596998
33755 -596998 70857 241791 -293955 -842886 -952379 -780582 -532316 -181012 238255 552856
33745 552856 735933 896061 958591 723846 276000 -54983 -215761 -494809 -903099 -930149
33735 -930149 -245381 700402 1203354 1207958 1171787 1129855 527092 -794523 -1951750 -1830146
33725 -1830146 -357898 1410533 2409879 2445271 2024143 1696228 1656753 1698686 1379427 418296
33715 418296 -918557 -1957844 -2257338 -1997225 -1676603 -1584123 -1658615 -1696473 -1557082 -1281370
33705 -1281370 -1102128 -1208393 -1445871 -1446249 -1131610 -858148 -954361 -1377406 -1942308 -2554205
33695 -2554205 -3027875 -3081640 -2828767 -2873254 -3473042 -3972190 -3630052 -2711067 -2047365 -1714282
33685 -1714282 -1021492 93219 577699 -357005 -1988559 -2802209 -2179341 -933083 -336553
33676 -336553 -939801 -2190244 -2932920 -2382877 -823914 691983 1393987 1400290 1281902
33667 1281902 1326601 1386989 1221387 803013 405323 398908 769470 924271 375295 -402409
33657 -402409 -348628 781115 1976568 2272013 1924398 1771736 1889514 1647592 949743
33648 949743 624286 1347887 2676283 3488268 3200764 2299058 1714381 1843805 2261451
33639 2261451 2344099 1990697 1565395 1293135 1044426 679138 209532 -432942 -1361002 -2316945
33629 -2316945 -2748220 -2546984 -2279465 -2343924 -2325320 -1665379 -664566 -234309 -726376 -1505763
33619 -1505763 -1777776 -1529269 -1503875 -2318295 -3653757 -4443288 -4039344 -3025282 -2453680
33610 -2453680 -2421027 -2085198 -1137804 -362710 -366557 -660465 -646815 -691689 -1337552 -2131042
33600 -2131042 -2298167 -2110865 -2418246 -3080240 -3066898 -2068551 -866264 -37226 570435
33591 570435 888451 341124 -1024347 -2111311 -2075200 -1314081 -655232 -262635 112105
33582 112105 453375 680289 1043244 1762194 2606545 3207502 3402538 3015220 1849803
33573 1849803 250515 -915886 -1246825 -1238976 -1402787 -1615402 -1763936 -2209915 -2941289
33564 -2941289 -3011268 -1687197 373162 1894002 2402655 2100035 1019840 -572733 -1533536
33555 -1533536 -1000235 48970 -137362 -1453893 -1907075 -551251 1044696 1003041 -431117
33546 -431117 -1627062 -1784487 -1323986 -725111 -127474 221250 142238 46679 454083 1082169
33536 1082169 1197237 800257 635938 972392 1222768 1012298 822705 1151258 1680244
33527 1680244 1823663 1612084 1431589 1220191 574366 -493290 -1503127 -2177214 -2615564
33518 -2615564 -2794375 -2454341 -1625864 -757736 -125281 420643 912080 1038282 834039
33509 834039 1009580 1960459 2869464 2598442 1292952 256330 219701 608089 732439
33500 732439 804549 1225080 1579047 1129274 -30980 -1045358 -1381829 -1245816 -969834
33491 -969834 -581756 -68954 403970 714955 904593 939028 612021 -159863 -1086821 -1650178
33481 -1650178 -1462568 -568728 474859 930154 506857 -380312 -1139696 -1652065 -2146885
33472 -2146885 -2578440 -2525722 -1766632 -647344 229483 500898 203836 -337135 -716813
33463 -716813 -727841 -518125 -379991 -381002 -287563 203136 1227857 2579300 3604621 3536924
33453 3536924 2284953 772510 125496 567239 1412163 1983696 2071414 1595135 486647
$$ [...]
##END NTUPLES=NMR SPECTRUM
##END=
