##TITLE=31Pdec_DE_128H
 D2O, 24 sc
 20.2.2026
##JCAMPDX= 6.0         $$ Bruker NMR JCAMP-DX V2.0
##DATA TYPE= NMR SPECTRUM
##DATA CLASS= NTUPLES
##ORIGIN= UXNMR, Bruker Analytische Messtechnik GmbH
##OWNER= root
$$ XWIN-NMR		Version 3.5
$$ Fri Feb 20 14:00:01 2026 Russian Standard Time (UT+4h)  she@DPX200
##.OBSERVE FREQUENCY= 81.013821
##.OBSERVE NUCLEUS= ^31P
##.ACQUISITION MODE= SIMULTANEOUS
##.ACQUISITION SCHEME= undefined
##.AVERAGES= 24
##.DIGITISER RES= 17
##SPECTROMETER/DATA SYSTEM= spect
##.PULSE SEQUENCE= zgpg30
##.SOLVENT NAME= DMSO
##.SHIFT REFERENCE= (INTERNAL, DMSO, 0, 198.062)
##AUDIT TRAIL= $$ (NUMBER, WHEN, WHO, WHERE, WHAT)
$$ ##TITLE= Audit trail, XWIN-NMR		Version 3.5
$$ ##JCAMPDX= 5.01
$$ ##ORIGIN= Bruker BioSpin GmbH
$$ ##OWNER= she
$$ F:/spectra/data/she/nmr/P31/2/pdata/1/auditp.txt
$$ ##AUDIT TRAIL=  $$ (NUMBER, WHEN, WHO, WHERE, WHAT)
(   1,<2026-02-20 13:58:22.40 +0400>,<she>,<DPX200>,
      <created by zg, POWCHK disabled, PULCHK disabled
       configuration hash MD5:
       00 E9 B6 7A A2 85 ED C7 34 08 36 98 17 FE 4E 26
       data hash MD5: 32K
       25 1C 89 20 BF 73 F4 7A 1A 56 5B D3 1C 1A 71 D3>)
(   2,<2026-02-20 13:58:25.45 +0400>,<she>,<DPX200>,
      <Start of raw data processing
       efp BC_mod = 2 LB = 1.5 FT_mod = 6 PKNL = 1 PHC0 = 1408.868 PHC1 = 1.900681 SI = 64K 
       data hash MD5: 64K
       57 90 71 FC 54 66 27 37 9C 56 02 F1 28 46 AA D8>)
(   3,<2026-02-20 13:58:42.62 +0400>,<she>,<DPX200>,
      <pk PHC0 = 4.67556 PHC1 = 2.6 
       data hash MD5: 64K
       52 D8 FF 3E A2 FC CB 9E 87 BB 21 0C 4B CC 76 34>)
$$ ##END=
$$ 
$$ hash MD5
$$ F0 B8 87 A5 A0 F9 BD 2E CC 43 17 16 B4 0D FB 0C
##$RELAX= 
##$RELAX= 
##$RELAX= 
##$RELAX= 
##$RELAX= 
##$RELAX= 
##$RELAX= 
##$RELAX= 
$$ Bruker specific parameters
$$ --------------------------
##$DU= <F:/spectra>
##$EXPNO= 2
##$NAME= <P31>
##$PROCNO= 1
##$TYPE= <nmr>
##$USER= <she>
##$AMP= (0..31)
100 100 100 100 100 100 100 100 100 100 100 100 100 100 100 100 100 100 
100 100 100 100 100 100 100 100 100 100 100 100 100 100 
##$AQSEQ= 0
##$AQ_mod= 1
##$AUNM= <au_zg>
##$AUTOPOS= <>
##$BF1= 81.014009
##$BF2= 200.13
##$BF3= 200.13
##$BF4= 200.13
##$BF5= 200.13
##$BF6= 200.13
##$BF7= 200.13
##$BF8= 200.13
##$BYTORDA= 1
##$CFDGTYP= 0
##$CFRGTYP= 5
##$CHEMSTR= <none>
##$CNST= (0..31)
1 1 145 1 1 1 1 1 1 1 1 1 1 1 1 1 1 1 1 1 1 1 1 1 1 1 1 1 1 1 1 1 
##$CPDPRG= <waltz16>
##$CPDPRG1= <>
##$CPDPRG2= <waltz16>
##$CPDPRG3= <>
##$CPDPRG4= <mlev>
##$CPDPRG5= <mlev>
##$CPDPRG6= <mlev>
##$CPDPRG7= <mlev>
##$CPDPRG8= <mlev>
##$CPDPRGB= <>
##$CPDPRGT= <>
##$D= (0..31)
0 1 0 0 0 0 0 0 0 0.06 0 0.03 2e-05 3e-06 0 0 0.0002 0 0 0 0 0 0 0 0 0 
0 0 0 0 0 0 
##$DATE= 1771581501
##$DBL= (0..7)
120 120 120 11 120 120 24 19 
##$DBP= (0..7)
150 150 150 150 150 150 150 150 
##$DBP07= 0
##$DBPNAM0= <>
##$DBPNAM1= <>
##$DBPNAM2= <>
##$DBPNAM3= <>
##$DBPNAM4= <>
##$DBPNAM5= <>
##$DBPNAM6= <>
##$DBPNAM7= <>
##$DBPOAL= (0..7)
0.5 0.5 0.5 0.5 0.5 0.5 0.5 0.5 
##$DBPOFFS= (0..7)
$$ [...]
##$SUBNAM2= <"">
##$SUBNAM3= <"">
##$SUBNAM4= <"">
##$SUBNAM5= <"">
##$SUBNAM6= <"">
##$SUBNAM7= <"">
##$SUBNAM8= <"">
##$SUBNAM9= <"">
##$SW= 400.765351723535
##$SWIBOX= (0..15)
0 1 3 0 0 0 0 0 0 0 0 0 0 0 0 0 
##$SW_h= 32467.5324675325
##$TD= 32768
##$TD0= 1
##$TE= 0
##$TE2= 300
##$TE3= 300
##$TEG= 300
##$TL= (0..7)
0 120 53 12 22 120 120 120 
##$TP= (0..7)
150 150 150 150 150 150 150 150 
##$TP07= 0
##$TPNAME0= <>
##$TPNAME1= <>
##$TPNAME2= <>
##$TPNAME3= <>
##$TPNAME4= <>
##$TPNAME5= <>
##$TPNAME6= <>
##$TPNAME7= <>
##$TPOAL= (0..7)
0.5 0.5 0.5 0.5 0.5 0.5 0.5 0.5 
##$TPOFFS= (0..7)
0 0 0 0 0 0 0 0 
##$TUNHIN= 0
##$TUNHOUT= 0
##$TUNXOUT= 0
##$USERA1= <user>
##$USERA2= <user>
##$USERA3= <user>
##$USERA4= <user>
##$USERA5= <user>
##$V9= 5
##$VALIST= <valist>
##$VCLIST= <CCCCCCCCCCCCCCC>
##$VD= 0
##$VDLIST= <DDDDDDDDDDDDDDD>
##$VPLIST= <PPPPPPPPPPPPPPP>
##$VTLIST= <TTTTTTTTTTTTTTT>
##$WBST= 1024
##$WBSW= 4
##$XGAIN= (0..3)
0 0 0 0 
##$XL= 0
##$YL= 0
##$YMAX_a= 5957
##$YMIN_a= -6345
##$ZGOPTNS= <>
##$ZL1= 120
##$ZL2= 120
##$ZL3= 120
##$ZL4= 120
##$ABSF1= 0
##$ABSF2= 0
##$ABSG= 0
##$ABSL= 0
##$ALPHA= 0
##$AQORDER= 0
##$ASSFAC= 0
##$ASSFACI= 0
##$ASSFACX= 0
##$ASSWID= 0
##$AUNMP= <proc_1d>
##$AZFE= 0.1
##$AZFW= 0.5
##$BCFW= 0
##$BC_mod= 2
##$BYTORDP= 0
##$COROFFS= 0
##$CY= -3
##$DATMOD= 1
##$DC= 0
##$DFILT= <>
##$DTYPP= 0
##$F1P= 0
##$F2P= 0
##$FCOR= 1
##$FTSIZE= 65536
##$FT_mod= 6
##$GAMMA= 0
##$GB= 0
##$INTBC= 1
##$INTSCL= 9.790993e-09
##$ISEN= 30
##$LB= 1.5
##$LEV0= 0
##$LPBIN= 0
##$MAXI= 10000
##$MC2= 0
##$MEAN= 0
##$ME_mod= 0
##$MI= 50
##$NCOEF= 0
##$NC_proc= -8
##$NLEV= 6
##$NOISF1= 182.463
##$NOISF2= 159.3651
##$NSP= 0
##$NTH_PI= 0
##$NZP= 0
##$OFFSET= 198.0616
##$PC= 4
##$PHC0= 1413.544
##$PHC1= 4.500681
##$PH_mod= 1
##$PKNL= yes
##$PPARMOD= 0
##$PSCAL= 0
##$PSIGN= 0
##$REVERSE= no
##$SF= 81.0140089999434
##$SI= 65536
##$SIGF1= 159.3651
##$SIGF2= -187.1042
##$SINO= 113.3802
##$SIOLD= 16384
##$SREGLST= <1H.CDCl3>
##$SSB= 0
##$STSI= 65536
##$STSR= 0
##$SW_p= 32467.5324675325
##$SYMM= 0
##$S_DEV= 0
##$TDeff= 32768
##$TDoff= 0
##$TI= <>
##$TILT= no
##$TM1= 0
##$TM2= 0
##$TOPLEV= 0
##$USERP1= <user>
##$USERP2= <user>
##$USERP3= <user>
##$USERP4= <user>
##$USERP5= <user>
##$WDW= 1
##$XDIM= 65536
##$YMAX_p= 281659577
##$YMIN_p= -52584671
$$ End of Bruker specific parameters
$$ ---------------------------------
##NTUPLES= NMR SPECTRUM
##VAR_NAME=  FREQUENCY,     SPECTRUM/REAL,   SPECTRUM/IMAG
##SYMBOL=    X,             R,               I
##VAR_TYPE=  INDEPENDENT,   DEPENDENT,       DEPENDENT
##VAR_FORM=  AFFN,          ASDF,            ASDF
##VAR_DIM=   65536,         65536,           65536
##UNITS=     HZ,            ARBITRARY UNITS, ARBITRARY UNITS
##FACTOR=    0.49542278885378, 1,            1
##FIRST=     16045.7642231865, 0,            0
##LAST=      -16421.768244346, 0,            0
##MIN=       -16421.768244346, -52584671,    0
##MAX=       16045.7642231865, 281659577,    0
$$ Real data points
##PAGE= N=1
##DATA TABLE= (X++(R..R)), XYDATA
$$ [...]
41100E28187k14019k8288n73869m90566L40742R71524J181517J496413J853969
41091E065610J633181P37304m02172j489506k127933j599042L3707J296631J006899
41082D154679m0500l80231j72434o06615j521437j470655j26493J127903J285605
41073B249822Q89569P33644P47965O57421N23202R6783j181566k858260l252481
41064a393901j535388P57882J399941K90524m89519M58225J865202J348366j371059
41055A330273l700694l115689k81628J745598J320676o1779k54653P14155J391305
41046i12436J339872J203010R30745j77114j632918j789751l04343R23008K28184
41037a91743j472212j958526o84798P63781J062254Q15956J344220K529089K793844
$$ y = [528187, 314168, 285880, -287989, -778555, -437813, 533711, 1715228, 3211641, 5065610, 6698791, 7436095, 7033923, 5544417, 3416484, 1817442, 1851149, 3147780, 4154679, 4114179, 3733948, 3561514, 2954899, 1433462, -37193, -163686, 964217, 2249822, 3139391, 3873035, 4621000, 5278421, 5801623, 5898406, 4716840, 1858580, -1393901, -2929289, -2171407, -771466, -480942, -970461, -512236, 1352966, 2701332, 1330273, -2370421, -5486110, -5767738, -4022140, -2701464, -2763243, -3017896, -2303741, -912436, 427436, 1630446, 2561191, 2384077, 751159, -1038592, -1342935, -419927, -191743, -1663955, -3622481, -4307279, -3543498, -2481244, -1665288, -321068, 2208021, 5001865]
41028E001865J233251j045330k207610j782762p59446l717M26197N57274K62206
41019A681928j68796l60233p84447j941799k600743r35726K040893K731454N4777
41010b82692k288664r76719J805295J601571j543361l362915j820951O09798J409471
41001d849167J085013Q12424K76538o49744p48672L90723J223097O95826j38717
40992a902679k51557l10055q42574q46412J49631O21470n42884j931082j734593
40983g590735l89180O77595J307055J779752J404344M161p15274N37059K328565
40974f56658K594589J600938O39077n83151k628049l963031k939165q98619j41989
40965f976058L0726J688911L689026K929081j07735j516737j18962J016648K14069
$$ y = [5001865, 6235116, 5189786, 2982176, 1199414, 439968, 436251, 862448, 1419722, 1681928, 1513132, 1152899, 368452, -1573347, -4174090, -5109816, -3068923, -337469, -282692, -2571356, -3548075, -1742780, -141209, -1684570, -5047485, -6868436, -6258638, -4849167, -3764154, -2951730, -2675192, -3324936, -4073608, -3682885, -2459788, -1763962, -1902679, -2154236, -2464291, -3306865, -4153277, -4003646, -3382176, -3925060, -5856142, -7590735, -7979915, -7302320, -5995265, -4215513, -2811169, -2807008, -3522282, -2985223, -656658, 1937931, 3538869, 4177946, 3594795, 966746, -2996285, -5935450, -6834069, -6976058, -6945332, -5256421, -1567395, 1361686, 1253951, -262786, -381748, 634900, 848969]
40956H48969k40891R69249J200721j320953l584485k363090L81414P44206p90104
40947d154964p01928J299647K018511M58117o42749L92796J679233J348517M50181
40938B147361N92147J185772Q91542n6575p29087j223322j865123j955125r58198
40929a970608Q7638l5768q09989j060489j058705j639367j903800j48251K931862
40920e607477M340736K725962J54303r90190q92559p57950l59812P75315J251244
40911F39572m08649k572431k087200Q38009K366506N83688j571653p45037J854106
40902a103089K497935M59900j444990j334611m48269m63950r38883m49538J165249
40893b060246K726263L105216K058185K16745j379050k107833k185504k004494
$$ y = [848969, 608078, 1577327, 2778048, 1457095, -2127390, -4490480, -4109066, -3364860, -4154964, -4856892, -3557245, -1538734, -1080617, -1723366, -1330570, 348663, 1697180, 2147361, 2739508, 3925280, 4816822, 4760247, 4031160, 2807838, 942715, -1012410, -1970608, -1882970, -1918738, -2728727, -3789216, -4847921, -6487288, -8391088, -8539339, -5607477, -1266741, 1459221, 1613524, 623334, -269225, -1027175, -1386987, -611672, 639572, 230923, -2341508, -4428708, -3590699, -1224193, -640505, -2212158, -2957195, -1103089, 1394846, 1854746, 409756, -924855, -1373124, -1837074, -2775957, -3225495, -2060246, 666017, 3771233, 5829418, 6046163, 4667113, 2559280, 373776, -1630718]
40885a630718j510940p72435m16884n79342k49453J060984J927309J044148k08496
40876a335827M22043K170855K043532l32632j774298m58564J254335O90278j073664
40867A606058j393398k96602J88783l56269n84969j87135k35775q68738r39097
40858c067142j97717J48922n02937j169904r10953j37431L20660M80369R00200
40849d135933J667936K163607J675131K21841j170029j391251o19459j33719m94161
40840b216037q15158l39862L61457N49998N39121P39989O18114j73209p10717
40831a446304k37766L85140J81621j25573M26009R35537J72075q07861j56164
40822f73286J340458J221982m84482j136697J56289J079689p0356j854323k238246
$$ y = [-1630718, -3141658, -3914093, -4330977, -4910319, -5159772, -4098788, -2171479, -1127331, -1335827, -913784, 1257071, 3300603, 2967971, 1193673, 735109, 1989444, 2679722, 1606058, 212660, -83942, 104841, -251428, -836397, -1023532, -1259307, -2128045, -3067142, -3264859, -3115937, -3618874, -4788778, -5699731, -5837162, -5516502, -5036133, -4135933, -2467997, -304390, 1370741, 1592582, 422553, -968698, -1588157, -1721876, -2216037, -3031195, -3371057, -3009600, -2459602, -1920481, -1180492, -562378, -735587, -1446304, -1684070, -1298930, -1117309, -1242882, -816873, 118664, 290739, -517122, -673286, 667172, 1889154, 1404672, 267975, 424264, 1503953, 1433597, -420726, -2658972]
40813b658972j323295j45003J147654K380768K418987P36869j431576k765593
40805a640161l332551l407397k494912p26219M73915M75028N55545J564051K271296
40796f261405J680798J101350J855999K620864J478650p06487j593720j096183
40788i20134j078927j862276j784019k49998J261262J588249J236339R64022P56860
40779h8622N11708K43377m59124j706329k251096r41220R60648J020531p17757
40770c427884j617126m35607R45348P55677P0163P31744K203250K391956P76634
40761B394155r92967j400646p12970j83870l68353o35786k89345K37873K0049
40752a931860n25587J94791K180113K908812R00400j371912p56377J513910J454470
$$ y = [-2658972, -3982267, -4127270, -2979616, -598848, 1820139, 2557008, 1125432, -1640161, -4972712, -8380109, -10875021, -11601240, -11127325, -10652297, -10096752, -8532701, -6261405, -4580607, -3479257, -1623258, 997606, 2476256, 1769769, 176049, -920134, -1999061, -3861337, -5645356, -5895354, -4634092, -3045843, -1809504, -845482, -88622, 423086, 666463, 207339, -1498990, -3750086, -4691306, -3730658, -2710127, -3427884, -5045010, -5480617, -4535269, -3779592, -3709429, -2977685, -774435, 1617521, 2394155, 1401188, 542, -712428, -896298, -1264651, -1900437, -2189782, -1951909, -1931860, -2457447, -2262656, -82543, 2826269, 3726669, 2354757, 1598380, 3112290, 4566760]
40743D566760j300268k721493p76957J377382N22064j749398j991246j46673J171511
40734a048318Q81087Q0511l03376j27960O34241J225449J66021k150861k869655
40725c512861r27467M94473j142079k911669p82210L150271L182048r01814l092722
40716f444030l02895L387571L581115J531062L81369r6603j380763k387541j759876
40707c490591j193731k425552l174643m23217L886750M976226K216008m39674
40699f8424p30553l45343n00742K44391K300395L084921R85489j681681k082016
40690A206437r39347p43183j666100j879613q60962R5758K20435L7455q1371m02815
40680e013306p67750m28643P74355K004815K366851J652989L00758p92093p25426
$$ y = [4566760, 3266492, 544999, -231958, 1145424, 1667488, -81910, -2073156, -2219829, -1048318, -167231, -86720, -390096, -518056, 116185, 1341634, 1507655, -643206, -3512861, -4440328, -3945855, -5087934, -7999603, -8781813, -5631542, -2449494, -3351308, -6444030, -6746925, -3359354, 221761, 1752823, 2134192, 2037589, 656826, -1730715, -3490591, -4684322, -7109874, -10284517, -10707734, -6820984, -1844758, 371250, -68424, -798977, -1144320, -1645062, -1400671, 899724, 3984645, 4970134, 3288453, 1206437, 267090, -476093, -2142193, -4021806, -4882768, -4787010, -4566575, -4529120, -4610491, -5013306, -5781056, -6209699, -5435344, -3430529, -1063678, 589311, 890069, 97976, -627450]
40671f27450M02642J275411R06056P189j36442K35669k90569j871065k787359
40662b885918j833479j14713M97278j03393m61255N6855M17167k53506j126376
40653e807340q07760N79566J504528J150180M18079M42731R19357O32144p66202
40644a734717k260902k675759j790164k39487J242083K338814L084098L335165
40636A299131K537641N33453j488113j869313p18395j08217j197458k356157j513069
40627d880497O98339J972337J746916J397321J409616Q72397q7746k1650J030425
40618D137458J067588m45227j304013k94737L90431j287371l468412l053213n59183
40609d816679P59894j88284j305969q88691M55265J483271J586724M02289j631930
$$ y = [-627450, -224808, 1050603, 1956659, 1963848, 1827406, 2063075, 1772506, -98559, -2885918, -4719397, -4834110, -4336832, -4440225, -4901480, -4844625, -4427458, -4680964, -5807340, -6615100, -6035534, -4531006, -3380826, -2962747, -2520016, -1600659, -968515, -1734717, -3995619, -6671378, -8461542, -8701029, -7458946, -5120132, -2036034, 1299131, 3836772, 4370225, 2882112, 1012799, 294404, 186187, -1011271, -3367428, -4880497, -4182158, -2209821, -462905, 934416, 2344032, 3216429, 3128683, 3107033, 4137458, 5205046, 4759819, 3455806, 3161069, 3551500, 2264129, -1204283, -4257496, -4816679, -4056785, -4245069, -5551038, -6439729, -5984464, -4501193, -2914469, -2512180, -4144110]
40600d144110k450393m37570K695551L550584J620004l42009o53851m89796q15808
40591a467398p01538J67758L24238n49931l75641J670119K941839J201625j614723
40582A596348k278738j010911l41346p43618o80231p1012l29985j188752o72205
40573e720450J445143K942353K501547J348852Q54379O89102K60007N1905M43229
40564D816067O57401m3842j153405j680382j324821m96389N8277l89322j592749
40555a149165j943325l56230J734806J957019L68702q11331p99051j008596j777308
40546c784479j287821R25887K269666J004013n98422K50190K116511J405383j898306
40537D02622m040941k944685n93514N74466P21123R48381J135070J027125J478693
$$ y = [-4144110, -6594503, -7032073, -4336522, -785938, 834066, 492057, -161794, -651590, -1467398, -2168936, -2001178, -1676940, -2226871, -2602512, -932393, 2009446, 3211071, 1596348, -682390, -1693301, -2034647, -2778265, -3458496, -3529508, -3859493, -5048245, -5720450, -4275307, -1332954, 1168593, 2517445, 3371824, 4060926, 4320933, 4372838, 4816067, 5473468, 5429626, 4276221, 2595839, 1271018, 774629, 832906, 443584, -1149165, -3092490, -3448720, -1713914, 243105, 611807, -199524, -998575, -2007171, -3784479, -5072300, -4146413, -1876747, -872734, -1471156, -1220966, 895545, 2300928, 402622, -3638319, -6583004, -7176518, -6602052, -5880929, -4932548, -3797478, -2770353, -1291660]
40528a291660K744157L056198R70861j911592k791824j696363j275139k483440
40520d678802k971893q56363K018995K522419O78635o50283j21040N30054k32685
40511c760963j266039r19686K07481O61784R19717K285173L709039K643329o49965
40502C829870k546597j014323J374938J219526r35656j947089q20887N67149Q89459
40493F16390Q08259R06226O40218j6628K662Q57145J010295l82389j800514j492421
40483A149243j62669M9492j366023k769131k661242j172700O92254K083104K402263
40474a755409J457488l3130q09894l93718M21567O76425L58158J01772K57957
40465B81216O72487J029385R61028J01877j428675k713919k757084j593288k89150
$$ y = [-1291660, 1452497, 4508695, 5479556, 3567964, 776140, -920223, -2195362, -4678802, -7650695, -8507058, -6488063, -3965644, -3287009, -3937292, -4058332, -3528278, -3760963, -5027002, -5946688, -5739207, -5077423, -4157706, -1872533, 1836506, 4479835, 3829870, 1283273, 268950, 1643888, 2863414, 1927758, -19331, -840218, -273069, 616390, 1424649, 2330875, 2971093, 2954465, 2957127, 3814272, 4824567, 4442178, 2641664, 1149243, 986574, 1036066, -329957, -3099088, -5760330, -6933030, -6240776, -4157672, -1755409, -297921, -331051, -1140945, -1534663, -1113096, -436671, -78513, 23259, 281216, 953703, 1983088, 2944116, 3045993, 1617318, -1096601, -3853685, -5446973, -5736123]
40456e736123K52606J24259l1687J21931M00183L83066k42587j213440j436022
40447g377814P5149K537395L501133J587965j430193k551539j260095J97660K88981
40438d431358N7793P26173J293640K04611j777681k406770j202919J35111N88388
40429f813012J101761K425271L438050K778611R78478l13683n75239o86788j293558
40420A039891j955653j925884j020412L26605J345612J340997L61049n92958n74921
40411a655674R0941J76500p45580j531821p75319J416949L362372L503838J949973
40402E792179K58247k17375L54276O71343r6540j372451j982377j611929j030378
40393G64995r18048j012406o94354J9422N96047Q56935J049093J082172N51587
$$ y = [-5736123, -5483517, -5359258, -5390945, -5269014, -4868831, -4485765, -4728352, -5941792, -7377814, -7302665, -4765270, -1264137, 323828, -1106365, -3657904, -4917999, -4720339, -4431358, -4373565, -3647392, -2353752, -2149141, -3926822, -6333592, -7536511, -7401400, -6813012, -5711251, -3285980, 152070, 2930681, 3909159, 3595476, 3020237, 2333449, 1039891, -915762, -2841646, -3862058, -3535453, -2189841, -848844, -487795, -1080753, -1655674, -1564733, -1388233, -2133813, -3665634, -4440953, -3024004, 338368, 3842206, 5792179, 6050426, 5833051, 6187327, 6858670, 6762130, 5389679, 3407302, 1795373, 764995, -153053, -1165459, -1859813, -1840391, -1244344, -387409, 661684, 1743856, 2295443]
40384B295443j82650P4125J522237K309468O62131k285490l421197j639147O84762
40375A9682Q54881r33649k478172k354599o49275J866283L829484L633469J385920
40366E174024m13492m5726O04349j103334l750901l351881K36667K340957L62879
40357E3542k124975q83459K481908L214319O13249j664106j705967j444240k279926
40348c739655k622944j231807K64212J96429k90725N42371J871567J774082N19274
40339b717196o2140L06092K95663k73599k7699J310103J949142N47361j771074
40330d43347k839027j900883J40208K113185L366220L637846K916317J413939
40322H404458m95078k140254k615119j758508j007483k057056m245258m631839
$$ y = [2295443, 2112793, 2186918, 3709155, 6018623, 6680754, 4395264, 974067, -665080, 19682, 874563, -59086, -2537258, -4891857, -5541132, -3674849, 154635, 3788104, 5174024, 4760532, 4714806, 5319155, 4215821, 464920, -2886961, -2650294, -309337, 53542, -2071433, -2954892, -472984, 2741335, 3354584, 1690478, -15489, -1459729, -3739655, -6362599, -7594406, -7330194, -7133765, -7424490, -6882119, -5010552, -3236470, -2717196, -2779336, -2473244, -2177581, -2451180, -2478879, -1168776, 780366, 1327727, -443347, -3282374, -5183257, -5043049, -2929864, 436356, 4074202, 6990519, 8404458, 7909380, 5769126, 3154007, 1395499, 388016, -1669040, -5914298, -10546137]
40314a0546137j739588J929540K726280N42556j296332p72193M33137J64602o64551
40305i222686K72876K632713L411325J196892j647356k019788N1740J876190J745263
40296a702831P07754O41556J660693K102472P30137j686105l168408k623390p92852
40287d130974P99858J331432R28247J15525l62626K45461J680006K223560N57089
40278C387578j987171k539556m32094J766930J758022M37919j7264M50964K72351
40269C097679p22196j042025k39317K29501o50412j885866j971250p72720P02352
40260c254254J504655J274045L62089l50980m70987p09196j474378j439989O63682
40251c895313L195460L092151N36066p71828Q55013K284058L79222l065358m139513
$$ y = [-10546137, -12285725, -10356185, -7629905, -7087349, -8383681, -9155874, -8722737, -8558135, -9222686, -8949810, -6317097, -2905772, -1708880, -3356236, -5376024, -5324284, -3448094, -1702831, -995077, -353521, 1307172, 3409644, 4139781, 2453676, -714732, -3338122, -4130974, -3331116, -1999684, -1071437, -955912, -1318538, -1073077, 606929, 2830489, 3387578, 1400407, -1139149, -1571243, 195687, 1953709, 2391628, 2374364, 2825328, 3097679, 2375483, 1333458, 1094141, 1323642, 673230, -1212636, -3183886, -3956606, -3254254, -1749599, -475554, -113465, -464445, -935432, -1644628, -3119006, -4558995, -3895313, -699853, 2392298, 2928364, 2156536, 3011549, 5295607, 5674829, 2609471, -1530042]
40242a530042k555729j125743p62460J88001J929414K301615N23459j337100j646033
40233d014618j242327j126589p20259K23155L93049p37787j425307k71988J478956
40224g443715K050142J800145J837396J605843J50623j477593j547038n28185
40216c552382k47162p82807o76588J29948J77246o06247m57400J134716K163836
40207b716840R70635j359738k579302j983244n58737N54305Q79191O09343M05930
40198e778457O51178P95564K31590l76323Q8629J160044J244292K65988r8068
40189a815563O33071P18556p67546j946228q91774J256274J953568Q73673k22355
40180b08324m97079q04823j710768k603988k830849k282445r26630R42484K183777
$$ y = [-1530042, -4085771, -5211514, -5973974, -5785973, -3856559, -1554944, -1031485, -2368585, -4014618, -5256945, -6383534, -7103793, -6880638, -6487589, -7225376, -8650683, -8922671, -7443715, -5393573, -3593428, -1756032, -150189, 434, -1477159, -3024197, -3552382, -3799544, -4582351, -5258939, -5128991, -4951745, -5557992, -6015392, -4880676, -2716840, -1746205, -3105943, -5685245, -7668489, -8227226, -7672921, -6793730, -6184387, -5778457, -5127279, -4331715, -4100125, -4476448, -4387819, -3227775, -1983483, -1717495, -1815563, -1182492, -463936, -1231482, -3177710, -4069484, -2813210, -859642, 14031, -208324, -705403, -1510226, -3220994, -5824982, -8655831, -10938276, -11864906, -10922422, -8738645]
40171h738645J892371Q43886N51278J115886J395775J023408O92545O49061N94095
40162A9660R39186K239909L363830K407780j53303j494168m25423Q46069J16090
40153G859630j739341k627919k324106j826666j177215j5120Q30783M37141l64975
40144i47788k83262R2372n46144j412529n70374J541179K285486Q65012n12930
40135E11022l02877J50260o31581j639702j344866l54430M0540M39281J963234
40126a169119L337480K185593r26593k535108j029531J030710O18096j611283
40118i9755k600775j169755R14270J729683J247176L53227o21444j581351j865941
40109c694665q70476Q42284J968019K015259J705910J693683J644425J037270
$$ y = [-8738645, -6846274, -6002388, -5451110, -4335224, -2939449, -1916041, -1223496, -574435, 19660, 958846, 3198755, 6562585, 8970365, 8817062, 7322894, 6897471, 7743540, 7859630, 6120289, 3492370, 1168264, -658402, -1835617, -1850737, -1019954, -582813, -947788, -1231050, -1138678, -1684822, -3097351, -3667725, -2126546, 158940, 1023952, 511022, 208145, 358405, -273176, -1912878, -3257744, -3612174, -3571634, -3132353, -1169119, 2168361, 4353954, 3427361, 892253, -137278, 893432, 1511528, -99755, -2700530, -3870285, -2956015, -1226332, 20844, 374071, -247373, -1828724, -3694665, -4565141, -3722857, -1754838, 260421, 1966331, 3660014, 5304439, 6341709]
40101F341709K43119J8666J83038l25671j910032l498599l648006k120592q4297
40092d800665J071814J007427O69532J170789K242210K284871O12634j001893
40084C256719m51354J292330R91090k011085m109112k340689J056551J697656
40076f17894o10212j953681m77463J231880Q52666j18192M31392J394150O71719
40067H04365q34880p51082M70813K30855j651193k484796j176579P1585m59284
40058e780196j376689q45043M67160R21345N54188L10114R7150m90579o68069
40049f810619M55617K165595L144107L232677K638012P09388k398800m150282
40041a014305k499010M33158O87580j747574k913804j074089P79066P0046j236663
$$ y = [6341709, 6584828, 6603494, 6786532, 6460861, 4550829, 1052230, -2595776, -4716368, -4800665, -3728851, -2721424, -2051892, -881103, 1361107, 3645978, 4258612, 3256719, 2805365, 4097695, 5088785, 3077700, -1031412, -3372101, -2315550, -617894, -1228106, -3181787, -3659250, -2427370, -1574704, -1692896, -1261504, 132646, 804365, -30515, -781597, -310784, -79929, -1731122, -4215918, -5392497, -5320912, -5780196, -7156885, -8001928, -7534768, -6613423, -6059235, -5749121, -5651971, -6142550, -6810619, -6355002, -4189407, -1045300, 2187377, 4825389, 5534777, 3135977, -1014305, -3513315, -3080157, -2392577, -4140151, -7053955, -8128044, -7348978, -7278932, -8515595]
40032h515595k09864K151092K863648J968166J976234L138898K894402K67655
40024F534636k333035k623935j263951n6410N61643Q94791N92876n29562j454918
40015C22135j249830n58126m63691o31528o0915Q45088O34535p82008j620118
40006c564458o04173J266816K026894J120058k10374n31918L59002J474142J634740
39997B970729M27526j536854l166326l711363l142428j925770o30922L52700J025803
39988i336905J740399K681059L349328K916229J277229n27638j230270n51890
39980C17541O46038J210583N23095j146695k665753k717113j145057M48212K61727
39971d267422j371796k113265n82051J717350K380409J311808N70964J231010
$$ y = [-8515595, -8725459, -6574367, -3710719, -1742553, 233681, 3372579, 6266981, 6534636, 4201601, 1577666, 313715, 257305, 818948, 1713739, 2306615, 1777053, 322135, -927695, -1485821, -1949512, -2581040, -2641955, -1796867, -1162332, -1944340, -3564458, -4168631, -2901815, -874921, 245137, 34763, -497155, -138153, 1335989, 2970729, 3398255, 1861401, -1304925, -5016288, -8158716, -10084486, -10715408, -10362708, -9336905, -7596506, -4915447, -1566119, 1350110, 2627339, 2099701, 869431, 317541, 963579, 2174162, 2697257, 1550562, -1115191, -3832304, -4977361, -4529149, -4267422, -5639218, -7752483, -8334534, -6617184, -4236775, -2924967, -2354003, -1122993]
39963a122993K004123J466229K21222j79120M55708R28791M78036m98994j374347
39954B378655j958548k229611k201428k111647k073299j610932l03302J204292
39946h905820J779883J439207J281108J515194Q81657j144845k788957k023752
39938g966325M85033K114981J809669J122431J342891J405444n0096j880675j701456
39929c318103M55679J862676R38245n35257j94641J431589J986249R01686j56534
39920C371589k83124n86624j858023k865327k133898j46313J435975J804497J180970
39911h0278p6083j304307j328314J62605J620259J394395m4597r90330r50745
39902a597395o09339j1586J171326J963737J026909p21430r48495L03121M43764
$$ y = [-1122993, 881130, 2347359, 2568581, 2389461, 2845169, 3773960, 4251996, 3753002, 2378655, 420107, -1809504, -4010932, -6122579, -8195878, -9806810, -10110112, -8905820, -7125937, -5686730, -4405622, -2890428, -2008771, -3153616, -5942573, -7966325, -7481292, -5366311, -3556642, -2434211, -1091320, 314124, 264028, -1616647, -3318103, -2862424, -999748, -61503, -596760, -791401, 640188, 2626437, 3528123, 3371589, 3088465, 2501841, 643818, -2221509, -4355407, -4501720, -3065745, -1261248, -80278, -156361, -1460668, -2788982, -2626377, -1006118, 388277, 343680, -646650, -1597395, -2206734, -2218320, -1046994, 916743, 1943652, 1222222, 273727, 576848, 1020612]
39893A020612j226263j959339r0672J839884J032652j013369j132300J94367n02
39884a334930j715982j944177j53845M71433j508075k991026j218059J701191
39876h693470K061522J40690p51327M81527J740353J601201J044056R51678O42086
39867g81684j25166L0476J803741L365406K562519k568j766629j591179p52060
39858B742856o30463r94658j071103j039711j471323j984248j613213l78440N52717
39849e887586N03981J89090M45538Q58119N66566l2266L58112J801808K622767
39840A426129J628785j71723r85204o21611l37931p26969j045068o29920K02776
39831a260736R19024J369764J291922K62015j282900j926961r49793N85482J143028
$$ y = [1020612, -205651, -2164990, -2255662, -415778, 616874, -396495, -1528795, -1334428, -1334930, -3050912, -4995089, -5148934, -4677501, -6185576, -9176602, -10394661, -8693470, -6631948, -6491258, -7242585, -6761058, -5020705, -3419504, -2375448, -1423770, -781684, -906850, -876374, 927367, 4292773, 6855292, 6852724, 5086095, 3494916, 2742856, 2112393, 1117735, 46632, -993079, -2464402, -4448650, -6061863, -6440303, -5887586, -5383605, -5194515, -4748977, -3890858, -3324292, -3356558, -2998446, -1196638, 1426129, 3054914, 2883191, 1897987, 1276376, 938445, 211476, -833592, -1463512, -1260736, -341712, 1028052, 2319974, 2581989, 1299089, -627872, -1577665, -992183, 150845]
39822A50845M52239p40579j812314k232732j306492P23988K018030J168415n66339
39813b144939q29835L46280P66632j65050m58556Q96084J991980J231841J29745
39804A764182O02799J409792K38662j909904j836108O96159K375732J438298N6249
39795D835861L78439J157276L28824j392660j972877j516141j638204k276363
39787b095845j752932J38477J437932Q23514o51190j230331n91197L05222O15586
39778c000764L41192J39154N86687J314365J172620j85525j440143j252202k23480
39769b548096P7284l57158o8337J257578K108825J581110P37123N91906L29644
39760C709879j037610k421717j910449K06881J500835O73102p70416p50521O34590
$$ y = [150845, 603084, -137495, -1949809, -4182541, -5489033, -4765045, -2747015, -1578600, -2144939, -2974774, -2628494, -1861862, -2026912, -2485468, -1589384, 402596, 1634437, 1764182, 2366981, 3776773, 4015435, 2105531, 269423, 965582, 3341314, 4779612, 4835861, 5214300, 6371576, 6700400, 5307740, 3334863, 1818722, 180518, -2095845, -3848777, -3710300, -2272368, -1448854, -2100044, -3330375, -3921572, -3616350, -3000764, -2659572, -2520418, -1933731, -619366, 553254, 367729, -1072414, -2324616, -2548096, -2470812, -2827970, -2896307, -1638729, 470096, 2051206, 2788329, 3380235, 3709879, 2672269, 250552, -1659897, -1453016, 47819, 720921, -49495, -800016, -165426]
39751a65426J557832J021906j24808o29484k93628L46748J006226J601141J657207
39742E977714O98378p84447j656764j669429j742774k228207j895436L00151L104916
39733A04102M010644K337370O174j010077q46680q13828j303181j572149j164722
39724b52347n80298m15579m62509r0474O09622N86301q00605k392668k125918
39715e924475K98379K534427K276370J70280j148568n43024N54534N80907j97816
39706a398986o80734n21260J10567J216990K345582K151533o5058k762784l429978
39697c034128j542488Q13255J556298Q79083K79825J33984n45539j949452k455361
39688e864523p73443J686175K154210J95526j594704j154576M79904J332406J529509
$$ y = [-165426, 1392406, 2414312, 2289504, 1660020, 1366392, 1713140, 2719366, 4320507, 5977714, 6676092, 5891645, 4234881, 2565452, 822678, -1405529, -3300965, -3000814, 104102, 4114746, 6452116, 6458290, 5448213, 4601533, 3787705, 2484524, 912375, -252347, -832645, -1248224, -1710733, -1801207, -1191585, -605284, -1405889, -3798557, -5924475, -5626096, -3091669, -815299, -645019, -1793587, -2336611, -1782077, -1201170, -1398986, -2079720, -2600980, -2490413, -1273423, 1072159, 3223692, 3158634, 395850, -3034128, -4576616, -3763361, -2207063, -1327980, -1048155, -914171, -1459710, -3409162, -5864523, -6637966, -4951791, -2797581, -2602055, -4196759, -5351335, -4871431, -3539025, -2009516]
39679b009516K228305K745036J390040j206317k353519j252661j47152p31392
39671a337176j820302j817937j264987j238060j106096N4691J198921P10228p31270
39662g351988q23163J078350L117054L379430J878477J23314l57709P11816J887102
39653C642683J388228m67364j336137k05465Q91648K2771j434632j004366P34367
39644B231733J032297n91408j794165j311913m54318j50849O36149K381723L332284
39635E311533J982869n21547j991997j901432j207201o52991m74420q32047j462867
39626a750100j649614j206090o07692J69935J522141K524061J335839j698721
39618a360241l377684j619964J633957L275557L079326K710921K236881M88282
$$ y = [-2009516, 218789, 2963825, 4353865, 3147548, 794029, -458632, -605784, -1337176, -3157478, -4975415, -6240402, -7478462, -8584558, -8529867, -7330946, -6620718, -7351988, -8175151, -7096801, -3979747, -600317, 1278160, 1401474, 1043765, 1755581, 3642683, 5030911, 4563547, 3227410, 3021945, 3913593, 3936364, 2501732, 1497366, 2231733, 3264030, 2672622, 878457, -433456, -887774, -1038623, -402474, 1979249, 5311533, 7294402, 6772855, 4780858, 2879426, 1672225, 1019234, 544814, -287233, -1750100, -3399714, -4605804, -5213496, -5043561, -3521420, -997359, 338480, -1360241, -4737925, -6357889, -4723932, -1448375, 1630951, 4341872, 6578753, 7067035]
39610G067035j867901k648087j594448q26174j420319j969127j285712l13459
39602d858192k25858n02996k54966K6214m72825j141281p50273O44729J895036
39593e640412K379439K269808J570018J27512j461911k061261j339289j78252
39585d334348M73754N90217O99945R92006J076600M68162q00073j958541j997638
39576d789916o12466J368969K663472K594946J424713j03175j252062j516768
39568b22287q07098M41443J481081J697308R95071m2501n12117j90485j33286
39559B707129j445372l203254k831537M13367L446090K691660j028598l206389
39551b456904j511628J506533K608584K140689J982444J508319j011343m099860
$$ y = [7067035, 5199134, 2551047, 956599, 130425, -1289894, -3259021, -4544733, -4858192, -5084050, -5587046, -5842012, -5815798, -6288623, -7429904, -8180177, -7535448, -5640412, -3260973, -991165, 578853, 706365, -755546, -2816807, -4156096, -4334348, -3860594, -3270377, -2570432, -1578426, -501826, -33664, -833737, -2792278, -4789916, -5402382, -4033413, -1369941, 1225005, 2649718, 2546543, 1294481, -222287, -1029385, -587942, 893139, 2590447, 3585518, 3543017, 3030900, 2840415, 2707129, 1261757, -1941497, -4773034, -4359667, -913577, 1778083, 749485, -2456904, -3968532, -2461999, 146585, 2287274, 4269718, 5778037, 4766694, 666834]
39543F66834m128624r25736J463988P88298k59775J054466K820642J848254q24078
39534B504269j645533k86398M32750k89979l64209O74943N47497j176743j433659
39525a037062J181353L154089J071663k711193l124988L54695L265342K570253
39517D724152L6364j244100p46908J44753M56846m6173j314987k585200k613118
39508c188371j351237l74578o42863q63466N84864K811608L199877J077106j029600
39499B23340o56318J208683J434032q95623l105913k512907N9686J669552J229365
39490a346103L04603K70547O82322P91655P48401N43374m16299j641160j325771
39481a388431P64609J996448M60289j731327j310815J104919J909120O4462j516721
$$ y = [666834, -3461790, -4387526, -2923538, -2135240, -2395015, -1340549, 1480093, 3328347, 2504269, 858736, 572338, 1005088, 715109, 350900, 1025843, 1573340, 396597, -1037062, 144291, 3298380, 4370043, 1658850, -1466138, -1111443, 2153899, 4724152, 4760516, 3516416, 2769508, 2914261, 3371107, 3324934, 2009947, -575253, -3188371, -4539608, -4914186, -5557049, -6420515, -5835651, -3024043, 175834, 1252940, 223340, -432978, 775705, 2209737, 1314114, -1791799, -4304706, -4245020, -2575468, -1346103, -1041500, -770953, -88631, 703024, 1451425, 1994799, 1578500, -62660, -1388431, -623822, 1372626, 1832915, 101588, -1209227, -104308, 1804812, 1869274, 352553]
39472C52553o93205Q72489P55097o27594j262588o82354j4277K8876l51632p94710
39462b417345q48585n8485J045704J039911k46368q08335Q78706L230821L310216
39453E126240P29336j874993k171446n10461J096238J170036k15065j656914j572335
39444A20636J19788J576241J095508o56712j522991p62115K00756P1219n92766
39435c50436n64636J40525M25273k47146j118663j061026J14415J431155J872335
39426F41796J580400J498123J782418J394250k08893j820057j914637p78936n9956
39417B114508n08405j330767j572694r63703L94037J841321J876734k80226k783712
39408a212907k708109M9956K358984K116504Q56521P92164J306082M73400j373911
$$ y = [352553, -340652, 531837, 1286934, 659340, -603248, -1285602, -1299879, -1271003, -1622635, -2417345, -3265930, -3324415, -2278711, -1238800, -1485168, -2293503, -1414797, 1816024, 5126240, 5855576, 3980583, 1809137, 1298676, 2394914, 3564950, 3349885, 1692971, 120636, 240424, 1816665, 2912173, 2255461, 732470, -29645, 171111, 242330, -350436, -915072, -774547, -349274, -596420, -1715083, -2776109, -2661694, -1230539, 641796, 2222196, 3720319, 5502737, 6896987, 6688094, 4868037, 2953400, 2174464, 2114508, 1606103, 275336, -1297358, -2261061, -1867024, -25703, 1851031, 1570805, -1212907, -3921016, -3871060, -1512076, 604428, 1460949, 2253113, 3559195, 4032595, 2658684]
39399B658684k076869r66373N33708J294662J350456O05902j064136k367011j618881
39390a649858L19957N28682j654785l159049j490927J588108K711692J590069
39382a216111N94565O71794M20023q60020j777146j215844r0553L28338L64208
39373b780746R54104J714306J387749j10383j260313p09367J153652K579821K157821
39364E086644J49995j681161j726774k49029P26454m28499k971315m383368l056417
39355h533470k6185K276358K693078K127512J696135J092144m31090k151975k333153
39346c590646o15713J359281K157041K140780K157284J920243R33001K7269L59618
39337F848158J340484J218570l28216j725966j824697j258731j069444j251132
$$ y = [2658684, 581815, -384558, 149150, 1443812, 2794268, 3400170, 2336034, -30977, -1649858, -1329901, -801219, -2456004, -5615053, -7105980, -5517872, -2806180, -1216111, -621546, 50248, 470271, -389749, -2166895, -3382739, -3473292, -3144954, -2780746, -1826642, -112336, 1275413, 1165030, -95283, -804650, 349002, 2928823, 5086644, 5236639, 3555478, 1828704, 1579675, 2306129, 1877630, -1093685, -5477053, -8533470, -8559655, -6283297, -3590219, -1462707, 233428, 1325572, 894482, -1257493, -3590646, -4206359, -2847078, -690037, 1450743, 3608027, 5528270, 6461271, 6488540, 6848158, 8188642, 9407212, 9078996, 7353030, 5528333, 4269602, 3200158, 1949026]
39329A949026j309256j250273j278795j190211o85541J20050P99881Q56618l8331
39320b026832j391933j778196m67305J076903Q23647p12499q67558J193910K967483
39311a182380K193394M9363q94782l90568j49599p61592j155256p77262l53197
39302c421879m17398o09658n43124j74416O00946J572648J720205M36817j020242
39293a856101q57029N80115J153634R1714j027069r40666n22219r49732j627052
39284e954405j328328l58995l5952n30168o73462J55243J166240J437259J150437
39275d972131J080889J401609J569060J220161O57031L12669J31859j76466n34553
39266F90128o69268p88434j380374k170790k040266m72919J483750K288440J534599
$$ y = [1949026, 639770, -610503, -1889298, -3079509, -3765050, -3645000, -2845119, -1988501, -2026832, -3418765, -5196961, -5664266, -4587363, -3763716, -4476215, -5343773, -4149863, -1182380, 1011014, 1060377, 165595, -224973, -374572, -1136164, -2291420, -3068682, -3421879, -3839277, -4448935, -4992059, -5166475, -4565529, -2992881, -1272676, -835859, -1856101, -2713130, -2133015, -979381, -887667, -1914736, -2855402, -3377621, -4327353, -5954405, -7282733, -7641728, -7677680, -8207848, -8881310, -8726067, -7559827, -6122568, -4972131, -3891242, -2489633, -920573, 299588, 956619, 1269288, 1401147, 1224681, 690128, 20860, -767574, -2147948, -4318738, -6359004, -6831923, -5348173, -3059733, -1525134]
39257a525134J5476j370265k157557k129139j294432N295J309127K196882K224483
39248b725264J305906K63367J04602M97619R5739j184958j650166m38421Q86022
39239b845554O68305l24913m04395K61676L64466L3544N20106J828357K743805
39230B845397K856282K575522J567569o58313k903815l314304k177232j458993
39222f67887j628736j313956j40032O49673O82896R74454J502301R13365o84585
39213B87493j301322l24348M06573j79928o92956j7117Q23290R10434J028279
39204I40398J534573J183212k71187q56948L35617J179667n4046j709389j534320
39195G47577j89722M90240N53690O70705L0260j663235k236673k31786J940216
$$ y = [-1525134, -1509658, -2879923, -5037480, -7166619, -8461051, -8455756, -7146629, -4949747, -2725264, -1419358, -1155991, -1051389, -553770, -458031, -1642989, -3293155, -3731576, -2845554, -2177249, -2502162, -2906557, -2644881, -2280415, -2246871, -1726765, 101592, 2845397, 5701679, 8277201, 9844770, 9186457, 6282642, 2968338, 791106, -667887, -2296623, -3610579, -3750611, -3100938, -2418042, -1443588, 58713, 972078, 287493, -1013829, -1338177, -931604, -1111532, -1804488, -1821605, -998315, -87881, 940398, 2474971, 3658183, 3386996, 2530048, 2865665, 4045332, 3991286, 2281897, 747577, 557855, 1048095, 1601785, 2272490, 2302750, 639515, -1597158, -1828944, 111272]
39186A11272J402772n00297o33422N35437J86970j459876j633763l36465m49617
39177b776989k332690k879703p60046J611072K427590K786933L236130K024340
39169C336637j127910l035178j389057J617832K512071J158295k13040o18241
39161B241409n13035O0678J095709J457614K49820j412494j777630r34679l68954
39152I8438o84523j189554j217665o48681L68754J191659Q07121p94663j979139
39143d048253j242778Q18924K220248J867448L51037j144551j896581j747283
39135d821789q23387O00806K000467K526671J597604j10484r77174l97078L58358
39126d6006O9243o65982p71233n80929p12512l18077J294546K426037J189640
$$ y = [111272, 1514044, 1013747, 380325, 915762, 1102732, -357144, -1990907, -2327372, -2776989, -5109679, -7989382, -8749428, -7138356, -4710766, -1923833, 1312297, 3336637, 2208727, -826451, -2215508, -597676, 1914395, 3072690, 2859650, 2241409, 1728374, 1789052, 2884761, 4342375, 4592195, 3179701, 1402071, 467392, 98438, -586085, -1775639, -2993304, -3641985, -3273231, -2081572, -1274451, -2069114, -4048253, -5291031, -4472107, -2251859, -384411, -33374, -1177925, -3074506, -4821789, -5645176, -5044370, -3043903, -517232, 1080372, 969888, -7286, -404364, -46006, 23237, -642745, -1413978, -1994907, -2707419, -3025496, -1730950, 695087, 1884727]
39117A884727q22637l46155K344813L537530J656241q21403j692882j673122j643427
39108B423685q82516M42229M99103p22399o00493J448054K129951l12270k489164
39099A936180j030705J855840J990567j81349j010733R8853M38053q52521j723318
39090A520867j221491p39767r51480p75928J22016O31539N00645Q45727J832733
39081A764861K039651P03969j142458k168716j990001r02214L68763R07333O79139
39072B60327O88449J099199N85540j097293j815416l59100J039504J90491j109792
39063e18091p811K345586K683507J211572Q09187J485326N68013j699711j947079
39054D930499K28482J076385r59348k628557j655418m08451j074703j558419L28551
$$ y = [1884727, 1062090, 715935, 3060748, 6598278, 8254519, 7433116, 5740234, 4067112, 2423685, 1541169, 1983398, 2482501, 1760102, 1159609, 2607663, 4737614, 4425344, 1936180, 905475, 2761315, 4751882, 4570533, 3559800, 3658653, 4096706, 3244185, 1520867, 299376, -440391, -1391871, -2167799, -2045783, -1414244, -913599, -67872, 1764861, 3804512, 4508481, 3366023, 1197307, -792694, -1694908, -1326145, -418812, 260327, 948776, 2047975, 2633515, 1536222, -279194, -638294, 401210, 591701, -518091, -525902, 1819684, 4503191, 5714763, 6523950, 8009276, 8577289, 6877578, 4930499, 5158981, 6235366, 5276018, 2647461, 992043, 583592, -491111, -2049530, -1720979]
39045a720979K307214J287350j237308j625163R7404R98003M74746N98456J715516
39036B895239J561771q08621l232487l416013j632428K51464R49282M79820j58857
39027c110830K47555J885705L375581L074067Q29047j859353l054849j772452
39019c85529R37820K290689N09753k583978l438856j479562K77365n7579o54233
39010d584110M43506J882830J498140M1627k97814N13868R54350Q07895P39283
39001A999575K24055j255551k014473k69910K279882K251645l35885k060079j297380
38992d78121j61199o43696j891744k365795k047824j288182K18600K035272K613499
38983d009190J571661M98315L92651K56962n74733q32193L29706J303848M11771
$$ y = [-1720979, 586235, 1873585, 636277, -988886, -891482, 106521, 581267, 1179723, 2895239, 4457010, 3648389, 415902, -3000111, -4632539, -4381075, -3431793, -2951973, -3110830, -2863275, -977570, 2398011, 5472078, 6301125, 4441772, 1386923, -385529, 552291, 2842980, 3352733, 768755, -2670101, -4149663, -3872298, -3929877, -4584110, -4140604, -2257774, -759634, -718007, -1015821, -501953, 452397, 1260292, 1999575, 2223630, 968079, -1046394, -1316304, 963578, 3215223, 2879338, 819259, -478121, -639320, -1283016, -3174760, -5540555, -7588379, -8876561, -8657961, -6622689, -4009190, -2437529, -1939214, -1546563, -1289601, -1864334, -2696527, -2366821, -1062973, -651202]
38974f51202j169251j057083P73570K231305K230196J509313P88389J69100J97679
38965E022016J445596K813354K197811n32067k828588k511235k08607K018207
38957G416487L184452L453720K868319J520814M12449N84297J454773J367976
38949B2263287l6201j274213j256020q20754j190341j867790j308124P12568K589028
38940A7811440K818631J589031K43458k51948j17896l67989j593259k950671k784633
38931A4396164p21098J427111J644387R0294j501535k241560k477884k119037
38923H496842m45862K065372L472429K677038O69142j159333k498755l193485
38915A0083388k501195n38651R22397O17730k80626J04899J582772K424452J975300
$$ y = [-651202, -1820453, -2877536, -2103966, 127339, 2357535, 3866848, 4655237, 4824337, 5022016, 6467612, 9280966, 11478777, 10946710, 8118122, 5606887, 5398280, 7416487, 10600939, 14054659, 16922978, 18443792, 18856241, 19440538, 20895311, 22263287, 22227086, 20952873, 19696853, 18876099, 17685758, 15817968, 14509844, 15222412, 17811440, 20630071, 22219102, 22462560, 22210612, 22092716, 21724727, 20131468, 17180797, 14396164, 13675066, 15102177, 16746564, 16836858, 15335323, 13093763, 10615879, 8496842, 8050980, 10116352, 13588781, 16265819, 16934961, 15775628, 13276873, 10083388, 7582193, 7043542, 7965939, 8583669, 8303043, 8407942, 9990714, 12415166, 14390466]
38906A4390466J084971L54537m33924j267592j665807j508796j082798m78878
38898I392179J49475J73711o25761j304477j051442o03573r57933j331126k09219
38889C631834J911709K840062J838485N42280L40784O35390L71596k81504o76524
38880A1154112q70248j141261j256775j023496q15213q67151o92641J88205J435748
38871F111280K253575K176645J313235K53928k51977q6604r1944q99566j717695
38862I060877j322069o7823L84727n45763j546598j285800N4508J437632K066993
38853H236684J551258J19847j048901q85933l5733r5751j096787j420737o33200
38844D690747l83927j511712k266753j007429R96054J439257M68547R5033Q23241
$$ y = [14390466, 15475437, 15829974, 15396050, 14128458, 12462651, 10953855, 9871057, 9392179, 9541654, 9715365, 9089604, 7785127, 6733685, 6130112, 5172179, 3841053, 3631834, 5543543, 8383605, 10222090, 10764370, 11105154, 11740544, 12112140, 11830636, 11154112, 10283864, 9142603, 7885828, 6862332, 6047119, 5179968, 4487327, 4675532, 6111280, 8364855, 10541500, 11854735, 12108663, 11856686, 11770082, 11678138, 10778572, 9060877, 7738808, 7670985, 8055712, 7509949, 5963351, 4677551, 4732059, 6169691, 8236684, 9787942, 9907789, 8858888, 7972955, 7937222, 7841471, 6744684, 5323947, 4690747, 4306820, 2795108, 528355, -479074, 516980, 1956237, 2424784, 2519817, 3343058]
38835C343058J152655L22718n97630p43361p33186j188771j457343q10600R9318
38826f13142P3859q69889j523521j075968O5765J009486J316438J082830N66071
38817C1929J9758l44333m96529n55438m46026J18050R74094J228215L46177p32499
38807A43398o35332K61054O4236j727905l087143k286256m18121M82704N45001
38798f658364J183199K059224J541606p9879o13562M59366J128258L53957k31726
38789h57921N93536J377536O22373m70520p8832J098325J159370K12782k04334
38780C452315o1066o35923j796541j992804j024460m88205j028160j216060N3803
38771d737101J762743K353956J853910J348217J166631O32181o64009k043087
$$ y = [3343058, 4495713, 4818431, 4220801, 3477440, 2744254, 1555483, 98140, -712460, -613142, -539283, -1409172, -2932693, -4008661, -3942896, -2933410, -1616972, -534142, 31929, 51687, -292646, -789175, -1344613, -1790639, -1672589, -698495, 529720, 875897, 143398, -491934, -230880, -166644, -1894549, -4981692, -7267948, -7686069, -7203365, -6658364, -5475165, -3415941, -1874335, -1954214, -2567776, -2108410, -980152, -626195, -857921, -264385, 1113151, 1735524, 1265004, 1186172, 2284497, 3443867, 3656649, 3452315, 3391249, 2755326, 958785, -1034019, -2058479, -2546684, -3574844, -4790904, -4737101, -2974358, -620402, 1233508, 2581725, 3748356, 4380537, 3716528, 1673441]
38763A673441k302407j031515O54132J091168Q1753o84911J17462J477197J435295
38754B511615l6020j020224n01906L22427J00826n85604j30036J781683L655755
38745F098516L822233K072057k57874j537855j202790j7230Q63050Q86708K30002
38736A0956817n77407r51845o96583m11837q58873j620119j279924M40881J700566
38727F701676P14662j807891l544802l300374j719152J22130J462557J657527
38719B86333P34019p7002K62702R87031P76703J31929N61071J681295J497564
38710F841645j84261j141325l19512M33810m74842j775605j629095n52431J8783
38701A217167L93799J429120K006537N26038j779305j953237K95130K080643J625913
$$ y = [1673441, -628966, -1660481, -1006349, 84819, 166572, -518339, -400877, 1076320, 2511615, 2475595, 1455371, 953465, 1275892, 1376718, 791114, 661078, 2442761, 6098516, 9920749, 11992806, 11734932, 10197077, 8994287, 8977057, 9840107, 10726815, 10956817, 10379410, 9427565, 8730982, 8319145, 7460272, 5840153, 4560229, 5001110, 6701676, 7416338, 5608447, 2063645, -1236729, -2955881, -2833751, -1371194, 286333, 1020352, 943350, 1206052, 2193083, 2969786, 3101715, 3662786, 5344081, 6841645, 6657384, 5516059, 5196547, 5630357, 5155515, 3379910, 1750815, 1198384, 1217167, 1610966, 3040086, 5046623, 5572661, 3793356, 1840119, 2135249, 4215892, 5841805]
38692E841805M13434K11913M57381k575o54307n64883k75157n88370p53567J60066
38682D245740J088629L55291j388374j866193n86513P26963J148216J553006K129319
38673G406084J473122o23622j853533o97405Q81462L08313j495471j512855O90837
38664D576932K494360K265302J153742M66577j56454j025529j163073j74464M30147
38655H867540o43616k317393k609470j303028K12274R53483R10835K92667n41282
38646C822010q94391n47159k78482o92064j170574r32664m06214m86697j079711
38637b665946j439875j320142p79594L52421J679888J833027L05138j122520m74974
38628c632577J508831K369660J414405K84609J81299M85715L75331N6085o1026
$$ y = [5841805, 6255239, 6467152, 6924533, 6921958, 6267651, 5702768, 5427611, 4839241, 4085674, 4245740, 5334369, 5689660, 4301286, 2435093, 1848580, 2575543, 3723759, 5276765, 7406084, 8879206, 8255584, 6402051, 5704646, 6586108, 6894421, 5398950, 3886095, 4576932, 7071292, 9336594, 10490336, 10956913, 10800459, 9774930, 8611857, 8437393, 8867540, 8223924, 5906531, 3297061, 1994033, 2206307, 3159790, 4070625, 4363292, 3822010, 2927619, 2380460, 2101978, 1409914, 239340, -693324, -1099538, -1586235, -2665946, -4105821, -5425963, -6205557, -5853136, -4173248, -2340221, -2035083, -3157603, -3632577, -2123746, 245914, 1660319, 1944928, 2126227, 2611942, 2987273, 3043358, 2982332]
38619B982332p235K38937O34472L89104j147654k842923k701668p37535Q02235
38610b389935O22221P6907Q39698K400939L016338K075651M93382m90767j48130
38601F496304J318854K537580J953037k68256k032956j661325J56677J294505
38593I794420O06785j002346j629534l95223J348416J253821j041789k982355
38585E952195k223714K08606J529965J124899O31646O26018l65j221651j360724
38576E266875j16760O60089K18337J38204J024906R18395j105749k582720j412444
38567C009133M76379J66489j488784j407094P38174K371748K110883R25459l15528
38558F586859j463286j514143N48334L182188L432918J125795p24560l31705O05021
$$ y = [2982332, 2975097, 3214034, 3848506, 4237610, 3089956, 247033, -2454635, -3192170, -2389935, -1767714, -1690807, -851109, 1549830, 4566168, 6641819, 7135201, 6644434, 6496304, 7815158, 10352738, 12305775, 12037519, 10004563, 8343238, 8499915, 9794420, 10401205, 9398859, 7769325, 7374102, 8722518, 9976339, 8934550, 5952195, 3728481, 3937087, 5467052, 6591951, 7223597, 7849615, 7849250, 6627599, 5266875, 5150115, 5810204, 6028541, 6166745, 7191651, 8110046, 7004297, 4421577, 3009133, 3485512, 3652001, 2163217, 756123, 1494297, 3866045, 5976928, 6902387, 6586859, 5123573, 3609430, 4157764, 7339952, 10772870, 11898665, 11174105, 10842400, 11447421]
38549A1447421L7184j411460j982148j521239j112434j127328r67345o1557J667803
38540D968897L622214M378409K783516j94954j797448n14356J965969K684210
38532A7896457P94783j664977k129677j54596K264002K925045J870882J079832
38524B2881751J584370K034173J041770k35990M06566K789606M434301M011342
38516C8947889K742536K099508K019247K045627K532477L728747M885248N214644
38508F4215923M970057N038429O176157Q747633J2170394J4631252J4814394J4089277
38500A44853516J5247025J8547967K0874257J9745689J6420692J3693572J2139349
38493B61522067J0208778O969888K958844j136768m996298q033493r591801r862129
$$ y = [11447421, 11484605, 10073145, 8090997, 6569758, 5457324, 4329996, 3362651, 3301094, 4968897, 8591111, 12969520, 15753036, 15558082, 13760634, 13246278, 15212247, 17896457, 18691240, 17026263, 14896586, 14741990, 17005992, 19931037, 21801919, 22881751, 24466121, 26500294, 27542064, 27306074, 27712640, 30502246, 34936547, 38947889, 41690425, 43789933, 45809180, 47854807, 50387284, 54116031, 59001279, 64215923, 69185980, 74224409, 80400566, 89148199, 101318593, 115949845, 130764239, 144853516, 160100541, 178648508, 199522765, 219268454, 235689146, 249382718, 261522067, 271730845, 278700733, 281659577, 280522809, 275526511, 267493018, 257901217, 248039088]
38485B48039088r697194r499933r011191q143071p354509p112206p343325p445720
38477A82431939o760036n252071l729740l004707k915891k737484k406472k529673
38469A53095865l229306l941198m382605m668583m450065l223792j672991j232952
38461A26294373j883186j873274l47519J173573Q58886j010133k520507k109611
38453A18582602L76720L379575M072850Q66091l893937n682466l209063M355N94200
38444A15090927n88921j179337j333683k182959k417798j26826L052872L423915
38436A13738190O75738j605974j136519N43617J308372J177330Q28278Q0741q62657
38427A14747116q91431O4413N31509M311r9478Q41926J186085j22581j281103
$$ y = [248039088, 238341894, 228841961, 219830770, 211687699, 204333190, 197220984, 189877659, 182431939, 175671903, 170419832, 166690092, 163685385, 160769494, 158032010, 155625538, 153095865, 149866559, 145925361, 141542756, 136874173, 132424108, 129200316, 127527325, 126294373, 124411187, 122537913, 122190394, 123363967, 124222853, 123212720, 120692213, 118582602, 118959322, 122338897, 126411747, 127277838, 123383901, 117701435, 114492372, 114496727, 115090927, 114502006, 113322669, 111988986, 109806027, 107388229, 107261403, 110314275, 113738190, 114413928, 112807954, 111671435, 112215052, 113523424, 114700754, 115529032, 115609773, 114747116, 113855685, 113920098, 114451607, 114455918, 114356440, 115198366, 116384451, 116261870, 114980767]
38418A14980767k72952J787112K245647Q32187l20001q9117M02879O0709n33569
38409A19093662l16879O01986J174232P81846m1054j74061P97374J928705J961996
38400A25807807R93164L90756R32523J877031K134286J423336j8174j761450k821055
38391A28958224k279693r51465j055487l320186n778606o528483o199995o230783
38383I6613526o241916n233803m257618n317050p948679r365430q227933o142595
38375D3878502m956959m504000l757971k606927j589560j041202j180154k044181
38367B2197548k916102k879089k224979k051106k189381j126324J395599L334758
38359A3540924K923271R16147q15477j648409j940960j636678o50044K28023K87977
$$ y = [114980767, 114707815, 116494927, 118740574, 119572761, 119252760, 119163643, 119566522, 119627231, 119093662, 118776783, 119378769, 120553001, 121334847, 121293793, 121119732, 121917106, 123845811, 125807807, 126800971, 127191727, 128124250, 130001281, 132135567, 133558903, 133540729, 131779279, 128958224, 126678531, 125727066, 124671579, 121351393, 115572787, 109044304, 102844309, 96613526, 90371610, 85137807, 80880189, 75563139, 67614460, 58249030, 50021097, 43878502, 38921543, 34417543, 30659572, 28052645, 26463085, 25421883, 24241729, 22197548, 19281446, 16402357, 14177378, 12126272, 9936891, 8810567, 10206166, 13540924, 16464195, 17380342, 16564865, 14916456, 12975496, 11338818, 10688774, 10916797, 11204774]
38350A1204774P1557K31370N0217j271932k570347j951085J67731J291747L46578
38341G570610r50356p71062M59994J245447J153957O60696j69873j592857l149765
38332D456791l695970k535220k14752J738953J965582O09557n95577k46068Q78326
38323B361622Q32737o77124j775382j030682P07187J701582J388213L05503q95592
38314B918064j483417p60070Q32351J683561J114081M48276Q52159J384728Q32820
38305G822553K28000J238634K827613K254576o11145k744706k328498j020884
38297G666143p55286q16341Q2829R27734L1482j774546k121396o71475O45766
38288C214910P43318M50454L49786j97302j218246j355996l1332J229337R45164
$$ y = [11204774, 11276331, 11507701, 11557918, 10285986, 7715639, 5764554, 5932285, 7224032, 7570610, 6620254, 5849192, 6309186, 7554633, 8708590, 9369286, 9199413, 7606556, 4456791, 760821, -1774399, -1989151, -250198, 1715384, 2324941, 1729364, 1483296, 2361622, 3194359, 2517235, 741853, -288829, 418358, 2119940, 3508153, 3813656, 2918064, 1434647, 674577, 1506928, 3190489, 4304570, 4752846, 5605005, 6989733, 7822553, 8050553, 9289187, 12116800, 14371376, 13760231, 11015525, 8687027, 7666143, 6910857, 6094516, 6177345, 7105079, 7136561, 5362015, 3240619, 2569144, 3214910, 3958228, 4408682, 4758468, 4561166, 3342920, 1986924, 1955592, 3184929, 4130093]
38279D130093q8068j72775O28596Q40075O4002n46917k55628L14627M33193J87881
38269E535079j73916o51626q37149q0769J091718J014613p22801k132865j402954
38260A639330M10698R57767J37466k7116J127806J875916J090437O0778J63665
38251G436747N82122n1547j167086j295930o57748p09568j564268j812264r00312
38242a39854P5066K37093P2854K16457L46343k7990n36965l85543N62381J481831
38232A901673J284879j87739j557066j192408N12473J281931J87140p80494J10730
38223A561119J238390K18248j678987j080213J907532L415796J662630o43942
38215F600573j025906p04359j299948j463594L14641K223044J738040k28110j054715
$$ y = [4130093, 4042025, 3869250, 4497846, 5337921, 5401923, 4855006, 4599378, 4914005, 5347198, 5535079, 5361163, 4709537, 3872388, 3791619, 4883337, 5897950, 5175149, 3042284, 1639330, 2050028, 3007795, 3145261, 3118145, 4245951, 6121867, 7212304, 7273082, 7436747, 8018869, 7967322, 6800236, 5504306, 4846558, 4136990, 2572722, 760458, -139854, -64788, 172305, 245159, 461616, 807959, 779969, 243004, -142539, 419842, 1901673, 3186552, 2998813, 1441747, 249339, 761812, 2043743, 2230883, 1450389, 1561119, 2799509, 3017757, 1338770, 258557, 2166089, 5581885, 7244515, 6600573, 5574667, 4870308, 3570360, 2106766, 2421407, 4644451, 6382491, 6154381, 5099666]
38206E099666p25429j046441j753770r78330R74040J750758P66702k12712l33369
38197C541115n21208r38749n12063O45445J111491Q02374R55653J197716k17574
38188F064200k664172l091620q77498P31224k52549j371130m0123K037209J831110
38179B366651o9857r15228m93843p79304j830141j616111K30769J692591J718089
38170C03616J517745J889515J730595K23986j449959j766861q63576J05259N53033
38161B243353N43805J55264m28356p46800n63707j37908K59976N93423O83189
38152B602239K41803m88416p75497l79858M1063j90467r28405j479422j343617
38143b700577n04965O24557J358314J182840K73367o53982j099795j150814j054935
$$ y = [5099666, 4374237, 3327796, 1574026, 595696, 1569736, 3320494, 4087196, 3874484, 3541115, 3019907, 2081158, 1569095, 2214540, 3326031, 4128405, 5084058, 6281774, 6064200, 3400028, 308408, -569090, 162134, -90415, -1461545, -1501668, 535541, 2366651, 2296794, 1381566, 887723, 108419, -1721722, -3337833, -3107064, -1414473, 303616, 1821361, 3710876, 5441471, 5665457, 4215498, 2448637, 1585061, 1690320, 2243353, 2787158, 2942422, 2514066, 1767266, 1203559, 1065651, 1325627, 1919050, 2602239, 2844042, 2355626, 1580129, 1200271, 1241334, 1050867, 122462, -1356960, -2700577, -3205542, -2580985, -1222671, -39831, 233536, -420446, -1520241, -2671055, -3725990]
38134c725990p93654l09973J02487O0242k03452J85122J611440L023376K883973
38125B833571J269037P3045M68922J170152M48843r91761j033318L56949R62027
38116E557467j5209n75642O58279J889682Q25947j765143l278577k899315j839995
38107a442506p36640Q89756K758397L489632K435419M31909j362870k227917j773708
38098B461472m53662J43748r54084k345700j911271L4500J165088O56244J10790
38089a092875O19593J125917N95246j64480q2236L58676K14179k83783n36973
38080G53264r52092k026737k815103j857221N98830K587838K719836J572203O13693
38071A194511M07056K72629m72540j381762j383577l34937O87745R91534J172907
$$ y = [-3725990, -4519644, -4829617, -4727130, -4666888, -4870340, -4685218, -3073778, -50402, 2833571, 4102608, 4175653, 4644575, 5814727, 6263570, 5271809, 4238491, 4595440, 5557467, 5542258, 4966616, 5624895, 7514577, 8340524, 6575381, 3296804, 397489, -1442506, -2179146, -1289390, 1469007, 4958639, 7394058, 7825967, 6463097, 4235180, 2461472, 2007810, 2151558, 1197474, -1148226, -3059497, -3024997, -1859909, -1203665, -1092875, -473282, 652635, 1247881, 1083401, 1001165, 1359841, 1574020, 1290237, 753264, -198828, -2225565, -5040668, -6897889, -6299059, -3711221, -991385, 580818, 1194511, 1601567, 1874196, 1401656, 19894, -1363683, -1698620, -1010875, -19341, 1153566]
38062A153566J598328J158090q69129k625857j614645J410477K926277J347840
38054D484947j107144j914266j203083j93040Q99367J825703J369708n88026j879792
38045A694374j027971J99398m92669k114790j985727j08739R76961L06779m15570
38036b967954N9181R19726J244674J249396R95964n2775j485749j828390p22949
38027b588876M56301Q00013R32493J228085Q89098k11667o50421K77567J077060
38018B209653L29053j054725j513485j388857j825727k242869j229670O09710
38010f106917J167938K14134j20921J168353K191393J116874q10486r57251R13782
38001a223101K406619J907433N68343K94210R03596M08182k118347m906868n193244
$$ y = [1153566, 2751894, 3909984, 3040855, 414998, -1199647, 210830, 3137107, 4484947, 3377803, 1463537, 260454, 67414, 966781, 2792484, 4162192, 3574166, 1694374, 666403, 865801, 373132, -1741658, -3727385, -3836124, -2859163, -2552384, -2967954, -2908773, -1989047, -744373, 505023, 1500987, 1448212, -37537, -1865927, -2588876, -2132575, -1332562, -400069, 828016, 1717114, 1505447, 855026, 1132593, 2209653, 2538706, 1483981, -29504, -1418361, -3244088, -5486957, -6716627, -6106917, -4938979, -4724845, -4845766, -3677413, -1486020, -369146, -1179632, -2136883, -1223101, 1183518, 3090951, 3659294, 3953504, 4857100, 5265282, 3146935, -1759933, -6953177]
37992f953177k285038J511257L155162J860056l94451j219550k63567R34394J127413
37983b527501O57101M55330N92927N52010M22914P35763J181078P58460m29118
37974B398964q55944O7055N73170j004542l236664l127270m92911J463396O32250
37965c582496j095157q70861Q73191J423656J54931o33097N32495J974617J406244
37956A83523p69973k227834j947421j040168n26615R2273J476053K860555K924882
37947A025275J734448O79150M79778L39018m84957j207744n71117J075332J859211
37938D928394O82601j422847k580909k075666o83040M44492O98038J75760n17632
37929c50809p30431l37230K52896P44855J211635J517482J115221o0819j039692
$$ y = [-6953177, -9238215, -7726958, -4571796, -2711740, -3106191, -4325741, -4589308, -3654914, -2527501, -1870400, -1415070, -822143, -270133, 152781, 888544, 2069622, 2828082, 2398964, 1543020, 1610075, 2183245, 1178703, -2057961, -5185231, -5678142, -4214746, -3582496, -4677653, -5548514, -4675323, -3251667, -3096736, -3729833, -3197338, -1222721, 183523, -586450, -2814284, -4761705, -5801873, -6328488, -6236215, -4760162, -1899607, 1025275, 2759723, 3438873, 3918651, 4257669, 3772712, 2564968, 1993851, 3069183, 4928394, 5610995, 4188148, 1607239, -468427, -1151467, -706975, -8937, 166823, -350809, -1081240, -1418470, -1165574, -420719, 790916, 2308398, 3423619, 3362800, 2323108]
37920B323108q69225J48729J016015J412091J534622R29039j099178l721715m707181
37911c033695l060903m43432R47007R53665Q43799J004127P76835J75222O6201
37902a771174N04910M37348m64181j069473o07986Q8292J56842L04019J407497
37893a013906K422674J518853r73366k623446k174533j035188q42612j127009
37885e848533n50150P50512J542708J524424J420419J336549N82628o92327j149478
37876a083248j92377Q64895N09283p78296j145709K561J091039M82210j234742
37867a484384j881207n26911J147546R06483j047888k116107n91756J979660K582962
37858a031602M89205j810069j626154P81984K669628K047688k20975j721068j396422
$$ y = [2323108, 1453883, 1602612, 2618627, 4030718, 5565340, 6494379, 5395201, 1673486, -3033695, -6094598, -6538030, -5591023, -4637358, -3793559, -2789432, -2012597, -1837375, -1771174, -1266264, -828916, -1293097, -2362570, -2970556, -2882264, -2725422, -2421403, -1013906, 1408768, 2927621, 1954255, -669191, -2843724, -3878912, -4721524, -5848533, -6398683, -5648171, -4105463, -2581039, -1160620, 175929, 758557, 66230, -1083248, -1275625, -410730, 98553, -679743, -1825452, -1822891, -731852, -249642, -1484384, -3365591, -3892502, -2744956, -1838473, -2886361, -5002468, -5594224, -3614564, -1031602, -542397, -2352466, -3978620, -3196636, -527008, 1520680, 1299705, -421363, -1817785]
37849a817785n07051n52840j068337m97678J063394J595159J89726j237444o54386
37840c487242R12454R15130o95926j439749l30435P12247L34449N2495J363755
37831a662822K696510J691809q18056j833961n97607P28886P50768N02463Q36089
37822B294079P16573n73420j569936o89438J209863K027164J231225j04207j264921
37813C276982k204644k440981j446222K625N24815K08813L48527R80975N79177
37804a69933j154576k088866n74794J904241K688806J556318M36946N8038q56925
37795A799255k746902l749451k248246N99714K326197K226807J535476J154523
37787H97373Q01429K28724k75750p95984j759769k589127j786200Q65819L385565
$$ y = [-1817785, -2324836, -2877676, -3946013, -4443691, -3380297, -1785138, -1595412, -2832856, -3487242, -2574788, -1659658, -2355584, -3795333, -4125768, -3413521, -3079072, -3026577, -1662822, 1033688, 2725497, 1907441, 73480, -524127, 204759, 955527, 1457990, 2294079, 3010652, 2437232, 867296, 177858, 1387721, 3414885, 4646110, 4541903, 3276982, 1072338, -1368643, -2814865, -2812240, -2287425, -2078612, -1730085, -749110, -169933, -1324509, -3413375, -3988169, -2083928, 604878, 2161196, 2598142, 2656180, 1799255, -947647, -4697098, -6945344, -6345630, -4019433, -1792626, -257150, 897373, 1698802, 1927526, 1651776, 855792, -903977, -3493104, -5279304, -4413485, -1027920]
37778a027920L850926K591294J111111j12973j354751k083442j593429p89802
37770E91014j254051k441172k020270L65669J964822Q90247q37623l23551J644448
37761a420467J793693m98397k237206j381784L71602O46072m8876K19556J316271
37752a239536J427270L21780k39103L96357N00382j155357k855561k036514J012677
37743c867605L293631K845810Q26415m85861l90852L11897R69061J369204R92182
37734E863882n49008k300365k554628j047163N67443R56279O73234O94672N83467
37725B887813n60575k142140k676916k008573j328317j081073m78225P68503J872444
37716d747059K434428K769822K387499K53947k520350k671455O77876L586633
$$ y = [-1027920, 2823006, 5414300, 6525411, 6412438, 5057687, 2974245, 1380816, 591014, -663037, -3104209, -5124479, -4758810, -2793988, -1903741, -2741364, -3064915, -1420467, 373226, -125171, -2362377, -3744161, -3372559, -2726487, -2775363, -2555807, -1239536, 187734, 509514, 270411, 666768, 1167150, 11793, -2843768, -4880282, -3867605, -573974, 2271836, 3098251, 2612390, 2221538, 2533435, 3502496, 4871700, 5863882, 5314874, 3014509, 459881, -587282, -19839, 936440, 1609674, 2304346, 2887813, 2327238, 185098, -2491818, -4500391, -5828708, -6909781, -7388006, -6619503, -4747059, -2312631, 457191, 2844690, 3098637, 578287, -2093168, -1415292, 2171341]
37708B171341K098605j988010l423453r36384J311843J74490k213847k306910
37700e112325l29730R21413N30105m6571N6089K54123L18535P60919J292353Q30881
37690e24208n56916j349981p92380p0254m99308j519786j387621N69062K997602
37681c133790L747751J994932o56198j491453L28824K468327K000886r30693l220749
37672A107837k649263l45995J065223O31050m43330o96848R5491J006603R46479
37663G17247k24458j348147j155831J14176J004901Q83676O56972J013916J193524
37654B855976M40632m08771j59829O56186N02921o74211j317102p16217m8487
37645A131098m36173j266311j274265m07179L14401L06716j0182K9406N45387
$$ y = [2171341, 4269946, 2281936, -1141517, -2077901, -766058, -591568, -2805415, -5112325, -5442055, -4520642, -3990537, -4037108, -3981019, -3726896, -3408361, -2647442, -1355089, -524208, -1081124, -2431105, -3223485, -3293739, -3793047, -5312833, -6700454, -6131392, -3133790, 613961, 2608893, 1952695, 461242, 790066, 3258393, 5259279, 4328586, 1107837, -1541426, -1887421, -822198, -191148, -634478, -1331326, -1235835, -229232, 717247, 492789, -855358, -2011189, -1897013, -892112, -8436, 648536, 1662452, 2855976, 3296608, 2887837, 2728008, 3384194, 3887115, 3212904, 1895802, 1179585, 1131098, 694925, -571386, -1845651, -2252830, -1938429, -1631713, -1641895, -1612489, -1067102]
37636a067102R92701O03979p89643k220349k318381q93047O62084R31811M7423
37627d050524p15307m71966O59371K058388K994796K780359J379709j20930m75967
37618D037929Q4061k4385j528014k921991k124183P70826L248976L045200M72837
37609E061256k155220k949844j923633m40776K05190l12779j341750j841421j200186
37600f899163K74849J654940K208372J915399J293563R14102J028729J382142
37592C772933J357816O02834m29374q87478n57068p5662L0306k9111K1801j17520
37582C689477o18791p45530J68040J196549N86581j657486l181994k075242O23702
37573b014694K221228J630033J91411n52078o36184q67127j235241r35956L74333
$$ y = [-1067102, -74401, 529578, -260065, -2480414, -4798795, -5691842, -5029758, -4097947, -4050524, -4765831, -5237797, -4578426, -2520038, 474758, 3255117, 4634826, 4513896, 4037929, 4121990, 4097605, 2569591, -352400, -2476583, -1705757, 1543219, 4588419, 5061256, 2906036, -43808, -1967441, -2408217, -2203027, -2515806, -3857556, -5698977, -6899163, -6624314, -4969374, -2761002, -845603, 447960, 1362062, 2390791, 3772933, 5130749, 5733583, 5304209, 4416731, 3859663, 3784001, 3814307, 3785196, 3806997, 3689477, 3070686, 2325156, 2493196, 3689745, 4276326, 2618840, -563154, -2638396, -2014694, 206534, 1836567, 2027978, 1475900, 839716, -27411, -1262652, -2198608, -1824275]
37564a824275J977173K743402K117820N36080r48652j543965j333754q99616l91910
37555D32303N35796J653895J697465j85861k756878l518340j611602R47209J615348
37546a190665L09068q84147o11124L66480Q12340O86718M57174j08985j232858
37537a395999j943349j148009L66150O64097m09861p71123P42259K463163K441993
37528A009321J395180J197922J466262J30743k733771m255685k713031O7823J500239
37519b934997J513244J366787Q67460q66068k757532k537571j73789J797140J816594
37510a908732J052243Q62877O68441l18130j109959n77399K64849k63790j541490
37501b871090j408490L84207J742927J435670N80135L60830L10937j46971l07099
$$ y = [-1824275, 152898, 2896300, 5014120, 5550200, 4601548, 3057583, 1723829, 824213, 432303, 968099, 2621994, 4319459, 4133598, 1376720, -2141620, -3753222, -2806013, -1190665, -881597, -1765744, -2376868, -2010388, -1198048, -511330, -54156, -163141, -1395999, -3339348, -4487357, -4121207, -3457110, -3866971, -4638094, -3895835, -1432672, 1009321, 2404501, 3602423, 5068685, 5199428, 2465657, -1790028, -4503059, -4435236, -2934997, -1421753, -54966, 812494, -53574, -2811106, -5348677, -5522466, -3725326, -1908732, -856489, 6388, 674829, 356699, -753260, -1330659, -1065810, -1329600, -2871090, -4279580, -3895373, -2152446, -716776, -136641, 224189, 535126, 388155, 81056]
37492H1056L08696N99482l40456j344005q50019N39017J123204R21745J186401
37483B225121J592077N21871j694137k512590r61374Q04616R83089P29622J436172
37474C124467J685614l36304k921718k656367K72301J876148o585k820403l239161
37465e022008j542617k73457l18447m40975K25104J178319J728328J678660R90447
37456a796646n6828n61398N7325R96089J002604J97206j63918L07534N70531j48352
37446D04147j146482j246622l42646N26540L15661r98768k273310k188116p48317
37437g697913N21299M59657j29710K56311J344168J329641k67383j530520o37421
37428f351871J750480L471435L361706J888293L6157j429042k036920j861607
$$ y = [81056, 389752, 989234, 648778, -695227, -1545246, -1006229, 116975, 1038720, 2225121, 3817198, 4339069, 2644932, 132342, -829032, -24416, 958673, 1688295, 3124467, 4810081, 4473777, 1552059, -1104308, -832007, 1044141, 1037556, -1782847, -5022008, -6564625, -6838082, -7156529, -7597504, -7372400, -6194081, -4465753, -2787093, -1796646, -1853474, -2414872, -2357547, -1361458, -358854, -161648, -325566, -18032, 552499, 404147, -742335, -1988957, -2331603, -1805063, -1489402, -2488170, -4761480, -6949596, -7697913, -7176614, -6716957, -6846667, -6590356, -5246188, -3916547, -4183930, -5714450, -6351871, -4601391, -1129956, 2231750, 4120043, 4156200, 2727158, 690238, -1171369]
37420a171369j470823j050982n1476J638287K779641K098187K12392q74119l01349
37411A808389N67129l2067j950839l149897j972009Q44694K735538K163638N15549
37402A530125K79228J519514J702566m18087k539975k014203N3696K59617j999312
37393a626831l464319j607683J924061L692286K735847R70061K52007N63110Q20887
37384D259426K98422q82622k006953k381669j932008j089297j15539R57624J677448
37375a215168J299180k7727j002386p21964J73397N56671L14580m9820o29915
37366a303152j713146k491612j608162P26993K393653J875514L06152J4315J367986
37357d31459K220800Q39733j568714k230021l56324J877194K199224R10892j67155
$$ y = [-1171369, -2642192, -3693174, -3744650, -2106363, 673278, 2771465, 2983857, 2109738, 1808389, 2375518, 2343451, 392612, -2757285, -4729294, -3884600, -1149062, 1014576, 1530125, 1809353, 3328867, 5031433, 4613346, 2073371, 59168, 112864, 372481, -1626831, -5091150, -6698833, -4774772, -1082486, 1653361, 2623422, 2875429, 3438539, 4259426, 4557848, 3675226, 1668273, -713396, -2645404, -3734701, -3850240, -2892616, -1215168, 84012, 56285, -946101, -1668065, -1494668, -937997, -623417, -673237, -1303152, -3016298, -5507910, -7116072, -6389079, -3995426, -2119912, -1813760, -1799445, -431459, 1789341, 2629074, 1060360, -1169661, -1525985, 351209, 2550433, 3461325, 3294170]
37348C294170m45835q47029j730557k153066j462489l37608K59043J93754j63662
37339c393279m37366r7193J128757K309122J950727J22085j273698j010515p7638
37330g78998O3158n78498j265964j799792j857968n76956J690857K695609J261289
37321a147263m59128J5139J522980J161467p24444r30388J221024K515756Q77939
37312D053082j490679j693725j81897Q34342Q56506P25059M22412l95580p88995
37303B340525K81076J821677J846666J13926j823137k792270k676887j544702
37295b433126J81324J184447O41444k57591P8216J000618O51491o98110p97747
37286d49034Q51862J938363Q73347q72905j271524o45030m51463o94304m33857
$$ y = [3294170, 2848335, 2001306, 270749, -1882317, -3344806, -3682414, -3423371, -3229617, -3393279, -3830645, -3927838, -2799081, -489959, 1460768, 1582853, 309155, -701360, -778998, -715840, -1294338, -2560302, -4360094, -6218062, -6795018, -5104161, -2408552, -1147263, -1606391, -1591252, -68272, 1093195, 368751, -561637, 659387, 3175143, 4053082, 2562403, 868678, 686781, 1521123, 2377629, 3102688, 3525100, 3129520, 2340525, 2621601, 4443278, 6289944, 6403870, 4580733, 1788463, -888424, -2433126, -2251802, -1067355, -425911, -683502, -605286, 395332, 1046823, 348713, -449034, 402828, 2341191, 3214538, 2341633, 1070109, 425079, -26384, -720688, -1154545]
37277a154545J37578O8450m61435m49056j4694k68428j154142j128821M97345
37268c927748K297934K570363J406274J05613o59729j165268j659746k044656
37260c076963k283789k271232j437077N88771K841753L514574K037312l9256q11654
37251i37561j44809O02234M98562j54283p23909j021631j057733p95472m01898
37242d136500j49636J12217P61492J513516J511910O50047k5669K18906P23286
37233A179569N40772r1640l17109j23061j56767m17062k69446L22179O23334K27350
37223A518119n61589j390082j967197j666377k27155J138343P91147q33790j310078
37214d508659M43537K399848K205897M74419l63104K64889M69369j033989l001800
$$ y = [-1154545, -1016967, -948517, -1409952, -1859008, -1873702, -2142130, -3296272, -4425093, -3927748, -1629814, 940549, 2346823, 2452436, 1792707, 627439, -1032307, -3076963, -5360752, -7631984, -9069061, -8480290, -5638537, -2123963, -86651, -125907, -937561, -1082370, -480136, 18426, -135857, -859766, -1881397, -2939130, -3734602, -4136500, -4286136, -4173919, -3412427, -1898911, -387001, 263046, 237377, 456283, 1179569, 1720341, 1628701, 1311592, 1188531, 1031764, 614702, 345256, 667435, 1290769, 1518119, 956530, -433552, -2400749, -4067126, -4294281, -3155938, -2364791, -3198581, -4508659, -4065122, -1665274, 540623, 1015042, 651938, 916827, 1386196, 352207, -2649593]
37205b649593l408999j939083J9924J130090J139005O05126K70809N96117J420804
37196b815800J975521J466621j22474j767037k171927j127281N9465L3781p83127
37187e252258p29594N51734J337735L63639j113136j155041l8604N36252M48809
37178e050464J041604K118650J734500l29020j528790m09521R59201M04086p25850
37169a785604r1464J256982N40513j600890j595676J167353K885443J134103j414744
37160D96016j281561P02149J395996L52051l79111j54697j92400o53131l60394
37151g5082N29980L87589r58932j671898r06341k2094j2363J7094P54933J192505
37141g64609N44248j97666o4267J99732k57493o82791k51667J66538m33170j226564
$$ y = [-2649593, -6058592, -7997675, -7977751, -6847661, -5708656, -5103530, -4832721, -4236604, -2815800, -840279, 626342, 503868, -1263169, -3435096, -4562377, -4502912, -4469131, -5252258, -5981852, -5430118, -4092383, -3728744, -4841880, -5996921, -6035525, -5499273, -5050464, -4008860, -1890210, -155710, -484730, -2013520, -2423041, -1463840, -1059754, -1785604, -1877068, -620086, -79573, -1680463, -3276139, -2108786, 776657, 1910760, 496016, -785545, -83396, 1312600, 1664651, 1285540, 1130843, 938443, 285312, -75082, 454898, 842487, -116445, -1788343, -2694684, -2716778, -2729141, -2712047, -1957114, -764609, -220361, -418027, -482294, -282562, -540055, -1222846, -1474513, -1307975, -1741145, -2967709]
37131b967709j039990m33740k12148O73501L039962M540960K267841k128895l638710
37122A01072p56184K374602J913204q41356k436970k186892j545639p63605Q36707
37113c305061K424685K302183N35592j222169k114142k378018j873957m24415
37105f055302Q26974O26797p6963O17146K088513J643865j076776k913617j644998
37096e964361Q04322J414972L82893J20187J198748J775564P23718q42428j457001
37087a843386j090877n15190k9045N02648R45205Q04007j96999j484175j700015
37078d607827j8275K325090K712693K33160k587859k381411R48289L904484L348189
37069C876533j64270l251020l244154o45732J538206R21554j568678k615736n85169
$$ y = [-2967709, -4007699, -4441439, -4653587, -3980086, -940124, 3600836, 5868677, 3739782, 101072, -655112, 1719490, 3632694, 2791338, 354368, -1832524, -3378163, -4141768, -3305061, -880376, 1421807, 1957399, 735230, -1378912, -3756930, -5630887, -6055302, -5228328, -4601531, -4678494, -4061348, -1972835, -328970, -1405746, -4319363, -5964361, -5160039, -3745067, -3362174, -3241987, -2043239, -267675, 456043, -386385, -1843386, -2934263, -3449453, -3478498, -2975850, -2030645, -1226638, -1423637, -2907812, -4607827, -4626102, -2301012, 411681, 644841, -1943018, -4324429, -3376140, 528344, 3876533, 3712263, 461243, -2782911, -3428643, -1890437, -968883, -2537561, -5153297, -5738466]
37060e738466K262624K740503R70796j94299M76302J164260K83407j124443j381640
37051e40956p03140k78957k14202O8242L66460J33069l36500m26698k45634l1814
37041b210130O20771J684914J797080P386k307202k952510j760210k61292Q11041
37032d570152J703557J856140L53886j772286k105268k68131J323974Q78757n52819
37023c152342j123363n72676M71940J774320K771529K156871l21004k806714l399463
37014d200902k221350l82951J697929L561934L790595J771341o24653j147968
37006B243975k64978j21885r51974q43797Q35240K080107J128688j009520k061757
36997A034099j493739q01913j175356j891466j390303M43576J784153J107721
$$ y = [-5738466, -3475842, -735339, 235457, 41158, 517460, 1681720, 1965127, 840684, -540956, -1244096, -1523053, -1737255, -1669013, -1302553, -1169484, -1505984, -1932682, -2178316, -2210130, -1589359, 95555, 1892635, 1900021, -407181, -3359691, -5119901, -5381193, -4570152, -2866595, -1010455, -656569, -2428855, -4534123, -4802254, -3478280, -2599523, -3152342, -4275705, -4848381, -4376441, -2602121, 169408, 2326279, 2005275, -801439, -4200902, -6422252, -6805203, -5107274, -1545340, 2245255, 4016596, 3391943, 2243975, 1978997, 1857112, 905138, 61341, 896581, 2976688, 4105376, 3095856, 1034099, -459640, -1261553, -2436909, -4328375, -5718678, -5275102, -3490949, -2383228]
36989b383228o25111j154137j15482N70805o6418l39879J307225L450034L473895
36980D117704J149072j497733l101417l760209l457407j801180O79535K700146
36972d971489L695523L786163K731077N70112j216324j193550l04629o24407k038018
36963D34458k466711j298305l9050O23371J652689K998860K928278J071410m76289
36954E428711m00040n5706o76888j180242n69168j70045j230033k268435j324605
36945b446451O73166J333614M80480o1686M45694J101304J293989J038914o4285
36936C794739k083116l405637k294366M00688K044921J624924N49366K03277N29380
36927A364176J002578J266679P68240o33837j731389j222863K17270P79750K38294
$$ y = [-2383228, -3008339, -4162476, -4277958, -3707153, -3773571, -4113450, -2806225, 643809, 4117704, 5266776, 3769043, 667626, -3092583, -6549990, -8351170, -7671635, -4971489, -1275966, 2510197, 5241274, 5811386, 4595062, 3401512, 3096883, 2472476, 434458, -2032253, -3330558, -3369608, -2746237, -1093548, 1905312, 4833590, 5905000, 5428711, 5028671, 4972965, 4296077, 3115835, 2546667, 2376622, 1146589, -1121846, -2446451, -1773285, -439671, 40809, -20877, 424817, 1526121, 2820110, 3859024, 3794739, 1711623, -1694014, -3988380, -3587692, -1542771, 82153, 631519, 834796, 1364176, 2366754, 3633433, 4401673, 3767836, 2036447, 813584, 1030854, 1810604, 2048898]
36918B048898m7623K61879M4122q64320j061770j51153J53358j320140l056826
36909c993575k760389l84987J953970K492938J378821J46358J57206J208067J631778
36900A830187L56152j417674j646318k89652P49951N05488p662L4465m4120p28837
36890f58020j094841m66647K19442Q6394P481R91934J952060J042624j245329
36881H35098k291584q12121J472919K163699R99975l87079p99975o37560q45956
36872c02584j450337j580238p40168N17884J361475J555740J154289o2143k001814
36863a547896l530574l413393j916712m68651K22127O04187Q93409O79806K52121
36854h225576Q04875K511885L621426K528165p7658k092948k385076j443715k79694
$$ y = [2048898, 2001275, 2263154, 2307276, 1442956, 381186, 230033, 383391, -936749, -3993575, -6753964, -7138951, -5184981, -2692043, -1313222, -1166864, -1009658, 198409, 1830187, 2186339, 768665, -877653, -1167305, -417354, 88134, 80472, 114937, 70817, -658020, -1752861, -2219508, -2000066, -1913672, -1906191, -914257, 1037803, 2080427, 835098, -1456486, -2268607, -795688, 1368011, 2367986, 1980907, 1180932, 543372, -302584, -1752921, -3333159, -4073327, -3555443, -2193968, -638228, 516061, 453918, -1547896, -5078470, -8491863, -10408575, -10877226, -10655099, -10050912, -9157503, -8477697, -8225576, -7420701, -4908816, -1287390, 1240775, 1163117, -929831, -3314907, -4758622, -5038316]
36845e038316M06348L80317M1784K00454J088358J852468J503464J24990j161041
36836f01174j181557L19987K180411K478399O08681j518624j660919m47640n09244
36827c31680k240987k968500j359938J02665q33908k144221o07323K743877L972215
36818c667800K333748J042876J625347J539851j020963l483047k636643M40348
36810c826283K176726J683924J057882J270356R50495m67885j230820p2045J484408
36801C026758J170544q88018k573036k611169j592949m45919P36239K060723K987850
36792A871023K716298J150813p92333j832746j431730m20210j81383q69657r88655
36783g78580N41534K468676K585463P68911r05490j220840j166132j568935j411771
$$ y = [-5038316, -4631968, -4251651, -4209867, -4009413, -2921055, -1068587, 434877, 559867, -601174, -1782731, -1462744, 717667, 3196066, 3804747, 2286123, 625204, 177564, -331680, -2572667, -5541167, -6901105, -6798440, -7632348, -9776569, -10383892, -7640015, -3667800, -1334052, -291176, 1334171, 2874022, 1853059, -1629988, -4266631, -3826283, -1649557, 34367, 1092249, 2362605, 3313100, 2845215, 1614395, 1542350, 3026758, 4197302, 3309284, 736248, -1874921, -3467870, -3913789, -3177550, -1116827, 1871023, 4587321, 5738134, 4945801, 3113055, 1681325, 1261115, 1079732, 210075, -778580, -237046, 2231630, 4817093, 5586004, 4680514, 3459674, 2293542, 724607, -687164]
36774f87164R406J044360J4507j642978j182235J085376K062625N65107j105838
36765A63166r62020K6373K96341K02397M63400K52784j072979k034085j105474
36756c770097N19285N84770p35162j394844q57614l95476l23409M15720J702852
36747d253975J857341N03004m91561K6436O64276l6016j108658q91144J40168
36738c590129K85617m15127k62700J159581K055806R39873j349014k904801k993947
36729g074841k173943r32253O91699K320845L055359K364404P18593q25234j413669
36720c269040q88412M5154K50107o05894j311817m69289J368858K103194J005984
36711a771155k15586j57677P7586r74475k220401j607510J75741M39042j104008
$$ y = [-687164, -677758, 366602, 381109, -1261869, -2444104, -1358728, 703897, 1269004, 163166, -798854, -772481, -476140, -273743, 189657, 442441, -630538, -2664623, -3770097, -3250812, -2666042, -3401204, -4796048, -5653662, -6049138, -6372547, -5956827, -4253975, -2396634, -1893630, -2385191, -2358755, -1694479, -1730495, -2839153, -3730297, -3590129, -3304512, -3719639, -3982339, -2822758, -766952, 172921, -1176093, -4080894, -7074841, -9248784, -10181037, -9489338, -7168493, -4113134, -1748730, -1030137, -1855371, -3269040, -4157452, -4112298, -3862191, -4468085, -5779902, -6249191, -4880333, -2777139, -1771155, -1986741, -2144418, -2066832, -3041307, -5261708, -6869218, -6693477, -6254435, -7358443]
36702g358443j615839M56284K997663L539198K551020J797548J481277R12094
36694D760802L22566N3296o76917k287388l384989k656996j009823o499N11214
36685d374734J288842J594339O09791m06737Q3383J060261O28555n11245l09582
36676c37127Q02704P46591j21106M35683J967981J468080j282835k684190j056519
36667f0738O06102k44694j558992n36050J500953J575418J64604P3972J479741
36658C000316J771743k0149j878050k131146j497733j212611j214271r77132o01980
36649d761013k72652L16646J281348J941104J464700q9875j607512j842752p14219
36640d284225M12411K38538p59532r34078K48093J585760J920317J302966K08783
$$ y = [-7358443, -8974282, -8517998, -5520335, -1981137, 569883, 2367431, 3848708, 4760802, 5083368, 5136664, 4459747, 2172359, -1212630, -3869626, -4879449, -4885948, -4374734, -3085892, -1491553, -881762, -1288499, -1205116, -144855, 483700, -27545, -337127, 465577, 1212168, 1091062, 1526745, 3494726, 4962806, 3679971, 995781, -60738, 545364, 300670, -1258322, -1794372, -293419, 1281999, 1446603, 1520575, 3000316, 4772059, 4751910, 2873860, 742714, -755019, -1967630, -3181901, -4159033, -4761013, -5033665, -4717019, -3435671, -1494567, -29867, -119742, -1727254, -3570006, -4284225, -3871814, -3633276, -4392808, -5326886, -5078793, -3493033, -1572716, -269750, -60967]
36631f0967r40903j174147L12052K221245J983063m70729j927316m06521J748033
36622A283810J431400n63735j243853k92376O6218n84795j83646J764424K706432
36613D383879Q78899j802987k349288o17681R76086P51018o47203j581514j297827
36604a306618l84570J72217J68491K34755O76261Q45033J53324q84328j362910
36595a688345j200182p76079O1543J506517K717570K491270Q92637q59744j974619
36586A170568k487987k326257j266453J23860P08328J87350o07296r06385o56633
36577f060905k8377Q07487J399560J359434R61523O62646K59177o14763j464773
36568b718991j442230o41098J25165N58622Q32204P00981r0493q44172p07902
$$ y = [-60967, -1001870, -2176017, -1863965, 357280, 2340343, 1869614, -57702, -464223, 1283810, 2715210, 2151475, 907622, 615246, 681464, 96669, -86977, 1677447, 4383879, 5262778, 3459791, 1110503, 492822, 1468908, 2219926, 1572723, -8791, -1306618, -1691188, -1518971, -1350480, -1115725, -439464, 405569, 558893, -325435, -1688345, -2888527, -3664606, -3603063, -2096546, 621024, 3112294, 4004931, 3145187, 1170568, -1317419, -3643676, -4910129, -4786269, -4077941, -3890591, -4497887, -5404272, -6060905, -6089282, -5281795, -3882235, -2522801, -1561278, -898632, -639455, -1254218, -2718991, -4161221, -4802319, -4677154, -4118532, -3286328, -2585347, -2675840, -3520012, -4227914]
36559d227914j58124k60109p55932n11514L53872O01095Q1897j12295J99459Q8004
36549d701561k29777P40288K872154L700031J866399p34580j784020j670844j959593
36540a901503k338464j447336J58819L87760j074036j959492n41897J935073K850048
36531c931028J447974l93441n25495R49818J941648J062532o57989j311443o80424
36522b097848j17093k30845k70991J00128J87469l7323N38680J894599J933391
36513A900167m96682l053646k557290N45610K669438J904081M7680o55819o13435
36504c09896j381468k619023k467019m94784J520193K042404J580309J287131
36496h42153R22960m28704k151916k316639m22571J570847J779729P68866L13402
$$ y = [-4227914, -4386038, -4646147, -5402079, -5913593, -5559721, -4958626, -4876729, -4989024, -4789565, -4701561, -4931338, -4191050, -1318896, 2381135, 4247534, 3512954, 1728934, 58090, -1901503, -4239967, -5687303, -5528484, -5140724, -6214760, -8174252, -8716149, -6781076, -3931028, -2483054, -2876495, -3401990, -2452172, -510524, 552008, -105981, -1417424, -2097848, -2214941, -2445786, -2716777, -2616649, -2429180, -2466503, -1927823, -33224, 1900167, 1403485, -1650161, -4207451, -3661841, -992403, 911678, 959358, 303539, -309896, -1691364, -4310387, -6777406, -7272190, -5751997, -3709593, -2129284, -842153, 80807, -347897, -2499813, -4816452, -5239023, -3668176, -1888447, -1119581, -806179]
36487h06179P82954J102311O32376l19819j386672k159398j796025q5807J540012
36478b496247J646474R46680R89484J279243J20402j889717k105200m0070J587360
36469C8409J034722q1128m7335J02739q93664j647549m24053J477693J484672
36460A044506k82386j474340j120472k51592M56963J200408J570167Q79458k16665
36451A806047m94423l02892q83086j859691j661694l45820L19582k21908n22390
36442d166275L55791J574516K210482K280876J671344N2423j602824j518492O5223
36433I23064O11751j119598l119535l070567j499394m04256j73718K57471J049121
36424f545661J125792L2862j214881j252696K96269K420881L360238K248903M19900
$$ y = [-806179, -23225, 1079086, 1711462, 1391643, 4971, -2154427, -3950452, -4036259, -2496247, -849773, 96907, 1086391, 2365634, 2486036, 596319, -1508881, -1548951, 38409, 1073131, 992003, 944668, 1047407, 153743, -1493806, -1917859, -440166, 1044506, 762120, -712220, -1832692, -2084284, -1627321, -426913, 1143254, 2022712, 1806047, 1311624, 1008732, 125646, -1734045, -3395739, -3741559, -3421977, -3643885, -4166275, -3810484, -2235968, -25486, 2255390, 3926734, 3979157, 2376333, 857841, 923064, 1534815, 415217, -2704318, -5774885, -7274279, -7678535, -7852253, -7594782, -6545661, -5419869, -5387007, -6601888, -7854584, -7558315, -5137434, -1777196, 471707, 891607]
36415H91607J07541J400874J811553j78767k537403k267573L51421K091730J086409
36406B757392j130351k176655j661349p05941n6711J48596l69301j646155k643716
36397g484191k060712r6972J602918K026839J821053J794275J565895P28983L15232
36388B13320J386210K658499J700399j223756k789537j158237J234369J203323
36380C224590o49696j341289k59432L81106n05600j418846j200377p00009n45501
36371c015054K66131K048274K821961J062682j412265j546105P19936K465292
36363C410852J849589J62144n38292j39152J00821k21349k94336J74666L1694
36354D536637j717457l805756l502026j13595L365882L420247K92278k488530
$$ y = [891607, 999148, 2400022, 4211575, 4032808, 1495405, -772168, -420747, 1670983, 2757392, 1627041, -549614, -2210963, -2916904, -2973615, -2825019, -3194320, -4840475, -7484191, -9544903, -9641875, -8038957, -6012118, -4191065, -2396790, -830895, -101912, 213320, 1599530, 4258029, 5958428, 4734672, 1945135, 786898, 2021267, 3224590, 2574894, 1233605, 974173, 1355279, 849679, -569167, -1769544, -2469553, -3015054, -2748923, -700649, 2121312, 3183994, 1771729, 225624, 945560, 3410852, 5260441, 5422585, 4884293, 4745141, 4845962, 4624613, 4330277, 4504943, 4536637, 2819180, -986576, -4488602, -4602197, -1236315, 2183932, 2476210, -12320]
36346a2320k707406j664983j320649j351926n06287O69632M98051j015497j926350
36337i337735r83039R23617K236268K501550K174634J515490M13683r63061j921768
36328c440361j840542r22987j37131j76875n99510l71168P63792J931496K195681
36319b597605J473340L19909o15754q03358j62244N71966M16362o61600j658357
36310c717341j786241j151102r0298J254566K394865K477992J364391j6430q57772
36301a27370j296136j641832j647334j068260j69854P81973J684339J899628N82692
36292a002154j654240k689978j505355K75376O07219k18835l76143P32897J957462
36283c873751K187560J372294M0667j107743j385160p81590j62266j46182l03047
$$ y = [-12320, -2719726, -4384709, -5705358, -7057284, -7563571, -6893939, -6395888, -7411385, -9337735, -10320774, -9397157, -7160889, -4659339, -2484705, -969215, -555532, -1518593, -3440361, -5280903, -6203890, -6341021, -6517896, -7117406, -7488574, -6724782, -4793286, -2597605, -1124265, -804356, -1420110, -2223468, -2385712, -1813746, -1397384, -2058984, -3717341, -5503582, -6654684, -6744982, -5490416, -3095551, -617559, 746832, 730402, -127370, -1423506, -3065338, -4712672, -5780932, -5950786, -5168813, -3484474, -1584846, -1002154, -2656394, -5346372, -6851727, -6576351, -5969132, -6187967, -6564110, -5831213, -3873751, -1686191, -313897, -273230, -1380973, -2766133, -3547723, -3709989, -3856171, -4159218]
36274d159218j6579O66429J588817K673678K882365P55879k676943l549528K3981
36265a811119M411941M632939J009102j607925q20593P09058J38298j578681k117078
36256B965942j433920r69345j009425p95165j68530M30973Q55679J047856O97445
36247A621510o8095m55857j68876L5357m53969j175599j342100o67344P89248
36238a885725K540680L280119J916956o92086k407673k431495j785961j157407
36230b622592k62724M29059j96038j427435j044066Q74921J382554n39520j783146
36221e188987q4517J913340R01740j396211r49755J841704K772728O08970j385242
36212i66230j091651l76742j037099j686996o18991J125527J590356O69699o62835
$$ y = [-4159218, -4175797, -3509368, -1920551, 753127, 3635492, 4391371, 1714428, -1835100, -1811119, 2600822, 7233761, 8242863, 6634938, 5814345, 6523403, 6661701, 5083020, 2965942, 1532022, 562677, -446748, -1241913, -1410443, -979470, -123791, 924065, 1621510, 1553415, 1097558, 928682, 964039, 510070, -665529, -2007629, -2674973, -1885725, 654955, 3935074, 5852030, 5159944, 2752271, 320776, -1465185, -2622592, -2885316, -2456257, -2652295, -4079730, -5123796, -4248875, -2866321, -3405841, -5188987, -5273504, -3360164, -2458424, -3854635, -4804390, -2962686, -189958, 419012, -966230, -2057881, -2434623, -3471722, -5158718, -5777709, -4652182, -3061826, -2392127, -3054962]
36203c054962j938932k451237r05418K391837M679417L912077J403646l48755
36195C687673r87251j527720j661897k53560K056772L003828J553341r20360k361121
36186B589705j839055J29965K006560K263932R53851j94390q6629J41783r73995
36177D991727k666427k955698j612473k11467M65913J063164J662825J311666
36169B049230Q8035l07943R84385K492984K513888J421570O10547J72870q41487
36160I184079k365351l037718k076692l56530O90136O01792M9154j45378R8397
36151B641889J23978n90382j631587k007089j362737m39286q6978k16630p8831
36142c647653O98432J707045K208303J742551N25664n66225p49014k96365k79795
$$ y = [-3054962, -4993894, -7445131, -8350549, -5958712, -1279295, 2632782, 4036428, 3687673, 2700422, 1172702, -489195, -742755, 1314017, 4317845, 5871186, 4950826, 2589705, 750650, 880615, 2887175, 5151107, 6104958, 5910568, 5823939, 5965722, 4991727, 2325300, -630398, -2242871, -2454338, -1988425, -925261, 737564, 2049230, 2137265, 1829322, 2813707, 5306691, 7820579, 9242149, 9852696, 10025566, 9184079, 6818728, 3781010, 1704318, 1347788, 2037924, 2639716, 2688870, 2543492, 2641889, 2765867, 2175485, 543898, -1463191, -2825928, -3265214, -3352192, -3568822, -3647653, -2949221, -1242176, 966127, 2708678, 3234342, 2668117, 1919103, 1622738, 1342943]
36133A342943r78061j174880J79164K065198K330537N93782r97187n22985J182681
36124D021192J822533Q36902j39465n6964n6934j345330k722279j989971N24064
36115H93748J831219K70823k080817k311468p37644j57345j520034k556651j313373
36106g681542P99611R13518j274875k956449j654873J911454M804141N084954
36098e4061L516225K125333J576375N95864j797726m283546m520939k273710M7538
36089e068647M03183m87565o02879N21322J576027J537158O42056m63288j290265
36080c232898j199292K12629K042921K472629Q69081j208321j736557m70593J096629
36071a153772J571877Q30428l49253j093941q87538J36667J087482R29953l52172
$$ y = [1342943, 364882, -809998, -630834, 1434364, 3764901, 4358683, 3361496, 2838511, 4021192, 5843725, 6680627, 6541162, 6484198, 6427264, 5081934, 2359655, 369684, 893748, 2724967, 2995790, 914973, -1396495, -2134139, -2291484, -3811518, -6368169, -7681542, -6881931, -5968413, -7243288, -10199737, -11854610, -9943156, -5139015, -54061, 3462164, 5587497, 7163872, 7759736, 5962010, 1678464, -2842475, -5116185, -5068647, -4665464, -5153029, -5755908, -5234586, -3658559, -2121401, -1479345, -1942633, -3232898, -4432190, -4219561, -2176640, 295989, 1165070, -43251, -1779808, -2250401, -1153772, 418105, 1248533, 899280, -194661, -1082199, -945532, 141950, 1071903, 719731]
36062G19731j364750o01634J676874L307985K453695k54935k408022k569543j543051
36053e83650p44720l61633J47813N89234K85428n06941o65793J45245Q65988M56339
36043c72690p49322j505640j070226J04510Q27423K63058j155878k010085j399216
36034g068066J04678J397446K175213K566659K116226N00321j065110q37607Q40641
36025G30401J664073O37766n19046j88107O54898K55835j002921j403322p43012
36016H6565l63907p10970q42974l88900j21378k59885N3839R89875J335653M39888
36006B17806n18793k87932N64416P53521L55024L09511M60128k00180j397593
35997B55908j461183Q9302J333000M20661j753534k736313j844377p06061m16575
$$ y = [719731, -645019, -1246653, 430221, 3738206, 6191901, 5936966, 3528944, 959401, -583650, -1328370, -1690003, -1542190, -952956, -667528, -1174469, -1840262, -1695017, -829029, -372690, -1122012, -2627652, -3697878, -3593368, -2765945, -2502887, -3658765, -5668850, -7068066, -6963388, -5565942, -3390729, -824070, 1292156, 1792477, 727367, -110240, 730401, 2394474, 3032240, 2513194, 2325087, 2979985, 3235820, 2232899, 829577, 86565, -277342, -988312, -1831286, -2220186, -2341564, -2601449, -2547610, -1557735, -222082, 217806, -300987, -588919, -24503, 729018, 1084042, 1393553, 1853681, 1653501, 255908, -1205275, -1115973, 217027, 637688, -1115846, -3852159, -5696536, -6402597, -6819172]
35988f819172R3897J877842L514036K624149m72814k479360j139117J813248K862128
35979A874837J084968j086738j313167p0187O58710K36359l37470n12876r85686
35970d51250j963858k052261j52856K309441K771827J059021k89268L05786J348040
35961B884622R53025j79180l62177m9164q17315k018949j424852P46591J529294
35952A261895j94523j709504o57672J343062J440550j36037j083712q87756q26324
35943a450021r10940K23990K376674L375292K205338M55424j05851K88986M44625
35934F903517K7130n30591r51111j171804j143315j048148j177664j383178j214172
35925a689336o27309M6831O78190J159148R87578j8093r26578p34516J18791N03004
$$ y = [-6819172, -6725275, -4847433, -1333397, 1290752, 817938, -1661422, -2800539, -987291, 1874837, 2959805, 1873067, 559900, 489713, 1148423, 1384782, 1047312, 534436, -451250, -2415108, -4467369, -4620225, -2310784, 461043, 1520064, 1230796, 1536582, 2884622, 3837647, 3658467, 3296290, 3247126, 2429811, 410862, -1013990, -267399, 1261895, 1067372, -642132, -1299804, 43258, 1483808, 1347771, 264059, -623697, -1450021, -2360961, -2136971, 239703, 3614995, 5820333, 6275757, 6169906, 6458892, 6903517, 6930647, 6400056, 5448945, 4277141, 3133826, 2085678, 908014, -475164, -1689336, -2316645, -2269814, -1591624, -432476, 555102, 537009, -389569, -1124085, -1005294, -502290]
35915e02290M59731P94574J149074L76756j144431j618249o30953J71629j51915
35906a096074m37287K39523Q13797K90301j32031J138154L210246L546188J297286
35897H870103j679278l072854k371816q92006k21393o54212j036724m35047L72769
35888a120458K0442j140130j434461n98975j08474k66004O86057L282278M936606
35879D256881L333726m2749k081176k369125k758474l533103k941623n18843J749379
35870d905107K139592J085532j79052j107469j357623m65494J104906J793653
35862a891062P34387j050405j863558j128545L93358J519590J478972M72204l45696
35853a680755l2767Q67406R13702k38187j251935q90214L42736R47221M21900
$$ y = [-502290, -42559, 752015, 1901089, 2277845, 1133414, -484835, -1115788, -944159, -1096074, -1533361, -1293838, -480041, -189740, -321771, 816383, 4026629, 7572817, 8870103, 7190825, 4117971, 1746155, 854149, 632756, -21456, -1058180, -1493227, -1120458, -1100016, -2240146, -3674607, -4273582, -4382056, -4648060, -3962003, -679725, 4256881, 7590607, 7547858, 5466682, 3097557, 339083, -3194020, -6135643, -6654486, -4905107, -2765515, -1679983, -1859035, -2966504, -4324127, -4789621, -3684715, -1891062, -1156675, -2207080, -4070638, -5199183, -4805825, -3286235, -1807263, -1335059, -1680755, -1713522, -846116, 67586, -170601, -1422536, -2312750, -1970014, -1022793, -600893]
$$ [...]
##END NTUPLES=NMR SPECTRUM
##END=
