##TITLE=31Pdec_DE-127_D0_R
 , 24 sc
 11.2.2026
##JCAMPDX= 6.0         $$ Bruker NMR JCAMP-DX V2.0
##DATA TYPE= NMR SPECTRUM
##DATA CLASS= NTUPLES
##ORIGIN= UXNMR, Bruker Analytische Messtechnik GmbH
##OWNER= root
$$ XWIN-NMR		Version 3.5
$$ Wed Feb 11 14:13:31 2026 Russian Standard Time (UT+4h)  she@DPX200
##.OBSERVE FREQUENCY= 81.013821
##.OBSERVE NUCLEUS= ^31P
##.ACQUISITION MODE= SIMULTANEOUS
##.ACQUISITION SCHEME= undefined
##.AVERAGES= 24
##.DIGITISER RES= 17
##SPECTROMETER/DATA SYSTEM= spect
##.PULSE SEQUENCE= zgpg30
##.SOLVENT NAME= DMSO
##.SHIFT REFERENCE= (INTERNAL, DMSO, 0, 198.062)
##AUDIT TRAIL= $$ (NUMBER, WHEN, WHO, WHERE, WHAT)
$$ ##TITLE= Audit trail, XWIN-NMR		Version 3.5
$$ ##JCAMPDX= 5.01
$$ ##ORIGIN= Bruker BioSpin GmbH
$$ ##OWNER= she
$$ F:/spectra/data/she/nmr/P31/2/pdata/1/auditp.txt
$$ ##AUDIT TRAIL=  $$ (NUMBER, WHEN, WHO, WHERE, WHAT)
(   1,<2026-02-11 14:12:19.46 +0400>,<she>,<DPX200>,
      <created by zg, POWCHK disabled, PULCHK disabled
       configuration hash MD5:
       00 E9 B6 7A A2 85 ED C7 34 08 36 98 17 FE 4E 26
       data hash MD5: 32K
       C3 D9 D7 21 44 90 05 85 3E 7E A9 81 5E 12 96 F1>)
(   2,<2026-02-11 14:12:22.71 +0400>,<she>,<DPX200>,
      <Start of raw data processing
       efp BC_mod = 2 LB = 1.5 FT_mod = 6 PKNL = 1 PHC0 = 1383.522 PHC1 = 140.7009 SI = 64K 
       data hash MD5: 64K
       5C A7 7B 02 19 78 EC 2D 60 93 11 01 52 DA 18 1D>)
(   3,<2026-02-11 14:12:45.18 +0400>,<she>,<DPX200>,
      <pk PHC0 = -2.648647 PHC1 = 0 
       data hash MD5: 64K
       59 B8 C3 C8 95 E9 32 FC 11 FE 59 36 82 A8 F9 64>)
$$ ##END=
$$ 
$$ hash MD5
$$ B2 F4 52 D7 2D B9 63 F3 20 A5 DD 67 A0 ED B4 9A
##$RELAX= 
##$RELAX= 
##$RELAX= 
##$RELAX= 
##$RELAX= 
##$RELAX= 
##$RELAX= 
##$RELAX= 
$$ Bruker specific parameters
$$ --------------------------
##$DU= <F:/spectra>
##$EXPNO= 2
##$NAME= <P31>
##$PROCNO= 1
##$TYPE= <nmr>
##$USER= <she>
##$AMP= (0..31)
100 100 100 100 100 100 100 100 100 100 100 100 100 100 100 100 100 100 
100 100 100 100 100 100 100 100 100 100 100 100 100 100 
##$AQSEQ= 0
##$AQ_mod= 1
##$AUNM= <au_zg>
##$AUTOPOS= <>
##$BF1= 81.014009
##$BF2= 200.13
##$BF3= 200.13
##$BF4= 200.13
##$BF5= 200.13
##$BF6= 200.13
##$BF7= 200.13
##$BF8= 200.13
##$BYTORDA= 1
##$CFDGTYP= 0
##$CFRGTYP= 5
##$CHEMSTR= <none>
##$CNST= (0..31)
1 1 145 1 1 1 1 1 1 1 1 1 1 1 1 1 1 1 1 1 1 1 1 1 1 1 1 1 1 1 1 1 
##$CPDPRG= <waltz16>
##$CPDPRG1= <>
##$CPDPRG2= <waltz16>
##$CPDPRG3= <>
##$CPDPRG4= <mlev>
##$CPDPRG5= <mlev>
##$CPDPRG6= <mlev>
##$CPDPRG7= <mlev>
##$CPDPRG8= <mlev>
##$CPDPRGB= <>
##$CPDPRGT= <>
##$D= (0..31)
0 1 0 0 0 0 0 0 0 0.06 0 0.03 2e-05 3e-06 0 0 0.0002 0 0 0 0 0 0 0 0 0 
0 0 0 0 0 0 
##$DATE= 1770804738
##$DBL= (0..7)
120 120 120 11 120 120 24 19 
##$DBP= (0..7)
150 150 150 150 150 150 150 150 
##$DBP07= 0
##$DBPNAM0= <>
##$DBPNAM1= <>
##$DBPNAM2= <>
##$DBPNAM3= <>
##$DBPNAM4= <>
##$DBPNAM5= <>
##$DBPNAM6= <>
##$DBPNAM7= <>
##$DBPOAL= (0..7)
0.5 0.5 0.5 0.5 0.5 0.5 0.5 0.5 
##$DBPOFFS= (0..7)
$$ [...]
##$SUBNAM2= <"">
##$SUBNAM3= <"">
##$SUBNAM4= <"">
##$SUBNAM5= <"">
##$SUBNAM6= <"">
##$SUBNAM7= <"">
##$SUBNAM8= <"">
##$SUBNAM9= <"">
##$SW= 400.765351723535
##$SWIBOX= (0..15)
0 1 3 0 0 0 0 0 0 0 0 0 0 0 0 0 
##$SW_h= 32467.5324675325
##$TD= 32768
##$TD0= 1
##$TE= 0
##$TE2= 300
##$TE3= 300
##$TEG= 300
##$TL= (0..7)
0 120 53 12 22 120 120 120 
##$TP= (0..7)
150 150 150 150 150 150 150 150 
##$TP07= 0
##$TPNAME0= <>
##$TPNAME1= <>
##$TPNAME2= <>
##$TPNAME3= <>
##$TPNAME4= <>
##$TPNAME5= <>
##$TPNAME6= <>
##$TPNAME7= <>
##$TPOAL= (0..7)
0.5 0.5 0.5 0.5 0.5 0.5 0.5 0.5 
##$TPOFFS= (0..7)
0 0 0 0 0 0 0 0 
##$TUNHIN= 0
##$TUNHOUT= 0
##$TUNXOUT= 0
##$USERA1= <user>
##$USERA2= <user>
##$USERA3= <user>
##$USERA4= <user>
##$USERA5= <user>
##$V9= 5
##$VALIST= <valist>
##$VCLIST= <CCCCCCCCCCCCCCC>
##$VD= 0
##$VDLIST= <DDDDDDDDDDDDDDD>
##$VPLIST= <PPPPPPPPPPPPPPP>
##$VTLIST= <TTTTTTTTTTTTTTT>
##$WBST= 1024
##$WBSW= 4
##$XGAIN= (0..3)
0 0 0 0 
##$XL= 0
##$YL= 0
##$YMAX_a= 8213
##$YMIN_a= -7531
##$ZGOPTNS= <>
##$ZL1= 120
##$ZL2= 120
##$ZL3= 120
##$ZL4= 120
##$ABSF1= 0
##$ABSF2= 0
##$ABSG= 0
##$ABSL= 0
##$ALPHA= 0
##$AQORDER= 0
##$ASSFAC= 0
##$ASSFACI= 0
##$ASSFACX= 0
##$ASSWID= 0
##$AUNMP= <proc_1d>
##$AZFE= 0.1
##$AZFW= 0.5
##$BCFW= 0
##$BC_mod= 2
##$BYTORDP= 0
##$COROFFS= 0
##$CY= -3
##$DATMOD= 1
##$DC= 0
##$DFILT= <>
##$DTYPP= 0
##$F1P= 0
##$F2P= 0
##$FCOR= 1
##$FTSIZE= 65536
##$FT_mod= 6
##$GAMMA= 0
##$GB= 0
##$INTBC= 1
##$INTSCL= 9.790993e-09
##$ISEN= 30
##$LB= 1.5
##$LEV0= 0
##$LPBIN= 0
##$MAXI= 10000
##$MC2= 0
##$MEAN= 0
##$ME_mod= 0
##$MI= 50
##$NCOEF= 0
##$NC_proc= -7
##$NLEV= 6
##$NOISF1= 182.463
##$NOISF2= 159.3651
##$NSP= 0
##$NTH_PI= 0
##$NZP= 0
##$OFFSET= 198.0616
##$PC= 4
##$PHC0= 1380.873
##$PHC1= 140.7009
##$PH_mod= 1
##$PKNL= yes
##$PPARMOD= 0
##$PSCAL= 0
##$PSIGN= 0
##$REVERSE= no
##$SF= 81.0140089999434
##$SI= 65536
##$SIGF1= 159.3651
##$SIGF2= -187.1042
##$SINO= 113.3802
##$SIOLD= 16384
##$SREGLST= <1H.CDCl3>
##$SSB= 0
##$STSI= 65536
##$STSR= 0
##$SW_p= 32467.5324675325
##$SYMM= 0
##$S_DEV= 0
##$TDeff= 32768
##$TDoff= 0
##$TI= <>
##$TILT= no
##$TM1= 0
##$TM2= 0
##$TOPLEV= 0
##$USERP1= <user>
##$USERP2= <user>
##$USERP3= <user>
##$USERP4= <user>
##$USERP5= <user>
##$WDW= 1
##$XDIM= 65536
##$YMAX_p= 325707982
##$YMIN_p= -106173028
$$ End of Bruker specific parameters
$$ ---------------------------------
##NTUPLES= NMR SPECTRUM
##VAR_NAME=  FREQUENCY,     SPECTRUM/REAL,   SPECTRUM/IMAG
##SYMBOL=    X,             R,               I
##VAR_TYPE=  INDEPENDENT,   DEPENDENT,       DEPENDENT
##VAR_FORM=  AFFN,          ASDF,            ASDF
##VAR_DIM=   65536,         65536,           65536
##UNITS=     HZ,            ARBITRARY UNITS, ARBITRARY UNITS
##FACTOR=    0.49542278885378, 1,            1
##FIRST=     16045.7642231865, 0,            0
##LAST=      -16421.768244346, 0,            0
##MIN=       -16421.768244346, -106173028,   0
##MAX=       16045.7642231865, 325707982,    0
$$ Real data points
##PAGE= N=1
##DATA TABLE= (X++(R..R)), XYDATA
$$ [...]
40010a771458K13607N51320R30136J022749P56467N32138N32299L37610k99977
40001B804891p89171m84386J81293J66650o60838j312716j086324l74529J88245
39992a366885N94391J005532J105635N94168o2066n7101O79933J320169J031743
39983D845519j92448j473941j697934n43289R65169J345181L22384q68406j087219
39974A615016n53668j15576k0371r3725m30764r93756j079393k40972O60150M63127
39964g89932m97044q17030j25390N39454N07611K75893K34936m8684p05348r25674
39954b351208k28532O05821O95775L47142L43522O30924N91103J31017l23135
39945D42429n67938o66616n59241k15147J19391K91014N05321Q54446J060355
$$ plain form
40010 -1771458 -1557851 -1006531 -76395 946354 1702821 2234959 2767258 3104868 2804891
40001 2804891 2015720 1531334 1712627 1879277 1218439 -94277 -1180601 -1555130 -1366885
39992 -1366885 -772494 233038 1338673 1932841 1870775 1813674 2493607 3813776 4845519
39983 4845519 4653071 3179130 1481196 937907 1903076 3248257 3570641 2702235 1615016
39974 1615016 1061348 945772 925401 831676 400912 -592844 -1672237 -1913209 -1253059 -789932
39964 -789932 -1286976 -2104006 -2229396 -1689942 -1182331 -906438 -671502 -720186 -1425534 -2351208
39954 -2351208 -2579740 -1973919 -1278144 -931002 -587480 43444 634547 765564 442429
39945 442429 -125509 -792125 -1351366 -1566513 -1447122 -1156108 -650787 203659 1264014
39936A264014J039616J090611J120083N02779p01320j311305o65898J72957n2151
39927B459386q31646p83592N2990L59157k35373o35221j58369M87714N41144K98017
39917A554207K88556K93133j07393o40342o84711j60453M30669O58433N23879
39908B155978K72240M4527k53691o74230q83268m84677K27428M48762P4168o5197
39898H62040L19733K61141p68586j472183m96393J158639J307609j68463j184915
39889a81378o28098L20090M76345L33046N87052O99676P0995o88096q20364o44420
39879d75152o31204l63256M15800P77149j9219j009526q28720J64342N63724K07093
39869a198969K04773Q92490J300357P87483q2747n61314n86212l91652r2729J32168
$$ plain form
39936 1264014 2303630 3394241 4514324 5017103 4315783 3004478 2338580 2511537 2459386
39927 2459386 1627740 844148 897138 1256295 1020922 385701 227332 715046 1256190 1554207
39917 1554207 1842763 2135896 2028503 1388161 703450 542997 973666 1632099 2155978
39908 2155978 2428218 2472745 2219054 1544824 661556 176879 404307 853069 927237 862040
39898 862040 1181773 1442914 674328 -797855 -1294248 -135609 1172000 1003537 -181378
39889 -181378 -809476 -489386 -13041 320005 907057 1606733 1677728 989632 169268 -475152
39879 -475152 -1106356 -1469612 -1053812 -276663 -295882 -1305408 -2134128 -1969786 -1406062 -1198969
39869 -1198969 -994196 -101706 1198651 1986134 1903387 1342073 755861 364209 271480 403648
39859D03648J33985J53914M66601P32925M18272k50519n39707l38249j89344k44194
39849G47332r8081K81371L79611K9336l65930o11023q36381p45217J97483J539861
39839E18362J917205Q84230l31511n78601l29179n95348j130131q82461J95050
39830c32384J006656R17879M44553J91981L0625l26119o73374p37892p09211p88335
39820i75621n87447L51651J581078K002220J257346K59822l2934J17013k27091
39811C746037j161123j722685j232877j63551N96564P73650O41548M07344J49750
39802B034657N9683K62162N55843O60966N35748K08433l64679r65929j069118
39793A917766n64249j07929k24661m83197j98197M62855Q28308P99642O90131
$$ plain form
39859 403648 537633 691547 1158148 1891073 2309345 2058826 1519119 1180870 991526 747332
39849 747332 649251 930622 1310233 1339569 973639 362616 -473765 -1218982 -1021499 518362
39839 518362 2435567 3319797 2988286 2409685 2080506 1485158 355027 -527434 -332384
39830 -332384 674272 1592151 2036704 2228685 2259310 1933191 1259817 521925 -187286 -975621
39820 -975621 -1563068 -1211417 369661 2371881 3629227 3889049 3856115 3973128 3746037
39811 3746037 2584914 862229 -370648 -534199 62365 836015 1477563 1884907 2034657
39802 2034657 2094340 2356502 2912345 3573311 4109059 4317492 3952813 2986884 1917766
39793 1917766 1353517 1245588 1020927 537730 339533 802388 1630696 2430338 3120469
39784C120469L06434p15055j764028j654853l57664P86318R16094O50151P66487
39775B054353R43045N34501k56088q07494j024344j051814o49957K60243R09278
39766I11723N17247m53361q32228l86070J7921j11482k34142J36460N63028M23726
39756E52822o0587j47452L62469R18543R82065N52036r2004p73976j342873j464616
39746e13573q57151K24304J020197R96274M12696m9433j32912j90695n29001q82938
39736e02232p22345O3178R33374J148876M80265m90036q98028n35188n1090m2672
39726f15898k73637j99208O0930o9082n75810p78175l73791J60794M04470N19925
39716a739482O73064O31799L33855J92130L68810L75849p2470m43579k67766k1983
$$ plain form
39784 3120469 3426903 2711848 947820 -707033 -1064697 -278379 637715 1287866 2054353
39775 2054353 2997398 3531899 3275811 2468317 1443973 392159 -257798 2445 911723
39766 911723 1428970 975609 143381 -242689 -224768 -336250 -570392 -433932 129096 552822
39756 552822 492235 344783 707252 1625795 2607860 3159896 3067892 2293916 951043 -513573
39746 -513573 -1370724 -1146420 -126223 870051 1282747 1233314 1100402 909707 380706 -502232
39736 -502232 -1224577 -1161399 -228025 920851 1401116 911080 13052 -522136 -573226 -615898
39726 -615898 -889535 -1088743 -1027813 -1096895 -1672705 -2450880 -2824671 -2663877 -2259407 -1739482
39716 -1739482 -1066418 -434619 -100764 91366 460176 836025 763555 319976 52210 30227
39706C0227l17477p02966k62149Q44001J434260R02662j15646p71611r06510p41260
39696f06469l71267J07933M50609M94831K39411l28038j049657j304439n41208
39687b908294P76573J413140Q19738k04866o14667l31851L2922J68246K06819
39678f42240J80043p1658m75808o50410l33302L31762R54619J193032R26585L10027
39668A722650l11950o19919n01769r0579L10268M26852K81342J80980K77786K72057
39658A947718j74304q37643j105783p23691o464O61266J107281J147554O16023
39649B631957k22586p87105r17840j005713j157611q53188J23607J008581R88583
39640a91315L87399J36004L22223J74268n25057r54195m96969K98591N16474J02110
$$ plain form
39706 30227 -287250 -990216 -1252365 -408364 1025896 1928558 1812912 1041301 134791 -606469
39696 -606469 -977736 -869803 -419194 75637 315048 -12990 -1062647 -2367086 -2908294
39687 -2908294 -2131721 -718581 101157 -103709 -718376 -1050227 -1017305 -849059 -642240
39678 -642240 -462197 -533855 -1009663 -1660073 -1993375 -1661613 -706994 486038 1412623 1722650
39668 1722650 1410700 790781 289012 198433 508701 935553 1216895 1397875 1675661 1947718
39658 1947718 1773414 935771 -170012 -893703 -900167 -238901 868380 2015934 2631957
39649 2631957 2409371 1622266 704426 -301287 -1458898 -2312086 -2188479 -1179898 -191315
39640 -191315 196084 332088 654311 828579 303522 -650673 -1147642 -849051 -332577 -230467
39630b30467k63694j86038J12074L28567M48844N56818O18073N13998J48017m15808
39620A630384q39327p79733m25991l71018o23973k79509J134099K411213J874102
39611C730247k04337j642116j233516l18748n64132j339652q44723P83286J405334
39602b28357J06630j301452q39110R42130J985485J530245N53888p4360m65330
39593B209769p62479n98896J03106O68651M94492k07424q38134j103484r69625
39584a004024m09920L96438R56300R57736O61886M94132M60074K71528j43245
39575B640905n80536q74646r67209p83520l65594n4741j75398m98222l68727M53678
39565a574010J329333J366679M32696o80745j083478n90639K92607R14189Q67583
$$ plain form
39630 -230467 -494161 -680199 -568125 -239558 209286 766104 1384177 1898175 2046192 1630384
39620 1630384 791057 11324 -414667 -785685 -1409658 -1689167 -555068 1856145 3730247
39611 3730247 3525910 1883794 650278 331530 -232602 -1572254 -2416977 -1633691 -228357
39602 -228357 -121727 -1423179 -2262289 -1320159 665326 2195571 2749459 2675099 2209769
39593 2209769 1447290 848394 951500 1620151 2114643 1907219 1069085 -34399 -1004024
39584 -1004024 -1413944 -1017506 -61206 896530 1558416 2052548 2512622 2784150 2640905
39575 2640905 2060369 1185723 218514 -565006 -930600 -985341 -1160739 -1658961 -2027688 -1574010
39565 -1574010 -244677 1122002 1554698 873953 -209525 -800164 -507557 406632 1274215
39556A274215J34701q07432j156479n16925M77743P08378r4576r81000j002655
39547a964030l45577J90042M01751O86371J054894R88722L89616r7288n2761N0489
39537A302229l60090r76415j040561m94768l6411n0988j14783K37746P40934P71314
39527b1793K40332k97290l83517j57529k9292j19920k07125p7006K43271N02167
39517c07702L49971l57297j163228j183805j21964J044979J021303j02621q11729
39508a632093j40363J028685J232694M03431k96715k99306k48556o74522r95870
39499a622615l79796R45042J840481J558625M62197n30919q98912p78368m55801
39490A39934O3406P67940J179774P31652l25313r91526p84371l39690l16645l56615
$$ plain form
39556 1274215 1408916 601484 -554995 -1071920 -594177 114201 19625 -961375 -1964030
39547 -1964030 -2309607 -2119565 -1717814 -1031443 23451 1012173 1401789 1304501 1251740 1302229
39537 1302229 942139 -34276 -1074837 -1569605 -1606016 -1657004 -1771787 -1534041 -793107 -21793
39527 -21793 218539 -78751 -462268 -619797 -649089 -769009 -976134 -1053140 -809869 -307702
39517 -307702 42269 -315028 -1478256 -2662061 -2784025 -1739046 -717743 -820364 -1632093
39508 -1632093 -1772456 -743771 488923 892354 595639 296333 47777 -626745 -1622615
39499 -1622615 -2002411 -1057369 783112 2341737 2803934 2273015 1374103 595735 139934
39490 139934 203340 971280 2151054 2882706 2557393 1565867 781496 441806 125161 -231454
39480b31454J65800R21770J082975O24234J75216j65295p67707j365346j230580
39471g90387n21420k07606m33681k46662O39393J143770N65620k02379j01435
39462a54787N15332P37675N94057N77691M86212k7012l75154J52674R09551N92783
39452D009022o98646j399842o09136P69564J252732L70218j118568j975334j433306
39443h33296K9469R80227O52071m3459J55667R70006J073219J88010n87531n51685
39433B032698k04079l4666K46182P72491Q86748J07764j019221j622732j483847
39424c18662r24908l15612N075m7978O8578R22454J912459J648961m1314j498010
39414A411043j287772m821P65481M98362j43941n85458p44731n78390j26243K40741
$$ plain form
39480 -231454 -65654 856116 1939091 2563325 2738541 2573246 1805539 440193 -790387
39471 -790387 -1311807 -1519413 -1953094 -2199756 -1560363 -416593 149027 -53352 -154787
39462 -154787 360545 1098220 1692277 2269968 2756180 2729168 2354014 2506688 3416239 4009022
39452 4009022 3310376 1910534 1301398 2070962 3323694 3693912 2575344 600010 -833296
39443 -833296 -803827 176400 828471 785012 940679 1910685 2983904 3171914 2584383 2032698
39433 2032698 1828619 1793953 2040135 2812626 3699374 3807138 2787917 1165185 -318662
39424 -318662 -1243570 -1559182 -1554107 -1602085 -1533507 -611053 1301406 2950367 2909053 1411043
39414 1411043 123271 118450 883931 1382293 1238352 652894 -91837 -670227 -796470 -555729
39404e55729L24574N01949R45593R56383k0437j145935j066877J28709R68698
39395A036928O68290N7744J49550P38262R48762N01630j51090n63698o72952o14438
39385B098988m99845l34250n4915K70919L55659Q214n49436r49824j133370j188630
39375a976490r18200j00291Q61835J178179P17678K52700L85297P31951N80197
39366A712856l5674m47667l65405k07475l31638m06673Q9173R37423J211949M00758
39356B557627q31224j346120q43106n3838L03972K41323P8202q6686j81309J849
39346a59310L21564J63363o11275j084877m53011N90299O45234l21256q25878
39337a735147l7080J007703R67676Q8720l75838q4579J03475l61785r11607q21837
$$ plain form
39404 -555729 -231155 270794 1216387 2172770 2152333 1006398 -60479 68230 1036928
39395 1036928 1705218 1762962 1912512 2650774 3599536 4101166 3950076 3386378 2713426 2098988
39385 2098988 1599143 1264893 1209978 1480897 1836556 1844770 1295334 345510 -787860 -1976490
39375 -1976490 -2894690 -2994981 -2133146 -954967 -237289 15411 400708 1132659 1712856
39366 1712856 1677182 1229515 864110 656635 324997 -81676 7497 944920 2156869 2557627
39356 2557627 1726403 380283 -462823 -516661 -212689 28634 106836 20150 -161159 -159310
39346 -159310 162254 325617 -285658 -1370535 -1823546 -1233247 -588013 -909269 -1735147
39337 -1735147 -1772227 -764524 203152 291872 -83966 -168545 -65070 -426855 -1338462 -2160299
39327b160299k52538J43272J87848K04009L04158K61476J15859L17468R78350
39318I9603J449612J118228L16204j36224q4359l1114p7510K05190O63080L70837
39308C893547q49304j665158r27574N63412J091163L65376l78088l75416j13560
39299A604398o4007M9519L77340M89226K60260J88559L36798q33r51064j433513
39289H56683p30446K47796K91169k95585l80997Q6074J87338k46375l95732L7103
39279c42972L27721O056m30839m73906l57763l77384k26536L85169J023166J058744
39269E91456N55351P4715j71409m54132q70229r91073l53102Q13282J540467J049836
39259A785162k21129r00797l29800M80562J77096r47738j260463j26838J130187
$$ plain form
39327 -2160299 -2412837 -2269565 -2081717 -1877708 -1573550 -1312074 -1196215 -878747 99603
39318 99603 1549215 2667443 2983647 2847423 2763064 2731950 2654440 2859630 3522710 3893547
39308 3893547 3044243 1379085 451511 1014923 2106086 2471462 2093374 1717958 1604398
39299 1604398 1540391 1589910 1967250 2456476 2716736 2905295 3242093 3241260 2290196 856683
39289 856683 126237 374033 665202 369617 -11380 74694 262032 15657 -380075 -342972
39279 -342972 -15251 -9195 -440034 -913940 -1271703 -1649087 -1875623 -1490454 -467288 591456
39269 591456 1146807 1221522 1050113 595981 -274248 -1265321 -1618423 -805141 735326 1785162
39259 1785162 1564033 663236 333436 813998 991094 43356 -1217107 -1343945 -213758
39250b13758J081954O3665n73409l69327N5100L12019O79818J223807J390629
39241C650498P53606l94135j386614j719438j220102k06466M81583K21626m73368
39232b92810m35403M96236J032149J84342j210689j550681o34952K37146K51437
39223a923225O7840M76283J032866Q03101j10577o92707m75611k2171J10034Q2770
39213f51397J51122L9627m64544p66035r6959J199552J791450R95920k97017p50095
39203A151624k05622L58148K54198k11017n04355o31443p62862o47038j9803O86262
39193e31908P59807K93380J15154M90712O50461J432r00032j213872j055240j014750
39183b404856q73820Q5467J548357K117877J139932l88045j212271j250123j015760
$$ plain form
39250 -213758 868196 931861 358452 -10875 44225 356244 1036062 2259869 3650498
39241 3650498 4404104 4009969 2623355 903917 -316185 -522651 -41068 180558 -292810
39232 -292810 -728213 -231977 800172 984514 -226175 -1776856 -2411808 -2174662 -1923225
39223 -1923225 -1855385 -1379102 -346236 456865 346288 -346419 -822030 -844201 -734167 -651397
39213 -651397 -500275 -460648 -925192 -1691227 -1788186 -588634 1202816 2198736 1901719 1151624
39203 1151624 946002 1304150 1558348 1347331 842976 211533 -551329 -1198367 -1218170 -531908
39193 -531908 227899 521279 636433 1127145 1777606 1779038 879006 -334866 -1390106 -2404856
39183 -2404856 -3278676 -3193209 -1644852 473025 1612957 1224912 12641 -1237482 -2253242
39174b253242m90927N01437J388102J378315O58031R7227r5272m69520j102159
39165c88008j265408n71746L94504R40468J050092R28472M45354m25171j108310
39156B47r83698k11032M48797M93628N8287l88171m50575o2350M56459P07498
39146F9090O44489M95314K94720j12494n91184p58203o06624n01195m03628J49654
39136a320061R68421R79743k50721j520155j422276k39593O12808O34896N46598
39127a010340O94295M81249l16863q47250m18125M13288P05046M61165L42288
39118E04753M70259L29956k79578r14753j176691j171996j095684p78773J6384
39109d096123J035770J622122J418885P47523J36602k96358o69036p20508k199
$$ plain form
39174 -2253242 -2744169 -2242732 -854630 523685 1181716 1278943 1183671 714151 -388008
39165 -388008 -1653416 -2225162 -1830658 -890190 159902 1088374 1533728 1108557 247
39156 247 -983451 -1194483 -745686 -252058 -193771 -581942 -1032517 -1094867 -638408 69090
39146 69090 713579 1208893 1503613 1391119 799935 41732 -564892 -1066087 -1469715 -1320061
39136 -1320061 -351640 628103 377382 -1142773 -2565049 -2804642 -2191834 -1556938 -1010340
39127 -1010340 -316045 165204 -151659 -998909 -1417034 -1003746 -298700 162465 504753
39118 504753 975012 1304968 1025390 110637 -1066054 -2238050 -3333734 -4112507 -4096123
39109 -4096123 -3060353 -1438231 -19346 728177 864779 568421 -100615 -821123 -823322
39100h23322J148587J517739M59967j041228j482823p20999O2018J09003j26431
39091h97489l3411K54660L71351L70006M10828L86911K79284L35235N01010K79134
39081B257519l71614o16693J29784J167960J341562N65982k05023l11548K6534
39072C984463L16572K92936j53088r11462j476039j348814o69911k4462L32656
39063C42851N94704Q06248P04382K39166k25630l85983l33995l22789m73618p59607
39053A85729j031095j057165p59908l55981r4603q022o3407k28974j69207O02645
39043b979988J824691K329281J486243K61688p7241J71609k21690j201811j341872
39034B50910j74558Q62890M66262p23017j185178n36176M03371R29130R87918
$$ plain form
39100 -823322 325265 1843004 2302971 1261743 -221080 -942079 -880061 -771058 -897489
39091 -897489 -930900 -676240 -304889 65117 475945 862856 1142140 1477375 1978385 2257519
39081 2257519 1885905 1269212 1398996 2566956 3908518 4474500 4269477 3957929 3984463
39072 3984463 4301035 4593971 4440883 3529421 2053382 704568 34657 10195 342851
39063 342851 937555 1743803 2448185 2687351 2461721 2075738 1741743 1418954 945336 185729
39053 185729 -845366 -1902531 -2662439 -3018420 -3113023 -3121045 -3184452 -3413426 -3582633 -2979988
39043 -2979988 -1155297 1173984 2660227 2921915 2844674 3016283 2794593 1592782 250910
39034 250910 76352 939242 1405504 682487 -502691 -1038867 -635496 293634 1281552
39025A281552P71975M83132K90298J11717k66145o51599n77011j74249j62756
39016A106914o39232p88104k84805N0321k75008m07439L41198J006328M03081
39007E13254p49642q04131J66838M99838l25696q93124j89159Q59862R35755J86733
38997B00528l23529j65535K58078M76178K75046k91622p69067n99980J43229P77705
38987a8969R21586Q00856N41588m8764p44585q10722p4304O83804Q47576O97267
38977B795333N60938J14119p99524j438997j091966j69581L88111L23926J0812
38968F93171k85277l99484p1439N17939N78710j41226o60277j31383P10054N80202
38958A390990l66953q52425m61244K4670J64211L38502N85972L15262m73287q79505
$$ plain form
39025 1281552 2053527 2536659 2826957 2938674 2672529 2020930 1443919 1269670 1106914
39016 1106914 467682 -320422 -605227 -554906 -829914 -1237353 -896155 110173 513254
39007 513254 -236388 -1040519 -873681 -373843 -699539 -1592663 -1781822 -921960 13795 200528
38997 200528 -123001 -288536 -30458 445720 720766 429144 -339923 -939903 -796674 -18969
38987 -18969 902617 1703473 2245061 2196297 1451712 640990 566686 1250490 2098066 2795333
38977 2795333 3356271 3470390 2670866 1231869 139903 -29678 358433 682359 693171
38968 693171 407894 8410 -63029 454910 1033620 892394 232117 100734 810788 1390990
38958 1390990 1024037 171612 -289632 -264962 -100751 237751 823723 1138985 665698 -213807
38948b13807m59153J64459M62410P13635J075432J023145L48730k83890m70064
38939B360897p44905j334484j292909L999J410061J418684M01108n2431L34974
38930B504994L03070n91510j088757k90860P89788P35936j74772n22836R7547
38921A762600O25144J92638p04317r89740l67587M82265P85531M34884m0639q2918
38911B097861K94782M63657j44997j229296j678181p43442Q99091J678454R03570
38902B541499m00867q23967l36119k2452k71325k83761L43488O69530j26381j176721
38892A12924j009948K39104J033560P65062M64258Q59317J120875L49740p90025
38883C144867j030449l84769Q2093n4614k62904k16188j38945j7094M30640Q58538
$$ plain form
38948 -213807 -672960 -508501 -46091 667544 1742976 2766121 3114851 2830961 2360897
38939 2360897 1615992 281508 -1011401 -1007402 402659 1821343 2222451 2170020 2504994
38930 2504994 2808064 2216554 1127797 836937 1626725 2362661 2187889 1665053 1762600
38921 1762600 2387744 2580382 1876065 886325 518738 1001003 1786534 2221418 2180779 2097861
38911 2097861 2392643 2856300 2711303 1482007 -196174 -939616 -40525 1637929 2541499
38902 2541499 2140632 1316665 980546 958094 686769 403008 746496 1416026 1289645 112924
38892 112924 -897024 -657920 375640 1140702 1604960 2464277 3585152 3934892 3144867
38883 3144867 2114418 1729649 1811742 1757128 1494224 1278036 1139091 1121997 1552637 2411175
38873B411175M69175n91659j063178l10580P07492Q67357L99388J49710J15025
38864C153905k02625n30811j84680N11878M51880m77656j040406m67359M26957
38855A641083N56700J05532o2206J14861j7637n41364p33259k07730M51211M76056
38845A783247j28191o97505p12139k61118J50235R8106l92925q93825r69871n13329
38835b537315K68618J002884J251247P78657m7116l96746J20176Q68117R05044
38826B213566J80432m63323m85545k92825m74639q74610q50305k19438M94835
38817g71852P25227M22585q7454n20366p51364o85978k34834N25219J225961J346782
38807A193926O26655n54518j297285r30233K60661J226484J240792O28752J79072
$$ plain form
38873 2411175 2880350 2288691 1225513 914933 1622425 2489782 2889170 3038880 3153905
38864 3153905 2951280 2420469 2235789 2747667 3199547 2721891 1681485 1214126 1641083
38855 1641083 2197783 2303315 2241109 2355970 2338333 1796969 1063710 855980 1307191 1783247
38845 1783247 1655056 957551 245412 -15706 134529 232635 -160290 -1054115 -2023986 -2537315
38835 -2537315 -2268697 -1265813 -14566 764091 716975 320229 440405 1308522 2213566
38826 2213566 2393998 1930675 1445130 1152305 677666 -196944 -1047249 -1266687 -771852
38817 -771852 -46625 375960 288506 -231860 -983224 -1669202 -1904036 -1378817 -152856 1193926
38807 1193926 1820581 1266063 -31222 -961455 -700794 525690 1766482 2395234 2574306
38798B574306L5082l32465j055730j446367j005053k66809J217K5788N90021J545496
38788F65486J791272R41884K9385J1983L95271J01548q47307j405213j021910
38779F62399k67618O5623j39231m07165k13857N78078J480628J650420P58195
38770D167472m94060j048753n55481M96744J378281J460447M22304j212291k102555
38761B512108j479443k81197j9094p06037j002648m02587M3143m14711r07524
38752b657990l28826Q92009J420231Q95178J98275P1263L12656L47749k4600n59781
38742E66164q85101q24730n39253k60498Q6012O53788J089712P83901r7986n16151
38732E5858R8411J016372J225238O78747n2141p69174j500143j811650j180053
$$ plain form
38798 2574306 2609388 2276923 1221193 -225174 -1230227 -1497036 -1495819 -1470031 -880010 665486
38788 665486 2456758 3398642 3428027 3440010 3835281 3936829 3089522 1684309 662399
38779 662399 394781 460404 321173 -85992 -299849 278229 1758857 3409277 4167472
38770 4167472 3673412 2624659 2069178 2565922 3944203 5404650 5826954 4614663 2512108
38761 2512108 1032665 751468 732374 26337 -976311 -1378898 -1335755 -1750466 -2657990
38752 -2657990 -2986816 -2094807 -674576 220602 418877 490140 802796 1150545 1125945 566164
38742 566164 -318937 -1143667 -1682920 -1943418 -1857406 -1203618 -113906 669995 572009 55858
38732 55858 154269 1170641 2395879 3074626 3022485 2253311 753168 -1058482 -2238535
38723b238535R8829J107065J335296R72171L95157k9105Q1961O49468Q58208R8903
38713C329418j012206j335134p52599j66583q0430j43356j13498k42532m74181
38704i91101k26177O20248J305193J213069O65000K90472K17182K79006M28243
38695C801135M97275R7015p62680j399861j261963o20479q9956J34641J88084
38686E83211J24728K2649R9609L10404K23979k88144o73372m61187N4104M10393
38676D06374P39553J232326J324663L89707r60652j329892m17772N30431N01930
38667B416668L4689J30779N91314L93218n75221j201249p56630M1562R9533n10995
38657F63668q01211l70460J57010K24286N6451j1215j66732n35208n79318J48405
$$ plain form
38723 -2238535 -2139706 -1032641 302655 1274826 1669983 1640878 1722839 2372307 3230515 3329418
38713 3329418 2317212 982078 229479 62896 -17534 -160890 -274388 -516920 -991101
38704 -991101 -1217278 -597030 708163 1921232 2586232 2876704 3093886 3372892 3801135
38695 3801135 4298410 4395425 3632745 2232884 970921 350442 260486 395127 583211
38686 583211 707939 730588 830197 1140601 1364580 1076436 403064 -58123 -4019 406374
38676 406374 1145927 2378253 3702916 4092623 3131971 1802079 1384307 1914738 2416668
38667 2416668 2451357 2582136 3173450 3566668 2991447 1790198 1033568 1075130 1174663 663668
38657 663668 -137543 -508003 -350993 -126707 -70256 -81471 -248203 -783411 -1362729 -1214324
38647a214324J049670J136514M54540k3593J26337L32240J68205m229J17280J46375
38637B289015k48217o57080n87052k74988k44415m62334n16964l13117n5408J97802
38627h72758M84902O78419O73321N81937M17489l5414o66510q49001l21028K34767
38617C26124J44299j86284M4037O41913O89145N9885l57890q1758K65679J3078
38607A558228n65745p61427l80300K48609P96444J051932Q39171K23994l80468
38598B630438o15311n40917l93040j78972J97423N35062M14751k17043p59011
38589A073380n05496M77564J265838J098016L16112j10398P8187J68067l02757
38580C558513p59344n07418J67880N18492M96158N43665N09335k00384j345506
$$ plain form
38647 -1214324 -164654 971860 1426400 1402807 1529144 1861384 2029589 2025360 2142640 2289015
38637 2289015 2040798 1383718 796666 521678 277263 -185071 -702035 -1015152 -1070560 -872758
38627 -872758 -387856 290563 963884 1545821 1963310 1927896 1261386 412385 91357 326124
38617 326124 470423 284139 328176 970089 1659234 1719119 1361229 1279471 1545150 1558228
38607 1558228 992483 231056 -149244 99365 895809 1947741 2786912 3010906 2630438
38598 2630438 2015127 1474210 1081170 902198 1099621 1634683 2049434 1832391 1073380
38589 1073380 567884 1045448 2311286 3409302 3725414 3615016 3693203 3861270 3558513
38580 3558513 2799169 2291751 2459631 2978123 3474281 4017946 4527281 4326897 2981391
38571B981391j759927r23045J78819L15671m18844r03740n04514L23274Q23346
38562A12431P81571M73849J59994q2746j44404J43872O25411O64817j55303j205644
38552A373848j281057j64336Q67036N91163n90034j275558q75644k8178N53475
38543h29285P78499P35517L73165j82781n78126o38528m00361J73267R44535J245154
38533A621056N45362n78669r81366m61299J39475L60760N92321R44131Q33379
38524C015150J61813k16494J29905L78954j90876r20310q08522j07759J76609
38515A618470j37863m00326l49462k92391k22033K39553R70029J260876P77141
38506C463994l472m58874m77012l55009l95823o43429p95444m77558K14713O94038
$$ plain form
38571 2981391 1221464 298419 477238 792909 374065 -529675 -1034189 -710915 112431
38562 112431 894002 1367851 1527845 1445099 1300695 1444567 2069978 2734795 2579492 1373848
38552 1373848 92791 -71545 795491 1386654 796620 -478938 -1354582 -1382760 -829285
38543 -829285 -50786 684731 1057896 875115 296989 -341539 -741900 -568633 375902 1621056
38533 1621056 2166418 1587749 606383 145084 284559 645319 1237640 2181771 3015150
38524 3015150 3176963 2960469 3090374 3469328 3278452 2358142 1549620 1441861 1618470
38515 1618470 1480607 1080281 730819 438428 216395 455948 1425977 2686853 3463994
38506 3463994 3460522 3001648 2524636 2169627 1773804 1130375 334931 -142627 72086 766124
38496G66124O18400L13903K06132K57880K98898M14948N85359M67456N0894m8702
38486C931292M25913P02987J04821o99495n62753L60875P73947P2734r55048j322802
38476B832471r13314k61598O6995j56815n51076l49373N65138J185680O42452
38467C060560m70110r27029o35313m47327n19260k11161M11879M22773l38454
38458C46558q02969l12712M38910O37784M56295L45886K10501n9246q4879L15174
38448A491302O74661O56925N37970M50300K0858o92062q49929j27765N38005K99007
38438B999272l36460m60175k13611k92270o33478o31976k23862J65557L70694
38429G43691L88603R273o52744q08248p4142O53410M04353l34427m33196J6028
$$ plain form
38496 766124 1384524 1698427 1904559 2162439 2461337 2876285 3461644 3929100 3979994 3931292
38486 3931292 4357205 5060192 5165013 4465518 3902765 4263640 5037587 5110321 4155273 2832471
38476 2832471 1919157 1657559 1724554 1567739 1016663 667290 1232428 2418108 3060560
38467 3060560 2590450 1663421 1028108 580781 61521 -149640 262239 685012 346558
38458 346558 -456411 -769123 -330213 307571 763866 1109752 1320253 1261007 1176128 1491302
38448 1491302 2165963 2822888 3360858 3811158 3832016 3139954 2290025 2162260 2700265 2999272
38438 2999272 2662812 2202637 1989026 1696756 1063278 431302 207440 372997 743691
38429 743691 1132294 1141567 488823 -319425 -393567 259843 664196 329769 -103427 -87399
38419h7399k3358o43084p79618L8866R70347J114964N05810l24915q75129o78591
38409g82107L09330J243144J191239M39450N5386J90116l1870q12841j160790
38400F41057m87200M35327O82228L48278o0488m42089o65825k55336P18030J209729
38390B123711N09559o27241r42822k73831N23592P81389M81819n2011l01612J78590
38380B401143J061180J301873M74958n20352p46654n63922q19549j322012j224604
38371D2061n50746j59030l21436m57502k99570k42567l66271j20612O83459J411405
38361c80809J508648J169051P64076K79980k83167n60365l37615K5382R4635p8820
38351B200996k22070k95403l70812l91550l36641l12668k59522P1176O21396R25709
$$ plain form
38419 -87399 -110757 -753841 -1533459 -1494593 -524246 590718 1096528 771613 -103516 -782107
38409 -782107 -472777 770367 1961606 2401056 2456442 2646558 2614688 1801847 641057
38400 641057 153857 589184 1271412 1619690 1559202 1117113 451288 195952 913982 2123711
38390 2123711 2633270 2006029 1063207 789376 1312968 2094357 2576176 2524165 2222553 2401143
38380 2401143 3462323 4764196 5239154 4718802 3972148 3408226 2588677 1266665 42061
38371 42061 -508685 -667715 -989151 -1446653 -1746223 -1988790 -2355061 -2475673 -1792214 -380809
38361 -380809 1127839 2296890 3060966 3340946 3057779 2497414 2159799 2185181 2279816 2200996
38351 2200996 1978926 1683523 1312711 921161 584520 271852 12330 83506 704902 1630611
38341A630611P68854N00343L78306R7647n66023j099985q77030j74964Q8636m15339
38331C31056j029292r94552k95215M80928Q01957O12077K89583K20642L30983
38322G48167J87875l08160o38125l70232J60050L23567J03232k4679N4661R872
38312B46228k00690k05978L9958O9860k92577n51103l02218J60831L99023M61079
38302a75587M96939K49121m32202r40987n42861M85740J068596P12009M2533j68450
38292G94851M9718J57632o8535l23932k10733L05364Q12941Q33728L77861k7239
38282B701656m0370L7750j48869l31399j25057Q4794l66734j144877j171065l37229
38272h41400J64867k77615o27104J23743J183696J110136Q2000m14175O4938L83331
$$ plain form
38341 1630611 2399465 2899808 3278114 3375761 2809738 1709753 832723 657759 746395 331056
38331 331056 -698236 -1692788 -1988003 -1507075 -705118 -93041 196542 417184 748167
38322 748167 936042 627882 -10243 -380475 -220425 103142 206374 181695 236356 246228
38312 246228 45538 -160440 -120482 -50622 -343199 -894302 -1196520 -1035689 -636666 -175587
38302 -175587 321352 570473 138271 -802716 -1345577 -859837 208759 920768 963301 794851
38292 794851 844569 1002201 933666 609734 399001 704365 1517306 2351034 2728895 2701656
38282 2701656 2661286 2699036 2550167 2218768 2093711 2178505 1811771 666894 -504171 -841400
38272 -841400 -676533 -954148 -1581252 -1457509 -273813 836323 918323 504148 569086 952417
38262I52417j58551o73163j84045P95052J048017L72018l56056m97207k80264
38253A018218k01354l63135m90484l07856J67990O44012R13540J118034J390195
38244C889160J372420O17790n16392j054371p12863l30046n75534r30796n98978
38235A160390J51404L96346l1228m28873l98738k75066l28833l27573p7693K39978
38225H0114M86864P39237Q38913L83124n22319j075522p79759j57032M4496m8012
38215i896K34456Q88678J098152M09361n55261q77842m61781J5561P3735p1267
38205G43896m21K96638N37631O52069Q17759J010102Q69261J99797o11865r20245
38195C594622n03724K07443N24945P9176q22400j338266q68044J43426N12117
$$ plain form
38262 952417 793866 120703 -63342 731710 1779727 2151745 1795689 1298482 1018218
38253 1018218 816864 453729 -36755 -344611 -176621 467391 1380931 2498965 3889160
38244 3889160 5261580 5879370 5362978 4308607 3595744 3265698 2690164 1759368 1160390
38235 1160390 1311794 1708140 1676912 1248039 849301 574235 245402 -82171 -159864 80114
38225 80114 566978 1306215 2145128 2528252 2005933 930411 150652 -6380 38116 -9896
38215 -9896 224560 1113238 2211390 2620751 2065490 1187648 725867 741428 815163 743896
38205 743896 743475 1040113 1577744 2229813 3047572 4057674 4926935 5126732 4514867 3594622
38195 3594622 3090898 3298341 3823286 3902462 3080062 1741796 873752 1017178 1529295
38186A529295k60535j212677j067869R9652R96959Q23739J15961k48198j53708
38177F22619n238K3953J1248m6210j18612o336K78405L15020j07200n15092m24462
38166B8095j76510m36970j038935j083547k30870Q16449J284096J139300O99162
38157A000270P7767n61327p45155k51704L83974M54712k0211m39302m69153k57592
38147h27721M2010L76658M64817k227o95206p89658o6776O60807O42449K40727
38137D5880K89035P08270N61951m56814j360985j099354N9578R33704R54666O46506
38127A282437N69549M60463j69334j001950j131155l09336O07911P41306K78225
38118A328116L1461J99986K23929j34114l02258J46768O51246M02506l85633o78391
$$ plain form
38186 1529295 1268760 56083 -1011786 -912134 84825 908564 1024525 776327 622619
38177 622619 617381 641334 652582 606372 487760 481424 759829 1074849 967649 452557 28095
38166 28095 -148415 -585385 -1624320 -2707867 -2938737 -2122288 -838192 301108 1000270
38157 1000270 1078037 516710 -228445 -480149 -96175 358537 338326 -100976 -570129 -827721
38147 -827721 -785711 -409053 55764 53537 -641669 -1431327 -1498103 -837296 -194847 45880
38137 45880 334915 1043185 1605136 1148322 -212663 -1312017 -1252439 -318735 635931 1282437
38127 1282437 1851986 2312449 2143115 1141165 10010 -299326 308585 1049891 1328116
38118 1328116 1359577 1559563 1783492 1649378 1347120 1493888 2145134 2547640 2162007 1483616
38108A483616n9227P06915P17669j0751p91200j114771r31895m42125M7492K95322
38098i8955M23524P79963J268836J206278K45228q96761j175332m99822K63147
38089A516106M54671K23701k4746j96502l75221n74149p78550q83117n45481M27787
38079g55501J456302J523675M25547q20675j180274p58971l10763m5661L92575
38070g3746R88308J179085P24692J08051k14289m65438j033208j619351j446210
38061a852106l16130R66351J430206R61618K73810Q694J48698K78411J11414l40449
38051A670517q47634j046337o86872j0227L65064J93195l5825J45513L59587q1330
38041B5651r57077j210657l86782O92565J019402N74649j8659m74394q60504r92664
$$ plain form
38108 1483616 1424389 2131304 2848973 2838222 2047022 932251 356 -441769 -394277 -98955
38098 -98955 324569 1104532 2373368 3579646 3824874 2928113 1752781 1252959 1516106
38089 1516106 1970777 2194478 2169732 1973230 1598009 1023860 245310 -637807 -1183288 -755501
38079 -755501 700801 2224476 2650023 1829348 649074 -109897 -420660 -466321 -73746
38070 -73746 914562 2093647 2818339 2926390 2712101 2246663 1213455 -405896 -1852106
38061 -1852106 -2168236 -1201885 228321 1189939 1463749 1472443 1621141 1899552 2010966 1670517
38051 1670517 822883 -223454 -910326 -920553 -555489 -362294 -398119 -252606 106981 25651
38041 25651 -931426 -2142083 -2528865 -1836300 -816898 -242249 -260908 -735302 -1595806 -2588470
38031b588470n42039K94338Q43023Q13145O70605R35944J390330J290934L71435
38022C479245o13827o21388L74926J190885Q69127p3405m63658k35989l76195
38013C529721j091241j294599m29936M29164K47844k72286L8800O91968L25746
38004B175181q06950r88951K17913J161566N75893o91053j239863j064650q95295
37995a556209o95019n1150O70720Q00384N50208O19683R27172P96629K31020j2119
37985B281319L94114R29817J015220N10616m87210j599847k004940j161211K46680
37976A24558Q70486L19579m91960o89831l44600J04079M64331N13588q3639j091777
37966c05186j589485j075844j92841J49036p8605k28809O3077O14238J052899
$$ plain form
38031 -2588470 -3130509 -2836171 -1993148 -1180003 -509398 426546 1816876 3107810 3479245
38022 3479245 2865418 2244030 2618956 3809841 4678968 4605563 4141905 3905916 3529721
38013 3529721 2438480 1143881 713945 1143109 1390953 1118667 1157467 1849435 2175181
38004 2175181 1368231 379280 597193 1758759 2334652 1643599 403736 -660914 -1556209
37995 -1556209 -2251228 -2302378 -1631658 -831274 -281066 338617 1265789 2062418 2293438 2281319
37985 2281319 2675433 3605250 4620470 5131086 4643876 3044029 1039089 -122122 124558
37976 124558 995044 1314623 822663 132832 -211768 -107689 356642 870230 786591 -305186
37966 -305186 -1894671 -2970515 -3163356 -3014320 -3092925 -3321734 -3258657 -2644419 -1591520
37957a591520J010187L06706o18746q62331j52372N89115L98055l50762m73983
37948a745651K72887Q35977L94169m92551o72154R0796Q48343O22304m43361j190704
37938a479945p37606M44944J046493N52963j25983K7819P51968J044539O54483
37929B179675J77933j10879n29275j033578r99067k66780M57714O63717O90819
37920A230279Q46556P01824m3918p16440n40269J58512M80820K61786k1284k41628
37910B116238n34732n38983J49133R18454P49039j21039m16743J18333L04595
37901B744295l67369p02698K09211J288752J042821j24550o59662k77542m8564
37892C104694l81677n61238l50879m76750j106658j253694l68973O21715O75585
$$ plain form
37957 -1591520 -581333 -274627 -893373 -1755704 -1908076 -1318961 -920906 -1271668 -1745651
37948 -1745651 -1472764 -636787 -242618 -735169 -1407323 -1316527 -468184 154120 -289241 -1479945
37938 -1479945 -2217551 -1772607 -726114 -173151 -299134 -271315 480653 1525192 2179675
37929 2179675 2357608 2246729 1717454 683876 -315191 -581971 -124257 539460 1230279
37920 1230279 2076835 2778659 2734741 2018301 1478032 1636544 2117364 2379150 2357866 2116238
37910 2116238 1581506 1042523 1191656 2110110 2859149 2738110 2321367 2439700 2744295
37901 2744295 2376926 1674228 1883439 3172191 4215012 4090462 3430800 3153258 3104694
37892 3104694 2723017 2161779 1810900 1334150 227492 -1026202 -1395175 -773460 -97875
37883i7875J04768j64291l5190M341N800M07769J023547J114255M44930m38969
37873B369085r85212j098741q58026l47665J51205K73730J0621k48586j61890
37864h95479K55257O87360P20532J68377o13716r82876p59025l74900j03523K92401
37854a605592P90317P35548o4093n79346Q2410J071986Q01696o78333j663301
37845a108708j212945k28135K06857K37121M05213N73524M57361L09001K92260
37836f8451l351o55175q37601k9588R59423J106013O12870K35773r5431p50543
37826D73939j101437k45281J221865J663840P02592l18038l75739M6338J97761
37817B265840K15077M14834M81317J08489l11902l22230j15085o9961j52998k44329
$$ plain form
37883 -97875 6893 -157398 -192588 -188247 -182447 225322 1248869 2363124 2808054 2369085
37873 2369085 1383873 285132 -572894 -920559 -769354 -495624 -485003 -733589 -895479
37864 -895479 -640222 47138 767670 936047 322331 -660545 -1419570 -1794470 -1897993 -1605592
37854 -1605592 -815275 -79727 -143820 -723166 -640756 431230 1232926 554593 -1108708
37845 -1108708 -2321653 -2549788 -2342931 -2105810 -1700597 -1127073 -669712 -360711 -68451
37836 -68451 -71802 -726977 -1564578 -1594166 -634743 471270 1084140 1319913 1224482 473939
37826 473939 -627498 -872779 349086 2012926 2715518 2397480 2021741 2068079 2265840
37817 2265840 2480917 2895751 3377068 3485557 3173655 2851425 2736340 2666379 2513381 2269052
37807B269052m40307n71994j06823R39155J665626J433984O75131k3322q27559
37798E012943j855621k268843j288069L73730J253641J047459O74736O17508L82531
37789C950015l00720q68657q43612m94376k09598P8200M70628O84889M26687k05203
37779B688253q74509j199455p94683L21787J331579J287695L17669n00567o00178
37770A977591m95685o40777n90446J37477J063922J325851Q22317J45273l03237
37761C442286n19859m85237j51414K62000M41641L87293K99640K04654L3362q9212
37751C825154k249J66011J56265n9167l50263o97797j084979j287323j097571
37742d31919o44865k14832J17405M20844O25815N67464K05489l52510q61178q89137
$$ plain form
37807 2269052 1828745 1256751 1149928 2089083 3754709 5188693 5863824 5840502 5012943
37798 5012943 3157322 888479 -399590 -25860 1227781 2275240 2949976 3567484 3950015
37789 3950015 3649295 2780638 1937026 1442650 1233052 1311252 1781880 2466769 2893456 2688253
37779 2688253 1813744 614289 -180394 141393 1472972 2760667 3078336 2577769 1977591
37770 1977591 1481906 841129 250683 388160 1452082 2777933 3600250 3745523 3442286
37761 3442286 2922427 2437190 2285776 2547776 2989417 3376710 3676350 3881004 3914366 3825154
37751 3825154 3822905 3988916 4145181 4086014 3735751 3037954 1952975 665652 -431919
37742 -431919 -1076784 -1291616 -1174211 -753367 -127552 439912 645401 292891 -568287 -1457424
37732a457424j37870R87043J552074J153206L88210m0652j81768l56071m09179
37723A497569j12184J61786m1565l88663k38327K53565L76804L8312k35003l64193
37713I48101p61034j241598r91416O3969Q50078O05460p6549k37531J21880L46992
37703c71648K03645j8298j07154n4364J62749M68912O09154N32087N47093P70677
37693B742853P97790L21206k94647n09897l59529k46434k60806j76916P3260L36180
37683B423060M70604L36218j68688p31877o84945Q6345O63168J45054j063440
37674A475499j680862j145864j30665N18216O83943O86238O76860O30400N62682
37665B276447M56880J82707k77577o48406o08830k13010O9388j48588o21430o15563
$$ plain form
37732 -1457424 -1595294 -608251 943823 2097029 2485239 2444587 2262819 1906748 1497569
37723 1497569 1385385 1547171 1505606 1116943 878616 1132181 1508985 1547297 1312294 948101
37713 948101 187067 -1054531 -2045947 -1981978 -1131900 -526440 -602989 -840520 -718640 -371648
37703 -371648 -168003 -186301 -293455 -347819 -185070 283842 892996 1425083 1972176 2742853
37693 2742853 3540643 3861849 3567202 3057305 2697776 2451342 2190536 2013620 2086880 2423060
37683 2423060 2893664 3229882 3061194 2329317 1644372 1730717 2393885 2538939 1475499
37674 1475499 -205363 -1351227 -1481892 -963676 -279733 406505 1083365 1713765 2276447
37665 2276447 2733327 2916034 2638457 1990051 1381221 1168211 1237599 1089011 467581 -147982
37655a47982J90906J138654J306286O84599R0093p2199k36263o83247r49005o92306
37645F29536l94357n20197o29907j34036O01816Q32445O99774Q89698J271649
37636C246421J011473N3528n96656l18684K92788L71477j71206q33571j119429
37627A936141p04110L56220J326279J318052L86475m59832n47955k25334m9113
37618C336823j3233N2068j0520k85111m30124k22065j1979j71892m64770m11519
37608A367678J8564M55665N93430L35749j93222n61234l44234K52883N46654L51301
37598B823234K23481M38686M26775k33127q84604o09038M11512J094837Q43881
37589D535637R4755m32394m83808k68890j01732r4969o1386J71964L41396K0212
$$ plain form
37655 -147982 42924 1181578 2487864 3172463 3262556 3190357 2954094 2270847 1321842 629536
37645 629536 235179 -285018 -914925 -1048961 -447145 385300 1085074 1974772 3246421
37636 3246421 4257894 4311422 3714766 3396082 3688870 4060347 3889141 3055570 1936141
37627 1936141 1232031 1588251 2914530 4232582 4619057 4159225 3611270 3385936 3336823
37618 3336823 3323590 3375658 3365138 3080027 2649903 2427838 2415859 2243967 1779197 1367678
37608 1367678 1386242 1841907 2435337 2771086 2577864 2016630 1672396 1925279 2471933 2823234
37598 2823234 3046715 3485401 3912176 3679049 2794445 2185407 2596919 3691756 4535637
37589 4535637 4630392 4197998 3714190 3445300 3343568 3248599 3187213 3359177 3700573 3720785
37579C720785n97359p56405k58102J04174l30076j108945j374194j033675n98887
37570b232684k96463j8561K05589L68558P95776J614124K188803J786205O07353
37561E018700m32490p24580k61485O66024J421713J158063j68328j311080j156085
37552D210452k54533L6502m57882p92842o66613o96263r08662m49977P84353J534262
37542B338797Q44934o18606j530659j374033m64611O70950J421002J331895P04340
37533C324009K85991R9751n22627j444324j471346k54563P75577L80775o26684
37524E46559p25631k2928K12629k03578k13595M98915R05986L23544n38297p14229
37514F9375k54448J58565J71593j24057m82936n07274J48707J185393J704223
$$ plain form
37579 3720785 3123426 2367021 2108919 2213093 1883017 774072 -600122 -1633797 -2232684
37570 -2232684 -2529147 -2547708 -2342119 -1973561 -1177785 436339 2625142 4411347 5018700
37561 5018700 4586210 3861630 3600145 4266169 5687882 6845945 6677617 5366537 4210452
37552 4210452 3955919 3992421 3534539 2741697 2075084 1378821 470159 20182 804535 2338797
37542 2338797 3183731 2565125 1034466 -339567 -804178 -133228 1287774 2619669 3324009
37533 3324009 3610000 3709751 3187124 1742800 271454 16891 792468 1173243 546559
37524 546559 -179072 -202000 10629 -192949 -406544 92371 998357 1321901 783604 69375
37514 69375 -185073 -26508 145085 21028 -461908 -969182 -820475 364918 2069141
37505B069141J245590M07561K5328Q4311m0100m83353o55125j80253M43454M58950
37495C375504j38007n96102l83276K01593N10706L24084q3346l77413l51100P6820
37485B559463O29949O58328r4273q54143o40811L02960P44145K91453K2700P53918
37475D373689J588573J112036n17632j715349j529707o10876n4895j07656l11738
37466B226445l45405k79301k52754k53794k33144k78882n22512p97410o05762
37457a342519K32426J045679R89878K57780j02014K77378N88777K69529o1683
37448B155231K15649N49947K42733j44629K88354R91282O12754p25827j380552
37439B804942o24213L45182L64707m5468J66725P89552P36126k92526j417847
$$ plain form
37505 2069141 3314731 3722292 3747620 3831931 3791831 3308478 2653353 2473100 2916554 3375504
37495 3375504 3237497 2641395 2258119 2459712 2970418 3294502 3211156 2833743 2482643 2559463
37485 2559463 3189412 3847740 3753467 2899324 2258513 2561473 3305618 3597071 3619771 4373689
37475 4373689 5962262 7074298 6556666 4841317 3311610 2700734 2645839 2538183 2226445
37466 2226445 1881040 1601739 1348985 1095191 862047 583165 60653 -736757 -1342519
37457 -1342519 -1110093 -64414 925464 1183244 1081230 1358608 1947385 2216914 2155231
37448 2155231 2370880 2920827 3163560 3018931 3307285 4298567 4911321 4185494 2804942
37439 2804942 2180729 2525911 2890618 2845150 3011875 3801427 4537553 4245027 2827180
37430B827180j653997q11306M73253J235398R63012J49930k28228M9849K18255
37421C223346k51665q06472o33698J75897Q22537P98889K04458o31975j331176
37412A570141j472555r18554p3025N00365O36298N40030L83851J79744p2636l04701
37402I68958l77837j45490L16941O30171N67162M53033O36741P29761J04655q71328
37392C012767j037867j29182P06758N75794R8677K56917P61052N54997m91541
37383D308372j354168j175459j23178R43518J172334L60030o39724n66228O75041
37374C600538J637768J191703J01187j86021K82852K65660n18194r82163n32416
37365D860914K5174j13665n46339m78496O1477M53947L91496M7328k58048k23962
$$ plain form
37430 2827180 1173183 361877 835130 2070528 3033540 3183470 2955242 3005091 3223346
37421 3223346 2971681 2165209 1531511 1707408 2529945 3328834 3533292 2901317 1570141
37412 1570141 97586 -820968 -893993 -393628 242670 782700 1166551 1346295 1273659 968958
37402 968958 591121 445631 762572 1392743 1959905 2412938 3049679 3779440 3884095 3012767
37392 3012767 1974900 1845718 2552476 3128270 3226947 3483864 4244916 4799913 4308372
37383 4308372 2954204 1778745 1655567 2599085 3771419 4131449 3491725 2925497 3600538
37374 3600538 5238306 6430009 6531196 6345175 6628027 6893687 6375493 5393330 4860914
37365 4860914 4886088 4772423 4226084 3747588 3809065 4263012 4654508 4701836 4443788 4219826
37355D219826K12600O26999N14507N7611p2342K15772K62894k19128o10061l44539
37345D864139K71889O56958P34374O39668K51456m11602q34161o35940j52204
37336E384577J35629L02817N60986O10255J04702n74302p21730k79790K17588
37327E740732M67381N52266M68373J40139k18376l52255m39368p21254q46698
37318D790940l05831N74231Q70043L74506r3243J13270O49739Q43564N74413J57205
37308H548837j66362k92470k12559j65081m30339p65084n24802L71079J103193
37299G466412R61541K36001l20646m64459l80170o3080N24881R27514N90620k07982
37289I270632m98760J44336J037337J278213P84721J72573q7177o4477n6152j48828
$$ plain form
37355 4219826 4432426 5059425 5573932 5631543 5559201 5774973 6037867 5818739 5208678 4864139
37345 4864139 5136028 5792986 6527360 7167028 7418484 7006882 6172721 5536781 5384577
37336 5384577 5520206 5823023 6384009 6994264 7098966 6524664 5802934 5523144 5740732
37327 5740732 6208113 6760379 7228752 7368891 7150515 6798260 6358892 5637638 4790940
37318 4790940 4485109 5059340 5929383 6303889 6210646 6323916 6973655 7817219 8391632 8548837
37308 8548837 8382475 8090005 7877446 7712365 7282026 6516942 5992140 6363219 7466412
37299 7466412 8427953 8663954 8343308 7878849 7498679 7435599 7960480 8887994 9478614 9270632
37289 9270632 8771872 8916208 9953545 11231758 12016479 12189052 12101875 12037398 11981246 11832418
37279A1832418j50571J09093M91875O91901O68242O73692P21612M05105l84545
37270A5058822r22196m50750O51351J216630Q10723J85668R9366M57479Q85562
37261A7992655J334995J678971J516805J001644J077731K070746K779492K059610
37253C1512649P28332N35922J542428K081480J438579R32030J734034L077353
37245D3582807L617008L441482L524438L961515M060099L779910L853226M580914
37237G4401399N536416O456572P523075Q703249R620710J0205024J0806715J1592793
37229A44845953J2437043J3413049J4723863J6085200J6851958J6895364J6770169
37222B52022599J6861344J6816337J5842117J3169242Q479084K517259l022437
$$ plain form
37279 11832418 11681847 11790940 12282815 12974716 13642958 14316650 15038262 15443367 15058822
37270 15058822 14136626 13685876 14337227 15553857 16364580 16550248 16649614 17107093 17992655
37261 17992655 19327650 21006621 22523426 23525070 24602801 26673547 29453039 31512649
37253 31512649 32240981 32776903 34319331 36400811 37839390 38771420 40505454 43582807
37245 43582807 47199815 50641297 54165735 58127250 62187349 65967259 69820485 74401399
37237 74401399 79937815 86394387 93917462 102620711 112241421 122446445 133253160 144845953
37229 144845953 157282996 170696045 185419908 201505108 218357066 235252430 252022599
37222 252022599 268883943 285700280 301542397 314711639 323190723 325707982 322685545
37215C22685545p103003j0555295j4595017j8427413j9918956j8802482j7403788
37208B15879591j7444514j7813106j6691611j4425457j2697028j1906648j1143836
37201A13757391j0130745r417087q917264p927833o571926n703925n316238m537378
37193E5234995l383525k950308l431627l469286k221936p76197n44049j284593
37185C7173474j768995j649607j572973j883379k212210k181180j778906j159078
37177B2967146n95585m70726q83030j462953j864214k097606k127103j667947
37169A1797982p79761r0352P1879J98827O83379R90680M91915m04215q09322o30900
37159A1520112m05868k40011Q9600K56417k71475j099281j254776p35626n60601
$$ plain form
37215 322685545 315582542 305027247 290432230 272004817 252085861 233283379 215879591
37208 215879591 198435077 180621971 163930360 149504903 136807875 124901227 113757391
37201 113757391 103626646 94209559 85292295 77364462 70792536 65088611 59772373 55234995
37193 55234995 51851470 48901162 45469535 42000249 39778313 39002116 38458067 37173474
37185 37173474 35404479 33754872 32181899 30298520 28086310 25905130 24126224 22967146
37177 22967146 22371561 21900835 21017805 19554852 17690638 15593032 13465929 11797982
37169 11797982 11018221 10927869 10999748 11198575 11881954 12872634 13364549 12960334 12151012 11520112
37159 11520112 11114244 10874233 10963833 11220250 10948775 9849494 8594718 7859092 7298491
37150G298491j048664j214775l63289P63303J101442O88769K30169o0409l67906
37141G027131n36417k59512K74415O25029P54310Q24583O17700j42568j041557
37132H143114j260232o30705J69351N23888M78383L67171K98825J52814k08230
37123H034379p88538j319300j363320q19931j51686K27765N40448J126200J591178
37114G077195J198474O4918q18337r15929p43414q42979r16934m86655J95582
37105C811921N17825L64521J398n03967j074266j175351m02546O28953Q45520
37096C014008K00971k74969r3850n09n38885q67564R132J377482J432941k02665
37086D056092j735390j473577J3081Q11736K51413m19630M2676J166569J452067
$$ plain form
37150 7298491 6249827 5035052 4671763 5435066 6536508 7225277 7455446 7395037 7027131
37141 7027131 6490714 6231202 6505617 7130646 7884956 8709539 9327239 9184671 8143114
37132 8143114 6882882 6252177 6421528 6945416 7423799 7790970 8089795 8242609 8034379
37123 8034379 7245841 5926541 4563221 3743290 3591604 3819369 4359817 5486017 7077195
37114 7077195 8275669 8340587 7522250 6606321 5862907 5019928 4102994 3616339 3811921
37105 3811921 4329746 4694267 4695665 4191698 3117432 1942081 1539535 2168488 3014008
37096 3014008 3214979 2940010 2846160 2845651 2306766 1439202 1448334 2825816 4258757 4056092
37086 4056092 2320702 847125 860206 1671942 1923355 1503725 1546401 2712970 4165037
37077D165037L02485j296086j921026j121601L40766J329471J277190N02318k19808
37068C358746m07819k45977k05526l80085l80031P3566O62225P80547K72897l43808
37058C184735m45112M4689O33465P89703L83337l04159q16947p76547j37141O55471
37048C211494R13370L42968n97795j150298j023401n34194p9629K04133K52421
37039A539069l1952m92248o79507l85703O5665L45063N90743R46231R89386K89093
37029C175840o31710o79699L41486J356423J376029N98269j93320o91523r85916
37020C665879r47476m13577K67942N56499M66103L91858K92855k49626j078023
37011B952434j285755l79374Q65602J206211M00598n57574o83189j31186J51588
$$ plain form
37077 4165037 4467522 3171436 1250410 128809 469575 1799046 3076236 3578554 3358746
37068 3358746 2950927 2704950 2499424 2119339 1739308 1812874 2475099 3255646 3528543 3184735
37058 3184735 2739623 2784312 3417777 4207480 4590817 4286658 3469711 2693164 2556023 3211494
37048 3211494 4124864 4467832 3870037 2719739 1696338 1162144 1082515 1286648 1539069
37039 1539069 1507117 1014869 335362 -50341 15324 360387 951130 1897361 2886747 3175840
37029 3175840 2544130 1864431 2205917 3562340 4938369 5536638 5343318 4651795 3665879
37020 3665879 2718403 2304826 2572768 3129267 3595370 3987228 4280083 4030457 2952434
37011 2952434 1666679 1287305 2152907 3359118 3759716 3202142 2518953 2387767 2539355
37002B539355k19508m71824K59296J535575J933256Q70347n78380j105242p38040
36993D024835k98469Q4095Q33431J602408J421078L69583j53714N98521J558479
36984A0040247J447809O35163L29588N59093K42632r03141j789498j538068o53665
36975H370160j64178k97913n41742n36191l67989k19881j83244l10716n24207
36966E224099n43311j73998L77491P01837O56454M23773J38636k59724p22232
36957E823025r18176o13650o5442K65234L17249L74951M11987J9348p73718j172614
36947C668194o32894K46125N49476M19778O69396J178197Q59520n14182j616733
36938D826877j333744k77145K58923O9660j45809r7539l248J81609N88150P77790
$$ plain form
37002 2539355 2319847 1848023 2107319 3642894 5576150 6446497 5868117 4762875 4024835
36993 4024835 3726366 3810461 4643892 6246300 7667378 8036961 7883247 8481768 10040247
36984 10040247 11488056 12123219 12452807 13011900 13254532 12351391 10561893 9023825 8370160
36975 8370160 8205982 7908069 7366327 6830136 6462147 6242266 6059022 5748306 5224099
36966 5224099 4680788 4506790 4884281 5586118 6242572 6666345 6804981 6545257 5823025
36957 5823025 4904849 4291199 4225757 4490991 4808240 5183191 5595178 5614526 4840808 3668194
36947 3668194 3035300 3281425 3830901 4250679 4920075 6098272 6957792 6443610 4826877
36938 4826877 3493133 3215988 3474911 3544571 3398762 3301223 3297975 3479584 4067734 4845524
36928D845524K61292n44185q32286o32860n07398l28025L86580J097159O93563
36919D439364n53258j030302j90956N92751K58829l50734j18534M62953L43144
36910C853257j76551o3268N83748P74126L54781Q6594J65721J3272m39348n13330
36900D639002l9366K46907j02314n65206n20772n8691L93773N94551L76771l24667
36890D639988j043930r97063o4396R30935J188897P08500p8291q63175j360941
36881C060524j216947m45980L89660P63723O56930K74610k76539p86669q68539
36872A550773m35282Q0429K94843L56452N70412Q41945Q32888M76282L9437k26099
36862D382080l24005m69784q22798j151180r29174n9815P39636P84220M33246
$$ plain form
36928 4845524 5106816 4562631 3730345 3097485 2590087 2262062 2648642 3745801 4439364
36919 4439364 3886106 2855804 2664848 3257599 3516428 3165694 3047160 3510113 3853257
36910 3853257 3676706 3613438 4197186 4971312 5326093 5412687 5578408 5591680 5152332 4639002
36900 4639002 4599636 4846543 4744229 4179023 3658251 3599560 3993333 4587884 4964655 4639988
36890 4639988 3596058 2598995 2534599 3465534 4654431 5362931 5284640 4421465 3060524
36881 3060524 1843577 1397597 1787257 2550980 3207910 3482520 3205981 2419312 1550773
36872 1550773 1115491 1195920 1490763 1847215 2417627 3259572 4092460 4568742 4608179 4382080
36862 4382080 4058075 3588291 2765493 1614313 685139 625324 1364960 2149180 2582426
36853B582426N26251R34619O62396m42286j153466n73251N42300Q81799K94177
36844D254965l60535n06064k12292K83431O52863M44353l13034q19485m87408
36835B936794J71141L18249j092j93873j85395k49102k12041J47375K96210l00303
36825B727963r28227m51115P46016J087390J82882o21790m11218Q4420M0490j41691
36815B315120N5253J20598m13256q09369k79956N02453L56177n05496q34270k85798
36805B21456K62901K26059j679P0998M02249P71172R94939P68785N585o96261
36795C026204o43568n5204K44048M1344j50254j17458j87675m02956l55866N792
36785A404407K49106K65378L48482L45261k61814j146901j114760J52035J289107
$$ plain form
36853 2582426 3108677 4043296 4705692 4263406 3109940 2536689 3078989 3960788 4254965
36844 4254965 3894430 3388366 3176074 3459505 4112368 4556721 4243687 3424202 2936794
36835 2936794 3107935 3426184 3425092 3231219 3045824 2796722 2584681 2732056 3028266 2727963
36825 2727963 1799736 1348621 2094637 3182027 3364909 2743119 2331901 2416321 2456811 2315120
36815 2315120 2370373 2490971 2077715 1268346 988390 1490843 1847020 1341524 507254 221456
36805 221456 484357 710416 708737 779735 1181984 1953156 2948095 3716880 3722465 3026204
36795 3026204 2382636 2327432 2571480 2612824 2462570 2345112 2157437 1754481 1398615 1404407
36785 1404407 1653513 1918891 2267373 2612634 2350820 1203919 89159 241194 1530301
36776A530301R55617l86490j185729p48144K68920Q85704O49752k07060q93269
36767H69602o53415L10235Q93159M47826m26653q56416p90813n95378k95066N8199
36757a038720L080m76728m44481O04667J556194J146413L2589j15145P78170J187666
36747C233705N17894j65215j97084k86815p95995p92127J59885P72708q0140j415715
36737I51101j516668m32251L32230O2045o14288j043652j101627o64179K18642
36728c808647P67045L15820l66702J21479J631612K390390J416301j99676r08179
36719A359443n23491J62656O34299P76607M76776j28321m89331l47171j58359
36710A763108l11329m54375j88336J25279k4717l33486j47238M02645N79330K06991
$$ plain form
36776 1530301 2485918 2099428 913699 165555 434475 1320179 1969931 1762871 869602
36767 869602 216187 526422 1419581 1867407 1440754 584338 -206475 -801853 -1096919 -1038720
36757 -1038720 -1035640 -1512368 -1956849 -1352182 204012 1350425 1383014 1267869 2046039 3233705
36747 3233705 3751599 3586384 3389300 3102485 2306490 1514363 1674248 2446956 2366816 951101
36737 951101 -565567 -997818 -665588 -603543 -1217831 -2261483 -3363110 -4027289 -3808647
36728 -3808647 -3041602 -2725782 -3092484 -2971005 -1339393 1050997 2467298 2267622 1359443
36719 1359443 835952 998608 1632907 2409514 2886290 2757969 2268638 1921467 1763108
36710 1763108 1451779 997404 809068 934347 909630 576144 428906 831551 1410881 1617872
36700A617872j60133j98987j62898k06949j25401P5422N0445j92156j38306L51774
36690I10683O24465J57024n90439p81702l21925J59426K08646o4058l25701k93715
36680c17296J73089Q06785R37726K89278m17602l01461L59784M63214k19451o55772
36670A118294k23803K45556j58975q70467p22744J69625O48867L83876J78425
36661G68654L56365K13784n01106q61585k69656M08089J88112m35483l97014J08411
36651d21429K4781o79363q99487j62491P50852J140684J190044J094107M87114
36642B524812o85826j598239j507235o72312K17544R02308J286389R89872o7658
36633A389655j068629j052192o5937R90553J412802J074034J30585r70525j416911
$$ plain form
36700 1617872 1457739 1258752 1095854 888905 763504 838926 889371 697215 558909 910683
36690 910683 1535148 1692172 1101733 320031 -1894 157532 366178 302120 -23581 -317296
36680 -317296 -144207 662578 1600304 1889582 1471980 1170519 1530303 1993517 1774066 1118294
36670 1118294 894491 1140047 981072 110605 -612139 -442514 206353 590229 768654
36661 768654 1125019 1338803 837697 -23888 -293544 114545 302657 -132826 -529840 -421429
36651 -421429 -396648 -1076011 -1975498 -2137989 -1387137 -246453 943591 2037698 2524812
36642 2524812 1838986 240747 -1266488 -1938800 -1721256 -818948 467441 1457313 1389655
36633 1389655 321026 -731166 -797103 193450 1606252 2680286 2810871 1840346 423435
36624D23435p03920O07911J350507R78415m1768r22273j172086p04922R3446M69934
36614C78679J2141p80902j106269r03594p19725o74922l35252L33226O97188M20113
36604b679317j100l7036J32113J07385j5367P2387K95605L97395M26966N22755
36594g78214M87013J28367j96560k6941L19257M0358q47826j247662m29356Q45943
36584a705621J286980P84930L60839M94292M60184l03371j039690p11771L18576
36575e4652P05175J01646l78977M8314O54621M27235l64484o97820l20770J84139
36565C04427M93863P45274Q41199N18279O1080K7056K29920o5977q23302j102770
36555A229049n47923j3360k20838o74765n65000j9624K81292J92039O1036J1477
$$ plain form
36624 423435 -280485 327426 1677933 2656348 2614580 1692307 520221 -184701 -91255 378679
36614 378679 390820 -390082 -1496351 -2399945 -3119670 -3794592 -4129844 -3796618 -3099430 -2679317
36604 -2679317 -2680417 -2717453 -2585340 -2477955 -2493322 -2420935 -2125330 -1727935 -1300969 -778214
36594 -778214 -291201 -162834 -359394 -386335 -67078 -26720 -874546 -2122208 -2551564 -1705621
36584 -1705621 -418641 366289 727128 1221420 1681604 1378233 338543 -373228 -54652
36575 -54652 650523 752169 373192 421506 1076127 1503362 1138878 441058 120288 304427
36565 304427 798290 1543564 2384763 2903042 2964122 2991178 3221098 3155121 2331819 1229049
36555 1229049 681126 667766 446928 -227837 -792837 -812461 -531169 -339130 -278094 -266617
36545b66617l5746Q1019N38275J055772J166222P70023O8640p01784j118751o98717
36535H58336K94482P40198N4514q43832p74715J7087M04020J56480j6789M5809
36525I35590k09046o96673n71076K03014M70460l28659j165903r95599k95856
36516b653748q6070k44306N8079P71931J002091M31706l19819p42963r29748r21717
36506c634564m08733O15609J498045J589383R46958J77030j70961K8898M42179
36497A083844N46302J90271j33527J15062O92315P52391m8493j030604j287605
36488H79956p29226r0066m1619m79252o58489r107J127766J675759R55006m23621
36478B207107j119828n79221L43967M59732l42028j063808q82680j01197L41833
$$ plain form
36545 -266617 -302363 -221344 316931 1372703 2538925 3308948 3377588 2675804 1557053 858336
36535 858336 1152818 1893016 1947530 1103698 328983 346070 750090 906570 889781 935590
36525 935590 726544 29871 -541205 -338191 132269 -196390 -1362293 -2357892 -2653748
36516 -2653748 -2739818 -2984124 -2926045 -2154114 -1152023 -720317 -1040136 -1783099 -2712847 -3634564
36506 -3634564 -4043297 -3427688 -1929643 -340260 606698 783728 612767 641665 1083844
36497 1083844 1630146 1820417 1686890 1801952 2494267 3246658 3198165 2167561 879956
36488 879956 150730 60664 19045 -460207 -1118696 -1127803 -37 1675722 2630728 2207107
36478 2207107 1087279 508058 852025 1311757 969729 -94079 -976759 -1077956 -736123
36469g36123J13251j04603M22317J391785J757950J067112j5557o90444r70341
36460B235347j211132j229551o38844K19599N77086M56328O58739J312758J391703
36451C772033K33978j243556j629022p82150L05351J008849J454138J569002Q67573
36442E556196n16962j483354j241160m13773k49135r86814j579158j025068M25720
36433a513508J532452J357997J95645p90132q09600k04635J41483o7830l59371
36424e17499l28401j30820p385J48871M04990L98411j69802q95616j039928m50089
36414b587268L19593P51717Q10076O71581M63197L24461L31684K83389n5938m41965
36404H70527l42463K25699N71861L06451q9224q2260L1886l03826q23852p29466
$$ plain form
36469 -736123 -622872 -727475 -305158 1086627 2844577 3911689 3896132 3205688 2235347
36460 2235347 1024215 -205336 -844180 -624581 -47495 408833 1067572 2380330 3772033
36451 3772033 4006011 2762455 1133433 351283 656634 1665483 3119621 4688623 5556196
36442 5556196 5039234 3555880 2314720 1900947 1651812 664998 -914160 -1939228 -1513508
36433 -1513508 18944 1376941 1572586 782454 -27146 -231781 -90298 -158128 -517499
36424 -517499 -845900 -976720 -984105 -835234 -430244 -31833 -201635 -1097251 -2137179 -2587268
36414 -2587268 -2267675 -1515958 -705882 -34301 428896 753357 1085041 1368430 1312492 870527
36404 870527 528064 753763 1325624 1632075 1542851 1460591 1492477 1188651 364799 -364667
36394c64667J9970N19820J92444m57727o63214l56659P2773M20728N57198J82528
36384A23194o35843j056672l97373P21221J046000M79332J90428P01163R64804
36375B136254N0718j183179j192474J3647R69719R14707N56824N06831K83139
36366C056186m73260r30613k65262P97329Q41318j80263r47871p85599m59651
36357F52314o78842r12101l70458O09819R95310M82396k30687m35705j11124K93903
36347B94825L42402m6863m24593j63786O81078J149508M82090p94906j465387
36338E4368j118321l84411J93410O88641J085059R36645J66279m91976m08191
36329G21503Q4744K86866J36204K2970j1333j97943m19447l83008k73730n08678
$$ plain form
36394 -364667 -344697 175123 367567 -90160 -753374 -1110033 -1037260 -616532 -59334 123194
36384 123194 -512649 -1569321 -1966694 -1245473 -199473 279859 470287 1171450 2136254
36375 2136254 2186972 1003793 -188681 -175034 794685 1709392 2266216 2773047 3056186
36366 3056186 2582926 1652313 1387051 2184380 3025698 2845435 1897564 1111965 652314
36357 652314 -26528 -938629 -1309087 -699268 296042 778438 547751 112046 922 294825
36347 294825 637227 590364 165771 1985 683063 1832571 2314661 1519755 54368
36338 54368 -1063953 -1448364 -1254954 -566313 518746 1455391 1621670 1129694 721503
36329 721503 806247 1093113 1229317 1252287 1240954 1043011 623564 240556 -33174 -541852
36319e41852q89229p55418n9286M68459M12621J99308K36177K69000N5956L43
36309f03921M68137R91712Q72515K13532l67813p39600j156190j385196q95363
36300b602187O4002N40975K71729P2544M49538P45412L38236j37389K50905J082132
36290A075897J053191l5182r26740p58715j97246j95649n18996l65122J12949
36281g55613r308q00616j087720j00976J267033J542890O07388k49149j36166
36272B77763L98694M32431L7880p2568J46833k239p36867j314751j101213m82489
36262b416526k34877m19071m42462L7564P84311J397490J604335J266160N31684
36253B108608j16378l57491m27916o35817p67514n44940l70429p81381j292063
$$ plain form
36319 -541852 -1431081 -2186499 -2245785 -1777326 -1364705 -1165397 -929220 -660220 -604264 -603921
36309 -603921 -135784 855928 1728443 1941975 1574162 834562 -321628 -1706824 -2602187
36300 -2602187 -2538185 -1997210 -1725481 -1652937 -1203399 -457987 -119751 -257140 -6235 1075897
36290 1075897 2129088 2093906 1167166 408451 211205 15556 -503440 -868562 -755613
36281 -755613 -764921 -1565537 -2653257 -2754233 -1487200 55690 663078 413929 277763
36272 277763 676457 1108888 1146768 1074200 1221033 1218794 481927 -832824 -1934037 -2416526
36262 -2416526 -2651403 -3070474 -3512936 -3475372 -2691061 -1293571 310764 1576924 2108608
36253 2108608 1992230 1634739 1206823 571006 -196508 -741448 -1111877 -1893258 -3185321
36244c185321q00170O76568J694859J265229J39979l72083q0457L16863M37800
36235I3267L39807k1470n65930p42337k91304N6739l80814r10587l68844Q90810
36225a900663J318717N29849j59229N3183K39477m15144r47440j12055J392964
36216c41J730023N41476o97698q96069n55800m88965n14622o7376O73700R84423
36206G08751N77098j20377m87845k37505L82315P21500K99207o12351j220608
36197A0185j118424o37659k13687J58761O01678R09898P97477L19209k52647p10737
36187a35946q30893l93989L54013O86767L47754J07298O89361J490404J294514
36178C609283J43888n98567k67511J45220l72667j254469j295833m71890K53827
$$ plain form
36244 -3185321 -3985491 -3308923 -1614064 -348835 -208856 -580939 -661396 -344533 93267
36235 93267 433074 411604 -154326 -896663 -1187967 -1131228 -1512042 -2422629 -2791473 -1900663
36225 -1900663 -581946 -52097 -211326 -158143 81334 -333810 -1281250 -1393305 -341
36216 -341 1729682 2271158 1573460 677391 121591 -367374 -881996 -949372 -275672 708751
36206 708751 1285849 1165472 677627 440122 822437 1543937 1843144 1230793 10185
36197 10185 -1108239 -1745898 -1959585 -1800824 -1199146 -289248 508229 827438 574791 -135946
36187 -135946 -966839 -1360828 -1006815 -320048 27706 135004 824365 2314769 3609283
36178 3609283 3753171 3154604 2887093 3032313 2659646 1405177 109344 -362546 -108719
36169a08719M72220N31457M53790r7158p49234o08330J86197L42367n84648j266161
36159a428219n38749P63965J053440K71258l99224n81801r31382j420385j011543
36150d222640N16937J750165J418707R9436o67113l26595L96912P18839N42495
36141B27143J78018r0158j80243k53541m56388n25544m9662P07662Q38050L3415
36131D28752p94966p16965o9733J86494l6647j4592M35343O33617J80257m17699
36121a86139n42853k54986L2529J51218J19971r5091l96494m10582J18548R12272
36111e51607J378763J205950O19062J02718o8809m0412r8929k33256j89324m522
36101B119634j04266o22477j031725q64492m36049l13530l98180k06280K00104
$$ plain form
36169 -108719 363501 894958 1348748 1251590 502356 -105974 80223 422590 -162058 -1428219
36159 -1428219 -1966968 -1203003 -149563 121695 -277529 -859330 -1790712 -3211097 -4222640
36150 -4222640 -3705703 -1955538 -536831 -437395 -1104508 -1431103 -1034191 -315352 227143
36141 227143 405161 315003 134760 -118781 -575169 -1100713 -1150375 -442713 395337 428752
36131 428752 -366214 -1083179 -1152912 -966418 -1003065 -1017657 -582314 51303 231560 -186139
36121 -186139 -728992 -983978 -951449 -800231 -680260 -775351 -1171845 -1582427 -1463879 -551607
36111 -551607 827156 2033106 2652168 2754886 2686077 2645665 2546736 2313480 2124156 2119634
36101 2119634 2015368 1392891 361166 -503326 -939375 -1252905 -1651085 -1857365 -1657261
36092a657261L62226L42447N77738Q43856M06971n85888r41852j19851Q73388
36083A01774R27548L14360n4113j07178l90553q70016r95779p27886n51900n47595
36073b901338k89751K90063O88098N88273K35204n3882k30123k83026j30427J80103
36063a906806M95299P27774P05676J30879q27592j255995n43860N57213Q03646
36054a113766K07933j32445R9311L1329o50405r14390p5337R07900Q62785K24946
36044e52139K24096Q86494J172371P67437L74146K52868j86991j053574j435494
36035D49214p75605J48607L27507p4739j84778J57026K53543l03451j032219j209044
36025b243939o88543O3650N17909N42677M05757L66740L41305J21723j44752n8441
$$ plain form
36092 -1657261 -1295035 -952588 -374850 469006 875977 290089 -651763 -771614 101774
36083 101774 1029322 1343682 1289569 1182391 791838 -78178 -1073957 -1801843 -2353743 -2901338
36073 -2901338 -3191089 -2901026 -2212928 -1624655 -1389451 -1443333 -1673456 -1956482 -2086909 -1906806
36063 -1906806 -1411507 -683733 21943 152822 -674770 -1930765 -2474625 -1917412 -1113766
36054 -1113766 -905833 -1038278 -938967 -907638 -1558043 -2472433 -2547770 -1639870 -777085 -552139
36044 -552139 -328043 558451 1730822 2498259 2872405 3125273 2938282 1884708 449214
36035 449214 -326391 -177784 149723 74984 -109794 47232 300775 -2676 -1034895 -2243939
36025 -2243939 -2932482 -2868832 -2350923 -1808246 -1402489 -1035749 -694444 -572721 -717473 -775914
36015g75914L57161M99418r925p03980q31818k93589L93502Q52278J077263J036437
36005A600833O24585P2791j43262P247q001m53379q39061o57706k06400j12453
35995a14806k73229L7620R57656J602410J181645P8250o46319n41560p0173K13542
35985B425036K09398l8422n93184j260177j414111o60753N25149J244062J155870
35976A592868O46249J23337l52627o98622o26576j31456K39330K1733m78238n61991
35966b25993j07336K90865K10967l905J74196N82004N37747j12901o21078l32038
35956C92528K92460K41796n33314r32195l00738N54339N86726P9142K519K63377
35946F46640p4103q77954q14583M08734J204275M74590n29350j12175J157963
$$ plain form
36015 -775914 -418753 80665 70740 -633240 -1465058 -1758647 -1365145 -512867 564396 1600833
36005 1600833 2225418 2298209 2154947 2162194 2154193 1700814 861753 204047 -2353 -114806
35995 -114806 -388035 -350415 607241 2209651 3391296 3469546 2823227 2281667 2211494 2425036
35985 2425036 2634434 2596012 2002828 742651 -671460 -1332213 -807064 436998 1592868
35976 1592868 2239117 2362454 2009827 1311205 684629 553173 792503 814236 335998 -225993
35966 -225993 -333329 -42464 168503 164598 338794 920798 1458545 1345644 724566 392528
35956 392528 684988 926784 393470 -538725 -839463 -285124 301602 380744 383263 646640
35946 646640 572537 -305417 -1120000 -711266 493009 967599 438249 326074 1484037
35937A484037J382276L29422m40235k55524j21193n66606o99028j12324R6323
35928A097148o91207j216309l32000R25017R08314K5547m1121P92716R24123j97225
35918B195003j153683q31756J1261K12819n2298L1094L86414K87684l24473p26055
35908C6010m87334M2418L60834M16472M44749M98448L67119n2090m71078n21469
35898F34079l36186m35414q43778q14636R1908J100821J114559K48726l65607
35889C94472k21593M2763j21034l51609j64643K13205L01425J00027j07861k57256
35879a72104l95253m40632l95785m56882o18237n13398O0365P54970J037918P07778
35869d31260j5437n92475m34778M12002R51717L12473r13773j295231n52425J77385
$$ plain form
35937 1484037 2866313 3195735 2755500 2499976 2378783 1812177 1113149 1000825 1097148
35928 1097148 405941 -810368 -1142368 -217351 690963 716510 675389 1468105 2392228 2195003
35918 2195003 1041320 209564 220825 433644 381346 412440 798854 1086538 762065 36010
35908 36010 -451324 -408906 -48072 368400 813149 1311597 1678716 1626626 1155548 634079
35898 634079 297893 -137521 -981299 -1795935 -1704027 -603206 511353 760079 394472
35889 394472 172879 215642 94608 -257001 -421644 -208439 92986 193013 85152 -172104
35879 -172104 -567357 -1007989 -1403774 -1860656 -2478893 -2992291 -2931926 -2176956 -1139038 -431260
35869 -431260 -446697 -1039172 -1473950 -1061948 -110231 202242 -711531 -2006762 -2559187 -2381802
35859b381802K66318M42278J140730J430368O26119k44948L9834Q29631N98469
35850B746997n79503j192679o74774o503J10360J42745M52783N01890o5699n88588
35840H47029l42317L62529O45181J76354n88205r80799p00099p8186K12588N45
35830d45380o5625N05005J142665J044792N10838L98457N14696j12129j321344
35821B171975j664105n88031O14948P47796L38010M13434P65715N97287O4234
35812C461263j15794p2822m99795j191504j125932r4849Q14448O94857k707j92421
35802A674744M34253J143812J106043K96468n72036r13574q87545r71332j101742
35793B09091p48431J11677P19624N40123r724k63417k45190l79484o63484p36798
$$ plain form
35859 -2381802 -2115484 -1673206 -532476 897892 1524011 1279063 1318897 2148528 2746997
35850 2746997 2167494 974815 300041 293538 403898 546643 999426 1501316 1435617 847029
35840 847029 504712 867241 1512422 1688776 1100571 119772 -580327 -658513 -445925 -445380
35830 -445380 -511005 -6000 1136665 2181457 2692295 3090752 3605448 3493319 2171975
35821 2171975 507870 -80161 534787 1282583 1620593 2034027 2799742 3397029 3461263
35812 3461263 3345469 3272647 2772852 1581348 455416 360567 1175015 1869872 1867165 1674744
35802 1674744 2108997 3252809 4358852 4655320 4083284 3169710 2282165 1310833 209091
35793 209091 -539340 -427663 291961 832084 822360 558943 313753 -65731 -729215 -1466013
35783a466013n24774k45742L7938L47044M31215M4062m96389n42987M4856O91958
35773a678832P90712L25853k00944k94003N4604L30295P9267m86989p85597p26364
35763b591998p26068p78636k95220P55959J383035R18809J15804J8774L40840
35754h58701N7638p43363q69886Q7566J052138J007246L27481L7856L72582O48619
35744A119176K79113n21652r85197n91290L30600Q63920M86067l94958j046113
35735d60334j208714r92085m30641L04395O50298L21515m0054L49597J176102
35726c29921J397756P53632L3272j69750j07855j62814k82211l16586k34178J05647
35716F86992P11494R95889L75132o54272r92144n54940l13061n28602k77986P56038
$$ plain form
35783 -1466013 -1990787 -2236529 -2198591 -1851547 -1420332 -1376270 -1872659 -2415646 -2370790 -1678832
35773 -1678832 -888120 -562267 -763211 -1057214 -1002610 -672315 -593048 -1080037 -1865634 -2591998
35763 -2591998 -3318066 -4096702 -4391922 -3635963 -2252928 -1334119 -1218315 -1199541 -858701
35754 -858701 -801063 -1544426 -2414312 -2326746 -1274608 -267362 60119 97975 470557 1119176
35744 1119176 1398289 876637 -108560 -699850 -369250 494670 980737 585779 -460334
35735 -460334 -1669048 -2661133 -3091774 -2787379 -2137081 -1815566 -1855620 -1506023 -329921
35726 -329921 1067835 1821467 1854739 1684989 1577134 1414320 1132109 815523 581345 686992
35716 686992 1398486 2394375 2769507 2115235 1123091 568151 255090 -273512 -551498 204540
35706B04540J384885P25830k52156j88867N36254M91282n24375j283835j050443
35697D3115m06284m9708J36922M65548O84279L08934o58199j601651j739205p88367
35687c604616N55715J055558K77986p29986o49794M28006J192269Q93241J77822
35678d03799j4414K99749M07585j2413n41075o49835l29715J7151J62283K88431
35668g76052N31701N49736k5573p83687p90128J62176J134906J219062N94700
35659A816841p27l05095m55113l76809J1171L09028R6715l23103l33840M6522
35649D85590L32047M62898P17741Q84618M54381l25940n35254P2297O46958M71506
35639C666842j63722o63227r44542j079062q02937k9297O17901M65498k26425
$$ plain form
35706 204540 1589425 2315255 2063099 1874232 2410486 2901768 2377393 1093558 43115
35697 43115 -363169 -412877 -275955 189593 873872 1182806 524607 -1077044 -2816249 -3604616
35687 -3604616 -3048901 -1993343 -1715357 -2445343 -3095137 -2667131 -1474862 -581621 -403799
35678 -403799 -418213 -118464 289121 276708 -264367 -914202 -1243917 -1226766 -1064483 -776052
35668 -776052 -244351 305385 279812 -503875 -1294003 -1131827 3079 1222141 1816841
35659 1816841 1816114 1511019 1055906 679097 690268 999296 1096011 772908 439068 485590
35649 485590 817637 1280535 1998276 2882894 3337275 3011335 2476081 2548378 3195336 3666842
35639 3666842 3503120 2839893 1895351 816289 13352 -15945 601956 1067454 841029
35630H41029n18586J5757P72845Q56927J13563o83923o96540k3731M04211P7358
35620A158910l78565j87501L35141L31337j14626j41109K56896N5788r37168j357635
35610i78532k60587J247181J475860M95561k40365j28333P9487j55865m37771
35601A096636m86114p19433j293242j478359o62070O04869J200297P76529L3746
35592i27141j88401K52724P93121P94103K35890k11477K6250O43308P73431P5376
35582B267184q81646j347461j083388k64208P85428J521875J346448K63321q88557
35573A718996j223743o97105j3419J32637m21534j217758j406246m64226R94878
35564b597520J546993N55973q94817j216057j87049R98735J343909R52112L81602
$$ plain form
35630 841029 322443 338200 1111045 1967972 2081535 1397612 701072 677341 1081552 1158910
35620 1158910 780345 592844 927985 1259322 1144696 1003587 1260483 1316271 379103 -978532
35610 -978532 -1239119 8062 1483922 1979483 1739118 1610785 1690272 1534407 1096636
35601 1096636 610522 -108911 -1402153 -2880512 -3542582 -2937713 -1737416 -960887 -927141
35592 -927141 -1115542 -862818 -69697 724406 960296 748819 775069 1418377 2191808 2267184
35582 2267184 1385538 38077 -1045311 -1309519 -524091 997784 2344232 2607553 1718996
35573 1718996 495253 -201852 -215271 -82634 -504168 -1721926 -3128172 -3592398 -2597520
35564 -2597520 -1050527 -494554 -1389371 -2605428 -2792477 -1793742 -449833 502279 883881
35555H83881o5418k03098J40240P11862Q98359N64658K91155M08714M14168j27125
35545C917396p08261o50604k62097l14282o58553m19594M45862Q75746K96217
35536B521830m70322m29169K07212N17830K00237l01111o29565p87114p55919
35527G3909m57419l4454K64706M03163M27167K34244j42052k77146J24050O65104
35517A281272P41156L94645J33182Q6673j3531j66678j41019j06238m38598q83575
35507H87289p62051j20994K33639P6920J38241P11873R36626J80868p68676q34937
35497F78798k47554K2920j50999j97008j62041n83547j171650r55861Q9960Q14549
35487a862433O27235K87468M35594M97570j12313o70448j44937J055825J487371
$$ plain form
35555 883881 818463 615365 755605 1467467 2365826 2930484 3221639 3630353 4044521 3917396
35545 3917396 3209135 2558531 2296434 1982152 1323599 904005 1349867 2225613 2521830
35536 2521830 2051508 1622339 1829551 2347381 2547618 2246507 1616942 829828 73909
35527 73909 -383510 -417964 -153258 249905 677072 911316 769264 492118 616168 1281272
35517 1281272 2022428 2417073 2550255 2636928 2623397 2456719 2315700 2209462 1770864 887289
35507 887289 125238 4244 237883 314803 453044 1164917 2101543 2282411 1513735 678798
35497 678798 431244 454164 303165 106157 -55884 -639431 -1811081 -2766942 -2676982 -1862433
35487 -1862433 -1235198 -947730 -512136 -14566 -126879 -797327 -942264 113561 1600932
35478A600932O20855n81407j003965m91114L60802P80202J89663j233424k265884
35469b023340j665068K78621J854242J831495O45667n09631j017224q82649k41383
35460a729270N05541O56263Q2361k97472K70474J071730Q18893l45954q92994
35451A39572j02786Q98178P93286j58921p23573l82986L52387Q69912Q96570L07525
35441B889164p03767j373259j020241K0171P28551O91621M55854N08548N38536
35432B735178K15j003708j699299j339314P7593J546050J720311L62919j042835
35423A357110q72166N08618J163285L05079o29154k82038M75299k1456j455672
35414E48905j872883o49563N69847L42608o14131p88744r3833M11386L33274K44000
$$ plain form
35478 1600932 2221787 1640380 636415 145301 506103 1286305 1475968 242544 -2023340
35469 -2023340 -3688408 -3409787 -1555545 275950 921617 411986 -605238 -1487887 -1729270
35460 -1729270 -1223729 -567466 -485105 -782577 -512103 559627 1378520 1032566 139572
35451 139572 36786 934964 1728250 1569329 845756 462770 815157 1685069 2581639 2889164
35441 2889164 2185397 812138 -208103 -187932 540619 1232240 1688094 2196642 2735178
35432 2735178 2735393 1731685 32386 -1306928 -1229335 316715 2037026 2399945 1357110
35423 1357110 484944 993562 2156847 2461926 1832772 1550734 2026033 2004577 548905
35414 548905 -1323978 -1973541 -1403694 -1061086 -1675217 -2463961 -2557794 -2146408 -1813134 -1569134
35404a569134M30018N01542L17978L10950O24197P56017M21768O1355L4832n5873
35394A833650o54685j340321j297287m24611O21691J265835J316204P00233l78908
35385A641801j165986j031328m16421k99246o84032n76567L18693R56146N56516
35376g00424j47461j17159L58529K90548l17308n72800k16552J01308J1949j35022
35366a444392q1969J4500J51383M86257P07074L20160l27870l16344L68158O93823
35356E70780K68960K7409O45610J351473J137213K77765k99500m59875o65134
35347B854701q40247n00156K08298N21768J07830n63244q75614o27555m4440L96913
35337F38254L39359q775j25767j4168j68836n03985k43155O36393R46429J15001
$$ plain form
35404 -1569134 -1139116 -637574 -319596 -8646 615551 1371568 1793336 1854691 1889523 1833650
35394 1833650 1178965 -161356 -1458643 -1883254 -1261563 4272 1320476 2020709 1641801
35385 1641801 475815 -555513 -971934 -1271180 -1955212 -2531779 -2213086 -1256940 -700424
35376 -700424 -847885 -965044 -606515 -315967 -633275 -1206075 -1422627 -1321319 -1309370 -1444392
35366 -1444392 -1526361 -1511861 -1360478 -874221 -167147 153013 -174857 -491201 -123043 570780
35356 570780 839740 867149 1512759 2864232 4001445 4279210 3979710 3519835 2854701
35347 2854701 2014454 1514298 1722596 2244364 2352194 1788950 913336 285781 241341 638254
35337 638254 977613 968838 843071 828903 660067 156082 -87073 549320 1495749 1610750
35327A610750o38949j52707O86834L66981o41871o35682L50589M68334q55896
35318E58383j825185r82359P08920J485397J126553N64141J89984k52841p19656
35309H53337q65043o83124m04985k3936N27767J001308J061815O66960o420o89452
35299A438227r86349o81083j41486J05863J53374L95525N89180J85459m71636
35290E87074m56427J39988K39426l54080n70328O047M05721J47640J83316R70989
35280A299366J256146J30036j173691j129792k71828N1222O8897P28176J417171
35271B375703Q17650n65459j045171n99886p07699j407081j042271O58844J699817
35262A84447Q71996m37961n89225L4729L36759M33971Q26041R77233K72183n87697
$$ plain form
35327 1610750 971801 819094 1505928 1872909 1231038 595356 945945 1414279 558383
35318 558383 -1266802 -2249161 -1540241 -54844 1071709 1635850 1825834 1572993 853337
35309 853337 -11706 -694830 -1099815 -1123751 -595984 405324 1467139 2134099 2127679 1438227
35299 1438227 451878 -229205 -370691 -264828 -111454 284071 873251 1058710 587074
35290 587074 130647 270635 510061 155981 -414347 -408300 -2579 145061 328377 1299366
35280 1299366 2555512 2685548 1511857 382065 110237 161459 230356 958532 2375703
35271 2375703 3193353 2627894 1582723 982837 275138 -1131943 -2174214 -1515370 184447
35262 184447 1056443 618482 29257 63986 400745 834716 1660757 2637990 2910173 2322476
35252B322476n86785k6309J71050P8544L33511O72945L28386m45938o16387n3309
35242B178184K56490k39381r39269j096035o96129j33151L05624M39585K33861
35233C09779k2383l183J77980K03500J73513M50194Q98499Q77276J48597o68124
35223B545648p95185j89095M53341M64873r8306n15234k11813N18724Q41574M29008
35213C443535k10047n52849o89357q30202p44745k21894L16247K90116j77239
35204F23565m55978k98237K3253L17543O20580P93832N71849P7119k16614j54048
35194A902864j14761m14937q21905q38751k92240M61964Q42154N74565k5365m24130
35184H49458n04354n11957l75470L00347J279270J478511L92154q61037q56864
$$ plain form
35252 2322476 1735691 1709382 1880432 1958976 2292487 2965432 3293818 2847880 2231493 2178184
35242 2178184 2434674 2195293 1256024 159989 -536140 -669291 -363667 75918 309779
35233 309779 287396 284213 462193 665693 839206 1289400 2187899 3065175 3213772 2545648
35223 2545648 1750463 1561368 2014709 2479582 2381276 1866042 1654229 2172953 3014527 3443535
35213 3443535 3233488 2680639 1991282 1161080 416335 194441 510688 800804 623565
35204 623565 167587 -130650 -107397 210146 830726 1624558 2196407 2273526 2056912 1902864
35194 1902864 1788103 1373166 551261 -287490 -579730 -117766 724388 1298953 1273588 849458
35184 849458 345104 -166853 -542323 -241976 1037294 2515805 2907959 2046922 1190058
35175A190058J21838M99321k44461q68781l55065N45464N15873l54542p91052
35166B58653k09833N87057O82879K41420L0916K23192K68042r9953l44384L1998
35156A669987N45411K81530o96904j258163p64201K2928J34243j69334R580O05632
35146C80709O42564j64041q97970q15234l42953k16609l13440k0664O15806Q19716
35136c12116J47642q53150j207896n51809N14937J094987R46575O27066O55563
35127A061799Q26776O26339O8320l34213l34097k11632k58230m23521n35185n05504
35117a9148k78720R3014L33822K54066J05742K19578M09401K72946j8751Q3719
35107A455669N12925N54757r088m92861l55860M5815J53411m509j81933m63405
$$ plain form
35175 1190058 1311896 1811217 1566756 697975 342910 888374 1404247 1049705 258653
35166 258653 48820 635877 1318756 1560176 1591092 1814284 2082326 1982373 1637989 1669987
35156 1669987 2215398 2496928 1800024 541861 -222340 -199412 -65169 -234503 -224923 380709
35146 380709 1023273 859232 -38738 -853972 -1196925 -1413534 -1726974 -1747638 -1131832 -312116
35136 -312116 -164474 -1017624 -2225520 -2777329 -2262392 -1167405 -220830 406236 1061799
35127 1061799 1888575 2514914 2583234 2249021 1914924 1703292 1445062 1021541 486356 -19148
35117 -19148 -297868 -204854 128968 383034 488776 708354 1117755 1390701 1371950 1455669
35107 1455669 1968594 2523351 2514263 2021402 1665542 1711357 1864768 1860259 1678326 1214921
35097A214921q89428j048432o31196J1132L97987O08003Q99439J059292P52358
35088B374076J91836j53709k45011k90949k10150Q5706J95319k43658p84881p43569
35078A75010l54002m53041j051985j192604l92771O69631J200773J158393P05250
35069D64654k86304j530582j924002p97200Q47529J329093L96933n50938m14670
35060b465487L41304O99766N58879N16299O75723N28713j9623k90373J92711Q84457
35050A622369Q44944l1867q44713p37273J39363P77224L60693p89323j392051
35041e0634o27836O56937P87454m55332j240386j46022J565589J482115m77340
35032A494545j807189r61787N60752O56180l26311n21480L49178O84982l12382
$$ plain form
35097 1214921 325493 -722939 -1354135 -1343003 -945016 -337013 562426 1621718 2374076
35088 2374076 2565912 2412203 2167192 1876243 1666093 1751799 1947118 1703460 918579 175010
35078 175010 -178992 -632033 -1684018 -2876622 -3269393 -2599762 -1398989 -240596 464654
35069 464654 178350 -1352232 -3276234 -4073434 -3225905 -1896812 -1499879 -2050817 -2465487
35060 -2465487 -2124183 -1424417 -865538 -349239 326484 855197 835574 545201 737912 1622369
35050 1622369 2467313 2435446 1590733 853460 992823 1770047 2130740 1341417 -50634
35041 -50634 -678470 -21533 765921 310589 -929797 -1075819 489770 1971885 1494545
35032 1494545 -312644 -1274431 -713679 -57499 -383810 -905290 -556112 128870 -183512
35023a83512j385820j124207J36877J011714Q47127J27102l84741k98954L06414
35014i48000R57824J078692N14127k98822p94457p84803m85233k45353k82178
35005a288203m84004m92996j58339K16803L20305L10148M79179O70940N39518
34996A13351K09354N4938n5323n39084j113518r14454J13767Q01035K87096o83841
34986a726679p41318K28836R89813O77203j21937k83878L37590Q11499M76707
34977F47836j21873j2584P61247J137260N60559k37031m18697k66977m53075o96497
34967I00168k57720N48257O01985k32888q28242n57202j23527j76809k88959J2474
34957d02463K70742R203l14527j98345r7937m88132o85178J39440J312249J405638
$$ plain form
35023 -183512 -1569332 -2693539 -2556662 -1544948 -697821 -570719 -955460 -1254414 -948000
35014 -948000 9824 1088516 1602643 1303821 509364 -275439 -760672 -1006025 -1288203
35005 -1288203 -1772207 -2265203 -2423542 -2206739 -1886434 -1576286 -1097107 -426167 113351
34996 113351 322705 377643 322320 -216764 -1330282 -2244736 -2130969 -1329934 -1042838 -1726679
34986 -1726679 -2467997 -2239161 -1249348 -572145 -694082 -977960 -640370 171129 647836
34977 647836 525963 513379 1274626 2411886 2972445 2735414 2316717 2049740 1596665 900168
34967 900168 642448 1190705 1792690 1559802 731560 174358 50831 -125978 -414937 -402463
34957 -402463 -131721 -122518 -437045 -635390 -733327 -1221459 -1906637 -1767197 -454948 950690
34947I50690L77714m13909l14979j14942m34107o91166k78953L01857L20214R1297
34937b06284M28955J182679J266033K00237j107715j471386q64133k54640j72957
34928i99211r2962N04311J078375P52059k28799o96764k47300K76283K54213J78255
34918G78460M89520N83399r4746q21514o13885J45447L45052l5345p9407L37504
34908A034485L91085j00120k94625K16109P87050Q64270O17135J13435r34732
34899B694092k118989k216495q53198O62898R31100J19502o27916o95138k20486
34890b324630M76348R70351Q16856J98723o5373L28232O90753N21960L09692M78310
34880B401222M77456j72492p98983o15586p0086K3321k5545M84125J036242N95041
$$ plain form
34947 950690 1328404 914495 599516 484574 50467 -640699 -919652 -617795 -297581 -206284
34937 -206284 222671 1405350 2671383 2871620 1763905 292519 -571614 -826254 -999211
34928 -999211 -1092173 -587862 490513 1242572 1013773 317009 69709 345992 600205 778460
34918 778460 1267980 1851379 1756633 935119 321234 466681 811733 776388 696981 1034485
34908 1034485 1425570 1325450 1030825 1246934 2033984 2898254 3515389 3628824 2694092
34899 2694092 575103 -1641392 -2494590 -1831692 -900592 -781090 -1409006 -2104144 -2324630
34890 -2324630 -1848282 -877931 -61075 137648 72275 400507 1091260 1613220 1922912 2401222
34880 2401222 2878678 2706186 1907203 1291617 1221531 1244852 1219307 1703432 2739674 3334715
34870C334715m49958p06753o0321J56224n68608j147479q09443k33213j35847
34861f20683j48446J22352K01443j89232l39597J81885N41353K3183n80914k20725
34851a029381O25144Q20307N31391P05740J032982K60428j422026k125548r18316
34842a519279P78541J223103N31092r4502k56311l58214m28229j45312K99962
34833C0851M18903L24781M97642P78179N37832j48073m62875j81446j19563q26289
34823H49942j596118j389962k29995R30788J385468J148537N21840j92277o19514
34814H08709n07726p7492J76953Q4636p7775m0818J62017L36391L03083j6090
34804A151888m12849l97233K34998Q99501P44516k76147j298925j610271j314845
$$ plain form
34870 3334715 2884757 2178004 2117683 2273907 1705299 557820 -251623 -484836 -620683
34861 -620683 -769129 -646777 -445334 -634566 -974163 -792278 -250925 -227742 -808656 -1029381
34851 -1029381 -404237 416070 947461 1653201 2686183 2946611 1524585 -600963 -1519279
34842 -1519279 -740738 482365 1013457 918955 662644 304430 -123799 -269111 30851
34833 30851 449754 774535 1272177 2050356 2588188 2440115 1977240 1795794 1676231 849942
34823 849942 -746176 -2136138 -2366133 -1435345 -49877 1098660 1620500 1428223 808709
34814 808709 300983 223491 400444 485080 407305 366487 528504 864895 1167978 1151888
34804 1151888 739039 341806 576804 1476305 2220821 1944674 645749 -964522 -2279367
34795b279367p68990N3059J150213J897852J576028M31775m20867l38788J01559
34786A402474J6326m99890n53103J47237P16544L20843m76071l37781R02283J770235
34776C409097J053952n11273j212395n99684J81729K08798r0759N9767N15041
34767C014273N67280Q6648l61849l78784j92553k26057m97848n96024k54191J26939
34757A287834j49650r87705j260711k65110J000035R70046k25893q32836K8847
34748d35143J205973J359743P09637J17356l92170j058616j298267n56374L93178
34739D5317L94072k82311m54201p813J39086j15986J29346R68094J254427M51825
34729B521856m56208n05975l2661K15746J68913j4884m60910r26005o25963M63879
$$ plain form
34795 -2279367 -3048357 -2995298 -1845085 52767 1628795 2060570 1639703 1300915 1402474
34786 1402474 1418800 918910 365807 513044 1229588 1550431 1074360 736579 1638862 3409097
34776 3409097 4463049 3951776 2739381 2139697 2321426 2530224 2439465 2499232 3014273
34767 3014273 3581553 3668201 3306352 2927568 2735015 2508958 2011110 1415086 1160895 1287834
34757 1287834 1138184 150479 -1110232 -1375342 -375307 594739 368846 -463990 -435143
34748 -435143 770830 2130573 2840210 2957566 2565396 1506780 208513 -347861 45317
34739 45317 439389 157078 -297123 -304936 -165850 -281836 -152490 815604 2070031 2521856
34729 2521856 2065648 1559673 1527012 1742758 1911671 1896787 1435877 509872 -116091 347788
34719C47788J055081K31537j105122j479792q34190j70955K00261P68049J446556
34710D59213J426667N36069l17422l81861L5317K22036R607k84072m35532m96231
34700G73791n77570o38422m39976K14599J072084J468579J045115K33107k94352
34691B856955m52246o11929q02352n95883J27446P73205O81073j7895m81865j40179
34681A336330N84662P69902J95686l47050k21340N6407l65564j178835j206771
34672c76573k05508P00421P18250M63395P09134J021517N64569m06728q76678
34663B311799n22592N9599L42463L03814P9057j47277j14251Q9021p8966p09102
34653A613565r50046j85718Q14909Q67121O2377n40947n56034m53797l69552K2982
$$ plain form
34719 347788 1402869 1634406 529284 -950508 -1784698 -1955653 -1755392 -987343 459213
34710 459213 1885880 2421949 2104527 1722666 1757983 1980019 1989626 1705554 1270022 773791
34700 773791 196221 -442201 -882177 -667578 404506 1873085 2918200 3151307 2856955
34691 2856955 2404709 1792780 990428 394545 521991 1295196 1976269 1958374 1476509 1336330
34681 1336330 1920992 2690894 2886580 2539530 2318190 2374597 2009033 830198 -376573
34672 -376573 -582081 118340 836590 1299985 2009119 3030636 3595205 3188477 2311799
34663 2311799 1789207 1848806 2191269 2495083 2574140 2426863 2312612 2401633 2322667 1613565
34653 1613565 663519 477801 1292710 2159831 2222208 1681261 1125227 671430 301878 324860
34643C24860N18159N16783K28432N04565J290970J461044N06904p28240j362657
34634C260820j435309j172399m27757N84820J008304M47260m23424q53478q42676
34625A46161n90271m3824N49555O07740K30308K47893P50215P28394j60336p84163
34615A681672m35399j88528j039609j899581j159159N73732J213794L05098n07852
34606a455832j49156N12555L60154l69157q01225o64735k09820L15911O39160
34597a822145N48751L07303L65582N42881K35829m50460o72460j74324K97566
34588h21477K63879K35323O34737R19213N30700k5087N8292N61947O10753P6387
34578C044667l07529j63989L7081j53144m95808n51231l29983j09570N5957K46281
$$ plain form
34643 324860 843019 1359802 1588234 2092799 3383769 4844813 5351717 4623477 3260820
34634 3260820 1825511 653112 225355 810175 1818479 2265739 1842315 988837 146161
34625 146161 -444110 -487934 61621 669361 899669 1147562 1897777 2626171 2465835 1681672
34615 1681672 1246273 1057745 18136 -1881445 -3040604 -2466872 -1253078 -947980 -1455832
34606 -1455832 -1604988 -1092433 -732279 -1101436 -1902661 -2567396 -2777216 -2461305 -1822145
34597 -1822145 -1273394 -966091 -600509 -57628 178201 -272259 -944719 -1119043 -821477
34588 -821477 -557598 -322275 312462 1231675 1762375 1737288 1795580 2357527 2968280 3044667
34578 3044667 2737138 2573149 2610230 2457086 1961278 1410047 1080064 970494 1026451 1272732
34568A272732K75809j68231r29903j311368q77325j19763R0712k98502l56495
34559b422334N54554J740480J881926O25159r93886j714993j257893l06609L36043
34550a557553L78226L9002l18433m89212m21199q0221M54027Q20301O85487L06584
34540a82991L23679P67286P97595j40890j387962j863742j388477n41564M02822
34531c214244J512059K368725K233135J169415J41868k56249m06356p20547q64622
34522A963184l89503M32820R01381O71933n7940q00391j009655m92123K10860
34513A430566L11965j65730l74296Q1033N09601K10687m30113n32310J440M45216
34503A488059K97809j64158l35837L6622N77850N73591k44248j163221j152151
$$ plain form
34568 1272732 1548541 1380310 450407 -860961 -1738286 -1858049 -1767337 -2065839 -2422334
34559 -2422334 -1867780 -127300 1754626 2379785 1385899 -329094 -1586987 -1893596 -1557553
34550 -1557553 -1179327 -1140325 -1458758 -1947970 -2369169 -2449390 -1995363 -1175062 -489575 -182991
34540 -182991 140688 907974 1705569 1564679 176717 -1687025 -3075502 -3617066 -3214244
34531 -3214244 -1702185 666540 2899675 4069090 4210958 3954709 3548353 2827806 1963184
34522 1963184 1573681 2006501 2907882 3579815 3521875 2721484 1711829 1219706 1430566
34513 1430566 1742531 1576801 1202505 1283538 1793139 2003826 1573713 1041403 1042843 1488059
34503 1488059 1785868 1621710 1285873 1322495 1900345 2473936 2229688 1066467 -85684
34494h5684j58018P82235Q87357M39374k8534n52077j173954j299770m67211O83610
34484i72672J067073N46129p3221k48145j77335j87172l04533m03864k75493K96658
34474g32575J037952J080754L4192j127934j083337O4280Q97787N77179k52911
34465D95387n84028k44278K97516O26736N47971J00055l13464k57500J20187K90793
34455A079375K07683L18808O11956M47244l41709r61181p62627j55776J69783
34446F13556L28447Q06797J374858J265847L23488p31554j221861j175433r92811
34437E91334q79277p63857n37738k27821K0247J32186K32173M01301L60366k29612
34427i00698j068855j296715n43209N09710R66709P49445M03256K47957K05516
$$ plain form
34494 -85684 -243702 538533 1425890 1865264 1836730 1284653 110699 -1189071 -1656282 -972672
34484 -972672 94401 640530 567309 319164 141829 -45343 -349876 -753740 -1029233 -732575
34474 -732575 305377 1386131 1420323 292389 -790948 -726668 171119 748298 495387
34465 495387 -88641 -332919 -35403 591333 1139304 1239359 925895 668395 788582 1079375
34455 1079375 1287058 1605866 2217822 2665066 2323357 1362176 599549 443773 613556
34446 613556 942003 1748800 3123658 4389505 4712993 3981439 2759578 1584145 591334
34437 591334 -287943 -1051800 -1589538 -1817359 -1797112 -1664926 -1432753 -1031452 -671086 -900698
34427 -900698 -1969553 -3266268 -3809477 -3299767 -2333058 -1583613 -1180357 -932400 -726884
34418g26884J75495O7159k96524q04133q76962k55198L55310J84525l20798j08507
34408b606517O69711O83011m35122j233458n08358Q37685J127485L53085p5441
$$ plain form
34418 -726884 -551389 -484230 -780754 -1584887 -2461849 -2717047 -2361737 -2177212 -2498010 -2606517
34408 -2606517 -1936806 -1253795 -1688917 -2922375 -3430733 -2593048 -1465563 -1112478 -1187919
$$ [...]
##END NTUPLES=NMR SPECTRUM
##END=
