##TITLE=31Pdec_DE-127_3
 , 24 sc
 11.2.2026
##JCAMPDX= 6.0         $$ Bruker NMR JCAMP-DX V2.0
##DATA TYPE= NMR SPECTRUM
##DATA CLASS= NTUPLES
##ORIGIN= UXNMR, Bruker Analytische Messtechnik GmbH
##OWNER= root
$$ XWIN-NMR		Version 3.5
$$ Wed Feb 11 15:59:08 2026 Russian Standard Time (UT+4h)  she@DPX200
##.OBSERVE FREQUENCY= 81.013821
##.OBSERVE NUCLEUS= ^31P
##.ACQUISITION MODE= SIMULTANEOUS
##.ACQUISITION SCHEME= undefined
##.AVERAGES= 24
##.DIGITISER RES= 17
##SPECTROMETER/DATA SYSTEM= spect
##.PULSE SEQUENCE= zgpg30
##.SOLVENT NAME= DMSO
##.SHIFT REFERENCE= (INTERNAL, DMSO, 0, 198.062)
##AUDIT TRAIL= $$ (NUMBER, WHEN, WHO, WHERE, WHAT)
$$ ##TITLE= Audit trail, XWIN-NMR		Version 3.5
$$ ##JCAMPDX= 5.01
$$ ##ORIGIN= Bruker BioSpin GmbH
$$ ##OWNER= she
$$ F:/spectra/data/she/nmr/P31/2/pdata/1/auditp.txt
$$ ##AUDIT TRAIL=  $$ (NUMBER, WHEN, WHO, WHERE, WHAT)
(   1,<2026-02-11 15:57:54.93 +0400>,<she>,<DPX200>,
      <created by zg, POWCHK disabled, PULCHK disabled
       configuration hash MD5:
       00 E9 B6 7A A2 85 ED C7 34 08 36 98 17 FE 4E 26
       data hash MD5: 32K
       13 D9 6B EC 21 58 B6 4F 9F 9A BF AC 8F 4C D3 7A>)
(   2,<2026-02-11 15:57:58.64 +0400>,<she>,<DPX200>,
      <Start of raw data processing
       efp BC_mod = 2 LB = 1.5 FT_mod = 6 PKNL = 1 PHC0 = 1513.976 PHC1 = -192.8991 SI = 64K 
       data hash MD5: 64K
       C4 E7 65 48 CE DE 42 80 2A BF 45 2F F9 F7 13 96>)
(   3,<2026-02-11 15:58:26.98 +0400>,<she>,<DPX200>,
      <pk PHC0 = -178.0265 PHC1 = 426.7997 
       data hash MD5: 64K
       13 8D C8 CE C5 D2 90 F1 83 78 56 D7 4D 0A 7E E9>)
$$ ##END=
$$ 
$$ hash MD5
$$ 0F BC 95 20 6E 80 0E C5 C0 D3 50 FB 8D 71 0E C7
##$RELAX= 
##$RELAX= 
##$RELAX= 
##$RELAX= 
##$RELAX= 
##$RELAX= 
##$RELAX= 
##$RELAX= 
$$ Bruker specific parameters
$$ --------------------------
##$DU= <F:/spectra>
##$EXPNO= 2
##$NAME= <P31>
##$PROCNO= 1
##$TYPE= <nmr>
##$USER= <she>
##$AMP= (0..31)
100 100 100 100 100 100 100 100 100 100 100 100 100 100 100 100 100 100 
100 100 100 100 100 100 100 100 100 100 100 100 100 100 
##$AQSEQ= 0
##$AQ_mod= 1
##$AUNM= <au_zg>
##$AUTOPOS= <>
##$BF1= 81.014009
##$BF2= 200.13
##$BF3= 200.13
##$BF4= 200.13
##$BF5= 200.13
##$BF6= 200.13
##$BF7= 200.13
##$BF8= 200.13
##$BYTORDA= 1
##$CFDGTYP= 0
##$CFRGTYP= 5
##$CHEMSTR= <none>
##$CNST= (0..31)
1 1 145 1 1 1 1 1 1 1 1 1 1 1 1 1 1 1 1 1 1 1 1 1 1 1 1 1 1 1 1 1 
##$CPDPRG= <waltz16>
##$CPDPRG1= <>
##$CPDPRG2= <waltz16>
##$CPDPRG3= <>
##$CPDPRG4= <mlev>
##$CPDPRG5= <mlev>
##$CPDPRG6= <mlev>
##$CPDPRG7= <mlev>
##$CPDPRG8= <mlev>
##$CPDPRGB= <>
##$CPDPRGT= <>
##$D= (0..31)
0 1 0 0 0 0 0 0 0 0.06 0 0.03 2e-05 3e-06 0 0 0.0002 0 0 0 0 0 0 0 0 0 
0 0 0 0 0 0 
##$DATE= 1770811074
##$DBL= (0..7)
120 120 120 11 120 120 24 19 
##$DBP= (0..7)
150 150 150 150 150 150 150 150 
##$DBP07= 0
##$DBPNAM0= <>
##$DBPNAM1= <>
##$DBPNAM2= <>
##$DBPNAM3= <>
##$DBPNAM4= <>
##$DBPNAM5= <>
##$DBPNAM6= <>
##$DBPNAM7= <>
##$DBPOAL= (0..7)
0.5 0.5 0.5 0.5 0.5 0.5 0.5 0.5 
##$DBPOFFS= (0..7)
$$ [...]
##$SUBNAM3= <"">
##$SUBNAM4= <"">
##$SUBNAM5= <"">
##$SUBNAM6= <"">
##$SUBNAM7= <"">
##$SUBNAM8= <"">
##$SUBNAM9= <"">
##$SW= 400.765351723535
##$SWIBOX= (0..15)
0 1 3 0 0 0 0 0 0 0 0 0 0 0 0 0 
##$SW_h= 32467.5324675325
##$TD= 32768
##$TD0= 1
##$TE= 0
##$TE2= 300
##$TE3= 300
##$TEG= 300
##$TL= (0..7)
0 120 53 12 22 120 120 120 
##$TP= (0..7)
150 150 150 150 150 150 150 150 
##$TP07= 0
##$TPNAME0= <>
##$TPNAME1= <>
##$TPNAME2= <>
##$TPNAME3= <>
##$TPNAME4= <>
##$TPNAME5= <>
##$TPNAME6= <>
##$TPNAME7= <>
##$TPOAL= (0..7)
0.5 0.5 0.5 0.5 0.5 0.5 0.5 0.5 
##$TPOFFS= (0..7)
0 0 0 0 0 0 0 0 
##$TUNHIN= 0
##$TUNHOUT= 0
##$TUNXOUT= 0
##$USERA1= <user>
##$USERA2= <user>
##$USERA3= <user>
##$USERA4= <user>
##$USERA5= <user>
##$V9= 5
##$VALIST= <valist>
##$VCLIST= <CCCCCCCCCCCCCCC>
##$VD= 0
##$VDLIST= <DDDDDDDDDDDDDDD>
##$VPLIST= <PPPPPPPPPPPPPPP>
##$VTLIST= <TTTTTTTTTTTTTTT>
##$WBST= 1024
##$WBSW= 4
##$XGAIN= (0..3)
0 0 0 0 
##$XL= 0
##$YL= 0
##$YMAX_a= 130996
##$YMIN_a= -140366
##$ZGOPTNS= <>
##$ZL1= 120
##$ZL2= 120
##$ZL3= 120
##$ZL4= 120
##$ABSF1= 0
##$ABSF2= 0
##$ABSG= 0
##$ABSL= 0
##$ALPHA= 0
##$AQORDER= 0
##$ASSFAC= 0
##$ASSFACI= 0
##$ASSFACX= 0
##$ASSWID= 0
##$AUNMP= <proc_1d>
##$AZFE= 0.1
##$AZFW= 0.5
##$BCFW= 0
##$BC_mod= 2
##$BYTORDP= 0
##$COROFFS= 0
##$CY= -3
##$DATMOD= 1
##$DC= 0
##$DFILT= <>
##$DTYPP= 0
##$F1P= 0
##$F2P= 0
##$FCOR= 1
##$FTSIZE= 65536
##$FT_mod= 6
##$GAMMA= 0
##$GB= 0
##$INTBC= 1
##$INTSCL= 9.790993e-09
##$ISEN= 30
##$LB= 1.5
##$LEV0= 0
##$LPBIN= 0
##$MAXI= 10000
##$MC2= 0
##$MEAN= 0
##$ME_mod= 0
##$MI= 50
##$NCOEF= 0
##$NC_proc= -4
##$NLEV= 6
##$NOISF1= 182.463
##$NOISF2= 159.3651
##$NSP= 0
##$NTH_PI= 0
##$NZP= 0
##$OFFSET= 198.0616
##$PC= 4
##$PHC0= 1335.949
##$PHC1= 233.9006
##$PH_mod= 1
##$PKNL= yes
##$PPARMOD= 0
##$PSCAL= 0
##$PSIGN= 0
##$REVERSE= no
##$SF= 81.0140089999434
##$SI= 65536
##$SIGF1= 159.3651
##$SIGF2= -187.1042
##$SINO= 113.3802
##$SIOLD= 16384
##$SREGLST= <1H.CDCl3>
##$SSB= 0
##$STSI= 65536
##$STSR= 0
##$SW_p= 32467.5324675325
##$SYMM= 0
##$S_DEV= 0
##$TDeff= 32768
##$TDoff= 0
##$TI= <>
##$TILT= no
##$TM1= 0
##$TM2= 0
##$TOPLEV= 0
##$USERP1= <user>
##$USERP2= <user>
##$USERP3= <user>
##$USERP4= <user>
##$USERP5= <user>
##$WDW= 1
##$XDIM= 65536
##$YMAX_p= 523419305
##$YMIN_p= -3703748
$$ End of Bruker specific parameters
$$ ---------------------------------
##NTUPLES= NMR SPECTRUM
##VAR_NAME=  FREQUENCY,     SPECTRUM/REAL,   SPECTRUM/IMAG
##SYMBOL=    X,             R,               I
##VAR_TYPE=  INDEPENDENT,   DEPENDENT,       DEPENDENT
##VAR_FORM=  AFFN,          ASDF,            ASDF
##VAR_DIM=   65536,         65536,           65536
##UNITS=     HZ,            ARBITRARY UNITS, ARBITRARY UNITS
##FACTOR=    0.49542278885378, 1,            1
##FIRST=     16045.7642231865, 0,            0
##LAST=      -16421.768244346, 0,            0
##MIN=       -16421.768244346, -3703748,     0
##MAX=       16045.7642231865, 523419305,    0
$$ Real data points
##PAGE= N=1
##DATA TABLE= (X++(R..R)), XYDATA
$$ [...]
43689 124247 124881 194276 285430 289215 221623 210979 301259 393515 401915 357647 323622 300163
43677 300163 263951 234385 255019 345391 486182 612252 630647 515844 385746 395247 536873
43666 536873 638513 589115 466388 386739 332262 221037 73516 -9314 -2225 19904 10472
43655 10472 7854 47659 97424 109706 86395 61401 56156 72510 101814 130203 158602 214633
43643 214633 311488 401487 417162 363295 320605 343638 395951 401731 323092 173034 -3497
43632 -3497 -139021 -177397 -131371 -76142 -58118 -41365 24476 113474 141998 67465 -59433
43621 -59433 -136763 -98921 16640 87614 30872 -81293 -80702 98183 338612 494318 547599
43610 547599 552656 502847 368885 226330 206013 304348 361607 266658 86122 -51882 -105466
43599 -105466 -90858 235 163046 318529 389142 410875 482830 613778 697484 648568 498992
43588 498992 343789 243233 202250 206787 243703 290932 311072 274925 205698 185893 279420
43577 279420 437451 525275 465037 309484 150316 13606 -103552 -155188 -95601 19168
43567 19168 73672 43061 21356 80917 171856 192029 107527 -24275 -112540 -93243 27962
43556 27962 167833 230130 197790 138504 114066 118470 113152 83897 46875 30187 60786 136954
43544 136954 204846 199374 122751 52238 60983 158268 302114 427491 466776 402259 312208
43533 312208 312637 437411 617827 774282 860883 826603 637386 370783 188405 157214 185038
43522 185038 190686 232688 374330 517058 504185 340940 179363 112085 108557 134940 191667
43511 191667 221050 126181 -65971 -183519 -123006 13249 70006 46872 63284 173071 308783
43500 308783 385615 381154 320425 244549 194565 183484 189003 202688 262113 391032 529400
43489 529400 577507 505442 374017 251988 158501 84998 21833 -47498 -129810 -180442 -124098
43478 -124098 49845 247116 361152 381061 369783 363706 353369 350569 393640 459847 447813
43467 447813 307345 134197 58226 69746 48866 -43096 -107753 -68875 15083 51712 41401
43456 41401 32262 19998 -23865 -78920 -115431 -155342 -203625 -175517 -8316 198235 290893
43445 290893 286549 327363 412405 363065 116282 -128547 -169633 -64821 5135 15692 71281
43434 71281 178059 235232 232188 271613 371146 405504 312239 224350 298126 486220 587727
43423 587727 500631 338782 280428 351114 402495 308804 137556 65644 138523 209564 159693
43412 159693 71391 85614 173779 202579 181352 261538 470750 628503 602730 498430 482925
43401 482925 546566 568902 529393 498974 474235 380547 235549 165678 228915 330483 351583
43390 351583 272270 132573 -36976 -191159 -249668 -170853 -9653 146548 266862 362679
43380 362679 425739 434992 403426 368693 346126 325591 300832 268597 216212 148654 112756 148928
43368 148928 224392 260832 231968 189834 185105 206638 220402 224873 230485 212964 135821 17463
43356 17463 -61533 -32368 94158 238113 321307 333067 336358 400260 513329 578652 519815
43345 519815 380110 280106 277776 313856 308828 266106 241203 241868 213768 123744 15390 -30869
43333 -30869 25566 148163 245517 242736 158229 97486 134887 214305 217068 122775 35122 33970
43321 33970 79800 107447 134753 196102 226579 130919 -37659 -84098 99958 393393 579933
43310 579933 564060 407337 216935 71822 16984 45213 90707 100352 98803 125509 135145
43299 135145 52840 -73108 -83911 79850 273533 324115 239370 155196 128741 95329 15957
43288 15957 -47602 -33519 32774 95456 146296 200676 252022 298187 362267 434484 445181 364699
43276 364699 285131 310889 390310 363685 189858 15254 -29365 -122 -24119 -87968 -61690
43265 -61690 87643 225791 222237 100947 -23441 -86764 -93869 -53872 24575 97593 119663
43254 119663 110244 125340 160555 144997 45634 -82844 -178535 -246466 -314240 -363663 -359673 -314716
43242 -314716 -269689 -231265 -178856 -115754 -60241 -1470 76861 139838 136280 90883 88515 151039
43230 151039 201124 175613 106374 53538 29629 40012 126573 292887 434049 430092 292826
43219 292826 148404 87527 98874 134897 167699 180212 171392 176477 223328 270300 250858 174927
43207 174927 111790 75351 17522 -52488 -47376 59437 173416 217471 238922 299035 340327
43196 340327 272522 137499 68982 103777 140300 90562 -18070 -110151 -154471 -163824 -159075
43185 -159075 -153843 -134438 -55163 97560 245127 284924 215320 121712 42219 -59737 -173952
43174 -173952 -204254 -106766 23245 76899 72373 89329 127687 133399 124595 179012 301660 407077
43162 407077 447617 470286 519852 567243 578110 587301 646594 734209 769106 702000 559872
43151 559872 413434 324590 311068 338522 354002 339862 325968 345291 395680 450627 487381
43140 487381 499716 503367 527246 571929 584356 516862 408156 347805 352249 345564 286346 232642
43128 232642 233339 239665 203446 188523 274745 402588 448309 439071 544937 820440 1084483
43117 1084483 1131037 966354 757233 616089 525241 426074 293278 139187 14017 -11285
43107 -11285 78275 191639 209688 108932 -28715 -113829 -120448 -81396 -57441 -97201 -188789
43096 -188789 -262149 -263127 -198515 -89550 61566 215781 279022 220691 155023 203293 312548
43085 312548 326926 221444 136448 166777 241709 255233 209339 174929 196385 282520 410245
43074 410245 493060 436004 277844 188669 257496 368546 370259 285319 250747 311736 388436
43063 388436 412584 389180 337382 266284 209801 211413 272900 366300 470754 546727 524937
43052 524937 399503 283024 272351 303288 252006 142311 110536 175781 203460 126519 50777
43041 50777 76424 146091 157319 123036 125172 184028 261994 338332 403897 436719 450469 504893
43029 504893 598108 622171 517519 403327 437839 591869 684751 625989 497502 396485
43019 396485 324627 264823 253136 312500 392050 432083 435658 430891 416006 386957 366618 356472
43007 356472 312083 229795 210931 352993 591816 739403 695664 554486 472757 494344 545091
42996 545091 551089 499892 410056 308133 235905 218414 209818 130582 -9682 -81424 20453
42985 20453 238617 418054 479303 458290 397751 296592 180906 125885 154014 185426 153831
42974 153831 111412 142546 221867 251851 218197 206973 260954 313906 300965 257208 255605 298421
42962 298421 322795 285295 201979 129049 132766 244928 409710 503287 449297 294751 135981
42951 135981 3881 -121183 -212738 -204626 -100111 8796 60113 86107 119011 112398 30136
42940 30136 -49161 -18953 91423 147430 104079 62102 104991 187130 237664 278491 357774
42929 357774 440572 461695 437524 428448 428330 394747 362415 409996 515213 556599 477282 343497
42917 343497 219708 97391 -14893 -49431 4483 45980 10731 -13500 80321 240420 325730
42906 325730 310411 301998 371465 473029 537405 551189 524829 455721 347674 219055 85250
42895 85250 -23256 -38265 84643 278276 398778 362414 207443 28909 -92062 -103968
42885 -103968 -6893 122359 186330 170579 148835 177181 232058 260508 240384 182979 128594
42874 128594 143504 257016 386628 392990 240272 49429 -36100 9345 107319 170823 153740
42863 153740 59613 -51518 -96094 -42900 62796 162348 236304 286486 315482 341515 382358
42852 382358 403479 338572 192273 68139 54574 124850 183595 171823 100016 26090 28041
42841 28041 142445 296402 358181 291200 195342 159795 155379 127814 107041 135576 166176
42830 166176 143444 131870 235786 420047 539633 542898 519250 531921 531839 478879 428883 426123
42818 426123 399500 257225 33041 -148446 -227935 -258568 -303660 -352958 -357740 -306743 -237037
42807 -237037 -181067 -128494 -53841 29746 77097 84409 117210 220979 326754 307876 135451
42796 135451 -79364 -216172 -266613 -295336 -327084 -322717 -248098 -121755 4306 82189 91276
42785 91276 55064 37010 86592 172981 199718 118112 12928 26881 184501 339675 343777
42774 343777 231223 168409 231168 323714 343496 330749 380986 477515 516721 479265 469394
42763 469394 559536 676640 692675 583867 449616 389964 408572 446041 477936 540169 648291
42752 648291 735542 724671 644265 601248 630311 654331 625420 609369 659976 695961 607913
42741 607913 431549 299446 254919 234846 219509 266173 379148 471953 499134 520839 587493
42730 587493 651208 647621 590079 525234 456789 368674 277039 214990 203693 262797 400251
42719 400251 571859 707247 792201 861154 899581 843372 701290 580305 545075 547016 541000
42708 541000 562419 613696 585645 404575 179158 81050 130319 208552 239474 243976 249249
42697 249249 256646 282511 329686 337067 260097 184163 244118 428601 573893 571162 483331 430640
42685 430640 447532 486926 494516 444262 355788 300565 339940 440564 499773 462587 361934
42674 361934 243855 121664 17879 -18123 31681 121050 187550 204615 185748 173982 216609
42663 216609 304441 355277 317085 262204 296585 392534 415718 325382 237393 255173 340098
42652 340098 401111 423087 440692 456785 459454 470927 513459 559055 563077 518593 442189 345443
42640 345443 257513 233081 292800 386068 446901 455032 416836 332422 221667 145723 158777
42629 158777 255329 384015 486511 516025 464719 390777 372381 417052 458720 448190 392074
42618 392074 309136 226969 216051 317405 422998 362693 158602 50058 177971 378655
42608 378655 413772 292019 213336 273934 385003 435864 387617 238182 40427 -68031
42598 -68031 1611 139007 160097 71077 51247 168034 278018 250351 130078 19498 -53641
42587 -53641 -69319 42257 276328 472096 476430 328750 184191 108175 47512 -35517 -105776
42576 -105776 -123983 -92284 -26546 62251 156486 239494 312789 382934 444208 491502 529757
42565 529757 555976 555650 524549 465499 369803 250533 184628 245926 388958 487265 507390
42554 507390 540967 621669 631364 479891 279202 214367 298567 381002 367475 309635 278419
42543 278419 262633 220720 155333 107487 120073 207788 322096 367931 311612 243956 264977
42532 264977 336055 339786 269237 244667 327097 424315 426985 354745 314413 369640 489637 577549
42520 577549 530227 335440 131698 92792 218988 329429 309785 266910 352117 522757
42510 522757 608461 564757 515059 543561 589898 590225 593798 654141 696917 610908 431361 319940
42498 319940 358867 459370 500298 473663 441121 413610 355143 277456 246445 287440 350308
42487 350308 386742 404741 421064 416333 379797 354371 384198 444077 472021 454144 427747 413067
42475 413067 394572 367210 349618 342280 316138 260146 210742 217873 296965 417363 523316
42464 523316 571999 569454 561069 571181 572114 534674 478609 436239 397658 342025 294166 286662
42452 286662 287126 237226 153825 110197 113995 89635 3452 -71927 -52663 56529 184466 261256
42440 261256 250077 176548 140013 219536 351192 386134 294778 210386 228673 280402 273823
42429 273823 247040 272980 309099 270042 184071 147057 167047 182040 194127 250558 313536
42418 313536 289691 189795 126484 141914 168442 182495 260369 428675 578357 599828 517356
42407 517356 425330 364905 322349 283069 230383 145873 56351 25953 65659 111518 124129
42396 124129 137192 171528 185659 163553 164699 217028 240058 161777 50233 34560 133883
42385 133883 248617 291738 254052 168608 84301 53634 82838 114657 110484 111995 164760 226954
42373 226954 225227 162985 101771 71793 68058 86884 90457 -4286 -202600 -357139 -339688 -240562
42361 -240562 -251297 -376174 -427823 -317377 -174454 -129446 -136617 -93780 -2991 83693 167555
42350 167555 250246 269941 198035 128189 162564 262800 313252 287490 255251 260804 292158
42339 292158 347842 439558 533880 569592 535145 473265 419450 386832 391011 433647 479579 499092
42327 499092 506362 511355 481399 414407 395414 487983 606456 598728 438175 238071 95781
42316 95781 27987 42107 142513 254040 267266 194159 162881 219205 255661 197604 137230
42305 137230 191690 327745 433134 484177 527038 548495 489726 365715 257890 189797 108181
42294 108181 -1972 -71289 -42989 45937 111415 115371 95222 119168 209561 300342 301891 229257
42282 229257 209955 314531 443621 467437 420747 438868 528156 546645 432652 308654 293735
42271 293735 331929 297318 181209 73632 19577 -3565 -3139 33893 78814 81824 51235 37886
42259 37886 44856 27294 -15332 -22060 38858 126888 194738 236034 248777 217335 162780 147956
42247 147956 187926 214339 188504 195264 333425 534109 595861 433430 207205 139590 254696
42236 254696 382810 400912 365988 378453 408941 353493 219978 146362 211404 317191 315663
42225 315663 193520 65754 21373 45360 77995 82640 49937 -8921 -58641 -68278 -49691
42214 -49691 -34273 -18607 20817 67747 83858 88313 144361 244143 284955 207343 91984 59640
42202 59640 126050 221386 310189 413607 534148 634244 687036 690162 635882 525099 404932
42191 404932 333403 309049 291979 288289 347383 474402 614627 730419 817989 837361 719930
42180 719930 488297 285880 226548 278026 350316 425218 514637 553861 453993 247967 82384
42169 82384 51888 118091 199589 262525 302815 314618 311969 326444 354866 359881 341803 346167
42157 346167 370886 338647 213865 85036 66573 167334 318031 470866 588937 595801
42147 595801 459968 307495 310359 444935 502747 394371 298499 401569 606934 658993
42137 658993 495852 307514 249339 265501 244440 205060 234844 333980 418105 426321 355646
42126 355646 239056 155140 196716 341025 404218 236369 -64901 -253452 -241977 -183646
42116 -183646 -222113 -294199 -259414 -121408 -4006 42858 91192 188141 265767 241973 148557
42105 148557 99232 152519 259696 350022 413865 467452 479468 408103 305506 287540 353427
42094 353427 331636 102944 -195308 -326397 -278731 -261024 -358646 -390870 -205444 56497
42084 56497 150403 71989 28324 121698 245993 287471 258129 209084 165976 189161 351332
42073 351332 593344 733849 699885 627901 643398 658425 520403 278866 144954 209281
42063 209281 342669 388101 329602 238415 157946 103156 103576 175409 276750 338176 329229 275264
42051 275264 228424 237875 320918 437443 512340 510541 478870 489152 547086 584147 543830 452859
42039 452859 388952 386310 397239 359484 283656 243549 277706 334555 338306 284952 236729 230526
42027 230526 234596 207662 164305 152238 182611 215659 214310 184815 156543 143724 142202 148108
42015 148108 160301 174491 196027 249117 344476 441894 482061 461552 434475 424619 386198 284821
42003 284821 164433 77459 -4220 -125680 -225221 -182400 -1984 155847 174953 123925 133175
41992 133175 208995 259457 254708 256404 299158 337959 328962 287488 240162 182407 121437 114680
41980 114680 213947 384266 516465 529588 450562 388159 427374 549241 659174 690199 660195
41969 660195 627724 624788 648917 684554 700636 659653 571063 508816 526032 573358 559220 476797
41957 476797 405628 392009 403308 414211 457464 546952 616302 595819 512364 452896 451408 470197
41945 470197 483853 522878 619836 752376 862348 912344 907537 874422 835219 803559 794260
41934 794260 824088 893954 973438 1013024 974398 849574 667702 501641 448063 552989 742397
41923 742397 863381 822631 666104 504296 389537 303578 240939 239955 313713 399427 419022
41912 419022 371064 323435 324246 365529 437617 558359 710525 804096 773756 688583 674661
41901 674661 725466 693801 515472 335589 319886 417730 438860 329654 231570 255737 339843
41890 339843 385030 416793 516428 667394 771481 782935 740214 683297 617374 553411 514330
41879 514330 489941 437058 337177 219070 122415 74123 96151 189465 300667 349590 314674
41868 314674 261427 259990 295444 291658 216902 128673 95096 98834 63664 -22028 -64875 11043
41856 11043 146589 218878 202597 172684 154393 86196 -31585 -74426 25755 129881 54570
41845 54570 -155420 -257573 -121509 113663 228633 172373 68802 50113 145981 293014
41835 293014 397439 408602 362193 332220 331888 303352 217280 123002 66508 16752 -72716 -170144
41823 -170144 -195312 -123211 -6202 94738 156862 186216 205052 241895 297495 329754 305487
41812 305487 248841 196742 131091 21117 -76079 -44264 129443 292409 289569 151585 56359
41801 56359 118325 277766 400609 424229 375222 293322 196075 110079 84151 145123 257891
41790 257891 349916 373879 340052 293425 267689 260109 246779 220613 206741 229634 271925 288672
41778 288672 264452 227048 193763 143829 78466 72168 199500 412581 554037 516046 346134
41767 346134 178467 107878 155448 295536 455466 529673 474995 383621 386361 476810 507568
41756 507568 386081 198237 87569 78031 92447 101112 151084 250181 319079 293981 206621
41745 206621 118795 36268 -58210 -134976 -149939 -121148 -104536 -105466 -81331 -27883 9492 22020
41733 22020 63221 160945 269178 346725 423584 534924 637807 660778 608997 555959 546435
41722 546435 567142 601164 645558 671264 626050 496789 331916 195927 135552 180027 317416
41711 317416 466451 532642 509490 472051 461087 442894 405880 410239 482128 531264 460203
41700 460203 310595 206411 175968 134391 46619 -730 64713 178261 222965 189502 176665
41689 176665 249738 365160 441876 455720 442354 439448 452240 464207 461547 443141 408683 341925
41677 341925 223382 75748 -18559 18982 172202 329130 388095 347663 278727 233365 210061
41666 210061 191950 178817 175536 176610 172483 157173 132401 123442 178923 314954 457826 491232
41654 491232 383504 229239 136332 107388 68954 -12648 -89593 -89521 22757 221230 418775
41643 418775 516522 503350 487483 572217 713159 763379 655981 470862 314819 216746 168681
41632 168681 187246 273790 368153 408095 405209 409340 426499 427678 418752 443849 523624 633608
41620 633608 737278 801552 790987 693612 551665 425974 329492 232848 130812 57423 32124
41609 32124 39185 72228 149640 261578 347420 364242 344577 341519 340544 282667 171939 99084
41597 99084 132596 230882 301890 319657 331552 365147 390331 386041 387029 430412 496839 542865
41585 542865 557179 544390 491427 405027 346893 357407 368021 282380 143884 117999 274392
41574 274392 481603 574560 545585 496494 470364 427603 355326 303918 312384 363245 415955
41563 415955 438459 412016 349964 303722 310516 350086 390434 445901 535851 615556 617715 546301
41551 546301 460568 383784 308704 281292 376058 566607 714634 731101 675600 652827 681469
41540 681469 720541 761817 821397 873255 861465 770847 640960 520435 440799 416728 434947
41529 434947 456504 461358 473840 513467 544015 515118 442605 402130 440953 531447 616805 672624
41517 672624 715194 772065 852607 931120 956407 897482 784864 686579 633726 589203 506821
41506 506821 404085 345943 358831 398432 420921 449273 525974 623574 667339 650425 653997
41495 653997 719777 769439 708875 562304 432611 365593 331952 314337 316567 296023 194043
41484 194043 54251 9959 110144 243131 286245 254265 235158 247846 245098 209669 162896
41473 162896 107960 46486 30644 111031 233967 275756 200027 110120 111905 183345 227633
41462 227633 214883 208840 259675 328748 350351 338914 386090 540969 733725 856767 902012
41451 902012 965996 1116190 1307081 1453868 1542298 1622023 1720875 1818715 1902193 2001863 2161249
41440 2161249 2390307 2660426 2936321 3207386 3489919 3800480 4134381 4480244 4849200
41431 4849200 5273063 5775770 6360082 7014204 7716927 8457852 9282992 10294129 11545889
41422 11545889 12943160 14285133 15407038 16237045 16742476 16908770 16782128 16452230 15972178
41413 15972178 15371694 14766323 14355181 14257823 14423388 14735326 15114984 15473698 15671579
41404 15671579 15616958 15335214 14860612 14141151 13143285 11970719 10770316 9591883 8456825
41395 8456825 7480858 6761685 6185246 5522683 4727328 3979587 3420368 2999501 2631403
41386 2631403 2341425 2166970 2030919 1823672 1550448 1312243 1176692 1125056 1095012 1033025
41376 1033025 927848 812598 711157 594919 442808 319624 307031 363966 362677 280134
41366 280134 241058 330338 468483 530511 496385 421868 345273 289342 277312 278301 209689 62747
41354 62747 -47941 -36205 26431 19762 -50316 -83774 -47600 -4586 -4664 -35850 -72325 -98997
41342 -98997 -96130 -56947 -10278 15663 27438 28965 -6668 -83806 -153534 -186483 -215784 -247490
41330 -247490 -203103 -41945 124203 153416 72502 38284 122050 247107 331484 376380 403789
41319 403789 414716 432392 493041 567911 578589 514096 451179 432740 409800 341285 274818
41308 274818 278333 345691 412595 423536 353805 212379 55769 -39772 -48641 -10359 36190
41297 36190 93567 172594 263971 353764 423722 434973 370049 299152 335237 495735 667067
41286 667067 735070 696059 612472 523568 447052 417831 466278 578696 714321 840028 927992
41275 927992 956145 940821 935249 962846 978638 925760 808026 685256 619615 638475 715423
41264 715423 769580 719934 565986 391337 276717 238180 247854 262476 224467 103283 -36115
41253 -36115 -72666 20019 121709 115793 36644 2622 44798 78984 32349 -69229 -141023
41242 -141023 -118828 1244 161833 278527 301945 250703 177214 119001 92998 105986 146735
41231 146735 190968 230772 272238 297240 274821 227284 226191 289862 343825 325559 268275 228954
41219 228954 197446 145005 100750 93532 71583 -15230 -90060 -25898 160061 305537 310411
41208 310411 239811 198898 210350 253397 319347 364356 294760 86495 -130506 -188283 -60730
41197 -60730 126844 243465 256283 211895 172964 174522 205440 226422 216811 189262 151057 85752
41185 85752 -4864 -79766 -116611 -157626 -250334 -363747 -414432 -368801 -275103 -196368 -153303
41174 -153303 -136257 -133470 -133680 -126836 -114107 -103131 -94888 -91528 -103704 -118503 -72609 90251
41162 90251 322581 481532 463641 300236 95626 -86221 -227461 -288739 -221127 -61573
41152 -61573 50980 3120 -174696 -349136 -419733 -382068 -282819 -165058 -59753 11741 44419
41141 44419 40968 -2864 -80126 -146707 -151550 -95879 -23796 48190 140030 232741 250007 159785
41129 159785 40895 -13556 -21131 -65782 -151942 -189674 -133975 -58954 -56577 -114673 -137113 -55552
41117 -55552 108767 271441 351902 336031 285935 264188 246799 155276 -14692 -157771 -188921
41106 -188921 -151243 -135649 -141625 -102594 -26803 -8293 -72996 -105981 3226 196512 303438
41095 303438 243610 107599 36478 79323 183004 266631 272720 188502 67039 7674 66854
41084 66854 193734 294876 352355 420740 504653 516130 398574 235486 167524 227451 321573
41073 321573 359592 334760 277868 205370 132803 76852 16012 -94069 -233030 -302231 -247977
41062 -247977 -148120 -112878 -136376 -120583 -27627 71494 104720 85226 72217 102021 175184
41051 175184 257408 276748 184132 47204 16232 145550 307987 350703 281734 220406 211315
41040 211315 200519 176795 200907 265789 258491 133330 15956 36328 139172 177128 136039
41029 136039 134468 223220 324125 376288 408419 430845 384546 261095 162045 158619 187610
41018 187610 177002 184345 294013 445365 498875 440294 386935 403878 445100 479525 535524
41007 535524 587481 535904 369247 229853 226897 273061 213228 52112 -64327 -64779 -30968
40996 -30968 -51775 -101343 -103186 -45259 25277 88921 181170 330080 496681 597112 583031
40985 583031 487115 380023 296390 225893 165220 136670 147477 172208 193489 220918 247608
40974 247608 233693 171920 131435 186369 324769 474666 594453 679765 700513 608489 422412
40963 422412 242961 151669 135483 138508 146790 177968 210807 181638 66692 -62018 -90649
40952 -90649 25780 214915 346527 332574 178657 -31477 -185358 -205950 -110886 -6067
40942 -6067 15463 -29500 -49570 -2827 64829 106769 134436 164005 170422 140595 118585 144094
40930 144094 189227 207345 196280 155781 43259 -140777 -273024 -227536 -59780 40534
40920 40534 -18723 -154179 -263145 -331847 -358111 -299247 -167478 -67257 -49393 -17854 121476
40909 121476 297138 367648 321181 260062 227510 181691 128207 141197 229818 303553 312565
40898 312565 317605 363940 382223 297990 171593 130585 191890 243603 205428 129649 114744
40887 114744 171472 220553 207031 172392 191855 259457 277364 178050 24375 -51469 9692
40876 9692 158614 325540 471494 548107 498360 350067 239966 268452 365738 373963 239899
40865 239899 56232 -72399 -125399 -125356 -80882 -3654 66486 87459 47380 -30560 -89284 -63850
40853 -63850 39870 109887 48011 -80385 -113271 -22909 37642 -28506 -100739 -18166 178495
40842 178495 317112 346106 363484 412726 407884 293213 144491 54351 19339 2195 19368
40831 19368 97595 208413 307729 386890 437071 427533 372307 347649 377611 374715 277827 180183
40819 180183 210591 332224 382446 298000 180512 130960 135052 142405 151767 164202 140209 74099
40807 74099 49008 140476 296127 378321 317282 174958 62439 32446 55841 77240 80525
40796 80525 97713 151137 204947 205889 166328 161170 229650 324171 379720 390106 376852 320358
40784 320358 184165 4215 -104416 -61932 77732 176949 165703 114576 131781 206034 207558
40773 207558 67710 -98325 -112470 45907 215423 252071 177631 103151 80566 91254 129065
40762 129065 206991 286822 282146 165825 28078 -18027 29824 68867 27425 -58242 -128486
40751 -128486 -202962 -323349 -420285 -351842 -114218 90994 91121 -26587 -35258 116770 247187
40740 247187 204782 59575 -28429 -26913 -32914 -113420 -223182 -262929 -172658 19383 215637
40729 215637 331496 360683 334177 243612 78251 -80591 -113269 -29665 30922 8063 4985
40718 4985 95974 177267 125515 5390 -21303 68504 157830 190882 233761 334837 445957
40707 445957 501641 488221 424421 345755 303173 309227 306220 258969 239096 324191 456401 515498
40695 515498 494000 466978 422700 287487 110458 39638 85542 92598 1584 -46861 38431
40684 38431 127798 82010 -16670 -4005 111977 206520 261980 356908 480010 528225 475447
40673 475447 392692 305945 177284 36166 -6174 96058 266036 412721 498634 495600 392968
40662 392968 275263 269960 369698 416387 322053 197797 177031 201613 102780 -145821 -372049
40651 -372049 -407423 -260159 -63185 86726 194327 299551 396778 439994 412327 361163
40641 361163 353853 417407 530987 647852 705480 657270 538354 459732 474295 486545 384652
40630 384652 237254 236071 423931 607962 606898 474975 387064 389882 388359 327688 257941
40619 257941 228934 239036 297792 428538 577999 622263 513378 344591 221010 137934
40609 137934 45883 -35355 -52315 -22496 -12756 -32568 -33414 -8785 -10973 -55996 -86587 -53796
40597 -53796 27274 126489 237747 334505 350592 258731 124285 31263 -6700 -16704 2725
40586 2725 57458 105018 104986 100742 170457 302172 393178 378091 291063 198664 139964 137695 194590
40573 194590 263509 287078 275747 277972 277606 217864 133724 135866 222393 238411 99351 -68694
40561 -68694 -114671 -74902 -67608 -71851 20988 188779 288183 271776 234231 233361 220224 173994
40549 173994 154578 170851 136136 24089 -53642 -6716 99730 152127 137277 101585 52325
40538 52325 -5573 -14184 52225 112888 96709 71103 139335 264153 328764 338565 408000 544325
40526 544325 603410 510884 391370 392687 478644 494906 381780 227118 139459 154509 255620
40515 255620 406405 546308 607309 560949 429257 251268 69131 -59190 -84745 -27806
40505 -27806 22933 4760 -43538 -29903 79652 226676 327161 339661 272702 166768 78513
40494 78513 44355 42658 25441 604 34265 141418 227710 196601 78941 -6440 3834
40483 3834 75447 147814 169410 86296 -102201 -274207 -279241 -127840 12973 46795 58268
40472 58268 139095 225019 214242 159850 207555 377512 532409 557744 473050 361711 280445
40461 280445 250788 266176 291968 310483 360204 472978 589619 611842 528433 413537 312474
40450 312474 221319 174951 241548 398244 513363 503066 427130 384077 391365 422791 482001
40439 482001 561307 589481 509424 375851 297935 302405 319716 293088 237108 188023 151430
40428 151430 115055 82400 78259 125145 207310 260141 224697 122236 40801 35525 81187 133972
40416 133972 183366 218242 208903 168746 166638 212298 192701 15091 -227358 -339831 -267654
40405 -267654 -155331 -155277 -269825 -407783 -510619 -572883 -595883 -574210 -502020 -368111 -174787
40394 -174787 28651 176917 265701 342465 403308 371629 224097 69788 32825 100271 162684
40383 162684 175589 195332 263980 347699 406944 450198 483829 473787 404032 322019 271225
40372 271225 217686 108040 -23286 -78427 -28258 48477 76907 75347 98230 141002 153217
40361 153217 117490 63852 18799 -14443 -31730 -26808 -13536 -12238 -15257 -2464 12709 -3906
40349 -3906 -47701 -76780 -80321 -93104 -125990 -138997 -115522 -110709 -178268 -284837 -345304 -319237
40337 -319237 -232299 -129585 -51481 -27969 -44586 -33332 50712 161007 221483 236502 268973
40326 268973 316269 292753 161442 10996 -46841 -11954 22600 2484 -18453 56123 245586
40315 245586 442113 492135 350466 143131 41821 82520 153016 153742 104585 77183 97617
40304 97617 163779 293850 480111 626211 615035 447934 257684 162622 145406 97135 -43419
40293 -43419 -219421 -321747 -311028 -258186 -252011 -285694 -277676 -204406 -147956 -173883 -218052 -164116
40281 -164116 -7850 129134 148122 72269 -9246 -33677 16725 129188 257612 345170 384433
40270 384433 425962 498975 555957 533099 440805 350228 300260 261377 199231 143054 170700
40259 170700 329366 576152 799932 909388 900276 830440 743381 645605 549485 483915 442606
40248 442606 374990 269830 203464 247359 358699 430777 434843 435571 467779 484911 457256 443170
40236 443170 512275 652651 803702 932590 1025182 1049306 995729 924042 897767 897331 869742
40225 869742 841401 888365 993517 1033751 942871 801963 717978 685970 638675 575529 556031
40214 556031 586124 593566 529633 440945 415589 483399 587927 650228 652343 649292 690003 746940
40202 746940 762745 753411 798065 911216 998911 983665 908124 861865 869645 919078 1030711
40191 1030711 1201397 1324891 1287402 1129772 1004332 971001 947858 876735 818533 839675
40181 839675 902324 922173 860771 722276 542376 420652 466363 649789 797555 805316 762231
40170 762231 781445 811868 745605 631395 618323 716018 773324 709250 618424 602300 622538
40159 622538 596147 544359 558590 664631 791654 854434 819987 711727 583733 478155
40149 478155 385923 263842 103743 -33630 -65675 40949 238973 419314 478444 407939
40139 407939 310742 288616 324145 322505 254897 188234 165894 136771 37896 -108223 -217617
40128 -217617 -230809 -151868 -37803 35871 39608 31744 91921 207263 280507 257714 180010
40117 180010 97152 12205 -60697 -71648 -13495 54127 103721 174673 257200 247230 100495
40106 100495 -66938 -133610 -132960 -140174 -103579 41251 166393 76324 -175688 -313332 -215989
40095 -215989 -67289 -53712 -113059 -102121 -40882 -25079 -21757 59569 163093 142129 -5737
40084 -5737 -131162 -168537 -219751 -359342 -488929 -459308 -252893 19838 242031 350609
40074 350609 328573 205287 49681 -73596 -132146 -106464 13837 191279 340494 405024
40064 405024 410650 414639 428634 425337 401829 396618 442134 522326 584478 591428 564206 561416 597628
40051 597628 598999 484107 289482 160262 191457 323836 431649 473299 506492 578605 658776
40040 658776 682801 627468 525899 423643 330021 222980 114925 90898 225275 455424
40030 455424 611222 610214 557624 593843 706499 777891 765337 721739 664534 558071 440527
40019 440527 435886 584207 764637 852413 859268 843264 774064 599084 383375 260765 266659
40008 266659 325932 396554 516328 692534 843651 890431 839825 747998 655737 585892 550477
39997 550477 529706 486070 422392 387862 413412 485088 588299 717076 820337 810198 669316
39986 669316 497190 401862 387917 393545 387596 371455 327857 242633 160512 151440 221766 308928
39974 308928 359308 362740 317530 221604 110668 54549 90240 186384 287554 365935 417025
39963 417025 434819 416107 375617 335278 298780 248057 171673 96038 75111 130663 209310
39952 209310 231154 187482 151907 175471 214194 200915 154123 155402 224899 273668 197890 -4186
39940 -4186 -218957 -311618 -241446 -93637 18429 83532 182509 333603 420778 341763 172470
39929 172470 88273 144097 233704 265708 268808 289481 290386 223287 136132 124056 199574 277672
39917 277672 286100 248099 252093 355870 515098 607792 556078 421933 339451 349829 365379
39906 365379 317247 263907 297855 402353 475834 469976 432272 423145 454782 510863 568749 592316
39894 592316 550282 458467 372849 330724 325068 340035 376636 426143 444552 383993 252465
39883 252465 127540 93682 156637 230751 230444 166388 121405 135287 158385 131456 61746 -10611
39871 -10611 -76155 -138863 -167563 -122082 -18904 78190 135392 179103 242073 307701 321873
39860 321873 253981 144311 82359 115216 181492 177700 98319 53597 117932 219291 235178
39849 235178 155912 85780 105556 197732 294765 342113 321038 263992 243888 299850 378866
39838 378866 395087 335897 262453 218940 193196 157014 96210 15414 -37248 22953 217055
39827 217055 428223 506607 441773 354453 324951 318823 288414 254224 257510 304462 377986 440720
39815 440720 426133 311300 199911 227333 365457 436801 356783 241908 226560 296451 373406
39804 373406 437366 467153 382211 172940 -4733 -4628 110100 180222 196770 275832 428013
39793 428013 522369 479102 351411 211670 98664 82920 223525 422206 475134 336438
39783 336438 196215 218886 328884 353144 265927 169350 106086 23667 -105072 -235633 -317050
39772 -317050 -324082 -242589 -101674 -3683 -35737 -148993 -203256 -143635 -61342 -56284 -107760
39761 -107760 -127659 -95397 -77610 -123072 -193038 -218777 -197913 -195614 -252688 -330205 -363005 -335279
39749 -335279 -270943 -180018 -69522 6857 -16887 -115668 -168156 -97935 21369 49523 -53662
39738 -53662 -187653 -229271 -158369 -62321 -31677 -59600 -54451 41820 176404 260127 285142
39727 285142 298099 274468 127107 -127856 -318646 -307412 -160918 -48477 -26411 -20269 18227
39716 18227 51036 50704 55694 99959 160216 207935 263066 362521 502296 626805 659907 559712
39704 559712 376050 232937 203411 219751 170199 67369 35328 125405 239890 271898 234903
39693 234903 200488 180905 144262 96530 72810 71620 62297 45698 56700 115609 214872 333735
39681 333735 425053 417228 291354 142992 99698 172825 253068 263841 250849 286797 351241
39670 351241 367001 318452 257156 195739 78911 -102065 -229935 -172284 43944 243811
39660 243811 306246 288124 309154 376222 396948 338485 285020 325087 447639 572284 631783
39649 631783 605525 521692 447988 431399 428147 350984 207357 113528 126627 148753 79779
39638 79779 -7528 39279 221520 378576 405667 359783 325501 296953 251075 234440 288122
39627 288122 350263 324806 215109 112370 71927 70255 70294 60094 28131 -34951 -98173 -106241
39615 -106241 -50438 17927 59684 94312 156738 244592 332116 404363 447621 432692 349520
39604 349520 250951 221578 290561 397713 456639 433604 355840 269594 218228 243625 362216
39593 362216 527380 651229 686821 664862 630953 582950 508278 449194 467805 552850 621217
39582 621217 617955 560900 483181 399844 348121 379637 465547 481172 354392 177719 96859
39571 96859 126909 161807 138420 98419 94583 128394 192594 292636 404238 482581 534357
39560 534357 607713 692230 717742 687449 710093 829505 916780 840291 678768 632127 740060
39549 740060 826327 748185 578083 472725 457268 436944 372239 331737 365878 418689 407189
39538 407189 333804 266930 239547 226461 215067 233725 288390 330641 336772 372942 509775
39527 509775 693418 787449 751888 692298 692459 681945 546217 316719 158863 180170 325300
39516 325300 466436 532007 528324 491924 459622 459886 500917 566776 629489 662099 653322 627292
39504 627292 634558 696570 768088 782150 725678 647404 604688 628707 719876 837366 910203
39493 910203 903823 860652 828431 775086 647005 494938 441753 504272 546720 466337 343941
39482 343941 331631 444975 555741 568073 516463 483994 494536 514582 520610 531092 579415
39471 579415 666050 739111 736216 659164 590093 605415 677293 689297 563818 362991 245557
39460 245557 312189 498118 640428 657552 626741 656706 728073 725067 602360 437251 314546
39449 314546 247830 233847 286036 363726 360973 247206 152148 219692 420654 597703 660379
39438 660379 643928 601738 544665 490705 481072 519278 554860 546622 499945 443523 413537 443610
39426 443610 514415 538766 469298 392928 423041 517922 528538 434827 397997 528598 726747
39415 726747 831340 825430 798090 784992 760004 735476 755797 805531 819157 784950 766193
39404 766193 813615 914787 1033580 1147959 1241045 1293763 1294389 1236911 1123217 987671 894436
39393 894436 882859 941965 1058919 1241536 1454090 1596470 1621872 1626196 1728642 1895502
39383 1895502 1986279 1961402 1928916 1969431 2028704 2030779 2000743 2005583 2042878 2065017 2069017 2087570
39371 2087570 2117556 2130513 2148243 2242320 2439497 2667095 2817557 2853959 2836124 2844702 2892934
39360 2892934 2929351 2923709 2909680 2910853 2866105 2702977 2478243 2355667 2407067 2506490 2478083
39349 2478083 2298490 2092984 1975082 1963698 2031222 2146364 2261942 2329205 2344910 2337944
39339 2337944 2302824 2203701 2059821 1961215 1957185 1978558 1926162 1806494 1717756 1709777 1719849
39328 1719849 1665160 1551598 1454346 1412422 1384384 1317864 1236994 1229830 1338658 1482029 1518554
39317 1518554 1397693 1219851 1123599 1136167 1172492 1165490 1137745 1131715 1130892 1094661 1028706 962618
39305 962618 883310 758030 615844 534239 533996 558033 576428 631833 730566 768967 661393
39294 661393 498412 469920 633946 858046 1002876 1065034 1100224 1104417 1052663 991492 991919
39283 991919 1029883 1002523 869817 707658 601492 548055 492303 415570 352323 349819 437639
39272 437639 604787 776905 851414 800668 716887 703053 735039 698250 566659 470267 540776
39261 540776 742074 912399 944752 863873 744331 630829 551761 536381 570894 578961 495414
39250 495414 345248 221399 200927 300209 478325 651062 732259 705763 640406 600731 570839
39239 570839 508324 436083 411370 423495 402723 331976 271458 261083 279883 325799 446589
39228 446589 640342 802989 846930 818067 821325 872215 900921 874476 831385 804353 782991
39217 782991 752702 705781 615681 466500 312094 242718 286863 404531 569932 776468
39207 776468 952401 978380 839833 673329 591842 538677 401650 211208 111504 155988
39197 155988 247409 298588 352521 491372 691225 831698 829783 723470 628438 632401 729074
39186 729074 848808 949343 1050401 1159917 1211914 1145533 1024781 986104 1049883 1079238
39176 1079238 974879 823363 773220 832579 890933 897855 901168 916533 882515 778505 687344
39165 687344 688256 761660 849485 936819 1011696 1012633 903927 765333 718151 774737 837804 843649
39153 843649 828861 843870 872638 871382 838812 809678 800229 784624 719170 589795 446894
39142 446894 375558 402805 455080 450221 410259 423009 506325 590668 642891 715771 836749
39131 836749 932073 927578 864409 838686 864599 874473 835231 792305 800772 870297 974984 1063814
39119 1063814 1064905 939848 746494 599621 553583 561509 558937 542766 547258 580403 615244
39108 615244 626419 612392 587628 561891 525379 463199 395146 379390 447564 556318 644858
39097 644858 720745 826376 927434 920668 786598 658960 676915 812890 917250 907971 840632
39086 840632 795133 772749 734286 678231 627762 570697 472424 351132 289349 339559 443965
39075 443965 490568 449914 415297 484390 633501 750708 775841 750673 724577 675774 569064
39064 569064 445777 390312 419397 468244 496124 545822 664358 806920 868595 797384 636896
39053 636896 467125 345610 305307 356289 460172 538417 547246 531012 566013 658456 734148
39042 734148 730723 664953 599949 580407 619367 717414 858539 994652 1066305 1054171 1007065
39031 1007065 1011367 1116517 1275000 1369088 1327195 1208973 1137019 1143796 1137452 1034659 867637
39020 867637 722409 629520 576823 582978 672500 793281 844799 800937 738476 728076 756304
39009 756304 772242 751004 686962 583691 486195 470118 553422 659394 715045 752762 858821
38998 858821 1038145 1186852 1205896 1105353 985247 935704 967404 1029469 1081427 1134929 1220055
38987 1220055 1330120 1423093 1461400 1417074 1258632 993888 725878 594239 632079 736507
38977 736507 806346 843146 878710 883699 826508 765406 782933 851618 861260 780577 704192 719909
38965 719909 802460 867049 866894 802950 688379 550918 446748 433455 528476 697471 869017
38954 869017 969295 978911 958898 981469 1027294 996018 836860 624408 475928 433457 465838
38943 465838 549168 682423 830822 919264 913300 872113 881641 946515 988520 957633 898104
38932 898104 868808 838207 733004 586360 540335 649247 762947 702602 510339 408228
38922 408228 507241 670138 703568 592538 479015 474232 566667 676139 727814 692168 608889
38911 608889 558191 567630 575758 534757 505973 576348 709631 782576 770216 783169 881576 959088
38899 959088 893622 735397 636286 631900 614913 527401 459735 509294 634370 725473 760618
38888 760618 799086 851106 853006 782740 716327 728852 791635 814286 763793 704154 723205 833529
38876 833529 936870 893759 663813 379723 236681 295933 447365 577654 695490 842155
38866 842155 966492 995669 986504 1077801 1281032 1431501 1392822 1223702 1083316 1039743 1043797
38855 1043797 1043168 1033993 1011917 957269 893377 898582 1012467 1156678 1200990 1113685 1004029
38844 1004029 988440 1047593 1067314 1006328 948492 967394 1019818 1035169 1043825 1120570 1236067
38833 1236067 1278581 1227439 1197074 1276394 1414531 1507454 1515611 1445608 1296147 1094858 931942
38822 931942 882530 929526 1016136 1125589 1245252 1305417 1243992 1108894 1014586 1007384 1041464
38811 1041464 1069210 1077295 1045239 955977 856003 824958 865815 894327 858866 805207 797573 840721
38799 840721 914478 1023378 1161834 1272179 1288649 1203400 1060023 910630 806803 793462
38789 793462 863991 941334 946975 879767 795233 724330 655765 593153 581587 657112 793219
38778 793219 916202 966018 937304 875079 841967 878941 976226 1073398 1100022 1035142 931118
38767 931118 868215 882401 948426 1030859 1123342 1222999 1296668 1309268 1275651 1249086 1256504 1272443
38755 1272443 1260684 1218236 1173568 1160991 1198979 1273815 1341343 1363053 1344149 1322565 1323009 1337334
38743 1337334 1344046 1327483 1284534 1235195 1219077 1253994 1302619 1309654 1270494 1233972 1238588 1277383
38731 1277383 1326985 1379094 1436784 1504453 1581831 1645394 1648697 1579307 1505418 1516848 1619557
38720 1619557 1736045 1806433 1829517 1805023 1718825 1614386 1595007 1694456 1805900 1809008 1724872
38709 1724872 1671916 1697791 1734317 1710599 1635259 1554771 1493461 1462121 1482328 1565399 1681474
38698 1681474 1774299 1811150 1813979 1832771 1876716 1884373 1797629 1663810 1608377 1681375 1788232
38687 1788232 1818289 1787694 1788025 1836853 1868055 1853067 1838264 1855355 1882400 1915710 1995635 2118660
38675 2118660 2195034 2150370 2021293 1900420 1831974 1814797 1860316 1970168 2077994 2094733
38665 2094733 2020176 1946705 1936486 1951170 1930954 1895418 1920454 2036668 2193773 2323710 2405640
38654 2405640 2459309 2499755 2521850 2523743 2521038 2523184 2507146 2437015 2313676 2186138 2103378
38643 2103378 2071885 2075412 2116259 2205042 2314498 2380940 2369597 2318793 2299586 2338169 2389241
38632 2389241 2380566 2277736 2113297 1958356 1858992 1800029 1741486 1681771 1654057 1658172 1641723
38621 1641723 1576251 1513186 1521751 1599529 1692297 1775741 1854932 1900707 1867133 1780138 1730688
38610 1730688 1755661 1795886 1799407 1788853 1786547 1757145 1686891 1638579 1643828 1614772 1472640 1311010
38598 1311010 1302207 1460426 1621283 1654950 1581808 1472911 1365176 1303243 1338103 1430631 1463476
38587 1463476 1404116 1354923 1385926 1428984 1413101 1393602 1442956 1504892 1480278 1398672 1383389
38576 1383389 1479364 1619059 1731186 1790082 1786038 1737154 1705110 1718768 1717753 1650013 1569844
38565 1569844 1542779 1521388 1445877 1405648 1529700 1742757 1820959 1709143 1598037 1634890
38555 1634890 1734004 1757675 1723529 1715635 1719223 1679914 1640196 1685364 1807081 1930705 2036098
38544 2036098 2157480 2304664 2469889 2667223 2876687 2994533 2938335 2773591 2643937 2599487
38534 2599487 2585085 2575909 2618562 2729706 2844868 2895793 2879797 2834048 2788243 2756283 2737924
38523 2737924 2719196 2692649 2670182 2658152 2641503 2611253 2574444 2520584 2433509 2362765 2403899
38512 2403899 2552542 2663612 2640871 2586950 2653759 2814377 2923977 2958439 3024276 3139893
38502 3139893 3183595 3097032 2981125 2923541 2872294 2771628 2704196 2780885 2963221 3106818
38492 3106818 3140351 3111360 3086375 3087855 3111772 3137858 3129178 3070647 2998650 2958301 2950597 2951176
38480 2951176 2952398 2952424 2930260 2869031 2787926 2728532 2724726 2785858 2873462 2903725 2836690 2759521
38468 2759521 2790910 2888694 2866486 2650572 2403462 2311611 2359412 2417676 2450815 2495970 2518446
38457 2518446 2458712 2385409 2428304 2561953 2621707 2556405 2503879 2564073 2642832 2599210 2434170
38446 2434170 2252114 2127071 2081219 2110094 2153290 2119445 2017313 1986433 2118727 2327502
38436 2327502 2482515 2591316 2725437 2832541 2780008 2578863 2416366 2422724 2512906 2519432
38426 2519432 2408312 2296338 2289998 2364773 2404386 2334705 2205612 2128969 2141486 2171013 2156845
38415 2156845 2143430 2198878 2291156 2327864 2292079 2250565 2240840 2244740 2273339 2373600 2526646
38404 2526646 2637255 2663679 2668251 2692647 2675582 2563510 2423074 2358003 2373642 2411295 2464674
38393 2464674 2561276 2663155 2699617 2692982 2740871 2851957 2901127 2799452 2634721 2577176 2685880
38382 2685880 2868228 3009837 3085297 3134086 3172231 3164086 3080601 2958531 2874768 2865782 2905357
38371 2905357 2969122 3075020 3227694 3366432 3424296 3414653 3401173 3401906 3390749 3379905 3414618
38360 3414618 3476393 3482597 3417630 3378408 3430263 3492552 3453693 3353869 3353505 3526032 3767456
38349 3767456 3927150 3958140 3909358 3829985 3734870 3638639 3569603 3538280 3518333 3480114 3442411
38338 3442411 3472696 3614421 3813541 3944238 3927250 3807212 3694585 3652986 3676466 3755822
38328 3755822 3902317 4086214 4211263 4209981 4144919 4151431 4267252 4373810 4343019 4201490
38318 4201490 4092799 4095979 4150743 4171446 4163099 4182176 4235751 4280155 4294390 4300689 4326155 4386518
38306 4386518 4486153 4588742 4620015 4563474 4523715 4611364 4782584 4889773 4886863 4872099 4913902
38295 4913902 4965134 4997697 5086005 5265658 5426427 5466005 5457306 5523589 5619390 5601104 5482825
38284 5482825 5446090 5581759 5786898 5964824 6171369 6468636 6751348 6846217 6736985 6588877
38274 6588877 6563245 6677266 6838491 6960128 7032494 7108850 7231758 7381063 7513793 7641943
38264 7641943 7822855 8067670 8311073 8487623 8589548 8633329 8626907 8601202 8622149 8727704
38254 8727704 8884167 9036570 9172855 9312985 9464718 9612302 9723910 9765418 9745508 9745016
38244 9745016 9844172 10018715 10177960 10307604 10479687 10703173 10883232 10980459 11087125 11261931
38234 11261931 11411407 11455948 11505437 11711316 12017551 12237034 12338886 12473137 12712192 12959276
38224 12959276 13151286 13367547 13658218 13927229 14097012 14262689 14559651 14974657 15409029
38215 15409029 15841476 16291193 16689423 16950483 17147934 17463170 17941831 18434154 18809080
38206 18809080 19103664 19407741 19717748 19996234 20297575 20724844 21286004 21878347 22413216
38197 22413216 22895588 23384188 23930545 24559642 25250997 25916920 26444976 26797595 27053743
38188 27053743 27335196 27707775 28162688 28664716 29192940 29748690 30343331 30968861 31575702
38179 31575702 32110897 32598986 33147887 33832746 34601289 35346930 36054825 36806703 37646331
38170 37646331 38523852 39396913 40303659 41283263 42294124 43284946 44297957 45416150 46636695
38161 46636695 47889403 49173483 50576982 52135706 53760865 55361282 56981197 58755583
38153 58755583 60753670 62913682 65121271 67320874 69558467 71936209 74517023 77264628
38145 77264628 80094855 82990810 86037149 89330845 92898143 96720060 100790897 105106503
38137 105106503 109631745 114341066 119278622 124523193 130100183 135988566 142221247 148910870
38129 148910870 156138522 163863783 171996106 180531684 189568174 199192734 209411580 220204924
38121 220204924 231600161 243648752 256358890 269704946 283698662 298388118 313753709
38114 313753709 329650396 345908115 362469940 379364573 396527698 413702895 430545447
38107 430545447 446775392 462182842 476521254 489467594 500691025 509909354 516879180
38100 516879180 521407221 523419305 522975227 520162602 515001693 507507987 497828643 486252785
38092 486252785 473092537 458625433 443159079 427051624 410599236 393960418 377261298
38085 377261298 360723703 344593021 328961909 313771767 299001963 284765358 271191094
38078 271191094 258303814 246063506 234441911 223399554 212863359 202809116 193314265
38071 193314265 184445117 176131263 168240264 160748605 153740764 147243263 141151496 135334419
38063 135334419 129736021 124361516 119242433 114441250 110017358 105943370 102097250 98367459
38055 98367459 94735994 91253922 87984388 84971523 82196326 79545812 76900419 74284070
38047 74284070 71851645 69679495 67643190 65575998 63492129 61560859 59879191 58355197
38039 58355197 56827254 55239798 53678601 52261847 51014551 49847852 48664553 47471196
38031 47471196 46348217 45314181 44288724 43219969 42176685 41252048 40431901 39637985
38023 39637985 38863355 38169627 37558129 36938309 36249304 35544696 34920505 34399142 33913427
38014 33913427 33383874 32797495 32220631 31726752 31301001 30848663 30325460 29807167 29370514
38005 29370514 28962839 28493352 28015401 27671143 27439305 27094926 26495527 25776519 25155445
37996 25155445 24652455 24143339 23604068 23124557 22710673 22262112 21771957 21368913 21090691
37987 21090691 20777498 20304966 19791812 19428825 19195552 18918285 18556842 18242507 18027099
37978 18027099 17781990 17406800 16982217 16623787 16308362 15956446 15593917 15311953 15127780
37969 15127780 14997878 14920178 14906259 14884058 14747833 14498114 14230199 13989725 13740502 13475878
37959 13475878 13259078 13134712 13081535 13059347 13022574 12895321 12635041 12326297 12107427 11997166
37949 11997166 11904998 11813405 11800011 11842288 11764475 11469544 11092355 10816681 10650155 10492549
37939 10492549 10327300 10214249 10160063 10120258 10084177 10054385 9988989 9858770 9708806 9575153
37929 9575153 9409885 9188549 9010869 8969156 8988874 8939631 8839245 8792723 8787100 8725520 8628994
37918 8628994 8611005 8659482 8640358 8533165 8464290 8466962 8410433 8240804 8099454 8094065 8117942
37907 8117942 8024935 7848040 7710863 7637414 7588370 7586471 7654012 7697517 7611326 7458306 7401681
37896 7401681 7469312 7517198 7436753 7284470 7176134 7141395 7127905 7093780 7047083 7008312 6961965
37885 6961965 6858267 6671402 6447610 6272031 6191689 6194060 6238081 6258654 6171950 5963411
37875 5963411 5764952 5745200 5903093 6061267 6084790 6009080 5928035 5871075 5837482 5839430 5850436
37864 5850436 5814751 5761738 5792544 5892901 5901641 5756720 5623650 5653894 5760150 5791815 5799781
37853 5799781 5922212 6103147 6159097 6085584 6063607 6151375 6184149 6029502 5763797 5533547
37843 5533547 5393126 5346381 5413560 5571828 5719978 5769935 5716867 5601182 5477121 5418074
37833 5418074 5450966 5480644 5391117 5225996 5140411 5164374 5165160 5076758 4999312 5000438 4981201 4850669
37821 4850669 4699908 4670243 4745949 4809740 4829080 4852714 4871565 4818312 4694283 4589906 4572204
37810 4572204 4622998 4686807 4724402 4725729 4711805 4712577 4720843 4699925 4651156 4614686 4580557 4482360
37798 4482360 4327438 4240785 4299038 4402917 4418099 4376596 4412610 4535253 4602112 4523735 4373801
37787 4373801 4265956 4220987 4202565 4204972 4241429 4290210 4314532 4321654 4353929 4415383 4442029
37776 4442029 4372137 4235997 4139716 4145002 4202482 4239592 4271608 4354103 4452689 4465064 4386360
37765 4386360 4343645 4414838 4506187 4483970 4359813 4264374 4281097 4377914 4472638 4507053 4479933
37754 4479933 4442509 4427326 4371502 4188274 3936789 3804698 3859617 3944835 3922958 3892729 4011942
37743 4011942 4212271 4286830 4206175 4142324 4191712 4273133 4315603 4351185 4376668 4312556 4177201
37732 4177201 4133620 4263410 4434781 4499635 4494122 4528808 4595212 4614084 4588381 4574758 4568579
37721 4568579 4543693 4549543 4639894 4749831 4774691 4738944 4753018 4823315 4848400 4805392 4791308
37710 4791308 4844891 4868125 4793566 4713256 4746632 4859765 4918269 4875952 4813725 4805640 4831121
37699 4831121 4831995 4798383 4778260 4832925 4986389 5185760 5311114 5268346 5093584 4936964 4917528
37688 4917528 5010246 5098061 5118201 5121251 5183364 5297581 5382547 5387539 5354397 5362070 5431698 5512485
37676 5512485 5554213 5558861 5545844 5501114 5406545 5311793 5320002 5475613 5706722 5913875 6078373
37665 6078373 6232364 6357248 6393389 6349166 6317350 6359066 6444628 6542707 6691059 6920646
37655 6920646 7172488 7362441 7487607 7603515 7737629 7895414 8108753 8394620 8700418
37646 8700418 8979785 9288110 9696427 10138654 10477218 10721785 11040898 11523452 12066427
37637 12066427 12555760 13021640 13522893 13993640 14323278 14511348 14630236 14695796 14686450 14638208
37627 14638208 14601644 14535974 14356775 14064712 13720829 13321910 12822375 12267319 11770570 11346135
37617 11346135 10889380 10359901 9861337 9482864 9167058 8807597 8394951 7990672 7627799
37608 7627799 7315558 7082183 6921983 6737029 6425506 6022678 5679414 5490461 5396287 5269364
37598 5269364 5063593 4861916 4784072 4847136 4924672 4871514 4686615 4505870 4426041 4400589
37588 4400589 4339848 4241344 4158726 4098001 4022191 3923755 3817969 3695532 3561769 3495997 3578131
37577 3578131 3762959 3916082 3972800 3971175 3932344 3824987 3674369 3584605 3590781 3592617 3512123
37566 3512123 3422668 3423701 3467409 3432396 3321223 3254320 3284747 3345817 3389192 3450970 3545486
37555 3545486 3602883 3571501 3500734 3459594 3439110 3401919 3373713 3407498 3486224 3533898 3515116
37544 3515116 3467087 3436828 3435175 3452826 3478402 3494320 3487725 3470386 3461465 3451938 3417043 3366069
37532 3366069 3345625 3380081 3435307 3459799 3442946 3411856 3383966 3350928 3309706 3279201 3266996
37521 3266996 3242257 3177010 3107848 3112885 3214363 3343680 3423630 3444066 3430492 3393905 3363059
37510 3363059 3410027 3563260 3734516 3825067 3872209 3976570 4104998 4111431 3969911 3830502
37500 3830502 3791015 3769249 3684002 3602019 3580877 3519252 3336303 3175296 3216351 3368207 3381492
37489 3381492 3229278 3120967 3129765 3079473 2882781 2732497 2800246 2950718 2953073 2830385
37479 2830385 2782431 2850059 2879781 2796517 2707970 2712172 2764406 2784811 2771549 2749527 2707626
37468 2707626 2652849 2653088 2756137 2907815 3007116 3017543 2979069 2929795 2866901 2791962 2753226
37457 2753226 2804525 2926699 3030425 3060713 3065123 3116447 3198394 3236134 3226629 3250981 3344012
37446 3344012 3442810 3500070 3559040 3659939 3749592 3748408 3641027 3445534 3177888 2920949
37436 2920949 2831776 2964902 3157311 3212530 3145307 3116645 3179450 3241080 3247376 3234936 3198747
37425 3198747 3076663 2894778 2767880 2708052 2588644 2364369 2174358 2134918 2168798 2151344
37415 2151344 2101225 2094218 2093786 2021670 1924378 1909850 1961763 1975048 1955605 2023089 2201355 2353906
37403 2353906 2366187 2265502 2116219 1927098 1739990 1692992 1870097 2140911 2268887 2174716
37393 2174716 2006642 1942456 1994401 2034746 1960690 1794329 1643743 1602562 1687403 1845956
37383 1845956 2002313 2092115 2077486 1961594 1798749 1667997 1616006 1630275 1674426 1733129
37373 1733129 1806645 1877061 1907144 1872882 1781573 1663668 1564478 1531012 1571407 1625707 1614829
37362 1614829 1530947 1442699 1395522 1357345 1303001 1301423 1441513 1686308 1881620 1922620 1844137
37351 1844137 1729531 1609217 1493172 1430555 1460494 1539500 1588867 1596374 1609662 1642887 1653233
37340 1653233 1608802 1525129 1431828 1351144 1310341 1325062 1362365 1364219 1317752 1267797 1259353 1303825
37328 1303825 1392215 1488567 1514501 1409762 1229095 1117636 1154817 1268343 1336956 1333621 1319870
37317 1319870 1328759 1312952 1217490 1071906 986409 1047953 1220727 1368351 1390817 1320301 1259423
37306 1259423 1256081 1283235 1311518 1331617 1315295 1233130 1120089 1048579 1022632 983293 947047
37295 947047 1039347 1317212 1628285 1739495 1581968 1301227 1087039 1018548 1061052 1141793
37285 1141793 1210535 1265066 1334190 1424642 1495338 1502586 1454957 1399684 1366309 1342972 1298064
37274 1298064 1216339 1130990 1117933 1217654 1353527 1380867 1246449 1052876 930558 893878
37264 893878 868801 815799 762076 737880 743518 772169 817141 859632 884749 902646 925325 935951
37252 935951 909603 850707 786564 742391 742108 804299 909545 998135 1026446 1001143 944530 871387
37240 871387 822022 857342 973068 1067022 1047107 939282 845005 828583 886021 978499 1050559
37229 1050559 1061594 1042174 1064244 1117476 1097842 978939 894307 950304 1049639 1032416 921102
37218 921102 872027 927679 981659 974382 959257 966175 958513 952695 1027380 1169325 1251605 1219295
37206 1219295 1164872 1161607 1156478 1102459 1068157 1122533 1219470 1291679 1358252 1439452 1463635 1376307
37194 1376307 1261646 1231620 1256482 1230245 1153867 1119521 1139983 1127722 1045803 964195 948994
37183 948994 989762 1054435 1132117 1200049 1222934 1210369 1211988 1232314 1208841 1101888 956595
37172 956595 846038 791707 768916 760257 772964 817135 886316 953480 980313 941284 846980
37161 846980 744015 693739 741865 882118 1040296 1122500 1101941 1041922 1017727 1036565 1050506
37150 1050506 1022982 959759 893782 858454 857484 850702 797849 725633 710486 776785 858501 887939
37138 887939 871665 842937 795918 722305 662829 650741 640886 578739 521991 598606 825306
37127 825306 1046067 1096501 987283 881583 910072 1045535 1161220 1183521 1157901 1161083 1185225
37116 1185225 1153268 1038091 909776 850383 870210 926372 973323 972394 909798 839822 848762
37105 848762 927906 944900 809775 619521 556202 671236 850046 969576 1006737 995703
37095 995703 962492 924503 897428 877666 850110 821917 822004 868338 955981 1060514 1129832 1105269
37083 1105269 992224 882428 861980 922987 1004921 1079536 1135791 1125937 1012698 852396 749849
37072 749849 734882 753389 772245 815277 889586 947354 939816 864083 754744 669376 666390 746281
37060 746281 833456 868422 887844 951533 1034157 1078644 1118878 1233060 1386386 1442266 1346230
37049 1346230 1191921 1083630 1035127 1028238 1066714 1133621 1185925 1226131 1293519 1359663 1333812
37038 1333812 1208808 1098229 1081433 1113898 1144002 1206400 1320010 1395689 1352222 1257669 1249960
37027 1249960 1352493 1453375 1444452 1317555 1146947 1024994 987821 970959 877737 716358
37017 716358 612337 657134 812081 990498 1146273 1234535 1185787 1002280 806959 715488
37007 715488 718348 753208 815763 917826 1009470 1034525 1005156 944898 832329 686418 619203
36996 619203 690073 782775 751653 626484 545147 548759 588984 679607 866206 1067703 1124380
36985 1124380 1017598 893374 855159 877830 938924 1073830 1256556 1371391 1366595 1321690
36975 1321690 1312069 1317852 1309987 1307183 1296592 1219953 1098054 1043184 1073126 1041479 857689 666300
36963 666300 677924 892748 1117454 1212573 1205925 1182658 1170583 1145466 1084119 1001598 959664
36952 959664 1010575 1108531 1132052 1038468 936469 945817 1042661 1116364 1126980 1117450 1104863 1058569
36940 1058569 981961 931539 938799 967676 959658 885782 762497 653521 637667 725672 818751
36929 818751 797537 652155 491878 433376 503414 628990 692097 622836 480196 417035 522464
36918 522464 720275 861947 889135 855063 818073 783458 742690 707904 697176 718894 765163
36907 765163 796369 762158 678571 647936 741110 886816 949405 902146 846162 856050 884956
36896 884956 848884 749018 675823 715614 866003 1031174 1113143 1123845 1169649 1292154 1385584
36885 1385584 1346715 1252025 1272991 1439707 1617398 1721274 1812765 1940071 2023646 1988144
36875 1988144 1899264 1862629 1868318 1853384 1858473 1985619 2216944 2404929 2464866 2475293 2550377
36864 2550377 2692066 2813592 2849716 2797034 2691239 2595020 2576979 2646483 2716363 2677546 2523819
36853 2523819 2374824 2356634 2471734 2605035 2653482 2624646 2595225 2599592 2600507 2566601 2526720
36842 2526720 2518706 2521905 2485214 2405277 2333120 2308739 2329123 2378559 2445715 2502738 2514761 2495905
36830 2495905 2518979 2632176 2784412 2867496 2824249 2688660 2532779 2413691 2371722 2428585
36820 2428585 2550026 2633866 2582150 2396830 2182223 2044871 2009065 2033378 2072684 2091541
36810 2091541 2044102 1901519 1711185 1577722 1552075 1574904 1568750 1551240 1594457 1687021 1716090
36799 1716090 1607725 1415604 1229680 1062111 890729 762689 753303 831778 873975 837064
36789 837064 825279 923692 1050380 1067642 989901 966113 1059751 1158243 1138926 1035188 971421
36778 971421 990356 1023100 1007207 959807 926995 917051 906675 880416 841934 806270 800351 858013
36766 858013 992303 1169872 1323824 1399129 1384968 1302861 1174217 1017052 872842 802184
36756 802184 822930 869678 856483 781213 729662 768895 876239 988472 1078217 1151680 1204533
36745 1204533 1218243 1183130 1098093 967053 820280 715041 684359 702199 720318 713559 672185
36734 672185 597786 541735 588272 735657 846270 801738 671476 625182 700111 778175 799192
36723 799192 854583 1010824 1164289 1172935 1054168 946430 920280 926010 901729 840813 761562
36712 761562 690314 673147 733875 819060 848476 820147 801000 813248 804613 748479 702144 730367
36700 730367 823953 928426 1007983 1047774 1039029 1006186 1013232 1093182 1192394 1232258 1212422 1202900
36688 1202900 1235026 1252509 1193824 1088434 1033260 1078906 1169353 1206884 1158821 1077234 1019237
36677 1019237 982921 942226 916026 956175 1064015 1160495 1166289 1094068 1034665 1052344 1110619
36666 1110619 1110370 999519 839239 754664 820760 1006524 1225978 1411594 1521700 1517809 1391577
36655 1391577 1209549 1079092 1052857 1096210 1152952 1204182 1251802 1288418 1311138 1335943 1373947
36644 1373947 1415631 1451554 1475194 1450600 1326814 1123139 958559 940880 1044945 1147214
36634 1147214 1165098 1116697 1059963 1029644 1035117 1071385 1120056 1165452 1203297 1209387 1132702 974684
36622 974684 845348 856695 966302 1019983 963234 908565 955360 1048929 1086804 1065104 1019750
36611 1019750 908582 689287 466676 406076 500738 574061 538867 502014 548423 573701 453501
36600 453501 268353 203992 283352 356119 340093 314590 344746 358940 276657 153035 102475
36589 102475 142887 204173 249170 300585 368770 429315 468572 493492 500747 485294 470387 480131
36577 480131 493830 478736 452587 452603 457009 414807 352548 361370 453871 522148 485314 402335
36565 402335 375379 404084 413453 385370 379332 436022 527733 601532 622861 587209 534200 533148
36553 533148 606826 690739 719609 723597 767056 816793 767389 605238 457204 444881 556988
36542 556988 692742 769295 760009 688431 617502 596022 595857 553755 479074 442086 445393 413014
36530 413014 346691 374983 565439 787611 867563 802973 715657 659170 600955 545999 536733
36519 536733 549187 524005 496248 562431 711299 820185 841007 855909 908883 915894 808791
36508 808791 654016 549531 498424 463610 460837 510681 570807 601487 634041 690781 702537
36497 702537 601122 440898 329230 276720 215998 137617 103207 135338 186270 212919 207595
36486 207595 167288 109061 98812 180312 287004 309707 242660 175271 152086 144649 159159
36475 159159 248235 384610 440682 355237 229934 192590 237828 273295 261592 235762 211241
36464 211241 160171 64434 -56350 -162494 -207437 -151160 3703 195230 340620 384365
36454 384365 312099 151503 -30601 -165383 -226100 -209918 -96399 109033 296420 313991
36444 313991 149054 -34428 -90239 -49222 -27307 -52451 -66989 -41965 10858 105685 257364
36433 257364 399458 427099 339361 262547 303437 430903 526322 513099 417964 331403 321222
36422 321222 373533 422172 440256 473020 562166 680074 775883 846715 917234 986611 1045568
36411 1045568 1103947 1144747 1101860 959059 820077 782230 781377 681186 494161 379564 417555
36400 417555 523443 612371 705532 815038 860534 795722 716246 740161 853894 963526 1023880
36389 1023880 1024668 925697 721047 515433 422041 421291 426819 445474 540963 666992 689943 592029
36377 592029 507990 516726 528114 447461 340480 336357 438381 532023 545794 517307 513722 557754
36365 557754 633811 715199 775050 799626 799044 796985 813591 849180 858061 755038 510432 244709
36353 244709 149477 276203 472288 571394 569049 545487 505756 411366 310057 291513 331188
36342 331188 319127 250533 241287 321015 365823 310979 280616 384070 508004 477620 348503
36331 348503 346137 528888 698363 685559 563544 496391 508651 516552 502793 536828 649792
36320 649792 781817 847556 799559 649930 481521 407549 460600 544764 551644 494408 468176
36309 468176 512823 588852 657299 692414 636807 458572 265018 241723 426616 637690 694207
36298 694207 638789 658564 828701 1018023 1041998 852115 572276 383782 374876 484201
36288 484201 592847 659758 728192 810768 849901 821417 792464 815581 839604 806300 767302
36277 767302 796399 832988 747310 555094 430702 472902 575616 589218 513101 455484 478332
36266 478332 564397 683329 802120 856924 793969 634976 452224 295042 188351 174010
36256 174010 279988 450878 576007 602377 573825 549582 531806 490454 419295 344861 306293
36245 306293 339359 452485 604671 731815 806464 848031 867803 838291 736085 586660
36235 586660 442022 331726 253984 195103 138224 73896 25532 44128 147220 276393 349224
36224 349224 349239 333128 349827 387666 413400 433630 492816 620149 793777 952975 1040418
36213 1040418 1045001 1012991 1005501 1032990 1042071 980294 862730 755959 704889 699154 707945 718087
36201 718087 730584 748581 784726 854620 940417 984531 952505 889179 877129 943415 1038858
36190 1038858 1103905 1116768 1077891 994931 898463 830995 800167 778821 764722 787664 830127
36179 830127 806010 678984 552909 563519 700627 814563 792396 659947 520657 472257
36169 472257 576532 812583 1040811 1110819 1042945 1012027 1107084 1208078 1169871 1025847
36159 1025847 904334 827125 727317 619414 598692 670021 715188 663410 582782 559862 584505
36148 584505 604444 612108 620870 619381 600572 581703 557109 495123 423832 443755 589531 744223
36136 744223 772497 693853 640274 673939 735281 759648 758082 767205 785018 786910 772840 776279
36124 776279 831564 927943 997283 978242 898921 846550 838740 795342 678550 578649 586142 652852
36112 652852 678683 671094 692441 697257 581963 394019 323921 439397 570044 534075 367820
36101 367820 243435 249094 343317 457597 549213 596019 618227 672554 766820 824933 790369
36090 790369 705904 628818 537821 409032 316025 342147 435901 470327 422735 381866 392499
36079 392499 412276 418744 433098 425768 332909 205641 210395 408932 647740 753615 749856
36068 749856 780631 891795 996727 1018300 960007 857012 750207 696710 716492 730531 637224
36057 637224 457766 326402 323720 398773 476901 559303 669905 775714 825910 827609 823244
36046 823244 823002 813316 803163 802158 775117 687846 592064 592424 714866 871002 975185 1033400
36034 1033400 1080130 1093138 1038287 957036 927445 952450 970469 982390 1074917 1273801 1453576
36023 1453576 1472873 1357384 1262372 1270952 1322450 1350274 1389531 1491253 1605685 1636056 1570370
36012 1570370 1474242 1375488 1256059 1160646 1192813 1345739 1439390 1326754 1099517 972973
36002 972973 1002262 1046856 1015376 993009 1068405 1170606 1183587 1124683 1082485 1045614 941536
35991 941536 818192 828782 1010500 1210741 1280969 1234012 1157421 1083353 1023443 1032984 1128990
35980 1128990 1203280 1131306 945792 809195 825210 956656 1114464 1238724 1289649 1248485
35970 1248485 1159237 1110155 1143795 1223148 1296909 1351162 1382022 1366647 1292895 1192685 1123107
35959 1123107 1120001 1163310 1173380 1068161 863518 691497 662047 725123 741133 678141 647604
35948 647604 727175 843959 883120 833335 759263 693944 637526 616520 652596 689703 641222
35937 641222 518933 441346 489236 609113 689496 686622 637407 584435 540081 515437 534697
35926 534697 602021 681687 735823 769099 811068 861109 884851 872694 861737 869211 839276 712517
35914 712517 537445 444309 486110 564333 555957 470090 419172 460343 538037 585385 605899
35903 605899 620757 603569 537919 502618 608705 843176 1053338 1113967 1038210 887131 665106
35892 665106 395996 223582 286771 506976 647188 608987 529365 532677 541574 439791 290035
35881 290035 240296 298022 353458 372831 411076 466975 486416 494455 561968 642094 609191 478131
35869 478131 408403 449381 463872 375127 305642 360101 438930 415858 365112 438232 605535
35858 605535 697934 659917 601610 617906 689673 757503 783887 749693 677725 640122 665598
35847 665598 680650 624209 558003 558695 569565 494061 380329 355693 411337 420235 358333 333463
35835 333463 378010 384255 291302 186870 169490 239887 373258 561166 727648 745236 609738
35824 609738 476702 451873 464352 416257 326745 243985 150975 63096 83036 227962 326565
35813 326565 242675 95703 85398 185841 216098 163236 207506 411921 598885 607759 511651
35802 511651 485108 576480 706101 798463 818640 739661 570426 392846 303121 323125 400845
35791 400845 469771 477734 400974 283978 240534 353867 570816 736988 751097 658885 579225
35780 579225 558933 533417 435634 307956 263395 339930 442804 457653 387709 342755 408226
35769 408226 556444 679900 692381 607465 528462 541502 613490 634042 569639 515612 556432
35758 556432 638251 650714 589207 544564 547343 517020 386518 209112 108079 152102 293170
35747 293170 406553 401246 314871 272372 320136 354843 279814 167591 154765 215898 193077
35736 193077 57911 -20354 68063 197333 198205 112986 114365 232460 317133 265170 151139
35725 151139 104340 161399 285133 441712 591407 659394 598614 471547 402632 434240 481999
35714 481999 467432 451156 562514 798885 979448 946901 750836 558474 438160 337813
35704 337813 247125 236613 306613 336179 257630 170802 189370 268973 302373 304959 364478 455962
35692 455962 464655 383780 334456 366412 386324 335094 300035 369903 490831 564985 602191
35681 602191 658879 691595 604919 426530 311150 350511 471608 553031 565835 555965 544534
35670 544534 506641 435486 384083 427630 585645 782868 902051 895529 839203 853694 970418
35659 970418 1092896 1093627 938843 719164 566365 539775 594728 664517 745476 855663 926064
35648 926064 824132 529975 213440 59959 70191 114265 133976 176086 247310 274371 237246
35637 237246 221594 282008 349593 340703 276598 226179 201212 180189 171109 177073 164275 141573
35625 141573 197526 357958 479433 419237 265346 241070 389549 515453 471573 348869
35615 348869 311318 370862 424004 419531 382713 327116 241242 142021 72406 57136 96278 169378
35603 169378 216347 168926 46621 -32805 11226 131478 247075 354602 469913 533131
35593 533131 481034 370238 314618 325244 325301 305679 338214 427999 482387 459894 430657 441387
35581 441387 437215 387537 379420 484505 614584 626539 521899 425523 395389 377233 345342
35570 345342 358519 437557 501321 497597 510548 638170 810200 839536 656363 399730 252293
35559 252293 257163 330265 381880 370615 293119 191929 142313 165794 185898 139061 92097
35548 92097 150793 276521 325022 277471 281061 401479 490209 412707 276043 267516 359476
35537 359476 370265 276908 251734 366216 467054 429520 357707 405204 524599 545426 427105
35526 427105 287926 215424 180804 140877 111744 114983 130775 137539 148450 185662 252453 341892
35514 341892 442096 524397 551478 506928 410283 312941 282828 357973 489920 569107 546344
35503 546344 499992 536138 647360 726254 704339 618408 542537 511956 518642 525132 469363 314168
35491 314168 122974 38908 142142 350786 506024 544910 544864 592147 655495 634275 514086
35480 514086 410887 428174 513547 517491 382634 208541 116201 113327 128602 121626 100484
35469 100484 63799 -7550 -100620 -156713 -118960 18541 197152 319918 322928 243912 188575
35458 188575 206869 247722 267424 318007 460410 641019 743554 735802 674540 587069 455723
35447 455723 319428 270756 314983 334750 249111 121907 52591 41757 41592 67914 161366
35436 161366 274569 298814 201169 63785 -10627 24595 160767 338991 459870 463442 409308
35425 409308 410956 482089 522042 470672 391743 359895 348986 305751 268339 313146 414955
35414 414955 461532 405709 312224 244786 200444 181486 231470 340332 399286 332548 211862
35403 211862 154602 168548 203224 295129 504883 721642 716438 458346 219115 244408 437000
35392 437000 512362 391461 267163 299874 418881 469951 427236 378958 380051 395548 356597
35381 356597 227796 43775 -101105 -133098 -78384 -19426 24737 103332 208415 239756 146536
35370 146536 23698 -4154 69012 177051 314317 512725 713802 783391 674175 485319
35360 485319 334555 248273 208390 225750 304914 389376 412954 385547 373062 403983 444569
35349 444569 461926 464210 468689 465953 434217 371760 303828 266264 282011 339698 395862 413923
35337 413923 401522 394928 407633 409621 355938 223665 33965 -138320 -195860 -107669 34689
35326 34689 103394 84749 79312 132653 154590 73652 -7130 77235 318202 533651 606480
35315 606480 600682 604070 575419 430001 197322 -374 -86159 -68452 22165 157042 286388
35304 286388 362740 388487 396413 397046 387646 388354 414540 431511 393368 314780 251616 223110 204371
35291 204371 179938 151508 113585 82507 124521 275222 443360 485618 386854 280878 269965
35280 269965 303767 274481 167364 71612 79869 202817 350183 390826 279373 127504 95859
35269 95859 215896 382673 514706 624269 714138 717206 597019 424066 289978 214028
35259 214028 185978 221245 305761 361431 346904 329081 371996 418245 378692 287454 254195
35248 254195 290042 295238 215616 107083 33633 -7023 -36136 -51408 -55903 -61448 -38702 73080
35236 73080 273837 467784 552348 512710 414697 337794 323403 348702 335981 221804 33737
35225 33737 -123160 -159248 -58594 138194 358798 507229 510099 391910 275508 274785 391880
35214 391880 528649 586410 545922 459092 374810 289921 192885 137269 207567 385875 517499
35203 517499 472708 304668 178749 173633 230225 281114 337283 426348 518288 550917 493755
35192 493755 372490 260004 233080 289106 317425 216127 29281 -104070 -127837 -100384
35182 -100384 -45856 98166 332514 521012 565104 562708 664765 828491 861501 707157
35172 707157 541083 538004 660238 754842 771048 774333 791518 765019 670260 572242 519420
35161 519420 464394 359732 269336 289205 388898 440082 402498 366179 377912 350013 223307
35150 223307 116194 184382 385726 516758 465868 306663 142950 -3500 -118317 -140421
35140 -140421 -61564 11536 -14476 -83272 -62617 79747 246958 339175 343552 304737 258901
35129 258901 204744 114988 -18958 -143211 -171079 -81573 42058 106376 114549 140258 214674
35118 214674 283425 273015 169083 29082 -64016 -66795 -9431 39936 43974 9406 -55815
35107 -55815 -141769 -181710 -76076 169986 389989 419944 294447 197524 226008 289311 262596
35096 262596 156936 87771 127360 243777 356585 402378 363286 281275 240723 291773 384906
35085 384906 421178 378117 343246 396729 499034 539660 476278 373628 310242 303805 340098
35074 340098 413336 496768 519141 432648 294881 233920 323324 515802 696762 777492 740403
35063 740403 625508 488125 362878 261849 193717 160464 138381 98800 55434 51954 94052
35052 94052 144157 196288 288493 411858 485625 474668 454446 491955 540068 533378 507957 516960
35040 516960 500032 370206 178137 46851 -15376 -80499 -111692 7033 245872 415594
35030 415594 414855 330882 262596 214174 204545 293682 427844 442643 312282 217595 261408 302167
35018 302167 205905 81044 87325 164313 145766 25256 -86257 -162791 -222845 -179476 51172
35007 51172 348728 502180 484623 427861 378154 284615 185930 180963 229570 207568 154221
34996 154221 228138 402481 457095 328828 220859 270121 339403 269577 132391 73759 72925
34985 72925 31470 -21653 12310 118266 191737 196643 181114 180899 201768 251458 311214 327631
34973 327631 296402 288426 333163 357919 313125 273050 331842 475728 630845 753049 798208
34962 798208 708082 522903 406013 440032 491107 405727 253993 218869 305844 342221 249593
34951 249593 144209 138248 184647 176376 101474 40466 65785 179239 312015 374943 340351
34940 340351 266131 208578 146028 41111 -62969 -88439 -44304 -17659 -45170 -67382 -19793
34929 -19793 91255 213525 299539 323775 292593 251297 258365 343000 481403 590959 562441
34918 562441 365360 131421 45294 114442 142944 -2415 -199704 -242524 -121094 -12982
34908 -12982 -43912 -174483 -292313 -310506 -203256 -43830 23666 -50907 -124780 -34157 177025
34897 177025 321685 325584 281583 272804 290887 325544 383407 404677 310242 159006 114737
34886 114737 220305 344257 390099 407581 436322 394653 223628 18831 -90000 -97709 -65721
34875 -65721 3424 125156 236776 253669 182946 96058 27323 -23766 -28956 48537 185861
34864 185861 307420 347540 285556 160790 72359 102911 214608 286139 275022 259720 297434
34853 297434 351221 401511 496384 611229 598461 402140 202411 189033 281884 252289 59127
34842 59127 -128855 -216436 -280149 -362647 -370583 -256026 -138974 -139148 -195495 -166377 -38827
34831 -38827 70216 84971 48062 33583 57212 91458 127370 186637 270170 317342 254813
34820 254813 96722 -50089 -114274 -140982 -187482 -197045 -79284 113317 215911 171755 100505
34809 100505 105074 128370 78562 -2488 -6594 60074 80991 4377 -84448 -83801 5864 115051
34797 115051 199290 252285 256863 187784 82322 60814 213251 458134 577320 441904 166165
34786 166165 -26603 -63721 -62369 -117689 -168074 -120589 -8997 64669 81067 88398 70611
34775 70611 -46048 -241952 -374451 -357463 -289962 -324910 -455780 -526374 -447545 -312398 -257729
34764 -257729 -281668 -275224 -207854 -190059 -323118 -553505 -732030 -779224 -730103 -640610 -532646
34753 -532646 -442006 -437111 -537076 -659236 -708404 -697624 -727614 -853433 -1018088 -1122085 -1120922
34742 -1120922 -1044634 -954325 -900213 -905548 -967002 -1059073 -1134375 -1130887 -1012099 -821856 -675881
34731 -675881 -660133 -738492 -790326 -740578 -626280 -535769 -516562 -551030 -586488 -568926 -476983
34720 -476983 -351262 -271249 -275924 -321486 -341952 -329875 -316426 -285628 -170344 43803 258203
34709 258203 347923 287497 154070 26517 -67697 -112368 -77164 34837 160813 245702 306493
34698 306493 378539 424595 373870 254857 201840 283028 391356 378290 249428 137865 108490
34687 108490 98619 64789 69624 159961 254968 253249 190897 182125 233896 240289 162654 93176
34675 93176 103517 141770 144121 152721 230158 325130 334551 269308 248051 321850 398687 367375
34663 367375 224625 48532 -93945 -173109 -173384 -91825 48926 205993 329518 375991 334796
34652 334796 244401 160917 116110 127023 218223 380948 528557 567721 520855 504340 567966
34641 567966 635401 636702 612880 623678 623060 518658 321983 152494 99339 146034 225660
34630 225660 284960 291421 239992 170933 137047 138734 127399 82720 48927 77209 159856 241055
34618 241055 279910 291492 329509 427345 555080 648037 678180 666687 617490 490558 283294
34607 283294 95413 45083 130859 233633 254417 203108 154065 162596 227972 296204 298504
34596 298504 227708 173897 241301 432036 650342 806097 864351 820447 710004 636721 689218
34585 689218 804788 809826 638581 424222 318116 309689 308226 321892 433327 630139 782333
34574 782333 798909 713883 601451 493924 412751 395565 436296 457650 405922 334654 331587
34563 331587 390738 429307 422722 441037 526482 608809 599868 523616 477246 486937 490155 465474
34551 465474 479465 554515 577128 430105 171422 -17354 -45304 20510 97526 184624 281155
34540 281155 316583 243438 138365 121159 197579 257509 222349 131554 77641 105201 188662
34529 188662 276898 342310 397409 467327 544716 586770 565546 500327 426784 358973 300044
34518 300044 262576 252289 255241 266149 303071 366274 412420 405858 370816 355777 370419 395826
34506 395826 428395 465305 470113 407578 300140 203874 148519 148694 236088 400226 523147
34495 523147 480854 319619 222937 267457 321074 253637 150174 199329 419175 619552 637447
34484 637447 502584 344271 233855 180767 208046 331382 479623 528775 441777 310376
34474 310376 221603 144027 12208 -122335 -128971 7798 136727 131836 51233 31186 92380
34463 92380 152306 185964 251762 360399 436734 442059 433523 457502 472457 433813 379060 364939
34451 364939 385531 417708 482398 582500 639797 589651 496832 473415 508657 495456 419553
34440 419553 394338 474166 551542 511473 400829 353946 404212 468601 498964 546244 648452
34429 648452 734025 699982 556174 425615 391276 396313 337098 221416 166602 237295 356106
34418 356106 411103 391413 359920 342861 325376 324628 373498 438462 449871 425909 467435 595027
34406 595027 687790 645273 529452 466999 472012 458458 394375 347629 378193 457176 505827
34395 505827 471844 367894 269648 261291 344287 421246 413599 366215 378913 464214 546778 584819
34383 584819 607142 634087 653545 690032 804817 988208 1126962 1127335 1015294 875759 751233
34372 751233 647313 583130 575333 603717 640889 688312 744329 770935 736652 664571 598638
34361 598638 550863 516511 503427 502714 468380 378244 284386 252100 279508 329196 399434 492057
34349 492057 539643 455953 264707 106109 98729 242923 458945 659650 777632 782643 701000
34338 701000 589631 487737 420849 428592 530574 676762 794926 877923 955206 994954 934895
34327 934895 818721 787868 893559 1020233 1059443 1063107 1134812 1249298 1295968 1259607 1240201
34316 1240201 1301614 1401920 1479796 1519604 1516701 1466146 1415056 1445252 1557783 1641418 1614008
34305 1614008 1544082 1564035 1695296 1835161 1906126 1936825 1973982 1987441 1919325 1789695 1688859
34294 1688859 1670108 1702375 1735407 1763796 1808193 1874513 1957696 2050245 2116844 2097314 1979063
34283 1979063 1839979 1767726 1751881 1710190 1614203 1529785 1526663 1602869 1712207 1810951 1851655
34272 1851655 1785073 1619275 1453963 1407294 1500533 1633927 1684523 1627126 1556179 1577419 1677385
34261 1677385 1729264 1644904 1482886 1369166 1348679 1369494 1379089 1363769 1315220 1241033 1198763
34250 1198763 1233054 1282112 1239126 1107730 992242 925921 835964 714721 688262 836890
34240 836890 1061746 1222151 1307662 1373797 1397273 1314319 1141909 951766 775775 634166
34230 634166 590625 662847 739075 716603 676824 776779 993701 1133662 1099178 1002614 987768
34219 987768 1068694 1183916 1296549 1391786 1461368 1525696 1597561 1613804 1494415 1279933 1107620
34208 1107620 1036220 1005722 988088 1040446 1156866 1204813 1099116 930769 821644 741218
34198 741218 584864 375683 265226 344762 543454 712864 753331 666278 534779 451001
34188 451001 432137 419242 374286 342141 386279 497007 601969 650621 663239 704316 805926
34177 805926 901015 865942 685728 540387 624513 885387 1058369 987652 792292 669973
34167 669973 665719 715023 793987 903215 978915 948371 843224 763250 754163 791512 840333
34156 840333 855973 779108 617408 484044 463025 483354 429165 331671 330340 462935 620223
34145 620223 717414 792890 902908 1016157 1068422 1061688 1054469 1077526 1093693 1043437 928254
34134 928254 835298 839063 878559 805715 588330 379808 324420 380679 431402 485558 635221
34123 635221 857500 1008918 1016821 949943 888608 841418 807553 806975 815604 769633 670992 601902
34111 601902 601921 615912 600013 593610 635351 677174 640425 518782 387914 339546 414533 562120
34099 562120 667872 671099 642232 679707 750374 725763 574028 407547 317120 266117 194897
34088 194897 134485 149663 232866 315354 347278 336788 347951 460964 668656 816347 741814
34077 741814 492229 294285 273552 318551 280815 189359 168487 234138 291918 294388 297558
34066 297558 373695 532631 712720 810426 755839 595235 452349 380007 319061 235955 200023
34055 200023 253777 305812 258964 172927 181651 294834 396964 417566 397329 400879 455666
34044 455666 559283 660644 659609 520923 365370 343920 437664 492654 440520 356491 292999
34033 292999 204721 90784 70352 213638 394045 432854 344905 318021 451607 626731
34023 626731 676215 603897 562311 643846 773118 823532 778723 726474 722000 722448 663563 550879
34011 550879 455251 448078 545839 682531 739292 652421 494630 391481 360615 316709 240765
34000 240765 225671 305414 363947 308531 230842 275863 429786 570336 661651 744398 775969
33989 775969 664690 473795 412072 557193 728474 718323 543033 374348 308045 304928
33979 304928 313947 350036 447031 595085 740666 828303 841688 806565 743853 636571 478316
33968 478316 339137 325082 462892 669045 836251 905981 864625 738861 611229 576897
33958 576897 654698 779273 888310 967495 1007245 983831 905057 815020 730997 631173 522555
33947 522555 457889 460480 493958 533041 599944 698967 781400 817479 844133 895430 937175 916089
33935 916089 829381 707027 572662 459758 414150 434617 455074 425903 366988 305007 218162
33924 218162 93961 -13486 -43348 -1932 74115 177435 295049 368544 363276 336328 358681
33913 358681 402008 382356 294256 220792 218596 265422 321313 376771 432847 483377 523253 541381
33901 541381 516082 450892 393331 379327 384577 369462 334080 281798 179788 25250 -99591
33890 -99591 -128111 -120442 -163628 -194824 -66895 203270 402364 387758 254507 158715 97190
33879 97190 -17352 -146148 -141144 39710 257974 362881 350376 322253 352579 438838 543136
33868 543136 629319 668320 646550 583115 524368 505463 514478 505344 458117 419030 456315 568484
33856 568484 662117 646658 540742 454290 460371 512159 506538 412952 306810 270996 296149
33845 296149 304515 255862 193364 180994 227574 289705 328818 344437 360336 393715 435902 459881
33833 459881 454318 446424 471266 518032 534456 494547 435223 409931 427799 453774 448362 393867
33821 393867 304002 223079 196838 232965 305657 391507 466268 480468 405728 313228 324448
33810 324448 449318 554170 543206 489020 505037 565097 558495 474776 410909 412026 424716
33799 424716 415441 424236 472081 505987 474404 392220 306829 258499 282809 380475 473754 473538
33787 473538 410103 413778 534088 658529 653961 521399 370855 305735 366285 517670 651327
33776 651327 661113 558354 453453 400610 342838 241214 154049 129259 123683 110297 163330
33765 163330 331752 517591 603402 628025 700739 802008 824548 774177 757416 772532 691841
33754 691841 493080 343935 375837 503542 567556 557361 584034 692599 807661 841992
33744 841992 779421 658081 526648 416059 328405 264454 260108 345274 457912 476676 380976
33733 380976 302805 352660 458465 464617 346297 224490 186764 200098 215805 260256 366967
33722 366967 482720 513092 447829 390078 447006 608714 748649 746590 607833 454824 407729
33711 407729 490012 641628 783685 859658 860495 838096 850429 859269 739281 451584 156592
33700 156592 58230 157392 266870 274139 269475 370536 536186 645042 679210 716589 776868
33689 776868 789447 717490 616741 543600 480261 391614 301446 263917 289154 337343 370384
33678 370384 380521 381576 396581 443096 509275 553622 547554 509051 473727 440421 373453 266627
33666 266627 182695 204884 347198 530285 658730 709136 719165 703527 634140 523373 466648
33655 466648 536799 664099 700613 605950 492973 470521 519808 568943 614449 694485 787980
33644 787980 825702 789097 728696 686480 658046 631162 607528 584176 562489 574051 644718
33633 644718 733690 765698 726708 668394 619455 572201 568409 693669 926746 1082169 997668
33622 997668 735703 511375 446851 483078 517803 530074 545909 563283 559266 527952 477354
33611 477354 424659 420327 531431 753902 967894 1035160 941284 801170 718265 680367 618070
33600 618070 528186 483736 521145 573809 554184 468650 401611 400771 435635 472912 530099 624492
33588 624492 718360 758372 740948 701708 664778 635913 618772 601954 558690 500809 502381 616437
33576 616437 790162 919662 972380 995188 1014876 1000946 928551 812153 670161 520258
33566 520258 415520 410035 467779 479690 405683 334276 363002 482219 619453 733574 809820
33555 809820 821993 770281 715269 707326 716117 692178 658747 668108 699984 690312 646091 645508 724218
33542 724218 838630 943515 1028650 1073619 1048803 977862 921649 882423 806322 700832 649113
33531 649113 663219 631339 491428 360171 373588 470220 479729 402026 435712 689906 1006493
33520 1006493 1155030 1110470 1032204 1022289 1025309 968517 893267 892320 970236 1028793 985333 868177
33508 868177 784578 808231 906679 978338 958888 885278 846959 880405 932746 935198 885722 833733
33496 833733 801328 762996 709157 684042 726616 801144 833700 814384 817161 900418 1022161
33485 1022161 1085247 1051994 982375 956206 980166 985918 914272 786686 682517 649329 657443
33474 657443 657397 658575 710664 808992 866352 805550 650914 499314 423078 432187 508266 626125
33462 626125 740800 797357 773503 693229 591746 489009 402579 357446 365618 413676 482595
33451 482595 559445 615589 600789 492117 339081 226940 190734 189452 170552 135029 124463
33440 124463 163774 237194 306549 327207 255415 79983 -137268 -282640 -283897 -177499 -66397
33429 -66397 -20042 -28863 -36593 8870 116036 221798 219260 68246 -123442 -190086 -92732
33418 -92732 47421 120337 156207 235318 343875 405353 413586 439211 512353 580109 584342 515592
33406 515592 392574 258161 191698 240980 330259 323064 203714 111466 153499 265339 313558
33395 313558 266377 193733 152751 145759 154010 146786 87264 -11769 -67224 -13432 123070 283311
33383 283311 455085 623007 701051 622812 468792 388901 406590 417123 386113 413568 548444
33372 548444 662942 609736 429966 299147 300748 352057 350907 307815 300962 353686 401063
33361 401063 364427 231731 66232 -43301 -34538 99535 295655 436087 431080 319409
33351 319409 252471 335890 511836 642453 679679 688074 717354 733985 692869 607321 517764
33340 517764 438339 359875 271317 167071 67894 30553 86491 175692 204517 166547 129966
33329 129966 106667 39007 -56693 -53351 108092 301860 375484 351012 359508 424582 432043 305017
33317 305017 104855 -56005 -123905 -110857 -54193 10341 73382 155052 256843 331808 346169
33306 346169 344728 394815 482632 533893 531073 535664 582250 621277 600356 552864 562884 659709
33294 659709 774601 802721 704810 547374 431751 386752 360622 315558 271007 234956 170708
33283 170708 85356 74701 194059 340443 363785 259491 149823 106381 105143 135104 217290
33272 217290 307898 314678 241602 199376 235628 273156 263630 278328 374200 482580 520118 513310
33260 513310 516173 494083 402905 310535 312704 376827 400111 392982 465101 626020 735311 693436
33248 693436 576910 522594 550595 569996 520773 445810 424725 472553 518523 483774 372404
33237 372404 265692 223374 227485 243154 283896 366262 442048 449813 415838 425757 494649 539779
33225 539779 496845 395172 295950 222647 184478 202459 260852 284655 228276 152421 145169
33214 145169 186366 168564 60585 -27363 15538 150430 244703 252854 263373 353100 470497
33203 470497 515300 481388 443287 423242 364690 254808 182847 218578 294824 286901 177829
33192 177829 69710 43500 81152 129749 167499 178780 127693 7808 -113524 -148150 -74329
33181 -74329 59701 206891 360600 522887 668424 762073 802130 823956 848967 838739 726641
33170 726641 515683 327533 307281 457157 598071 542778 305820 100462 112313 310302
33160 310302 507006 571909 536812 507007 534957 603361 680125 744248 778153 771427 727713
33149 727713 654708 565234 493706 470354 459437 376840 210315 67787 45821 101111 132131
33138 132131 143584 224971 386928 533782 601028 606306 551336 400932 202692 104692 181336
33127 181336 337567 455385 537766 624774 665684 588539 431594 293935 201714 124479 77105
33116 77105 96083 149958 184648 233169 368112 557953 682155 692291 659080 652252 663970
33105 663970 659664 622631 543381 440373 383330 412878 453207 404759 309883 305972 412384
33094 412384 500585 504897 521114 630629 752017 761084 667665 575114 526141 480529 408352
33083 408352 331086 293402 340089 484768 661435 752121 706328 593991 512843 501850 574993
33072 574993 754344 1002676 1195062 1242751 1199681 1170005 1155436 1079342 928520 780344
33062 780344 702080 700850 761785 857239 921107 893448 805045 752122 768106 778823 711610 598399
33050 598399 530192 538284 564815 548380 503835 496043 545966 592928 563782 456583 331183
33039 331183 238532 196389 216295 300291 411685 500351 559905 610108 628871 573612 479503
33028 479503 452793 528590 604044 560541 400994 225334 118817 103498 153969 221569 275098
33017 275098 332510 410192 452289 394805 296991 287770 355103 333211 167820 43791 129841
33006 129841 320813 381190 252397 62866 -90633 -198508 -224141 -119420 47538 137920
32996 137920 126071 103571 102413 62775 -9634 -8011 110091 250637 323266 341129 341041 318663
32984 318663 291935 320392 400540 430425 337178 174456 57689 62638 191775 357743 411666
32973 411666 307204 231511 417608 802357 1047827 966767 746882 651875 680182 673111 609271
32962 609271 591478 627009 618124 537962 453492 395976 352757 363656 476958 617722 645009
32951 645009 550947 473526 496556 560899 596451 619329 656073 675096 643316 573382 480808
32940 480808 368399 276315 264033 313428 333050 291454 262763 303428 371986 419127 467671
32929 467671 535281 555448 460004 289552 144498 66222 37429 58588 141742 254334 350790
32918 350790 445760 578008 712031 762662 724489 687027 691565 659154 519406 343134 262508
32907 262508 291358 315484 263701 201768 220602 302114 360711 373973 388453 406872 364082
32896 364082 248165 163766 205008 316055 365752 341315 369405 524164 703445 752376 651704
32885 651704 516283 441522 423674 419307 409390 390161 359765 341691 379064 476516 580751
32874 580751 645845 684050 718287 718968 639996 501477 381178 321777 295041 267544 254876
32863 254876 287562 357932 428050 469912 479013 465239 441516 404701 330927 223609 159308
32852 159308 223169 379164 472130 403814 251136 156838 157554 188772 212275 251464 324687
32841 324687 426699 560478 708947 795180 760374 667470 630435 652037 642555 591341 578768
32830 578768 597598 526032 348866 246842 345030 499409 486141 315061 187161 191893 227193
32819 227193 216474 226861 316375 400769 362458 218172 101191 110584 224922 343515 387547
32808 387547 375683 400730 510355 632311 661166 592111 503012 427457 337999 254968 264944
32797 264944 393006 544481 625235 647553 662275 656755 593853 500313 433226 385688 304415
32786 304415 191132 113900 112580 155445 204256 267221 361105 465162 550633 629592 733164
32775 733164 850829 932077 955004 956532 970986 964141 864945 658504 417573 239721 175663
32764 175663 212484 292485 349957 370273 413587 530039 651112 642067 490502 357264 378147
32753 378147 489081 530350 460265 361601 285732 220726 198533 291338 469001 579930 532472
32742 532472 410571 355466 404349 496939 573410 606548 589927 553284 555191 617887 699676
32731 699676 755154 777816 764098 698808 609097 565259 580795 573025 476784 343181 270094
32720 270094 282726 334805 377817 375314 302118 192641 146023 222388 370166 499022 569110
32709 569110 564784 463487 305099 210328 235023 280098 250605 223664 324739 507352 617240
32698 617240 627581 631555 630552 535583 386930 349135 428672 414912 208030 6243 21297
32687 21297 179106 277679 296404 339671 381163 307326 174034 177541 347058 476556 419960
32676 419960 274457 193442 178760 163752 169401 245091 337177 348078 286306 247731 267026
32665 267026 282323 245187 187240 162745 176396 185454 149742 75530 17290 20291 59584 73578
32653 73578 66218 118087 267648 443281 557752 608334 625729 590373 484018 372811 338168
32642 338168 355170 340088 292643 277112 278210 212714 100611 81725 208819 353682 395558
32631 395558 385260 422147 470613 427155 303925 212628 200203 221466 250488 295836 314361
32620 314361 237116 98324 26166 76531 173383 238310 273982 284259 228114 120760 78049
32609 78049 167107 286395 292799 195581 125495 149905 221745 289522 347821 375032 327876 231498
32597 231498 189595 257051 364784 419283 423860 445005 498296 534734 525492 496106 468568 422692
32585 422692 343062 273691 289059 409745 564002 641912 589311 449317 310363 217782 152456
32574 152456 98792 94497 167123 241167 187417 -2832 -160203 -121721 65366 203668 190373
32563 190373 109543 76567 98320 134140 198191 316234 441602 505520 516189 524266 520382
32552 520382 460540 379071 376434 482822 618818 709523 759457 792851 799747 776913 752123
32541 752123 726117 651961 517022 390620 341125 351642 367014 382121 426089 486467 509740
$$ [...]
##END NTUPLES=NMR SPECTRUM
##END=
