##TITLE=31Pdec_DE-127_2
 , 24 sc
 11.2.2026
##JCAMPDX= 6.0         $$ Bruker NMR JCAMP-DX V2.0
##DATA TYPE= NMR SPECTRUM
##DATA CLASS= NTUPLES
##ORIGIN= UXNMR, Bruker Analytische Messtechnik GmbH
##OWNER= root
$$ XWIN-NMR		Version 3.5
$$ Wed Feb 11 15:12:18 2026 Russian Standard Time (UT+4h)  she@DPX200
##.OBSERVE FREQUENCY= 81.013821
##.OBSERVE NUCLEUS= ^31P
##.ACQUISITION MODE= SIMULTANEOUS
##.ACQUISITION SCHEME= undefined
##.AVERAGES= 24
##.DIGITISER RES= 17
##SPECTROMETER/DATA SYSTEM= spect
##.PULSE SEQUENCE= zgpg30
##.SOLVENT NAME= DMSO
##.SHIFT REFERENCE= (INTERNAL, DMSO, 0, 198.062)
##AUDIT TRAIL= $$ (NUMBER, WHEN, WHO, WHERE, WHAT)
$$ ##TITLE= Audit trail, XWIN-NMR		Version 3.5
$$ ##JCAMPDX= 5.01
$$ ##ORIGIN= Bruker BioSpin GmbH
$$ ##OWNER= she
$$ F:/spectra/data/she/nmr/P31/2/pdata/1/auditp.txt
$$ ##AUDIT TRAIL=  $$ (NUMBER, WHEN, WHO, WHERE, WHAT)
(   1,<2026-02-11 15:10:20.39 +0400>,<she>,<DPX200>,
      <created by zg, POWCHK disabled, PULCHK disabled
       configuration hash MD5:
       00 E9 B6 7A A2 85 ED C7 34 08 36 98 17 FE 4E 26
       data hash MD5: 32K
       38 93 61 5A B1 F0 A0 37 15 1C 13 E9 05 BD 41 8A>)
(   2,<2026-02-11 15:10:33.39 +0400>,<she>,<DPX200>,
      <Start of raw data processing
       efp BC_mod = 2 LB = 1.5 FT_mod = 6 PKNL = 1 PHC0 = 1404.313 PHC1 = 82.5009 SI = 64K 
       data hash MD5: 64K
       F1 08 9E EA F0 C2 FB D2 4D 94 71 79 22 8C 13 AC>)
(   3,<2026-02-11 15:11:15.53 +0400>,<she>,<DPX200>,
      <pk PHC0 = 109.6631 PHC1 = -275.4 
       data hash MD5: 64K
       7A DC 46 F9 9A 2B 9F B9 C5 69 03 D3 88 2E A0 A0>)
(   4,<2026-02-11 15:11:20.95 +0400>,<she>,<DPX200>,
      <abs ABSG = 5 
       data hash MD5: 64K
       27 A7 6B 8E 44 25 41 D0 B8 14 C8 64 87 13 61 BF>)
$$ ##END=
$$ 
$$ hash MD5
$$ BA A1 D8 BD 5B 93 04 7A 25 D0 4C 87 AD D7 61 4F
##$RELAX= 
##$RELAX= 
##$RELAX= 
##$RELAX= 
##$RELAX= 
##$RELAX= 
##$RELAX= 
##$RELAX= 
$$ Bruker specific parameters
$$ --------------------------
##$DU= <F:/spectra>
##$EXPNO= 2
##$NAME= <P31>
##$PROCNO= 1
##$TYPE= <nmr>
##$USER= <she>
##$AMP= (0..31)
100 100 100 100 100 100 100 100 100 100 100 100 100 100 100 100 100 100 
100 100 100 100 100 100 100 100 100 100 100 100 100 100 
##$AQSEQ= 0
##$AQ_mod= 1
##$AUNM= <au_zg>
##$AUTOPOS= <>
##$BF1= 81.014009
##$BF2= 200.13
##$BF3= 200.13
##$BF4= 200.13
##$BF5= 200.13
##$BF6= 200.13
##$BF7= 200.13
##$BF8= 200.13
##$BYTORDA= 1
##$CFDGTYP= 0
##$CFRGTYP= 5
##$CHEMSTR= <none>
##$CNST= (0..31)
1 1 145 1 1 1 1 1 1 1 1 1 1 1 1 1 1 1 1 1 1 1 1 1 1 1 1 1 1 1 1 1 
##$CPDPRG= <waltz16>
##$CPDPRG1= <>
##$CPDPRG2= <waltz16>
##$CPDPRG3= <>
##$CPDPRG4= <mlev>
##$CPDPRG5= <mlev>
##$CPDPRG6= <mlev>
##$CPDPRG7= <mlev>
##$CPDPRG8= <mlev>
##$CPDPRGB= <>
##$CPDPRGT= <>
##$D= (0..31)
0 1 0 0 0 0 0 0 0 0.06 0 0.03 2e-05 3e-06 0 0 0.0002 0 0 0 0 0 0 0 0 0 
0 0 0 0 0 0 
##$DATE= 1770808220
##$DBL= (0..7)
120 120 120 11 120 120 24 19 
##$DBP= (0..7)
150 150 150 150 150 150 150 150 
##$DBP07= 0
##$DBPNAM0= <>
##$DBPNAM1= <>
##$DBPNAM2= <>
$$ [...]
##$SUBNAM3= <"">
##$SUBNAM4= <"">
##$SUBNAM5= <"">
##$SUBNAM6= <"">
##$SUBNAM7= <"">
##$SUBNAM8= <"">
##$SUBNAM9= <"">
##$SW= 400.765351723535
##$SWIBOX= (0..15)
0 1 3 0 0 0 0 0 0 0 0 0 0 0 0 0 
##$SW_h= 32467.5324675325
##$TD= 32768
##$TD0= 1
##$TE= 0
##$TE2= 300
##$TE3= 300
##$TEG= 300
##$TL= (0..7)
0 120 53 12 22 120 120 120 
##$TP= (0..7)
150 150 150 150 150 150 150 150 
##$TP07= 0
##$TPNAME0= <>
##$TPNAME1= <>
##$TPNAME2= <>
##$TPNAME3= <>
##$TPNAME4= <>
##$TPNAME5= <>
##$TPNAME6= <>
##$TPNAME7= <>
##$TPOAL= (0..7)
0.5 0.5 0.5 0.5 0.5 0.5 0.5 0.5 
##$TPOFFS= (0..7)
0 0 0 0 0 0 0 0 
##$TUNHIN= 0
##$TUNHOUT= 0
##$TUNXOUT= 0
##$USERA1= <user>
##$USERA2= <user>
##$USERA3= <user>
##$USERA4= <user>
##$USERA5= <user>
##$V9= 5
##$VALIST= <valist>
##$VCLIST= <CCCCCCCCCCCCCCC>
##$VD= 0
##$VDLIST= <DDDDDDDDDDDDDDD>
##$VPLIST= <PPPPPPPPPPPPPPP>
##$VTLIST= <TTTTTTTTTTTTTTT>
##$WBST= 1024
##$WBSW= 4
##$XGAIN= (0..3)
0 0 0 0 
##$XL= 0
##$YL= 0
##$YMAX_a= 136286
##$YMIN_a= -150447
##$ZGOPTNS= <>
##$ZL1= 120
##$ZL2= 120
##$ZL3= 120
##$ZL4= 120
##$ABSF1= 198.0616
##$ABSF2= -202.7028
##$ABSG= 5
##$ABSL= 3
##$ALPHA= 0
##$AQORDER= 0
##$ASSFAC= 0
##$ASSFACI= 0
##$ASSFACX= 0
##$ASSWID= 0
##$AUNMP= <proc_1d>
##$AZFE= 0.1
##$AZFW= 0.5
##$BCFW= 0
##$BC_mod= 2
##$BYTORDP= 0
##$COROFFS= 0
##$CY= -3
##$DATMOD= 1
##$DC= 0
##$DFILT= <>
##$DTYPP= 0
##$F1P= 0
##$F2P= 0
##$FCOR= 1
##$FTSIZE= 65536
##$FT_mod= 6
##$GAMMA= 0
##$GB= 0
##$INTBC= 1
##$INTSCL= 9.790993e-09
##$ISEN= 30
##$LB= 1.5
##$LEV0= 0
##$LPBIN= 0
##$MAXI= 10000
##$MC2= 0
##$MEAN= 0
##$ME_mod= 0
##$MI= 50
##$NCOEF= 0
##$NC_proc= -3
##$NLEV= 6
##$NOISF1= 182.463
##$NOISF2= 159.3651
##$NSP= 0
##$NTH_PI= 0
##$NZP= 0
##$OFFSET= 198.0616
##$PC= 4
##$PHC0= 1513.976
##$PHC1= -192.8991
##$PH_mod= 1
##$PKNL= yes
##$PPARMOD= 0
##$PSCAL= 0
##$PSIGN= 0
##$REVERSE= no
##$SF= 81.0140089999434
##$SI= 65536
##$SIGF1= 159.3651
##$SIGF2= -187.1042
##$SINO= 113.3802
##$SIOLD= 16384
##$SREGLST= <1H.CDCl3>
##$SSB= 0
##$STSI= 65536
##$STSR= 0
##$SW_p= 32467.5324675325
##$SYMM= 0
##$S_DEV= 0
##$TDeff= 32768
##$TDoff= 0
##$TI= <>
##$TILT= no
##$TM1= 0
##$TM2= 0
##$TOPLEV= 0
##$USERP1= <user>
##$USERP2= <user>
##$USERP3= <user>
##$USERP4= <user>
##$USERP5= <user>
##$WDW= 1
##$XDIM= 65536
##$YMAX_p= 364811480
##$YMIN_p= -978108
$$ End of Bruker specific parameters
$$ ---------------------------------
##NTUPLES= NMR SPECTRUM
##VAR_NAME=  FREQUENCY,     SPECTRUM/REAL,   SPECTRUM/IMAG
##SYMBOL=    X,             R,               I
##VAR_TYPE=  INDEPENDENT,   DEPENDENT,       DEPENDENT
##VAR_FORM=  AFFN,          ASDF,            ASDF
##VAR_DIM=   65536,         65536,           65536
##UNITS=     HZ,            ARBITRARY UNITS, ARBITRARY UNITS
##FACTOR=    0.49542278885378, 1,            1
##FIRST=     16045.7642231865, 0,            0
##LAST=      -16421.768244346, 0,            0
##MIN=       -16421.768244346, -978108,      0
##MAX=       16045.7642231865, 364811480,    0
$$ Real data points
##PAGE= N=1
##DATA TABLE= (X++(R..R)), XYDATA
$$ [...]
41380G573328m44914l16854j70479J6631K32111M44256O39350P95702Q41621O93965
$$ 7573328 7128414 6811560 6641081 6657712 6889823 7334079 7973429 8769131 9610752 10304717
41370A0304717L45136j13292n46981q43550r54231r15710q19379p26872o29738
$$ 10304717 10649853 10536561 9989580 9146030 8191799 7276089 6456710 5729838 5100100
41361E100100n11988m10136l64291l46969l04497k46591k27166k47275k45433
$$ 5100100 4588112 4177976 3813685 3466716 3162219 2915628 2688462 2441187 2195754
41352B195754j86399j01493l7961j9248n1587j15440j54451j29646p9990p0348
$$ 2195754 2009355 1907862 1869901 1850653 1799066 1683626 1529175 1399529 1319539 1249191
41342A249191q9669p3694k4205j7165p5041j18010p8949N622O0840O6284M0104
$$ 1249191 1159522 1085828 1061623 1044458 969417 851407 772458 778080 838920 905204 945308
41331I45308j0625p1753r9083o6048p204K3614J4038j3541l8897n0120m2837l1588
$$ 945308 934683 862930 763847 697799 690595 714209 728247 714706 675809 625689 582852 551264
41319E51264l2025k6275R812M3043J1099p0886j06691n3582J4219K1088n109l397
$$ 551264 519239 492964 502776 545819 556918 486032 379341 325759 339978 361066 355957 352560
41307C52560J2943m303m1336m5765j6380M237N076P907J1180l394k1106j0743
$$ 352560 365503 361200 319864 274099 257719 261956 267032 274939 286119 282725 261619 250876
41295B50876J6931K0725n665k6229j6983R874L0630L0149R052q782P04J5492j3727
$$ 250876 267807 288532 282867 256638 239655 249529 280159 310308 319360 310578 311282 326774 313047
41282C13047p6681r4505l5971K4722K3307P129M1479Q1378M3345m1124o4747j6208
$$ 313047 236366 141861 105890 130612 153919 161048 202527 283905 327250 286126 221379 205171
41270B05171R848k5459n3920l0911n188j9133l5365j2289K4455L6359L5631M7959
$$ 205171 215019 189560 135640 104729 99541 80408 45043 32754 57209 93568 129199 177158
41258A77158O2392N7998L8238J0091k9427o6223p4202o1770o2620p0999m7455
$$ 177158 239550 297548 335786 345877 316450 250227 176025 114255 51635 -19364 -66819
41247f6819J23J4361j2971j9712J8241M0341Q230k2293M070M8742N0352K6093
$$ -66819 -66696 -52335 -65306 -85018 -66777 -26436 -18206 -40499 -36429 12313 62665 88758
41235H8758K6402M2267L8400L3369O0620Q5264N1839o666l073O4599R9999M8508
$$ 88758 115160 157427 195827 229196 289816 375080 426919 420253 417180 481779 581778 630286
41223F30286l1090o0891m0154j2949K465Q515n962m7291q5438q2138m4077j7156
$$ 630286 599196 538305 498151 485202 487667 496182 490220 442929 357491 275353 231276 214120
41211B14120k7235n0133m7670j6817J1650J7234J3075J8355K5699J5221r896k6055
$$ 214120 186885 136752 89082 72265 83915 101149 114224 132579 158278 173499 163603 137548
41199A37548k2387p348J1881K8699K3586j1549m0345j9494K9451M0665O797l025
$$ 137548 115161 107813 119694 148393 171979 160430 120085 100591 130042 170707 177504 174479
41187A74479M4544Q2376L8776n5578j15240j13503q5366n0015j721L8401L3472
$$ 174479 219023 301399 340175 284597 169357 55854 -29512 -79527 -81248 -42847 -9375
41176i375m613k2278m152O895j7455m5798l6409L419L2696L1046J5612J1830K3616
$$ -9375 -13988 -36266 -40418 -33523 -50978 -96776 -133185 -129766 -97070 -66024 -50412 -38582 -14966
41163a4966L7587N1501Q0758J19975J17137K8986r9300j63371j25008n4703k4591
$$ -14966 22621 74122 154880 274855 391992 420978 321678 158307 33299 -21404 -45995
41152d5995k0100L33K0979R456o919J8030O2716O7392K9679k134j4758l5245o1975
$$ -45995 -66095 -65762 -44783 -35327 -42246 -24216 38500 105892 135571 133437 118679 83434 21459
41139B1459o3995m3676l0313j8527J5789M9222M1020J9419M4242Q6341N4185m2824
$$ 21459 -42536 -86212 -116525 -135052 -119263 -70041 -29021 -9602 34640 120981 175166 132342
41127A32342p8207j341O9359K0926q4129j07463l3856L2941L1443J631M2L5082
$$ 132342 54135 52794 122153 143079 58950 -48513 -82369 -49428 -17985 -16354 -16312 18770
41115A8770P9388Q8766K6722p6187j17640m3365N8023N7784l7014r9668o8537
$$ 18770 98158 186924 213646 137459 19819 -23546 34477 92261 55247 -44421 -112958
41104a12958j5413j1612k6722j0242R869j5809n6995m1662K9321Q2452Q2160P0637
$$ -112958 -128371 -139983 -166705 -176947 -167078 -182887 -239882 -281544 -252223 -169771 -87611 -16974
41092a6974Q4131R2876N6344q774n6505p4103p3040m4784J9741Q0372Q0211L1932
$$ -16974 67157 160033 216377 207603 151098 76995 3955 -40829 -21088 59284 139495 171427
41080A71427Q462L0683L1595l2084r9424r5005m3871k0958k5611L358O5780Q9433
$$ 171427 179889 210572 242167 210083 110659 15654 -28217 -49175 -74786 -71428 -5648 83785
41068H3785M6901n775k6069l7944n9548n7128j2394L1731L7264K4244J6594k769
$$ 83785 130686 124911 98842 60898 1350 -55778 -68172 -36441 823 25067 41661 38892
41056C8892l6177l5840J5725M8972J829p7016r4887m6535K62J9610M1450O5974
$$ 38892 2715 -33125 -17400 31572 33401 -43615 -138502 -185037 -184775 -165165 -123715 -57741
41044e7741N1481o553n6193o0244l0526J2120N5266P0803L4764j9579k6591K0030
$$ -57741 -6260 -12813 -69006 -129250 -159776 -147656 -92390 -21587 13177 -6402 -32993 -12963
41032a2963N3988L0862j4752k6809J591L6159M3507R166n2047r1467o6854K829
$$ -12963 41025 71887 57135 30326 31917 68076 111583 120749 68702 -22765 -89619 -86790
41020h6790N6352O5996N2748K6665k8676r6697j14662n4584L0507P6291P9378
$$ -86790 -30438 35558 88306 114971 86295 -10402 -125064 -179648 -149141 -72850 6528
41009F528O4215K6773l6036p8599n3454J0471L8125J3413m865J9397M3913J7780
$$ 6528 70743 97516 61480 -17119 -70573 -60102 -21977 -8564 -13429 5968 49881 67661
40997F7661l8315o4346m7922l0396l1856j9821L0869Q7133R8064N9678M469m9680
$$ 67661 29346 -35000 -82922 -113318 -145174 -164995 -134126 -46993 51071 110749 115218 65538
40985F5538r4158r3316j9612P4492R3129K5988l1854k0386O473o042j1807L7313
$$ 65538 -28620 -121936 -141548 -67056 26073 52061 20207 -179 6294 252 -11555 25758
40973B5758P1204K721j04485j14812m4114m0840j28442j40716J6057J93041K04235
$$ 25758 96962 99683 -4802 -119614 -163728 -204568 -333010 -473726 -457669 -264628 -60393
40962f0393Q2951j323L898J4294o225J185N1814P1236K0731l8535m8719l5146
$$ -60393 22558 21235 25133 39427 33202 34387 86201 157437 178168 139633 90914 55768
40950E5768l5814k6112K6401Q4529Q2547J9455m0614m9802j9760J0438J7623M550
$$ 55768 19954 -6158 20243 104772 187319 206774 166160 116358 96598 107036 124659 129209
40938A29209j1379j3282J171J7576J9506M644j4969k6794l0820l7085m6984m2728
$$ 129209 117830 104548 105719 123295 142801 147445 132476 105682 74862 37777 -9207 -51935
40926e1935r476L3776M7056J9495j5824k6896j7661m673J1162K7533K5443J258
$$ -51935 -61411 -27635 19421 38916 23092 -3804 -21465 -26138 -14976 12557 38000 39258
40914C9258j2509O275K6633R136k8535l8632j9644j0963j9552j2076J5598K2453
$$ 39258 26749 33024 59657 68793 40258 1626 -18018 -28981 -48533 -60609 -45011 -22558
40902b2558o130k6718o887K1096J3033j6411j7809J8339M9720L7571j3494o6254
$$ -22558 -28688 -55406 -62293 -41197 -28164 -44575 -62384 -44045 5675 43246 29752 -36502
40890c6502q2378m9243Q620M9101N1978L1573R348o739j0561O936L4607L8392
$$ -36502 -118880 -168123 -159503 -110402 -58424 -26851 -17503 -24242 -34803 -27867 6740 45132
40878D5132M452l4974m2788k4731p460J1405N1019R3157Q7950K5977l5090m0877
$$ 45132 49584 14610 -28178 -52909 -60369 -48964 2055 95212 183162 209139 174049 133172
40866A33172r483R25k3775m0179j7035J9251K5021k074l0226m1563m1577k8747
$$ 133172 123689 124614 100839 60660 43625 62876 87897 85823 55597 14034 -27543 -56290
40854e6290P082M9048N3931J0711l1575k5900N570O318k4895k8053K7608R1733
$$ -56290 -49208 -160 53771 64482 32907 7007 12577 18895 -6000 -34053 -6445 85288
40842H5288R4755L1057m5479q6142p9795l8980J1755L8585K1971j6570l4352k0347
$$ 85288 180043 211100 165621 79479 -316 -39296 -27541 11044 33015 16445 -17907 -38254
40830c8254o806k0148m3420m4326k2166l505j515m998l598L095K1819N9813R3610
$$ -38254 -45060 -65208 -108628 -152954 -175120 -178625 -180140 -185138 -188736 -185641 -163822 -104009 -10399
40817a0399P7297M346o6336p6127l7827p696m823p62J9633L4789K8559J4213O926
$$ -10399 66898 71244 4908 -71219 -109046 -116742 -121565 -122327 -102694 -67905 -39346 -25133 -18207
40804a8207P173J7018L6466M1841J1807k3783j6369J4377k690o6058p8667L117
$$ -18207 -11034 5984 42450 84291 96098 72315 55946 70323 67633 1575 -77092 -73975
40792g3975Q1900N7092j9704k6766L7672O2064K022o0449n1565o09K9469K6114
$$ -73975 7925 65017 45313 18547 56219 118283 120305 59856 8291 7682 37151 63265
40780F3265P449j6125k7702n640L3302M1647J0479k0441l3587n2237p3208n4670
$$ 63265 70714 54589 26887 21247 54549 96196 106675 86234 52647 410 -72798 -127468
40768a27468M18K4062j1553l9652k380N5324N7230Q387k9048l0213j3499J2646
$$ -127468 -127050 -102988 -114541 -154193 -156573 -101249 -44019 -35632 -64680 -94893 -108392 -95746
40756i5746M4888N4449K1575k0751k8806r190R567L2041O5778P1459J3015o5509
$$ -95746 -50858 3591 25166 4415 -24391 -33581 -24014 8027 73805 145264 158279 92770
40744I2770q4714l8408Q614J8894J0825j172k2481l4385n251M5656N9380K3491
$$ 92770 8056 -30352 -21738 -2844 7981 6809 -15672 -50057 -55308 -9652 49728 73219
40732G3219j1456j1585J939M683J55j3238m6084p2543m3889K8311O4326K4567
$$ 73219 61763 50178 52117 56800 56955 43717 -2367 -74910 -118799 -90488 -26162 -1595
40720a595l0803l0769Q742K4623N210n674J6061M3114L7120p958n9418o9791k1882
$$ -1595 -32398 -63167 -54425 -29802 -24592 -30266 -14205 28909 66029 58071 -1347 -71138 -93020
40707i3020L9252M2488k5126r3777r0050k0090M6546N8349K5988l888j121J9948
$$ -93020 -53768 -11280 -36406 -130183 -220233 -240323 -193777 -135428 -109440 -113328 -114449 -94501
40695i4501K1781m720k4244r264J4397R161p972P426M5506N0723J2936j7853j8223
$$ -94501 -72720 -77440 -101684 -110948 -96551 -87390 -95362 -87936 -42430 8293 21229 3376 -14847
40682a4847k0681l7002l0650J466K411m0107m5735L1291J03125O8174k9473o5800
$$ -14847 -35528 -72530 -103180 -101714 -99303 -139410 -185145 -153854 -50729 17445 -12028 -77828
40670g7828k1131J5991Q340J0639M4356N2165J0783j6823P850K8191m666l8496
$$ -77828 -98959 -82968 -74628 -63989 -19633 32532 43315 26492 34342 62533 57867 19371
40658A9371p320M9843M7089r725l5850n048J7578r620m0678k7272j812k1037o5924
$$ 19371 12051 61894 108983 99258 63408 58360 75938 66318 25640 -1632 -3444 -24481 -90405
40645i0405o0347J7985R8134J01243L1106m0152n4616j4795L8086O5035M9803
$$ -90405 -150752 -132767 -34633 66610 97716 57564 2948 -11847 26239 91274 141077
40634A41077K838m4706o2136m3437p765K2862L9072M0942L1480J3000j8141o5494
$$ 141077 143915 99209 37073 -6364 -14129 8733 47805 88747 120227 133227 115086 49592
40622D9592j08953j04251l5535M2869N8626J4476j7684k483J5539l242k6090j0092
$$ 49592 -59361 -163612 -199147 -156278 -97652 -83176 -100860 -103343 -87804 -91046 -117136 -127228
40610a27228J9615J4215j2454r165K3032L4665J0909j4418k2147j9543O710P3856
$$ -127228 -107613 -93398 -105852 -115017 -91985 -57320 -46411 -60829 -82976 -102519 -95809 -21953
40598b1953J32247R4623l4370j34002j16828l6369O939N944K3146P1120R8332
$$ -21953 110294 204917 170547 36545 -80283 -116652 -109713 -103769 -80623 -9503 88829
40587H8829P8644M1506J2244j6482m6678o2769o9076r0107j16520r7918j6552
$$ 88829 167473 208979 221223 204741 158063 95294 26218 -63889 -180409 -278327 -294879
40576b94879P0729R8810P4473N1948M8447L1449j1654m0550k0762J9810K8181
$$ -294879 -224150 -125340 -50867 1081 49528 80977 69323 28773 8011 27821 56002
40565E6002J505j5133q78J5072J0279P684L0155N3309M3302J4783L291k045m0860
$$ 56002 57507 42374 41496 56568 66847 74531 104686 157995 201297 216080 219371 217326 176466
40552A76466r9915j10886m6558L3220N8449L0232l423j6524j6433j3069r028m227
$$ 176466 76551 -34335 -80893 -47673 10776 41008 37585 21061 4628 -8441 -17469 -21696
40540b1696R317L7755N9282M0019r003l1323m628K3715J1579j5235j6657n894
$$ -21696 -12379 25376 84658 124677 115674 84351 79723 103438 115017 99782 83125 77231
40528G7231r427n578K9388N1717O700o8860q5733l4010Q992J721j7116j6206j6261
$$ 77231 67804 62226 91614 143331 150031 81171 -4562 -38572 -29580 -27859 -44975 -61181 -77442
40515g7442k5863j6980O143m468m7710n2784L037M1127O431l6425r401M9804N7278
$$ -77442 -103305 -120285 -114142 -118610 -166320 -219104 -216067 -174940 -168509 -204934 -214335 -164531 -107253
40502a07253K1004M427j412n0267j09768q6239J4663P4112L3980k6569k8738j893
$$ -107253 -86249 -81822 -83234 -133501 -243269 -329508 -314845 -240733 -206753 -233322 -262060 -263953
40490b63953M589J7492O5419Q8522K4150o7854p1876J3447P2718M0738k1145l4059
$$ -263953 -259364 -241872 -176453 -87931 -63781 -131635 -203511 -190064 -117346 -76608 -97753 -131812
40478a31812n080J4838J2904Q037M162m741q187M889K1542K6045K7938L9516M3437
$$ -131812 -136892 -122054 -109150 -101113 -96951 -101692 -109879 -104990 -83448 -57403 -29465 10051 53488
40465E3488J7678j9390k8380j0551q727l7134n1039j2568M2626M4097j6109o4119
$$ 53488 71166 51776 23396 12845 4118 -33016 -84055 -96623 -53997 -9900 -26009 -90128
40453i0128l4687M5932R0705N4698j7286m9380k1378J8749K1166q207k5396q853
$$ -90128 -124815 -78883 11822 66520 49234 -146 -21524 -2775 18391 10184 -15212 -24065
40441b4065J8339K6088J5241N874M229J571k618q30j57j7873m5915m6072J96N6388
$$ -24065 -5726 20362 35603 41477 45706 47277 44659 43829 43672 25799 -20116 -66188 -65992 -9604
40427i604P0144L6711k049j5459j2230r393k661J7728M0796M2590J3202l4789
$$ -9604 60540 97251 95202 79743 67513 58120 55459 73187 113983 156573 169775 134986
40415A34986p8453r6413p6285k3983L2491N8014L9281K588n138L2930P2800N1473
$$ 134986 56533 -39880 -116165 -140148 -107657 -49643 -10362 -7774 -12912 20018 92818 144291
40403A44291l0169r1879o6991R929M6842J4687k4947j7843J0796R962j5925k4315
$$ 144291 114122 22243 -44748 -34819 12023 26710 1763 -16080 -5284 4678 -11247 -35562
40391c5562q537n620l4533o7676p1273m3901l831L8593P9566J05290R5490M7506
$$ -35562 -44099 -49719 -84252 -151928 -223201 -267102 -270933 -232340 -152774 -47484 48006 95512
40379I5512j0233l8630k6486l44J3269K2587M6284O6113M1535k4475p4403o6838
$$ 95512 85279 46649 20163 19819 33088 55675 101959 168072 209607 185132 110729 43891
40367D3891k2801J5642L3476K6980j2918o4057o5343L136P0544O4838J6637L355
$$ 43891 21090 36732 70208 97188 84270 20213 -45130 -41994 28550 93388 110025 113380
40355A13380K0671j48n9109p4651k0105K6155O523k7907j1612K7104K2412j8050
$$ 113380 134051 133903 74794 143 -19962 6193 12716 -15191 -26803 301 22713 4663
40343D663l3387p519K1474K9324K2923N229k2704l6714j5616J8458L0014K6021
$$ 4663 -28724 -36243 -14769 14555 37478 42707 20003 -16711 -32327 -13869 16145 42166
40331D2166L5895N1023L5891q912m5241n4495m9570l5268n243K5110L1317K2916
$$ 42166 78061 129084 164975 156063 110822 56327 6757 -28511 -33754 -8644 22673 45589
40319D5589K5019K2529j8997p6366p9362j3395N2193O2966M5777M3671M2899J1790
$$ 45589 70608 93137 74140 -2226 -81588 -94983 -42790 20176 65953 109624 152523 164313
40307A64313l3138n2971m7796m2712l6437j3755P271p299m6382n7832k1663J8270
$$ 164313 131175 78204 30408 -12304 -48741 -62496 -55225 -62524 -108906 -166738 -188401 -170131
40295a70131J2213k9896n0692j5747M3418O4075K7836j4258p520L1255L8373j957
$$ -170131 -157918 -187814 -238506 -254253 -210835 -146760 -118924 -133182 -140702 -109447 -71074 -73031
40283g3031l4550j8515J4192J7679N694J8174M5134M1039J025l4073m5615n3574
$$ -73031 -107581 -126096 -111904 -94225 -88531 -70357 -25223 15816 16841 -17232 -62847 -116421
40271a16421n8174k4092N0550R8800O1724k6606p5664m9560m58J1533p064j0007
$$ -116421 -174595 -198687 -148137 -49337 12387 -14219 -89883 -139443 -139901 -128368 -135432 -145439
40259a45439J2568K1621n602l1967q545M9551P2923K9559k9425l9715j1316o535
$$ -145439 -132871 -111250 -116852 -148819 -157364 -107813 -34890 -5331 -34756 -74471 -85787 -92322
40247i2322m2175o1974j9209N3665Q7927O7120L6194L0968L7283K8626R668j716
$$ -92322 -134497 -196471 -215680 -162015 -74088 -6968 29226 60194 97477 126103 135771 134055
40235A34055j2264l8252o1097l8324L0423Q2612O2400j0635o7838p0193l3851
$$ 134055 121791 83539 22442 -15882 14541 97153 159553 148918 81080 10887 -22964
40224b2964Q083L5487L9499K5393J7579L1634M2996J7052l0563m5128j1858J9636
$$ -22964 -14881 20606 60105 85498 103077 134711 177707 194759 164196 119068 107210 126846
40212A26846O895l0010m7847l7976j7502M028J8509R210k1457l9849k6293m786
$$ 126846 133741 103731 55884 17908 406 4434 22943 32153 10696 -29153 -55446 -60232
40200f0232K197J4827N2162Q0420N6459L3l1554k5520j5567j3237L127L2165M1051
$$ -60232 -58035 -43208 8954 89374 145833 145866 114312 88792 73225 59988 63115 95280 136331
40187A36331K2503R294J9623L2817L0423J8649N32k8704m6978j5091N8465J06400
$$ 136331 158834 168128 187751 220568 250991 269640 270172 241468 194490 179399 237864 344264
40175C44264Q1249R786n0562p2960n9827k0698K2859M3848M4148N0104N9362L6984
$$ 344264 425513 435299 384737 311777 251950 231252 254111 297959 342107 392211 451573 488557
40163D88557j4766l8113q049J6528j6196n6761k1503P5632J34530J03318L1034
$$ 488557 473791 435678 427629 444157 427961 371200 349697 425329 559859 663177 694211
40152F94211j7125l1402k9783j7230K95L287j2284k2086r164J2562K3612K0037
$$ 694211 677086 645684 615901 598671 598966 602253 589969 567883 558719 571281 594893 614930
40140F14930j238m3539q1073o8204o331L5155N254m9125m0938L3451Q5881N6529
$$ 614930 613692 570153 489080 420876 414545 449700 454954 405829 364891 398342 484223 540752
40128E40752j4154n7201o8013q3133r9178p6255j6631J9186o317n3694o0950k0991
$$ 540752 526598 469397 401384 318251 219073 142818 126187 145373 139056 85362 24412 3421
40116C421K4672M5472M2754K7085O254j2329l0678n9204q6199p2735j0336M3351
$$ 3421 28093 73565 116319 143404 149658 137329 106651 47447 -38752 -111487 -121823 -78472
40104g8472L4447k364J0879P4567J04993N5884k2690o7547p8283p8187o1326k2077
$$ -78472 -44025 -46389 -35510 39057 144050 199934 177244 109697 31414 -46773 -108099 -130176
40092a30176J2840K6520M1702O6703O0938N150m3071k7484J3732M564m9443p5636
$$ -130176 -117336 -90816 -49114 17589 78527 83677 40606 13122 26854 31418 -18025 -93661
40080i3661n0400k2126k2056k7210j9404j3450j1575J2437O4752J11743J20948
$$ -93661 -144061 -166187 -188243 -215453 -234857 -248307 -259882 -247445 -182693 -70950 49998
40069D9998Q6026J4551o5132r5979m9416J6074J8649k9318m3282o301P196l1082
$$ 49998 136024 150575 85443 -10536 -59952 -43878 -25229 -54547 -97829 -104130 -96934 -128016
40057a28016m3707K2076R3819P8592K177l9082k0798j396j5075l1759j9804J1147
$$ -128016 -171723 -149647 -55828 22764 24941 -14141 -34939 -36335 -51410 -83169 -102973 -91826
40045i1826L4350L5758K1643J6407L3896L8614j9837j10063j21638j5731R2819
$$ -91826 -57476 -21718 -75 16332 50228 88842 69005 -41058 -162696 -178427 -85608
40034h5608Q1055r775m4137N814M4258K4054Q890M0891O2958K5148k4398k0443
$$ -85608 -4553 -14328 -58465 -52651 -8393 15661 24551 65442 128400 153548 129150 108707
40022A08707J7072L0230K1240L3696O8270Q1141N1185m45m6604p1672o5029l1165
$$ 108707 125779 156009 177249 210945 279215 360356 411541 411096 364492 292820 227791 196626
40010A96626K708J3820O971n033k0702l1742j7288J8066L3787J3201q58K8356
$$ 196626 199334 213154 220125 215092 194390 162648 145360 163426 197213 210414 209556 237912
39998B37912O2184L6230l9479q5525n3562K4531Q4925Q8085L2655m2620p3517
$$ 237912 300096 336326 296847 211322 157760 182291 267216 355301 387956 345336 271819
39987B71819l1269L1627L9881l285k4617P275L8851J8647k9864n3870m2790j7539
$$ 271819 240550 272177 312058 308773 284156 291431 330282 348929 319065 265195 222405 204866
39975B04866J3143M4628N2979K0713l0279o2048o0907l3148J2837N4047N4514
$$ 204866 218009 262637 315616 336329 306050 244002 183095 149947 162784 216831 271345
39964B71345J4358j3765K393J8242j9466p8486q1846k5517J9082J7443R395K3603
$$ 271345 285703 271938 274331 292573 273107 194621 112775 87258 106340 123783 133178 156781
39952A56781L3988K7994M0695P7680P5231k955q7486r1634l4543j715j5299k5313
$$ 156781 190769 218763 259458 337138 412369 409414 321928 230294 195751 194036 178737 153424
39940A53424j2015j0134k8317k5576J3450M8635N3431N2030N9668M4124j6340
$$ 153424 141409 131275 102958 77382 90832 139467 192898 244928 304596 348720 332380
39929C32380q3438j04896p4149j6483M3577P4198M4595k1620m8912p906L6961
$$ 332380 248942 144046 69897 53414 96991 171189 215784 194164 145252 137346 174307
39918A74307K5672n817K709K4762m028o1613o7242k1457r368n2802o8804j3036
$$ 174307 199979 194162 196871 221633 217605 155992 88750 67293 57925 5123 -63681 -76717
39906g6717L7227N628n9748o2123L417O3696P9163O4129K7353k6576n4561j4960
$$ -76717 -39490 -33862 -93610 -155733 -152316 -88620 -9457 54672 82025 55449 888 -14072
39894a4072N1591N5776j7199q3772p5452j5759L4121M7911K7198k2927p5386q2421
$$ -14072 37519 93295 76096 -7676 -83128 -98887 -64766 -16855 10343 -12584 -87970 -170391
39882a70391l4157J8479L4270L8454O6472Q7183M4092m1765p8341k5538M4164
$$ -170391 -204548 -186069 -151799 -113345 -46873 40310 84402 42637 -35704 -61242 -17078
39871a7078M0408k6851o7050l1854K8382M1914J1653j13L2865O6032N6003K5167
$$ -17078 23330 -3521 -70571 -102425 -74043 -32129 -20476 -20589 12276 78308 134311 159478
39859A59478J9082K7904K684n6746q8690o0970k2398k7503n0584k5424M9362R8857
$$ 159478 178560 206464 209148 152402 63712 2742 -19656 -47159 -97743 -123167 -73805 25052
39847B5052O8958p559n7248m9896j6066M286Q147J9189M1905M5829R097l7696
$$ 25052 94010 86451 29203 -20693 -36759 -32473 -24326 -5137 36768 82597 91694 53998
39835E3998m3322r348R758q663j9127J3879N0169L7020K29N878N1794P0093L4372
$$ 53998 10676 1328 11086 2423 -16704 -2825 47344 84364 84593 90471 142265 212358 246730
39822B46730q833k5301l6649n4547m1892J7964O9506N3709r775n4990n1986j5038
$$ 246730 237897 212596 175947 121400 79508 97472 166978 220687 210912 155922 103936 88898
39810H8898L7045Q0534P5829J1113o0283p5462m1097j1985q574q554o566k0635
$$ 88898 125943 206477 282306 293419 233136 157674 116577 104592 96018 87464 80898 60263
39798F0263l9629k5510K0338M7620L1228M581l325j4868n3373q5431n9657J4747
$$ 60263 20634 -4876 15462 63082 94310 98891 95566 80698 27325 -58106 -117763 -103016
39786a03016O9889N9741J1491j0740K0095O5306O6327J3020m7514p2027o5353
$$ -103016 -33127 26614 38105 27365 47460 112766 179093 192113 144599 72572 7219
39775G219m7869j2890M4258Q2080N6499r97j3944K4867L9087r348n4117k3951
$$ 7219 -40650 -53540 -9282 72798 129297 128300 114356 139223 178310 168962 114845 90894
39763I0894M9922Q3440N5951J4816r001k4739l1965r570L7920P0126N9543J8678
$$ 90894 140816 224256 280207 295023 286022 261283 229318 219748 257668 327794 387337 406015
39751D06015k6396n9066o6306m3565j4512j6402n2518q1961p0683l4731j6395
$$ 406015 379619 320553 254247 210682 196170 179768 127250 45289 -25394 -60125 -76520
39740g6520k7482l4078j653N3999P5846L3782l0696n1517k3036l767k9906o4311
$$ -76520 -104002 -138080 -139733 -85734 -9888 23894 -6802 -58319 -81355 -85122 -115028 -179339
39728a79339n1612R084P1335R3169N9775j2421o8623n1518K1124N4931j727p8926
$$ -179339 -230951 -221867 -150532 -57363 2412 -10009 -78632 -130150 -109026 -54095 -55822 -134748
39716a34748q0559j7169K6553K2814J4504J8317Q276p277J1026M2588J7361n8678
$$ -134748 -215307 -232476 -205923 -183109 -168605 -150288 -142012 -149289 -138263 -95675 -78314 -136992
39704a36992q8675l5638J1784j7281o2443m1606J1186J8038L07L0586Q2026N6876
$$ -136992 -225667 -261305 -249521 -266802 -329245 -370851 -359665 -341627 -341320 -310734 -228708 -171832
39692a71832l8635p5428J0041J14548J10925J4353n9495n0821j735K9028L3760
$$ -171832 -210467 -285895 -275854 -161306 -50381 -36028 -95523 -146344 -148079 -119051 -85291
39681h5291L5325M2441M4017L2324J5154R58j9652n9339r7728q8334k3319L7252
$$ -85291 -49966 -7525 36492 68816 83970 84928 65276 5937 -91791 -180125 -203444 -166192
39669a66192L7631N016P440M8470O4593K7436j7353k9710k9095l7936l1712P196
$$ -166192 -128561 -123545 -116105 -67635 -3042 24394 7041 -22669 -51764 -89700 -121412 -114216
39657a14216L5531R188l5527k6535L3116O4544K6009l2680m6018j5004J4024J8331
$$ -114216 -78685 -69497 -105024 -131559 -98443 -33899 -7890 -40570 -86588 -101592 -87568 -69237
39645f9237J2575J1015Q832J929L426K8586O7352Q2497M5864k2709o6859n3466
$$ -69237 -56662 -45647 -36815 -34886 -31460 -2874 64478 146975 192839 170130 103271 49805
39633D9805q711J7774R948j2096k9931l7037k2050J8636N1020L0383k8515n2245
$$ 49805 41094 58868 68816 56720 26789 -10248 -32298 -13662 37358 67741 39226 -13019
39621a3019o520M7157L3348l0345o0923k7726J7189K6930J7291J7671J8952M885
$$ -13019 -19539 27618 60966 30621 -30302 -58028 -40839 -13909 3382 21053 40005 44890
39609D4890o807K505Q788j7779n2776m5882p67K6133J0211r206L131K4757J7386
$$ 44890 38083 40588 49376 31597 -21179 -67061 -67828 -41695 -31484 -40690 -37559 -12802 4584
39596D584j3200l2485k8799j7220p172L868J3190J4600J1322Q649L759L8J4757
$$ 4584 -8616 -41101 -69900 -87120 -94292 -90424 -77234 -62634 -51312 -42663 -38904 -38866 -24109
39583b4109M8173O2906K8139k7269m5426j9159J840j0916k6213j0150K0695L2713
$$ -24109 24064 86970 115109 87840 42414 23255 25095 14179 -12034 -22184 -1489 31224
39571C1224K8659L0150K9497J680m4750p0802o4069n5048o4246o6195l0276K4119
$$ 31224 59883 90033 119530 121210 76460 5658 -58411 -113459 -177705 -243900 -274176 -250057
39559b50057M4856J5781j9296j1401L1696N5205K4922l1264n6519k9905J4970
$$ -250057 -205201 -189420 -208716 -220117 -188421 -133216 -108294 -139558 -196077 -225982 -211012
39548b11012L4854K5606J7117K8482M3671L5042J460k5402j3414L2899O9322N2244
$$ -211012 -176158 -150552 -133435 -104953 -61282 -26240 -24780 -50182 -63596 -30697 38625 90869
39536I0869j1849o2889m7012J9694O5237M7756O780P273M9875P3765M7074J0517
$$ 90869 79020 16131 -30881 -11187 54050 101806 108586 115859 165734 239499 286573 297090
39524B97090J2340L8950M5169K5541J0358N249j4490m8520o0071l3931l309J805
$$ 297090 309430 348380 393549 419090 429448 434697 420207 371687 311616 277685 274376 276181
39512B76181l902M529J9854K3287J8772J6106O048j4995k1347K657K2664j495
$$ 276181 272279 276808 296662 319949 338721 354827 360875 345880 324533 327190 349854 348359
39500C48359m7784n7147j9420J5206J0906j4753l1897l3431j8861J4464M9098
$$ 348359 300575 243428 224008 239214 250120 235367 203470 170039 151178 165642 214740
39489B14740N3018K2121j4130l7215n3682n9997l9546o009J827j3077j511M1778
$$ 214740 267758 289879 275749 238534 184852 124855 85309 79300 81127 68050 66539 108317
39477A08317M8040j7425p8814n1946K2781L5373k8630o9245k1544O0077R0407
$$ 108317 156357 138932 60118 8172 30953 66326 37696 -31549 -53093 6984 97391
39466I7391N7502O235k6205k2331K1698P3917P4102M674p1346q1235l1174J2768
$$ 97391 154893 161128 134923 112592 134290 208207 282309 286983 215637 134402 103228 115996
39454A15996J5238K123N979K0264J8166o393k9683k4272P520K7284O68n2223o9306
$$ 115996 131234 133357 139336 159600 177766 171373 141690 117418 124938 152222 152890 100667 31361
39441C1361k3757L6897N4235L5753K8282L3303N885n7415q9605m3646L1741N0635
$$ 31361 7604 44501 98736 134489 162771 196074 201959 144544 54939 11293 43034 93669
39429I3669j084o0761p8312o0692k8052K1262Q0715J11768Q4853K3333k3381l6206
$$ 93669 92585 31824 -46488 -107180 -135232 -113970 -33255 78513 163366 186699 163318 127112
39417A27112k9280j2652J2221K6385K916m9007q1505o3655j5613K5038M6179N4536
$$ 127112 97832 85180 97401 123786 126702 77695 -3810 -67465 -83078 -58040 -11861 42675
39405D2675N1226L7718K8769L3189L1973N88n1099q2723o7685j9759K2698K9598
$$ 42675 93901 131619 160388 193577 225550 226138 175039 92316 24631 4872 27570 57168
39393E7168K570k5449k3101J186J0854k890p405J1134J2960l1111p5268n5928
$$ 57168 59738 34289 11188 12374 23228 20338 12933 24067 37027 5916 -69352 -125280
39381a25280P163L4869Q664p709K0700M4268J8259k1679k5338j1822k3289l7575
$$ -125280 -118117 -83248 -74584 -82293 -61593 -17325 934 -20745 -46083 -57905 -81194 -118769
39369a18769j594P0146J05152P7042L2847J0604p197l9814o2570m4614L446M5517
$$ -118769 -120363 -50217 54935 131977 164824 175428 168231 128417 65847 21233 24679 70196
39357G0196N9931M8862L2299M0571Q2650J14600P6972k1937r8607r1119k7430
$$ 70196 130127 178989 211288 251859 334509 449109 526081 504144 405537 314418 286988
39346B86988K6640M9168N7815N8358M3859K7827L4669O2145Q5167R0925Q3679
$$ 286988 313628 362796 420611 478969 522828 550655 585324 647469 732636 823561 907240
39335I07240O4959L6550J2187j580k2501n9830q0774m9008J4937N5723N9167N9378
$$ 907240 972199 1008749 1020936 1019356 996855 937025 856251 807243 822180 877903 937070 996448
39323I96448P2624P7099O5023N8633N6677K1818m7238q3447l7146M4516P5881
$$ 996448 1069072 1146171 1211194 1269827 1326504 1348322 1301084 1217637 1180491 1225007 1300888
39312A300888M4724J1600J1315J3149j4918n1798n5649k2154J3036J9390L136
$$ 1300888 1345612 1357212 1368527 1381676 1366758 1314960 1259311 1237157 1250193 1269583 1272719
39301A272719o791O39J544k5820n4279l1364L9346Q0078L3909n4384r6461p5140
$$ 1272719 1265928 1266567 1268111 1242291 1188012 1156648 1195994 1276072 1309981 1255597 1159136 1083996
39289A083996m5907l7538j9866J8567K9117k2487q8659r6711m6599k942j245j0379
$$ 1083996 1038089 1000551 980685 999252 1028369 1005882 917223 820512 773913 770971 769726 759347
39277G59347O062L2583K8963q363m0728l9441j9659j3345k6100l9518m6222n5300
$$ 759347 765409 797992 826955 818592 777864 738423 718764 705419 679319 639801 593579 538279
39265E38279o2305m5639o075K0628J2117q034j2911j5810l3214l6386M954N2924
$$ 538279 475974 430335 424260 444888 457005 448971 436060 420250 387036 350650 355604 408528
39253D08528M3069j1911l3472J730K9969J0674j2105J193J1786k1905n8817l9644
$$ 408528 451597 439686 406214 407944 437913 448587 436482 437675 449461 427556 368739 329095
39241C29095J0433K3914L112M991L1817K5701k5533n9642l4773J6795N1685O8206
$$ 329095 339528 363442 366554 371545 403362 429063 403530 343888 309115 325910 377595 445801
39229D45801O9100L3360l5122q0754o4596k5174k6524p0179j00888q3941l7656
$$ 445801 514901 548261 513139 432385 367789 342615 316091 245912 145024 61083 23427
39218B3427L518K4754L0291L1190L5585L9021K9826J2693J1665L3757M6395J7094
$$ 23427 26945 51699 81990 113180 148765 187786 217612 230305 241970 275727 322122 339216
39206C39216l3066m6480m500M1380L2385j8829l9520R914Q0496R4065M1252j5519
$$ 339216 306150 259670 255170 296550 328935 310106 270586 280500 360996 455061 496313 480794
39194D80794l3698l7829n6470o2241k1240L2470L4340j1579l4934l810L4153L1303
$$ 480794 447096 409267 352797 290556 269316 301786 336126 324547 289613 285803 319956 351259
39182C51259N257j207J9819M9101O9656O4085K0803l3519m9412k7425k6986o9795
$$ 351259 356516 355309 375128 424229 493885 557970 578773 545254 495842 468417 441431 371636
39170C71636r0239l4297M2870M9036q853l9469l453M4052M8800K0985j1004m2142
$$ 371636 281397 247100 289970 339006 330153 290684 287231 331283 380083 401068 390064 347922
39158C47922o0250l3320L6172Q7567O8924k227p0924j05301j00167n7373J043
$$ 347922 287672 254352 290524 378091 447015 444788 373864 268563 168396 111023 112066
39147A12066K8766N134k8134j6403L5844P7297Q0704O1796L4909m464m5123n0605
$$ 112066 140832 145966 117832 101429 137273 214570 295274 357070 391979 387515 342392 291787
39135B91787p729M2056M7138Q940k2769j2023K6871N5510N4515L1948K940k2686
$$ 291787 284058 326114 373252 382192 359423 347400 374271 429781 484296 516244 519184 496498
39123D96498l5620k7214k516J6643J2435r395k9832m1232m8230m7612k7011J0180
$$ 496498 460878 433664 431148 447791 460226 450831 420999 379767 331537 283925 256914 267094
39111B67094L7307L6202K3289K5422L7875K9947o111l6388k9657l530m024m2790
$$ 267094 304401 340603 363892 389314 427189 457136 451025 414637 384980 381450 377426 334636
39099C34636p6774n9195K824N4674N3490R338l2281l7561q751K9789N7295O5835
$$ 334636 257862 198667 201491 256165 309655 318993 286712 249151 240400 270189 327484 393319
39087C93319N4074K4177j3153m0537m8270m1765k8886r546J0200O750l2045p1123
$$ 393319 447393 471570 458417 417880 369610 327845 298959 289413 299613 306363 274318 203195
39075B03195n7964J896L8615J2026k7271j2620L6469M7929J5265N541M0723N1256
$$ 203195 145231 147127 185742 197768 170497 157877 194346 242275 257540 263081 303804 355060
39063C55060j2668r0421r2497k8419J5264l08l3742m6045m4837l8241j1448K6756
$$ 355060 342392 251971 159474 131055 146319 146011 112269 66224 21387 -16854 -28302 -1546
39051a546L1947n061k3094K5480Q9289P5459j8799r1803o6579J5629O0268M0639
$$ -1546 30401 25340 2246 27726 117015 192474 173675 81872 15293 30922 91190 131829
39039A31829R191M131P24k8667n2848k2969M4684P6104L4542l1793n2821j5605
$$ 131829 141020 145151 145875 117208 64360 41391 86075 162179 196721 164928 112107 96502
39027I6502M0066P6073P6917L9077k2109o2114m1145K4547P0617N3823k718m0222
$$ 96502 136568 212641 289558 328635 306526 244412 203267 227814 298431 352254 349536 309314
39015C09314k7935J0486K8052P889j7121o929K6645K8545k0784o5795m3947K8640
$$ 309314 281379 291865 319917 327806 310685 303756 330401 358946 338162 272367 228420 257060
39003B57060P6914N9632L347m7742p1431n7480p447M1966M0095r704l9557j192
$$ 257060 333974 393606 396953 349211 277780 220300 212853 254819 294914 285210 245653 244461
38991B44461P0033J03420P7088K1826l2110o9401o8786k0499L3045K4558m8889
$$ 244461 314494 417914 495002 516828 484718 415317 346531 326032 359077 383635 334746
38980C34746j02748o3825L3644R1389P3308L7721L6372L8334m583n9712n1003
$$ 334746 231998 168173 201817 293206 366514 404235 440607 478941 474358 414646 363643
38969C63643J5328M1822j8335q2646n6441K6700N7467J2311k6586j0552Q582j8890
$$ 363643 378971 420793 402458 319812 263371 290071 347538 359849 333263 322711 331293 312403
38957C12403n0661k3243L9784N8840J3898l4798l6447m741K4000L8651L8728J1313
$$ 312403 261742 238499 278283 337123 351021 316223 279776 275035 299035 337686 376414 387727
38945C87727m3432q5209p1491k0104L260k6854n4156j8108N2420P2953K5333j5742
$$ 387727 344295 259086 187595 167491 170751 143897 89741 71633 124053 197006 222339 206597
38933B06597J589K7766r64m8817l1272M5118Q2950M0933n419J5092N9654M0736
$$ 206597 208186 235952 234988 186171 154899 200017 282967 323900 318481 333573 393227 433963
38921D33963m0345r5322o9994p354J7278j1974m2165k1981L2885N5841J3888m5059
$$ 433963 393618 298296 228302 220948 238226 226252 184087 162106 194991 250832 264720 219661
38909B19661n3756j5138J2420R508J7627N7378Q5247O1366J0700k0156k7198l1980
$$ 219661 165905 150767 163187 172695 190322 247700 332947 394313 405013 384857 357659 325679
38897C25679l4726k3709m705J2001K6613K5772j6253p8428q4197m168P7310O5867
$$ 325679 290953 267244 262539 274540 301153 326925 310672 232244 148047 143879 221189 287056
38885B87056p106l2778J0885L6284m428m0331N229R1482J13066M3362l5323m2574
$$ 287056 279950 247172 258057 294341 289913 249582 254811 346293 459359 502721 467398 424824
38873D24824M234K3965j9792p4389p0509j4251K5747J5765m365O791L0439L0978
$$ 424824 429058 453023 433231 358842 288333 274082 299829 315594 311229 318020 348459 379437
38861C79437J9416K6311M0976K9943k405k2391k2771k0960j4508R107K7810O971
$$ 379437 398853 425164 466140 496083 493678 471287 448516 427556 413048 422155 449965 456936
38849D56936l5970m5623j1820J5903N516j8404k4882j5777l85K0886L1751P635
$$ 456936 420966 375343 363523 379426 384942 366538 341656 325879 325494 346380 378131 385766
38837C85766l3173l5209J3083N1746L3201j0810k3409m612O051J168R225L6653
$$ 385766 352593 317384 330467 382213 415414 404604 381195 376583 382634 383802 393027 429680
38825D29680N1436L1560o21p153J5194K8431J145m5527n7918k0536J9200J6882
$$ 429680 481116 512676 512055 504902 520096 548527 549672 504145 446227 425691 444891 461773
38813D61773n920q18K7441L0001o383m2852n3279n1735m6349k0659K0887M1015
$$ 461773 455853 455035 482476 512477 506094 463242 409963 358228 311879 291220 312107 353122
38801C53122K8614K1957M3050N4094J8462l2070l7451M601L6136J5161l8692p4342
$$ 353122 381736 403693 446743 500837 519299 487229 449778 454379 490515 505676 466984 392642
38789C92642o4044k5724J456L182M095K4603M1075K0632j6438j5111L1553O6210
$$ 392642 328598 302874 304330 307512 311607 336210 377285 397917 381479 366368 397921 464131
38777D64131M6697k709l6987m5031l6350j2136K1818M1545L0130j014k8495l5858
$$ 464131 510828 508119 471132 426101 389751 377615 399433 440978 471108 470094 441599 405741
38765D05741j5629J9716L2753L188l1807k3587J1734K0393M928J6729N3449N1043
$$ 405741 390112 409828 442581 445769 413962 390375 402109 422502 427430 444159 497608 548651
38753E48651k534l5068n782L2694L1569K0706L2654L2895j0134n6970o4545n4482
$$ 548651 546117 511049 505267 537961 569530 590236 622890 655785 645651 588681 524136 469654
38741D69654n0358j9013N3888J02750P8168L5791M2500O2060K9559k7226m8166
$$ 469654 419296 400283 454171 556921 635089 670880 713380 775440 804999 777773 729607
38730G29607o0010j14609j60340j08638M978O1635M0430K5545M5285M2225M814
$$ 729607 669597 554988 394648 286010 290988 352623 393053 418598 463883 506108 510922
38719E10922q537R742K979k4831l578N8605O2637j0890n5156j5197K1003j8882
$$ 510922 502385 512127 515106 490275 486697 545302 607939 597049 541893 526696 547699 528817
38707E28817o6388l5124L7063O6203N5911N5000N3475J8994j8552j1604J7645
$$ 528817 462429 427305 464368 530571 586482 641482 694957 713951 695399 683795 701440
38696G01440J4986j6874l6231l1990j3688K6135P8537R0931L5343l6815o4159
$$ 701440 716426 699552 663321 631331 617643 643778 722315 813246 848589 811774 747615
38685G47615n2869l1734R018O6034P4475p02p6949n4408L4025P2330L3252l321
$$ 747615 694746 663012 672030 738064 812539 811837 734888 680480 714505 786835 820087 816766
38673H16766R246L0345K4818J4783J8513J6243J720K876K6271L4906N036l7120
$$ 816766 826012 856357 881175 895958 914471 930714 932434 935310 961581 996487 1001523 964403
38661I64403n2620l0313J5588N4793N0049m389n6553m9255M562L8863K1053k0382
$$ 964403 911783 881470 897058 951851 1001900 997511 940958 891703 896265 935128 956181 935799
38649I35799m7352m5424j1130M4939Q2027O2336M008l8181m3128l4252k6316q826
$$ 935799 888447 843023 831893 876832 958859 1021195 1025203 987022 943894 909642 883326 874500
38637H74500J6991L0393K5864J8135J1936J680m093N415J6598J5067J9097M3449
$$ 874500 891491 921884 947748 965883 977819 979499 975406 980821 997419 1012486 1031583 1075032
38625A075032N1446L974n9309n9150O248N5705M1182k630l3691n1927n5299k3391
$$ 1075032 1126478 1130452 1071143 1011993 1018241 1073946 1115128 1112498 1078807 1026880 971581 948190
38613I48190K5749L3746p296k8753R351N1615L4701j6439l5984j3645J4053L0225
$$ 948190 973939 1007685 1000389 971636 980987 1032602 1067303 1050864 1014880 1001235 1015288 1045513
38601A045513L7709K4305j4491m2194k5929M340n387m8569o4477k3934L6798O6933
$$ 1045513 1083222 1107527 1093036 1050842 1024913 1029253 1023866 975297 910820 886886 923684 990617
38589I90617M9718L984l0320j6444L5467N9448P054p8498j05428n0052J5295K0412
$$ 990617 1040335 1044319 1013999 997555 1033022 1092470 1099524 1021026 915598 865546 880841 901253
38577I01253j9708m0813j4674L0251N4686M7576K4209L622j0655l2404p0368j02924
$$ 901253 881545 840732 826058 856309 910995 958571 982780 986402 975747 943343 872975 770051
38565G70051r0228k3759M8368O5463K1682k9371l9977j6582P661K3697M2502N6037
$$ 770051 679823 656064 704432 769895 791577 762206 722229 705647 713308 737005 779507 835544
38553H35544M2061R252l041J5534K4395o752m8608n5486k8751q2K3130N0587O4615
$$ 835544 877605 886857 883816 899350 923745 916993 868385 812899 784148 784066 807196 857783 922398
38540I22398L3803l1739q2443q8624o2679k5780R966K9741K5075J2248O875p819
$$ 922398 956201 924462 842019 753395 690716 664936 674902 704643 729718 741966 748841 741022
38528G41022m4283o0884j0795O8933R0842M4176R814L0827N1112J9215k5559k4201
$$ 741022 696739 635855 625060 693993 784835 829011 838825 869652 920764 939979 914420 890219
38516H90219R814K9547L2323L6097K4594j7098m9328k9545J0368P471l0395l5158
$$ 890219 900033 929580 961903 998000 1022594 1005496 956168 926623 936991 944462 914067 878909
38504H78909J6988P5744R2627P2023M1990K1187K0785M0501N8573N5339M0984
$$ 878909 895897 971641 1064268 1136291 1178281 1199468 1220253 1260754 1319327 1374666 1415650
38493A415650L0730R796l6282p4295n8659n338K4953J6535J4073L9699N3738K2187
$$ 1415650 1446380 1456176 1419894 1345599 1286940 1281602 1306555 1323090 1337163 1376862 1430600 1452787
38481A452787k5245l8594j6564K973K982N451L2211O8457P4130L0603k9528n1337
$$ 1452787 1427542 1388948 1372384 1375357 1378339 1383790 1416001 1484458 1558588 1589191 1559663 1508326
38469A508326j9343K6090M0374J9595j6460n3116p0556m1789K2499N9900L2051
$$ 1508326 1488983 1515073 1555447 1575042 1558582 1505466 1434910 1393121 1415620 1475520 1507571
38458A507571j4468j4574J6169J3923k1459k4586K5234O9370O1815K5919m854
$$ 1507571 1493103 1478529 1494698 1508621 1487162 1462576 1487810 1557180 1618995 1644914 1640060
38447A640060l7212p5271q6515n3788j6009j3343k8270k3357n384o367k3497k3734
$$ 1640060 1602848 1527577 1441062 1387274 1371265 1357922 1329652 1306295 1300911 1294544 1271047 1247313
38435A247313J701K5108K2361q80k1902k3658q016N601J998r616j3099j7144l9558
$$ 1247313 1249014 1274122 1296483 1295603 1273701 1250043 1242027 1247628 1249626 1240010 1226911 1209767 1170209
38422A170209o2302m5231N969L3125Q323k2738j1184K3869L3919J4282o060j7788
$$ 1170209 1107907 1062676 1068645 1101770 1110093 1087355 1076171 1100040 1133959 1148241 1142181 1124393
38410A124393k6320j8052J5980L9850J2203m0897m8737M847N7684N7161K3204
$$ 1124393 1098073 1080021 1096001 1135851 1148054 1107157 1058420 1063267 1120951 1178112 1201316
38399A201316J997n50n829j1975L445L7647N3003K2433l2251o0583l9247K924
$$ 1201316 1203313 1202763 1196934 1184959 1188404 1226051 1279054 1301487 1269236 1208653 1169406 1172330
38387A172330K2121J3563J0631K9789M2488J9178k1276l6578k3692j9367l6831
$$ 1172330 1194451 1208014 1218645 1248434 1290922 1310100 1288824 1252246 1228554 1209187 1172356
38376A172356m1384p007L4907L4411p352m1956m1166k4121j1681P939M4823P0199
$$ 1172356 1130972 1123965 1158872 1193283 1185931 1143975 1102809 1078688 1067007 1074946 1119769 1189968
38364A189968N1541P912j3297q916j9972n3786o2322k2178J9054J7662M625K4588
$$ 1189968 1241509 1249421 1236124 1227208 1207236 1153450 1091128 1068950 1088004 1105666 1110291 1134879
38352A134879M7484J7223l8073l5097K8350O0306J8576k3096M360N9433O6686
$$ 1134879 1182363 1199586 1161513 1126416 1154766 1215072 1233648 1210552 1214912 1274345 1341031
38341A341031L5094K4300L5419J7455l4407o1339k5018M5798R8749J04861N9911
$$ 1341031 1376125 1400425 1435844 1453299 1418892 1357553 1332535 1378333 1477082 1581943 1641854
38330A641854j8205q4068r1507m0888J8531L9414J6973j7899l0904j2170J8009
$$ 1641854 1623649 1539581 1448074 1407186 1425717 1465131 1482104 1464205 1433301 1421131 1439140
38319A439140L4762L8623M3762M3248K1676P47J8430N0387K0871p2956j21399
$$ 1439140 1473902 1512525 1556287 1599535 1621211 1621958 1640388 1690775 1711646 1638690 1517291
38308A517291m9483O1539Q4186K5689k701L3042N3722J1943l7741l9417j3039
$$ 1517291 1467808 1529347 1613533 1639222 1636521 1669563 1723285 1735228 1697487 1658070 1645031
38297A645031M901J9084L5130L1006P633N318L2097L7412l532m1108l0895j325
$$ 1645031 1649932 1669016 1704146 1735152 1742785 1748103 1780200 1817612 1814080 1772972 1742077 1740752
38285A740752P186R790K5767J8462l9808q8368m7776N5183J13185Q1747K4038
$$ 1740752 1747938 1757728 1783495 1801957 1762149 1673781 1626005 1681188 1794373 1876120 1900158
38274A900158Q689K8376L7080J8837l775k044L1154P0700P9708N6147M2924O7788
$$ 1900158 1908847 1937223 1974303 1993140 1989365 1987321 2018475 2089175 2168883 2225030 2267954 2335742
38262B335742R5803P7305K3688q419K553K3678K4164R136l882n842O701K3820
$$ 2335742 2431545 2508850 2532538 2524119 2526672 2550350 2574514 2583650 2579768 2573926 2580627 2604447
38250B604447J7291k2639n4747l1393L0693O6908M8402O155k3434k8077J955O6713
$$ 2604447 2621738 2599099 2544352 2512959 2543652 2610560 2658962 2665117 2641683 2613606 2615561 2682274
38238B682274J20019J00347J8804l7008j1917N2704Q9014Q5742O7845M2506R551
$$ 2682274 2802293 2902640 2921444 2884436 2872519 2925223 3014237 3099979 3167824 3210330 3219881
38227C219881j2058j2620j5864l4897l7882j692L6727L8093L7114R1003J70353
$$ 3219881 3207823 3195203 3179339 3144442 3106560 3104868 3141595 3179688 3216802 3307805 3478158
38216C478158J81927J04986K7095K0158N0784N4673M0552N9550J06183J18182
$$ 3478158 3660085 3765071 3792166 3812324 3863108 3917781 3958333 4017883 4124066 4242248
38206D242248P0659J4081M466L5426O1509O3414O2973Q1868J09248J17527J00008
$$ 4242248 4312907 4326988 4331454 4366880 4428389 4491803 4554776 4636644 4745892 4863419 4963427
38195D963427Q1850R0672J21958J42890J32140J04788Q8519Q5012P3737N2765
$$ 4963427 5045277 5135949 5257907 5400797 5532937 5637725 5726244 5811256 5884993 5937758
38185E937758N0816Q4172J21060J15940P3092M6116O8024J10164J26123J11695
$$ 5937758 5988574 6072746 6193806 6309746 6382838 6428954 6496978 6607142 6733265 6844960
38175F844960R7524J01552J19285J48415J87450K14354K04917J75719J69710J89623
$$ 6844960 6942484 7044036 7163321 7311736 7499186 7713540 7918457 8094176 8263886 8453509
38165H453509J89013J50525J28486J74610K54094K84859K44335J89389J75799
$$ 8453509 8642522 8793047 8921533 9096143 9350237 9635096 9879431 10068820 10244619
38156A0244619K02732K37848K54162K34487J78903J20606J00870J17120J28618
$$ 10244619 10447351 10685199 10939361 11173848 11352751 11473357 11574227 11691347 11819965
38147A1819965J22285J31361J71101K00583J79950J29446R6396R6550J26196J94655
$$ 11819965 11942250 12073611 12244712 12445295 12625245 12754691 12851087 12947637 13073833 13268488
38137A3268488K89277L37924K80318J71545J39212K22191L21210L39135L04681
$$ 13268488 13557765 13895689 14176007 14347552 14486764 14708955 15030165 15369300 15673981
38128A5673981L07920L66047M19221M30659M22581M21968M33657M69847N45031
$$ 15673981 15981901 16347948 16767169 17197828 17620409 18042377 18476034 18945881 19490912
38119A9490912O25278O39906N77450N26280N74904O97714P87342P90638P65608
$$ 19490912 20116190 20756096 21333546 21859826 22434730 23132444 23919786 24710424 25476032
38110B5476032P95980Q89391R84476J036528J064468J112426J188965J262575
$$ 25476032 26272012 27161403 28145879 29182407 30246875 31359301 32548266 33810841
38102C3810841J312758J365015J460072J596669J726771J813386J875466J963877
$$ 33810841 35123599 36488614 37948686 39545355 41272126 43085512 44960978 46924855
38094D6924855K106929K294323K501433K707049K892960L053370L213818L423643
$$ 46924855 49031784 51326107 53827540 56534589 59427549 62480919 65694737 69118380
38086F9118380L716082M078749M465347M831905N168058N509048N916932O430169
$$ 69118380 72834462 76913211 81378558 86210463 91378521 96887569 102804501 109234670
38078A09234670P023445P631896Q223035Q829705R502449J0246282J1020429J1786283
$$ 109234670 116258115 123890011 132113046 140942751 150445200 160691482 171711911 183498194
38070A83498194J2533072J3259953J3951427J4571427J5068759J5386692J5472244
$$ 183498194 196031266 209291219 223242646 237814073 252882832 268269524 283741768
38063B83741768J5269474J4700130J3674335J2147979J0162095P801630N127361
$$ 283741768 299011242 313711372 327385707 339533686 349695781 357497411 362624772
38056C62624772K186708r09701l970843o808230r306240j1396857j3016846j4142341
$$ 362624772 364811480 363901779 359930936 353122706 343816466 332419609 319402763 305260422
38048C05260422j4839817j5219278j5331850j5160873j4720314j4106970j3426280
$$ 305260422 290420605 275201327 259869477 244708604 229988290 215881320 202455040
38041B02455040j2709391j1945118j1162653j0425746r750552r086533q399853
$$ 202455040 189745649 177800531 166637878 156212132 146461580 137375047 128975194
38034A28975194p734713p158315o669896o205320n725415n259559m853060m507967
$$ 128975194 121240481 114082166 107412270 101206950 95481535 90221976 85368916 80860949
38026H0860949m199700l924301l691639l482631l255842l005440k777246k606623
$$ 80860949 76661249 72736948 69045309 65562678 62306836 59301396 56524150 53917527
38018E3917527k466029k301061k103244j918638j789941j714727j659785j594645
$$ 53917527 51451498 49150437 47047193 45128555 43338614 41623887 39964102 38369457
38010C8369457j507935j407731j311086j225541j144698j068764j013823r83070
$$ 38369457 36861522 35453791 34142705 32917164 31772466 30703702 29689879 28706809
38002B8706809r47348q84411q22371q02813q07991p76206o96069o29722o19482
$$ 28706809 27759461 26875050 26052679 25249866 24441875 23665669 22969600 22339878 21720396
37993B1720396o25499n94825n45423n27409n32797n06520m34949l64026l27995
$$ 21720396 21094897 20500072 19954649 19427240 18894443 18387923 17952974 17588948 17260953
37984A7260953l12583k98146k92499l04014l18915l22713l14870k89952k36069
$$ 17260953 16948370 16650224 16357725 16053711 15734796 15412083 15097213 14807261 14571192
37975A4571192j67408j27154j37320j70027j86817j82551j72150j59540j44000
$$ 14571192 14403784 14276630 14139310 13969283 13782466 13599915 13427765 13268225 13124225
37966A3124225j36538j43791j50915j44708j40204j59700j96147k21702k24742
$$ 13124225 12987687 12843896 12692981 12548273 12408069 12248369 12052222 11830520 11605778
37957A1605778k15966k05610j98143k03837k31082k68706k97195l14645l28218
$$ 11605778 11389812 11184202 10986059 10782222 10551140 10282434 9985239 9670594 9342376
37948I342376l22566k68538j74355j00358r8987j52482j93244j83130j50803j43569
$$ 9342376 9019810 8751272 8576917 8476559 8377572 8225090 8031846 7848716 7697913 7554344
37938G554344j61526j61756j25243r2490j13358j75493k11706j80879j14689p1680
$$ 7554344 7392818 7231062 7105819 7013329 6899971 6724478 6512772 6331893 6217204 6145524
37928F145524o8731p9899q5337q9337r3341q5050o7749p4058j23516j77338j68773
$$ 6145524 6076793 5996894 5911557 5822220 5728879 5643829 5576080 5502022 5378506 5201168 5032395
37917E032395q7977q890o235o2392r2669n9510j6387k2545o1208q0279p6085q1153
$$ 5032395 4944418 4935528 4929293 4866901 4774232 4714722 4698335 4675790 4614582 4534303 4458218 4377065
37905D377065r1554p3078l6093l4940p8181j04418p4523k8610j5159j9051o990
$$ 4377065 4285511 4212433 4176340 4141400 4063219 3958801 3884278 3855668 3840509 3821458 3814468
37894C814468M389j6777n0847n5057l3869k3661k7974k6425l0330o5328j06757
$$ 3814468 3818857 3802080 3751233 3696176 3662307 3638646 3610672 3584247 3553917 3488589 3381832
37883C381832r7309l2260L0618N0866L9861J1545l9680r5813j07762n8765N953
$$ 3381832 3284523 3252263 3282881 3333747 3373608 3385153 3345473 3249660 3141898 3083133 3089086
37872C089086L4577J9215k0058o0415p4031m5273l698L852j6507j5080J2348J0305
$$ 3089086 3123663 3142878 3122820 3062405 2988374 2943101 2939403 2943255 2926748 2911668 2924016 2934321
37860B934321l9446p8678o8427n2236o9633p4781j5449O0362O4696N098k9781
$$ 2934321 2894875 2816197 2747770 2695534 2625901 2551120 2535671 2596033 2660729 2665827 2636046
37849B636046p153J4805o567l7605l6429j6968j3863k9571m5722n4195n3480l9600
$$ 2636046 2628893 2643698 2637131 2599526 2563097 2546129 2532266 2502695 2456973 2402778 2349298 2309698
37837B309698j8076m508l199m139l875n960m95K7093O1705O2437J2688n4055q7759
$$ 2309698 2291622 2287114 2283915 2279776 2275901 2269941 2269446 2296539 2358244 2420681 2433369 2379314 2291555
37824B291555o7841j5033K8971L7307K4562K5453L7907J9601l4167n4034Q452
$$ 2291555 2223714 2208681 2237652 2274959 2299521 2324974 2362881 2382482 2348315 2294281 2302733
37813B302733Q6802P7367p534n3699j4420L0834J4272j8469J449N2427O9245M6256
$$ 2302733 2389535 2466902 2459368 2405669 2391249 2422083 2436355 2417886 2419335 2471762 2541007 2587263
37801B587263K1095j117l2927m7975j6732K3461J2322l2316l7965M49P791m5488
$$ 2587263 2608358 2607241 2574314 2526339 2509607 2533068 2545390 2513074 2475109 2475558 2483349 2437861
37789B437861q8677o1020o330j299l9878n4997k8394j0190l0264m9508k1152L6695
$$ 2437861 2349184 2288164 2281834 2280535 2240657 2185660 2157266 2147076 2116812 2067304 2046152 2082847
37777B082847O0205J8379n0626q1964n0553Q384L9004J9357k3351m6288l4084
$$ 2082847 2143052 2161431 2110805 2028841 1978288 1986672 2025676 2045033 2021682 1975394 1941310
37766A941310q537n43j7017l6588l5617j3474J0549J9682J1857n489k0913k2035
$$ 1941310 1932773 1932230 1915213 1878625 1843008 1829534 1840083 1859765 1871622 1866133 1845220 1823185
37754A823185q509j549k0840m8865m3002O572N8252P5564P2313P2353N5253r063
$$ 1823185 1814676 1813127 1792287 1743422 1700420 1706992 1765244 1840808 1913121 1985474 2040727 2031664
37742B031664q6753j00819l4566L7424M3340l364m2053m6169l0232p513J3658
$$ 2031664 1944911 1844092 1809526 1846950 1890290 1886926 1844873 1798704 1768472 1760959 1774617
37731A774617R555l4237q1743p5073j0436N1919O3197L6175P039j5215l6227m4626
$$ 1774617 1784172 1749935 1668192 1593119 1582683 1634602 1697799 1733974 1741013 1725798 1689571 1644945
37719A644945k8404m811K155M431L3082Q1101J01721P2707K7211L556m092j9361
$$ 1644945 1616541 1611730 1613885 1618316 1651398 1732499 1834220 1906927 1934138 1937694 1933602 1914241
37707A914241l3928j9753K0182M8086L7765k138m9122q1610p3450j1923O5372
$$ 1914241 1880313 1860560 1880742 1928828 1966593 1964455 1915333 1833723 1760273 1748350 1813722
37696A813722Q7578L0495m5805o6927l0389R517K2758K6199L3351L1356J8231
$$ 1813722 1901300 1931795 1885990 1819063 1788674 1798191 1820949 1847148 1880499 1911855 1930086
37685A930086J8227L7084L9114O22m2544l9691J152K8391K7673L8224P9950J12213
$$ 1930086 1948313 1985397 2024511 2025133 1982589 1942898 1944050 1972441 2000114 2038338 2118288 2230501
37673B230501R2824M2935J5536K0019J9814j778j7003m751J0550m583l8557m5518
$$ 2230501 2323325 2366260 2381796 2401815 2421629 2419851 2402848 2398097 2408647 2404064 2365507 2319989
37661B319989n201N0664P6002N9848K9672J2472N636p212k0947j0703K3944M0855
$$ 2319989 2314788 2365452 2441454 2501302 2530974 2543446 2549082 2541870 2520923 2510220 2534164 2575019
37649B575019P800m1259m0412J7900O9496O8456M5403M5808N2823K3111k6167
$$ 2575019 2582819 2541560 2501148 2519048 2588544 2657000 2702403 2748211 2801034 2824145 2797978
37638B797978l0697K1225O4321N1671K2085L6593Q5259J04815P3745M1733N7404
$$ 2797978 2767281 2788506 2852827 2904498 2926583 2963176 3048435 3153250 3226995 3268728 3326132
37627C326132J04230J32366J33711J49240J96289K24648J80633R8959P7581J49331
$$ 3326132 3430362 3562728 3696439 3845679 4041968 4266616 4447249 4546208 4623789 4773120
37617D773120K34595K58242K58971L15514M03436M22093L62068L41042M33074
$$ 4773120 5007715 5265957 5524928 5840442 6243878 6665971 7028039 7369081 7802155
37608G802155N49743N58074M55156L47594K95158K56312J75781N1982q7498k18879
$$ 7802155 8351898 8909972 9365128 9712722 10007880 10264192 10439973 10491955 10404457 10185578
37598A0185578l20779l86112m41750n13560n69799n50097m61556l91807l98845
$$ 10185578 9864799 9478687 9036937 8523377 7953578 7403481 6941925 6550118 6151273
37589F151273m33764m13639l39203k87997k98519l14164k65370j73843j30925
$$ 6151273 5717509 5303870 4964667 4676670 4378151 4063987 3798617 3624774 3493849
37580C493849j72650k22003j88171r3515m6494r2100j52879j41965p6081l2341
$$ 3493849 3321199 3099196 2911025 2817510 2771016 2678916 2526037 2384072 2307991 2275650
37570B275650l8599o1493p0965n9394k1773K4496K3287n1480j30210j25226o1452
$$ 2275650 2237051 2175558 2104593 2045199 2023426 2047922 2071209 2019729 1889519 1764293 1702841
37559A702841m3746r3385j14580m9243L1729M2876O814o493J862j5590m9808m3256
$$ 1702841 1659095 1565710 1451130 1401887 1433616 1476492 1483306 1476813 1478675 1463085 1413277 1370021
37547A370021J0090M6226K1208l2659n5920l3449r24N128o571Q653O6578J13009
$$ 1370021 1380111 1426337 1447545 1414886 1358966 1325517 1324593 1329721 1323150 1331803 1398381 1511390
37535A511390Q3953J086m8053l4314k1980m8857m9944L2135J22922R6592m4663
$$ 1511390 1595343 1596429 1548376 1514062 1492082 1443225 1393281 1425416 1548338 1644930 1600267
37524A600267j63138j57933o7625J0612L5375K8452J9605J8681J9849J3848M572
$$ 1600267 1437129 1279196 1211571 1222183 1257558 1286010 1305615 1324296 1344145 1357993 1362565
37513A362565J0259L4429N0792L9182J7190J0141J4477K0810L9032O0406L7413
$$ 1362565 1372824 1407253 1458045 1497227 1514417 1524558 1539035 1559845 1598877 1659283 1696696
37502A696696l9390q6021k6255Q0948J07794L6831k7180k4565r425k7426l4671
$$ 1696696 1657306 1571285 1545030 1625978 1733772 1770603 1743423 1718858 1709433 1682007 1647336
37491A647336J0768O7275Q0627O4317N1551L3537L091n173J9708K0985l7635r7560
$$ 1647336 1658104 1725379 1806006 1870323 1921874 1955411 1958502 1953329 1973037 1994022 1956387 1858827
37479A858827r1633n1936n2287q8567j00601p7160n3336l1612Q472M4561M0841
$$ 1858827 1767194 1715258 1662971 1574404 1473803 1396643 1343307 1311695 1320167 1364728 1405569
37468A405569K2816L5568M8154k061q3110r6465l4528M029k3884m3820k117M5135
$$ 1405569 1428385 1463953 1512107 1510046 1426936 1330471 1295943 1299972 1276088 1232268 1230151 1275286
37456A275286L8698J1441P450l508m9705p5623k9488L1998K5215k5400l6121n414
$$ 1275286 1313984 1325425 1332875 1329367 1279662 1204039 1174551 1206549 1231764 1206364 1170243 1164829
37444A164829L787o293K3043P7622P4534J0391j4677M3356J00443Q3595L8294
$$ 1164829 1168616 1162323 1185366 1262988 1337522 1347913 1333236 1376592 1477035 1560630 1598924
37433A598924K9073K7662j1750m3397o1Q1049J10395Q9251R0159J14798R0724
$$ 1598924 1627997 1655659 1643909 1600512 1600451 1681500 1791895 1881146 1971305 2086103 2176827
37422B176827J3723k7671j17J6167k9978o5012j7185M7810K0612p7217j24148
$$ 2176827 2190550 2162879 2162762 2178929 2148951 2083939 2066754 2114564 2135176 2057959 1933811
37411A933811q1779l8876o6746j26630j48828j27232r5777o7447l8269j3528M304
$$ 1933811 1852032 1813156 1746410 1619780 1470952 1343720 1247943 1180496 1142227 1128699 1133003
37400A133003K3799L5969J0828n1464r9309r0124m4791j2653q747j6712k8661
$$ 1133003 1156802 1192771 1203599 1152135 1052826 962702 917911 905258 896511 879799 851138
37389H51138m5490n4642m2987k1670j0212q399r757k4329n4506o4963j9267N8229
$$ 851138 805648 751006 708019 686349 676137 667738 657981 633652 579146 514183 494916 553145
37377E53145R7970O7123K696m2404n4684n2219n0010m8254l7362l877N3581J05939
$$ 553145 651115 718238 720934 678530 623846 571627 521617 473363 436001 432124 485705 591644
37365E91644J06338L5044p0939j39507j20896l3996M3187M5700q255l7579L293
$$ 591644 697982 733026 662087 522580 401684 367688 410875 456575 448320 410741 414034
37354D14034P3001J05092Q6252M4620k410m3865n0850j4649J2720j8021o3813
$$ 414034 487035 592127 678379 722999 720589 676724 625874 611225 623945 605924 542111
37343E42111m0451L8325O2535j0388q2925n6266L4992R0854Q5494O2030L4744
$$ 542111 501660 539985 602520 592132 509207 452941 487933 578787 664281 726311 761055
37332G61055j4608o4350o4119k0619Q43k7733o0633n2220j3031K4327M4792L6973
$$ 761055 746447 682097 617978 597359 598202 570469 509836 457616 444585 468912 513704 550677
37320E50677j1206p5543r5531m3779L3506P1880N7467J8017k2328m8886m5799
$$ 550677 539471 463928 368397 324618 358124 430004 487471 505488 483160 434274 388475
37309C88475j6217O250m14j2330j636J0507j0543m1029k2169M3717Q3170N6773
$$ 388475 372258 378508 378094 365764 364128 374635 364092 323063 300894 344611 427781 484554
37297D84554J4482J0049J5096k4128q3366q7917l1149J1838J70j7193N177K7490
$$ 484554 499036 509085 524181 500053 416687 328770 297621 309459 309629 292436 297613 325103
37285C25103n646o1005n5999J6096P2855N7979N503k7070l0964k2403K457M4878
$$ 325103 319457 258452 202453 218549 291404 349383 354886 327816 296852 274449 276906 321784
37273C21784O8091L2911m2088r3151q1846k8554J9708L3889J9781O773J5272K7964
$$ 321784 389875 422786 380698 287547 205701 177147 196855 230744 250525 257298 272570 300534
37261C00534R930l3097m5267O158P5061Q9837M3501j0133l6893n1750p0010p7642
$$ 300534 310464 277367 232100 238258 313319 403156 446657 436524 399631 347881 277871 200229
37249B00229o2705l8077j6948M927K9577M6390N1448M9808L1653j8301p4880p7962
$$ 200229 137524 99447 82499 87426 117003 163393 214841 264649 296302 278001 203121 125159
37237A25159j2310N3149M4392k1852o2035l3045K5888N7327N2210L9340L6361
$$ 125159 112849 165998 210390 188538 126503 93458 119346 176673 228883 268223 304584
37226C04584L3980K1023P009J1008L0070L1321r596o6765q4100m4225N564J0206
$$ 304584 338564 359587 366596 377604 407674 438995 429399 362634 278534 234309 239873 250079
37214B50079l0275p1963q1585n7527j3148L3437O1661O5749O4477P3542P7738
$$ 250079 219804 147841 66256 8729 -4419 29018 90679 156428 220905 294447 372185
37203C72185N3660R390k5406l9745m1871k9408L972L6604L5476P912n813J922
$$ 372185 425845 435235 409829 370084 328213 298805 302777 339381 374857 382769 376956 378878
37191C78878m353l3009l7794P877N7066N4647J8363J979O671r076m6902o2334
$$ 378878 374525 341516 303722 311599 368665 423312 441675 443654 450325 441249 394347 332013
37179C32013m1278j8720r920J3787N6620O7343J7408l9613l8359M734K4622Q586
$$ 332013 290735 272015 262095 275882 332502 399845 417253 377640 339281 344015 368637 377223
37167C77223K39J3288R280k7946n6106l8873L39K0364K0402K0483J5076j0137
$$ 377223 377462 390750 400030 372084 315978 277105 277444 297808 318210 338693 353769 343632
37155C43632l3379j5350L8864P5316N5693k392n5688p8785o8981l5122J736J6505
$$ 343632 310253 294903 333767 409083 464776 462384 406696 327911 258930 223808 225544 242049
37143B42049P884N425L1339O5328O6919K8961j0197j1280K2658N3616N0004J2864
$$ 242049 249933 255358 286697 352025 418944 447905 437708 426428 449086 502702 552706 565570
37131E65570l3685o6289p3007n0910q894K5715K2311j5592l9883p939N9646R6532
$$ 565570 531885 465596 392589 341679 332785 358500 380811 365219 325336 317397 377043 473575
37119D73575O9438J2135k8632m7852n8554m6374N552N9989N0342k5100q1072m6234
$$ 473575 543013 555148 526516 478664 420110 373736 379288 439277 489619 464519 383447 337213
37107C37213M6754J05707Q9472L5526p762l0771m2194m0815k6588j5032k1509
$$ 337213 383967 489674 579146 614672 606910 576139 533945 493130 466542 451510 430001
37096D30001m3338o6064p3466m8749J0445O9373P5995K1353m3298o9110o2528
$$ 430001 386663 320599 247133 198384 208829 278202 354197 375550 332252 263142 200614
37085B00614m9077j7203N2177J17522J02520J937r3304j04461n5987k3857k8504
$$ 200614 151537 134334 186511 304033 406553 408490 315186 210725 154738 130881 102377
37074A02377k6116J0519N2231N9331L1570p93j5164j3935j3574k2474k7588r126
$$ 102377 76261 86780 139011 198342 229912 229119 213955 200020 186446 163972 136384 127258
37062A27258K6615M4497K4774o287j1966L812J0262K622K658R379n553m1632n2420
$$ 127258 153873 198370 223144 216857 204891 208703 218965 221587 224245 233624 228071 186439 134019
37049A34019j0741M2979N0882J2834k3562l1917k7666k5856j7300N625K8949L5867
$$ 134019 123278 166257 217139 229973 206411 174494 146828 120972 103672 109297 138246 174113
37037A74113K6737J0752o656j9693k0083q248M382J0244J0669K350k2593n2706
$$ 174113 200850 211602 204946 185253 165170 156922 161304 171548 182217 184567 161974 109268
37025A09268n3929j0901M2237N7991L6533K2652M0402O1467N1850K2387P116R041
$$ 109268 55339 44438 86675 144666 181199 203851 244253 305720 357570 379957 387073 396114
37013C96114Q52k4076l6528j8476M198k47j7595o249L5577N5825J7700m2453n6490
$$ 396114 396966 372890 336362 317886 322084 321837 304242 297993 333570 389395 407095 364642 308152
37000C08152j4920K0346M172k6626r311M6490O8054K8771q846J2120N5509N1188
$$ 308152 293232 313578 317750 291124 281813 328303 396357 425128 416282 428402 483911 535099
36988E35099P136p174K1946K9705j6563n8244l7283J2458K0819j4241l9730l7384
$$ 535099 542235 535061 557007 586712 570149 511905 474622 487080 507899 493658 453928 416544
36976D16544l4855l9662k7392O90O794k2148m9964m6620k9270k8045m1885m8367
$$ 416544 381689 342027 314635 315325 322119 299971 250007 203387 174117 146072 104187 55820
36964E5820l5135p383J8549K4354J1948J3115M9373Q8140P6282J5513l7893m8738
$$ 55820 20685 13302 31851 56205 68153 81268 130641 218781 295063 310576 272683 223945
36952B23945l0395L431N1653P8067K5922q1869j27473m3486P9831J02915J5202
$$ 223945 193550 196981 248634 326701 352623 270754 143281 99795 179626 282541 297743
36941B97743o9653p3505k8384N645K0130L4443M8684N0768M0166K5269J5136J7492
$$ 297743 228090 154585 126201 131846 151976 186419 235103 285871 326037 351306 366442 383934
36929C83934K5537J3662k7895o5587o3432l8508l2433l7765q754N0992P2619J7932
$$ 383934 409471 423133 395238 329651 266219 227711 195278 157513 148759 199751 272370 290302
36917B90302n8131p4987k2999L9136N8060K7700k1907m9671l1521J3270L5167
$$ 290302 232171 157184 134185 173321 231381 259081 237174 187503 155982 169252 204419
36906B04419J1475k3583k3863R125L4747L0832J5675J1990J2295o659m4409o7548
$$ 204419 215894 192311 168448 177573 212320 243152 258827 270817 283112 276453 232044 164496
36894A64496m6348P319N1762O3381N4389L9977J5897j4682k2634N336K9049L503
$$ 164496 118148 125467 177229 240610 294999 334976 350873 336191 313557 318893 347942 351445
36882C51445m5571m4787K4351R3142R0999K4407m7724q3519q0072n2738j9118
$$ 351445 305874 261087 285438 378580 469579 493986 446262 362743 282671 229933 210815
36871B10815P803K5426L3894K5167j545k0069m647K4904K4340n075j3662J6427
$$ 210815 218618 244044 277938 303105 301560 281491 276844 301748 326088 321013 307351 323778
36859C23778L7725J1254l1304l7197q752J3729J9337K9193M4591L9513P832j7905
$$ 323778 361503 372757 341453 304256 295504 309233 328570 357763 402354 441867 449699 431794
36847D31794p032K9839N3423M0458Q606o330L490R118p359j8871L608L5685L4068
$$ 431794 424762 454601 508024 548482 557088 550758 554248 563366 556007 537136 540744 576429 610497
36834F10497J2924K3723N9427N3719l796l0233K8408J06736J11576M8923p010
$$ 610497 623421 647144 706571 760290 756494 726261 754669 861405 972981 1021904 1014894
36823A014894k5529k5987p118M7949J09794J20712P4602K0172j0966k4109j8935
$$ 1014894 989365 963378 956260 1004209 1114003 1234715 1309317 1329489 1318523 1294414 1275479
36812A275479J1291M1586L7038J2623J2424L0639J8060k8155n0055j9615K1378
$$ 1275479 1286770 1328356 1365394 1378017 1390441 1421080 1439140 1410985 1360930 1341315 1362693
36801A362693L3932L1172K6463n563p3240j22917j01000l0883J7469J5142p609
$$ 1362693 1396625 1427797 1454260 1448697 1375457 1252540 1151540 1120657 1138126 1153268 1145659
36790A145659j7745j6851k1036k7817j5570K3452N5824L4637l2258p0804l1009
$$ 1145659 1127914 1111063 1090027 1062210 1046640 1070092 1125916 1160553 1128295 1057491 1026482
36779A026482L7856N0858M317l3642l5320l7321n0128l4043P936L544p1340j28760
$$ 1026482 1064338 1115196 1119513 1085871 1050551 1013230 963102 929059 936995 940539 869199 740439
36767G40439r1903j6867o925n2943n8287k911K1426m3322j27858j31009n2095
$$ 740439 648536 631669 624744 571801 513514 510603 532029 488707 360849 229840 177745
36756A77745K3602M1701K8195K5140K2970j5021p9030j04917n6619J4092K7654
$$ 177745 201347 243048 271243 296383 319353 304332 225302 120385 63766 77858 105512
36745A05512j7298m4914j1743L5150L1161j7590n2805m3156j0344J0266R203Q488
$$ 105512 88214 43300 31557 66707 97868 80278 27473 -15683 -26027 -15761 -6558 1930
36733A930L5952Q2631R3348L2235m8880o0342M32L8675J042m6687k7927K5178
$$ 1930 37882 120513 213861 246096 197216 136874 137306 175981 177023 130336 102409 127587
36721A27587L0500j3833l8587j6331J3932K4553K8963L3323K2308j45q943k294
$$ 127587 158087 144254 105667 89336 103268 127821 156784 190107 212415 212270 203327 201033
36709B01033j613o876O93J3213M977j2487L73L8733M5513n668o7429q2159n1622
$$ 201033 199420 192544 193237 206450 211427 198940 199313 238046 283559 277891 210462 128303 76681
36696G6681k0596j9290m0214n1061k0812M7345J07423J16435Q3691M9187K6119
$$ 76681 56085 36795 -3419 -54480 -75292 -27947 79476 195911 279602 328789 354908
36685C54908J682j8146j3873Q67j0146m3584n4670k6857L462L711j6316l3013
$$ 354908 356590 338444 324571 325438 315292 271708 217038 190181 193643 197354 181038 148025
36673A48025l4519j1285L4244O4152M2160J68R839P6005J20786R3623L3554m578
$$ 148025 113506 102221 136465 200617 242777 242945 252784 328789 449575 543198 576752 572174
36661E72174k0791l1508k3813O362K4703J3170L977J5146P598m1592p9222n2690
$$ 572174 551383 519875 496062 502424 527127 540297 544274 559420 567018 525426 446204 393514
36649C93514K036J7971k12n215m10k0693m6808k7819K1726L2626j1147n4441o3964
$$ 393514 395550 413521 413309 408094 407684 386991 340183 312364 334090 366716 355569 301128 237164
36636B37164o1149n3911j6949L8999N4761J1050l6768m4070l3300k9565o922N0226
$$ 237164 176015 122104 105155 144154 198915 209965 173197 129127 95827 66262 59340 109566
36624A09566R0550O4886J0778j78K7071K3755k8445o5142l3644L5561P5995O5162
$$ 109566 200116 265002 275780 275602 302673 326428 297983 232841 199197 234758 310753 375915
36612C75915K9480l172k1867j5424K6368Q3526J03510N4279k6555o3498l0964
$$ 375915 405395 402223 380356 364932 391300 474826 578336 632615 606060 542562 511598
36601E11598J7290K1482j1192l5713m2210n1758n7169l1409L600j2219p4446r4381
$$ 511598 528888 550370 539178 503465 461255 409497 352328 320919 324519 312300 237854 143473
36589A43473k8479L8879J3434n9608n9286K3070O9887K2872k9011K736O6131N8696
$$ 143473 114994 153873 167307 107699 48413 71483 141370 164242 135231 137967 204098 262794
36577B62794r301m1842j3410O716j8038m0714k7247j2176k0214j4045K7356N0726
$$ 262794 253493 211651 198241 204957 186919 146205 118958 106782 86568 72523 99879 150605
36565A50605J4456k9364j5987K0755Q158l4671l0583J3438J5165k9912k9062M3416
$$ 150605 165061 135697 119710 140465 148623 113952 83369 96807 111972 82060 52998 96414
36553I6414Q5062K8968m1774k8954K3657J3779m6199n7642j32M8243M1595J2627
$$ 96414 181476 210444 168670 139716 163373 177152 130953 73311 73179 121422 163017 175644
36541A75644j0391l6835n7438m3587j3430j6067m1653l3831j50j0352o2515n9918
$$ 175644 165253 128418 70980 27393 13963 -2104 -43757 -77588 -77738 -88090 -150605 -210523
36529b10523L2939J16695J05233N0435L5592L3229k2840r0549p2662J4037N0154
$$ -210523 -177584 -60889 44344 94779 130371 163600 140760 50211 -22451 -8414 41740
36518D1740n053o0519m5168q494k1698n9785m6836K8593J03320J23046R1238M4530
$$ 41740 36687 -23832 -69000 -77494 -99192 -158977 -205813 -177220 -73900 49146 140384 184914
36506A84914J1181o143k0248l2812k4574J2499M4709L0573j7798m5083k8480j643
$$ 184914 196095 189952 169704 136892 112318 124817 169526 200099 182301 137218 108738 107095
36494A07095P318J5339L8509N0447K4001j7185l1145k1112k3364m3570n0244l1818
$$ 107095 114413 129752 168261 218708 242709 225524 194379 173267 149903 106333 56089 24271
36482B4271j7879l0798m8787l7271K907L8559M5247K9179J2144O317M619q164
$$ 24271 6392 -24406 -73193 -110464 -107557 -68998 -23751 5428 17572 23889 28508 20344
36470B0344l4224n4335m7379j7144J1704K5732L4484M3026L4895M086j4274J7070
$$ 20344 -13880 -68215 -115594 -132738 -121034 -95302 -60818 -17792 17103 21189 6915 23985
36458B3985P0893P3418N356n9631n2926q761r283n6644p2751k7313J3397m380
$$ 23985 94878 168296 173652 114021 61095 52334 43051 -13593 -86344 -113657 -100260 -104640
36446a04640l6813k1166J7767J3502k5036k5719K7481O9149N6658K5084J4074
$$ -104640 -141453 -162619 -144852 -131350 -156386 -182105 -154624 -85475 -28817 -3733 10341
36435A0341Q298j1457j7365J3929M3460K1490l1693n4232l4511j6390j9219j1889
$$ 10341 18639 7182 -10183 3746 47206 68696 37003 -17229 -51740 -68130 -87349 -99238
36423i9238K3270N2461L9905o86l0003l3914k6054j7537q570j260O38K674J4485
$$ -99238 -75968 -23507 16398 15712 -14291 -48205 -74259 -91796 -100366 -101626 -100988 -98314 -83829
36410h3829L1900L5845J4854j6369k8735j2220R236O742j3831k0474o343m560
$$ -83829 -51929 -16084 -1230 -17599 -46334 -58554 -49318 -42576 -56407 -76881 -83224 -87784
36398h7784l4018n9065l7925Q326K1348o348k0901P278M0452L9190K2246K5295
$$ -87784 -121802 -180867 -218792 -210466 -189118 -195466 -216367 -209089 -168637 -129447 -107201 -81906
36386h1906M0686M2399L8254M6777M7531J1012l8726n2341l6392l8628n3650k2935
$$ -81906 -41220 1179 39433 86210 133741 144753 106027 53686 17294 -21334 -74984 -97919
36374i7919N2205Q2804K4069m0285j4642O4834Q7258L1025k1964k1644l609Q21
$$ -97919 -45714 37090 61159 20874 6232 71066 158324 189349 167385 145741 142132 142953
36362A42953J5328M6960M4780j8608q4391q3315l0849Q428J6530K4363M3286N3601
$$ 142953 158281 205241 250021 231413 147022 63707 32858 41286 57816 82179 125465 179066
36350A79066M9981M6058L9193J5983j3473l0217m6377q2127j10546q2824j1098
$$ 179066 229047 275105 314298 330281 316808 286591 240214 158087 47541 -35283 -46381
36339d6381L3956K1643j638M599J5673J835q578K0509N9992N4183R639j4596L718
$$ -46381 -12425 9218 7580 12179 27852 29687 21109 41618 101610 155793 165432 150836 154554
36326A54554K6141J9437l960j7649j0734K0030O4281P7705J8419p7820j10791
$$ 154554 180695 200132 196172 178523 167789 187819 252100 329805 348224 270404 159613
36315A59613l8374N8557P8454K7841j0202p277j1495m0435l9456J7361N8123J0448
$$ 159613 121239 179796 258250 286091 275889 268612 257117 216682 177226 194587 252710 263158
36303B63158p7504r2176j4722N4265L9177j7136l6707j8524j3839l3226m1782
$$ 263158 185654 93478 78756 133021 172198 155062 118355 99831 85992 52766 10984
36292A0984k6847r994L041K8770N7653N0727J49m8182n1230j5824K5437N2268
$$ 10984 -15863 -25857 -22816 5954 63607 114334 114483 66301 15071 -753 24684 76952
36280G6952N5263L1137M42j363K7421M5620L1407J7935L4324M6292L277p5839
$$ 76952 132215 163352 163794 162431 189852 235472 266879 284814 319138 365430 368707 292868
36268B92868j15962q1210j3627K7205K7260J2977J0862K2799K7163K947l9011
$$ 292868 176906 95696 82069 109274 136534 149511 160373 183172 210335 213282 174271
36257A74271o1062m7411k5355j6505K748N3591R5734P2089Q5m1951k0947J6173
$$ 174271 113209 65798 40443 23938 26686 80277 176011 248100 248185 206234 185287 201460
36245B01460K2336P781O01K518O575J3015P258l1593q1506q9214n3223l4699n4369
$$ 201460 223796 231577 232178 234696 241271 254286 261544 229951 148445 59231 6008 -28691 -83060
36232h3060m8490K0246P7039L8668m6977n7883K9133J14092J18195O7213K1319
$$ -83060 -131550 -111304 -34265 4403 -42574 -100457 -71324 42768 160963 228176 249495
36221B49495l32l814M430Q77m0464r2487q7935j5388M9071L9083j8209n1722m0820
$$ 249495 249163 245349 249779 250656 210192 117705 29770 14382 63453 102536 84327 32605 -8215
36208h215k0083j7122k3107j1336L4530R3024J02296K5240p4187p9679K2729J03637
$$ -8215 -28298 -45420 -68527 -79863 -45333 47691 149987 175227 101040 21361 44090 147727
36196A47727N6714n3633q6909k3625K9861J6619M33L8577Q0567N2618k0931n2156
$$ 147727 204441 150808 63899 40274 70135 86754 87187 125764 206331 258949 238018 185862
36184A85862j5842K4883J4772k5194l9397j2636J8777J7461j1710l0122j0318
$$ 185862 170020 194903 209675 184481 145084 132448 151225 168686 156976 126854 116536
36173A16536L2844N7709L9451o860m4760n0587k8817j579J2086R545J988J387
$$ 116536 149380 207089 246540 239680 194920 144333 115516 113937 126023 135568 137556 138943
36161A38943J1188K6581L8388L9291L3945L8708N8011O5817L2739k7357o5021
$$ 138943 150131 176712 215100 254391 288336 327044 385055 450872 483611 456254 391233
36150C91233n7158l1825j9024j2325j764n843l3076m5449j0264L5634L0590j6795
$$ 391233 334075 302250 283226 270901 269137 263294 230218 184769 174505 210139 240729 223934
36138B23934l9326j4062J2757J2042J4561M2095N8423K8606k1000m4376l9227
$$ 223934 184608 170546 183303 195345 209906 252001 310424 339030 318030 273654 234427
36127B34427k8570j5174J875j526l6830o2315l3710K2067L8543O119j8421J264
$$ 234427 205857 190683 192558 191032 154202 91887 58177 80244 118787 124906 106485 107749
36115A07749L8236N5853N4480M5465K0675k3729o1233o2130l3125q162o376j2989
$$ 107749 145985 201838 256318 301783 322458 298729 237496 175366 142241 134079 127703 114714
36103A14714J97L9153P0573M9876k0032p1566m3280L6973P6626L3584l0959l4753
$$ 114714 114911 154064 224637 274513 254481 182915 139635 176608 253234 286818 255859 221106
36091B21106K3111P2353O2399Q784m1310n6490l4249L930K1953m767n9597r3662
$$ 221106 244217 316570 378969 387753 346443 289953 255704 259634 281587 276820 217223 123561
36079A23561p6373l0020m094j9419m7164m2982M752O1833P8482L2904m7656j04435
$$ 123561 47188 17168 13074 -6345 -53509 -96491 -91739 -29906 48576 81480 33824 -70611
36067g0611r2323j8341O2791R7170P7883M0892J9961J6188J1426k928j8740k3671
$$ -70611 -162934 -181275 -118484 -21314 56569 97461 117422 133610 145036 142108 123368 99697
36055I9697j2615P420J8343M967k5469m6372m2009k5195j5665j2038K00K0672
$$ 99697 87082 94502 112845 117812 92343 45971 3962 -21233 -36898 -48936 -48736 -28064
36043b8064L2012K4552Q267j774j198M089O130K337n7R997L1291M6468M2158K5862
$$ -28064 3948 28500 36767 34993 33795 37884 44014 46351 46294 56291 87582 134050 176208 202070
36029B02070J2334J467j4802k9072k2414N176K6272J8327o261j5298J322J8561
$$ 202070 214404 215871 201069 171997 149583 154759 181031 199358 193097 177799 179121 197682
36017A97682J0935j1171j6646j799K865j5159k1885J0260M7281L7039p499k5774
$$ 197682 208617 197446 180800 179001 181866 166707 144822 155082 202363 239402 231903 206129
36005B06129p634o865m2855o0675k2833K7281M0647L7298M8398M7264J0896r611
$$ 206129 198495 191630 148775 88100 65267 92548 133195 170493 218891 266155 277051 267440
35993B67440K9615O5284J6906o1203m4932N8032J10715O2613J9023N2462Q4708
$$ 267440 297055 362339 379245 318042 273110 331142 441857 504470 523493 575955 660663
35982F60663L2079n1223o9209k9432M221K3594M3545L2197k1152l7764L5004J02161
$$ 660663 692742 641519 572310 542878 547099 570693 614238 646435 625283 587519 622523 724684
35970G24684M6950p0151q7672O255O1782J2986l0771J4660P0750M2414k2803k5415
$$ 724684 771634 701483 613811 620066 681848 694834 664063 678723 749473 791887 769084 743669
35958G43669K4790M4488J3585k2842m6609o8185o7703k2541K6044J7499k7914
$$ 743669 768459 812947 826532 803690 757081 688896 621193 598652 624696 642195 614281
35947F14281l4162Q775K9703o662m6084l6849p601r364l0221k2628J1047J6435
$$ 614281 580119 588894 618597 611935 565851 529002 521401 512037 481816 459188 470235 486670
35935D86670k9970p8894o6125Q970Q0311Q3670J6118o9921j17228j02863m2129
$$ 486670 456700 377806 311681 320651 400962 484632 500750 430829 313601 210738 168609
35924A68609K6044N9232L8304j5587o0827p6395p1456n4811j9264L2146O8857
$$ 168609 194653 253885 292189 276602 215775 139380 67924 13113 -6151 25995 94852
35913I4852O4980L4514J1173L494m931j6683j0943K1846N6750N6620Q839o2433
$$ 94852 159832 194346 205519 209013 204082 187399 176456 198302 255052 311672 320511 258078
35901B58078j12394j07423n5442m670L063k0371k3391K1381Q4390J16181R8326
$$ 258078 145684 38261 -17181 -21851 -18788 -39159 -62550 -41169 43221 159402 257728
35890B57728M5720k1620q4587j13588q4358j4241M2003M9567L0462K4604L0274
$$ 257728 303448 281828 197241 83653 -705 -14946 27057 76624 107086 131690 161964
35879A61964J3562k8541n2854l1435L710L515l1649n8832n2766k5473Q053M4854
$$ 161964 175526 146985 94131 62696 66406 69921 38272 -20560 -73326 -98799 -90746 -45892
35867d5892O9039N1966j116l6148j4154K9470K7132k6154o1176k8016L5728N7258
$$ -45892 23147 75113 73997 37849 23695 53165 80297 54143 -7033 -35049 679 57937
35855E7937K4137j0849j1357J285q93m327J2338K9710J6840j1049j3927M211M336
$$ 57937 82074 71225 59868 61153 60260 55933 68271 97981 114821 103772 89845 94056 98392
35842I8392j1018L532M5784M7161j8495p6620n9327j0282q725l9204k8151K1558
$$ 98392 87374 90906 136690 183851 165356 88736 29409 19127 10402 -28802 -56953 -35395
35830c5395L5823M53j7603Q375K4129L417j154L7513N7272J1290m2195l1753Q903
$$ -35395 428 881 -16722 -8347 15782 19199 18045 55558 112830 124120 81925 50172 59075
35817E9075J280m4661n0902j318L8869K8581l896k5836l7758l3569R509P6674
$$ 59075 60355 15694 -35208 -36526 2343 30924 27028 1192 -36566 -70135 -60626 16048
35805A6048J06840O9999J2442p077N220j686m4899q3276p1092j3976L8565N0460
$$ 16048 122888 192887 205329 198252 203472 201786 156887 73611 2519 -11457 27108 77568
35793G7568L6660L4302M5866L6096j0032n5439n5012r847M0890O2105M0991j0377
$$ 77568 114228 148530 194396 230492 220460 165021 110009 100162 141052 203157 244148 233771
35781B33771m9942l3563K3783M5447j2444r2709j06016m3967K4619N1627M9883
$$ 233771 183829 150266 174049 219496 207052 114343 8327 -35640 -11021 40606 90489
35770I0489M3584L2872J4209n060k1123l5754m5181m8537n4653n7959l3218J5407
$$ 90489 134073 166945 181154 176094 154971 119217 74036 25499 -29154 -87113 -120331 -104924
35758a04924L6877J0450j461N5979J23087R6622j1152q1744n9855j4102r131j5463
$$ -104924 -68047 -57597 -59058 -3079 120008 216630 205478 123734 63879 49777 40646 25183
35746B5183J1547M7326M8264K4154Q194L515K900J5490L4828K6185j6557m5819
$$ 25183 36730 84056 132320 156474 164668 168183 171083 186573 221401 247586 231029 185210
35734A85210k6947J3850L8045M3012L4328N949k2763j4337R578k5902j20041j58302
$$ 185210 158263 172113 210158 253170 287498 293447 270684 256347 265925 240023 119982 -38320
35722c8320p0869N0421P9293K9107O89J5214J3400j6141k5952j0536q343j1700
$$ -38320 -109189 -58768 20525 49632 50321 65535 78935 62794 36842 26306 17963 6263
35710F263J8619N3678K3944m5793m5324N0209J28617J02365K2109k4673l6528
$$ 6263 24882 78560 102504 56711 11387 61596 190213 292578 314687 290014 253486
35699B53486n1431n4271j2840M2704N3955K0927p447r318l224m55Q450K5401L6940
$$ 253486 202055 147784 134944 177648 231603 252530 245083 235765 232541 232086 240536 265937 302877
35686C02877L1273M567l7727p3190p5794m9345k5494j9888j8107j1203r209j0588
$$ 302877 334150 338717 300990 227800 152006 102661 77167 57279 39172 27969 18760 8172
35674H172N29J5679O961j6635j1833K1855L0512L33n568M9034J00474P8400J2837
$$ 8172 8701 24380 31341 14706 2873 24728 55240 55573 50005 99039 199513 277913 290750
35661B90750k4927l5763o0341p5939k9378M5054M9700k5705p8609m7215K498r747
$$ 290750 265823 230060 169719 93780 64402 109456 159156 133451 54842 7627 10125 378
35649C78n5114n0981J0572N8877M7587L663k1773r444K3722M7714M2018J1147
$$ 378 -54736 -105717 -95145 -36268 11319 14982 -6791 -16235 7487 55201 97219 108366
35637A08366j9988l2215k8148j8543m943J5479L7356M7338L2127j2078o6432r0768
$$ 108366 88378 56163 28015 9472 4529 20008 57364 104702 136829 124751 58319 -32449
35625c2449o0002j665K6761O484j8928j440M9555Q1115O0295O434l4903l7870
$$ -32449 -92451 -94116 -67355 -60871 -79799 -81239 -31684 49431 109726 116160 81257 43387
35613D3387j6880n597j5195k0409K772L6131L9850J1152q840M266K1626N090l6828
$$ 43387 26507 20910 5715 -14694 -11922 24209 64059 75211 66371 70637 92263 97353 60525
35600F0525o2923n3190k1283J6679N5284Q1998P5531L4249j1819l2419l1343l5395
$$ 60525 -2398 -55588 -76871 -60192 -4908 77090 152621 186870 175051 142632 111289 75894
35588G5894n3721o4694m8649j9796j0871l1252n7509o5445n1242j6666L9122R5965
$$ 75894 22173 -42521 -91170 -110966 -121837 -153089 -210598 -276043 -327285 -343951 -304829 -208864
35576b08864J09292O2633M849m662K2918K5940p982j8060L4466R8340R7782L2183
$$ -208864 -99572 -36939 -32090 -36752 -13834 12106 4124 -13936 20530 118870 216652 248835
35564B48835l2673n3031m4168l7387l9916m1527l3108j2804Q426Q093k2825n8114
$$ 248835 216162 163131 118963 81576 41660 133 -32975 -45779 -37353 -29260 -52085 -110199
35552a10199n8969j8847L0748N8742O2223N5534M8605M1364L0249J6217P232P122
$$ -110199 -169168 -188015 -157267 -98525 -36302 19232 67837 109201 139450 155667 162899 170021
35540A70021K225k3975n6847n5515q567M0313M8741L4161M0291O4415O4899L3683
$$ 170021 172246 148271 91424 35909 27342 67655 116396 150557 190848 255263 320162 353845
35528C53845R792J4125J9280R91k3158k9698k7353l1561l1491j4086J772j1425
$$ 353845 363637 377762 397042 398033 374875 345177 317824 286263 254772 240686 242458 231033
35516B31033m4611n8925l2990J4835M5375K9764k4100o6257m6770K2505P2033
$$ 231033 186422 127497 94507 109342 154717 184481 160381 94124 47354 69859 141892
35505A41892N8215J4536n973o806k5243n7406n9766k0920J9037K9879K9437M4223
$$ 141892 200107 214643 208670 201864 176621 119215 59449 38529 57566 87445 116882 161105
35493A61105O5345O4107L0149k0806o0056n9071j1827M4631N3862N55o6911q7413
$$ 161105 226450 290557 320706 299900 239844 180773 168946 213577 267439 267994 201083 113670
35481A13670m8940Q750L8118J9986k8969o9561o8990k9602J3069K5792Q373j0182
$$ 113670 64730 73480 111598 131584 102615 33054 -35936 -65538 -52469 -26677 -18304 -28486
35469b8486O45M5447R2681R7091M7253j4279l6013j7046L68q103k4377k4139n778
$$ -28486 -27841 17606 110287 207378 254631 240352 204339 187293 187661 179558 155181 131042 125264
35456A25264K0947M2723L3937k1373q6536r3239k8792L5911L5367r424l4686k4683
$$ 125264 146211 188934 222871 201498 114962 21723 -7069 28842 64209 54785 20099 -4584
35444d584j1565p781P050L8198O3082O8998O4393N0092J7020k2475l7885k5147
$$ -4584 -16149 -23930 -16880 21318 84400 153398 217791 267883 284903 262428 224543 199396
35432A99396j5436k7707m2464l7815k4794k6377l8950l5519j501M4121O2442L0292
$$ 199396 183960 156253 113789 75974 51180 24803 -14147 -49666 -51167 -7046 55396 85688
35420H5688l1620p2154o1987k2759R669L3536O4944Q8391O6251n73o1677p7551
$$ 85688 54068 -18086 -80073 -102832 -93163 -59627 5317 93708 159959 159386 97709 20158
35408B0158n7490k8123j015J3983K157k5443k8956M718L4070K2505l854K135L2778
$$ 20158 -37332 -65455 -66470 -52487 -50330 -75773 -104729 -100011 -65941 -43436 -47290 -45155 -12377
35395a2377M0629J8719J2369M3250O8020L5188m6009j16073j26893p7238l909
$$ -12377 28252 46971 59340 102590 170610 205798 159789 43716 -83177 -160415 -164324
35384a64324M5694M6368J7691M358K1718L5997J5348j9013k3173J318J2454J062
$$ -164324 -118630 -72262 -54571 -50213 -28495 7502 22850 3837 -19336 -18018 -5564 -4502
35372d502P143M2389N1041m612o3631m1931L4276N6364j709l9505J3780Q7691
$$ -4502 2641 45030 96071 91459 27828 -14103 20173 76537 74828 35323 49103 136794
35360A36794Q0023P338l8244l2464k2895j9687J2195N7320N2377J174j2540L8478
$$ 136794 216817 224155 185911 153447 130552 110865 123060 180380 232757 233931 221391 259869
35348B59869O7907P056q5257j08037n3337Q929L3654K3502j1590n2491n7208r772
$$ 259869 327776 334832 249575 141538 88201 97130 130784 154286 142696 90205 32997 23225
35336B3225M0043L9673J0672P652K8445K8875N830l639M078m910l2366l7568m559
$$ 23225 63268 102941 113613 121265 149710 178585 184415 180776 184854 179944 147578 110010 105451
35323A05451L3382M4205K6958r044m8027n5007j3497K6195k513p9013j08239n1720
$$ 105451 138833 183038 209996 200952 152925 97918 84421 110616 108103 29090 -79149 -130869
35311a30869K0735L7382J9367K7756O5958Q5556O0523J1222l0828m9784m6120
$$ -130869 -110134 -72752 -53385 -25629 40329 125885 186408 197630 166802 117018 70898
35300G0898l1253j5929M00J6071J1392k4176n6532m0769J0628M1229L4442K7539
$$ 70898 39645 23716 24116 40187 51579 27403 -29129 -69898 -59270 -18041 16401 43940
35288D3940L3733J7681k7151m6147j0401K5805P161l5112l6766J267L0665L6441
$$ 43940 77673 95354 68203 22056 11655 37460 44621 9509 -27257 -25990 4675 41116
35276D1116L4487J6851l0128o9844m9442J3329M3105J2288k6102k2937M269J3962
$$ 41116 75603 92454 62326 -7518 -56960 -43631 -526 11762 -14340 -37277 -33008 -19046
35264a9046K463l994P547K4703K8855J4970k368n134R22r500l9755n8461m6179
$$ -19046 -16583 -20577 -13030 11673 40528 55498 53130 47996 48918 39418 -337 -58798 -104977
35251a04977k3849q883J8698O6175Q5094L6343l3985n2612k9028k9258n5128m1092
$$ -104977 -128826 -137709 -119011 -52836 32258 68601 34616 -17996 -47024 -76282 -131410 -172502
35239a72502K4566P0180N5622K6725J8888m800o4619r4400l5422N8372Q8288M3729
$$ -172502 -147936 -77756 -22134 4591 23479 18679 -45940 -140340 -175762 -117390 -29102 14627
35227A4627q180l2658m6753m9102j4854L7294M7164o54m8736m3580L715M9062
$$ 14627 6447 -26211 -72964 -122066 -136920 -99626 -52462 -53116 -101852 -145432 -141717 -92655
35215i2655O8613O3275M1122J2194j6484m3531n5298k1437N7717J15520Q1743
$$ -92655 -24042 39233 80355 92549 76065 32534 -22764 -44201 13516 129036 210779
35204B10779k0920r6435r6564o5078m7694k5227K5689O4443L9480k4045n2061
$$ 210779 189859 93424 -3140 -68218 -115912 -141139 -115450 -51007 -11527 -35572 -87633
35193h7633k3688J0434J0811j200J0647M1406N8010M7030K6820J7654J4637k808
$$ -87633 -111321 -100887 -90076 -91276 -80629 -39223 18787 65817 92637 110291 124928 122120
35181A22120l5626n1093k1001L0622M6102P797l7541m3571k0004Q87J6466L4024
$$ 122120 86494 35401 14400 45022 91124 98921 61380 17809 -2195 -1308 15158 49182
35169D9182L3019j50k4299O091N5242M2413l3648q1549m8205R697K0123n304j5809
$$ 49182 82201 82051 57752 63843 119085 161498 127850 46301 -1904 7793 27916 22612 6803
35156F803q156p985n750K3290O0196O4279L8265J8285J3057L703r556j0952o621
$$ 6803 -1353 -9338 -15088 8202 68398 132677 170942 189227 202284 205987 196431 185479 178858
35143A78858j0198p536J3305J9811j5493m7740j9377L1366J6849m8282n2200L3197
$$ 178858 168660 161124 174429 194240 178747 131007 111630 142996 159845 111563 59363 92560
35131I2560Q9596K5481q6261j18668o0350P381L9961M7771L1716r825l8498j9982
$$ 92560 182156 207637 121376 2708 -57642 -50261 -10300 37471 69187 59362 20864 882
35119H82J2980J0889j0612j3564k4723q6781j49501j17257j196Q2548P8382N1593
$$ 882 13862 24751 14139 575 -24148 -110929 -260430 -377687 -378883 -296335 -217953 -166360
35107a66360N9299O4791K6758j6461j3808J4802K2346R265j168j4644l8637m4950
$$ -166360 -107061 -42270 -15512 -31973 -45781 -30979 -8633 632 -536 -15180 -53817 -98767
35095i8767j2702K6019L2690K1451K4723L3770K3179K897o004j7832m9284o6994
$$ -98767 -111469 -85450 -52760 -31309 -6586 27184 50363 53260 47256 29424 -19860 -86854
35083h6854k9939L3868N6825K9036L498O067M426k2973m6649l6999p796J6838
$$ -86854 -116793 -82925 -26100 2936 6434 12501 16927 -6046 -52695 -89694 -97490 -80652
35071h0652L9753O6995P8758N6214J7084n691q770j4973l1350l7749k1464o63
$$ -80652 -40899 26096 104854 161068 178152 172461 163691 148718 117368 79619 58155 57492
35059E7492J608o058M300L1187L4119r187n8138n4718m630K6434J658m1775n0916
$$ 57492 59100 53042 57342 88529 122648 113461 55323 605 -4025 22409 24067 -17708 -68624
35046f8624k2581J2427L6845M7755L5933r97l9738n3694m1969j7331J2708L0967
$$ -68624 -91205 -78778 -41933 5822 41755 40758 1020 -52674 -94643 -111974 -99266 -68299
35034f8299P321n3969q8841l9939O3566J33443J23185O6743K4329K3180M5035
$$ -68299 -60978 -114947 -203788 -243727 -180161 -46718 76467 143210 167539 190719 235754
35023B35754M2223k2895j24675j78043j32218m0106J0712J4162L2631Q1049R8853
$$ 235754 277977 255082 130407 -47636 -179854 -219960 -209248 -195086 -162455 -81406 17447
35012A7447M9409k1706n5925n4394m8149m0945j9648J0112L2930M5914M7091K5733
$$ 17447 66856 45150 -10775 -65169 -113318 -154263 -173911 -163799 -130869 -84955 -37864 -12131
35000a2131j1606k9196l286M1437N9186L3808j4341n6914p6515o9567m4983j4533
$$ -12131 -23737 -52933 -56219 -14782 44404 78212 63871 6957 -69558 -139125 -184108 -198641
34988a98641J7092M2837M4079J6036p178R328M0684K6458l6927p9132n2435K793
$$ -198641 -181549 -138712 -94633 -78597 -85775 -76447 -35763 -9305 -46232 -125364 -177799 -175006
34976a75006K1632K797p457Q803K4269J2588k0782m7059l5752J7977P5024Q4795
$$ -175006 -153374 -150577 -158034 -149231 -124962 -112374 -133156 -180215 -215967 -197990 -122966 -38171
34964c8171N0703L3373O7345J06516Q3084l687q8445j11198o3782J3550N9026
$$ -38171 12532 45905 113250 219766 302850 299163 210718 99520 35738 49288 108314
34953A08314L6922j8696l4061R412M5936J9014l7697n5156k6442K767J0976R887
$$ 108314 145236 126540 92479 101891 147827 166841 129144 73988 47546 50313 61289 71176
34941G1176j914l2279n3914l1395J1752J1392m5007r5871q5856k4656M3853Q8779
$$ 71176 69262 36983 -16931 -48326 -36574 -25182 -70189 -166060 -251916 -276572 -232719 -143940
34929a43940R6155O5131J8664q611o579M176L644j0252l0823m6129m1194j9989
$$ -143940 -47785 17346 36010 27399 20820 24996 28640 18388 -12435 -58564 -99758 -119747
34917a19747j1030k5382l1528n005K6653L2572L6245O3283O8345K80q2596o7949
$$ -119747 -130777 -156159 -187687 -192692 -166039 -133467 -97222 -33939 34406 34686 -47910 -115859
34905a15859L7479J00467N1575k6390m2682k2011j8209p345M2214P6766M0222
$$ -115859 -78380 22087 73662 47272 4590 -17421 -35630 -42975 -761 76005 116227
34894A16227j2709Q77M3965J7919n8877o6743J6301O6682O594p5579o4477J4323
$$ 116227 103518 104395 148360 166279 107402 40659 56960 123642 130236 54657 -9820 4503
34882D503N0393J1805l5252l7692n831L4621O9679P4901K7369m7063q5944o5186
$$ 4503 54896 66701 31449 -6243 -12074 22547 92226 167127 194496 147433 61489 -3697
34870c697k3034L717K3554M6648M2560j2958p6905q1259k9471N920r128k2505
$$ -3697 -26731 -23014 540 47188 89748 76790 -115 -81374 -110845 -104925 -114053 -136558
34858a36558J6303P3627Q4419M9146J8455M607k3780o4893p3682m1745k0115l5437
$$ -136558 -120255 -46628 37791 86937 105392 109999 86219 21326 -52356 -94101 -114216 -149653
34846a49653m3792n730M5992O0109M3318L0593J7273j7565m6285k0526M2438O5803
$$ -149653 -193445 -199175 -153183 -93074 -49756 -19163 -1890 -19455 -65740 -86266 -43828 21975
34834B1975J6681m7238n2515M663O6055Q0069M7310R225j464J346j8300n5623
$$ 21975 38656 -8582 -61097 -56434 9621 89690 137000 146225 144761 146107 127807 72184
34822G2184o1700k0231J7282J0885N89L7114Q3703O6121j002k8266Q823L6897
$$ 72184 10484 -9747 7535 18420 19009 56123 139826 205947 204945 176679 185502 222399
34810B22399R491k6739k7899k9765p1150j09148q1567r101L3573K1075p611j6742
$$ 222399 231890 205151 177252 147487 76337 -32811 -114378 -123479 -89906 -68831 -76442 -93184
34798i3184m640J6179K5407N18m4411n3003n585K9174j6170r2181q3822K6727
$$ -93184 -97824 -81645 -56238 -55720 -100131 -153134 -158719 -129545 -145715 -237896 -321718 -294991
34786b94991J26979J20970M0988j7303j4909J5688L5203L1676R348j9598l7577
$$ -294991 -168012 -47042 -6054 -23357 -38266 -22578 12625 44301 53649 34051 -3526
34775c526l6409k4652j2984n519q164k1543k0337K5801R3161J03580J8723r2030
$$ -3526 -39935 -64587 -77571 -83090 -91254 -112797 -133134 -107333 -14172 89408 108131 16101
34763A6101j23499o2787K023J508l6805m6856j4167K8493O2527R0934R7816N5414
$$ 16101 -107398 -170185 -168162 -166654 -203459 -250315 -264482 -235989 -173462 -82528 15288 70702
34751G0702j9572o5087n1916k2483k1279k5915N888N0392M2151k3013p3817o3694
$$ 70702 51130 -13957 -65873 -88356 -109635 -135550 -129662 -79270 -37119 -60132 -133949 -197643
$$ [...]
##END NTUPLES=NMR SPECTRUM
##END=
