##TITLE=31Pdec_DE-127_1uP
 , 24 sc
 11.2.2026
##JCAMPDX= 6.0         $$ Bruker NMR JCAMP-DX V2.0
##DATA TYPE= NMR SPECTRUM
##DATA CLASS= NTUPLES
##ORIGIN= UXNMR, Bruker Analytische Messtechnik GmbH
##OWNER= root
$$ XWIN-NMR		Version 3.5
$$ Wed Feb 11 14:18:42 2026 Russian Standard Time (UT+4h)  she@DPX200
##.OBSERVE FREQUENCY= 81.013821
##.OBSERVE NUCLEUS= ^31P
##.ACQUISITION MODE= SIMULTANEOUS
##.ACQUISITION SCHEME= undefined
##.AVERAGES= 24
##.DIGITISER RES= 17
##SPECTROMETER/DATA SYSTEM= spect
##.PULSE SEQUENCE= zgpg30
##.SOLVENT NAME= DMSO
##.SHIFT REFERENCE= (INTERNAL, DMSO, 0, 198.062)
##AUDIT TRAIL= $$ (NUMBER, WHEN, WHO, WHERE, WHAT)
$$ ##TITLE= Audit trail, XWIN-NMR		Version 3.5
$$ ##JCAMPDX= 5.01
$$ ##ORIGIN= Bruker BioSpin GmbH
$$ ##OWNER= she
$$ F:/spectra/data/she/nmr/P31/2/pdata/1/auditp.txt
$$ ##AUDIT TRAIL=  $$ (NUMBER, WHEN, WHO, WHERE, WHAT)
(   1,<2026-02-11 14:17:24.87 +0400>,<she>,<DPX200>,
      <created by zg, POWCHK disabled, PULCHK disabled
       configuration hash MD5:
       00 E9 B6 7A A2 85 ED C7 34 08 36 98 17 FE 4E 26
       data hash MD5: 32K
       DB ED 75 0E 7E 92 8D CA B4 79 18 F7 28 42 4C 31>)
(   2,<2026-02-11 14:17:27.60 +0400>,<she>,<DPX200>,
      <Start of raw data processing
       efp BC_mod = 2 LB = 1.5 FT_mod = 6 PKNL = 1 PHC0 = 1380.873 PHC1 = 140.7009 SI = 64K 
       data hash MD5: 64K
       24 F1 ED 4A B5 57 74 EB 59 DB EF F6 A0 AD 0B 4F>)
(   3,<2026-02-11 14:17:48.09 +0400>,<she>,<DPX200>,
      <pk PHC0 = 23.44047 PHC1 = -58.19999 
       data hash MD5: 64K
       74 F1 0B 45 2C 0F 1B 9A 87 02 BD 43 78 52 B1 79>)
(   4,<2026-02-11 14:17:52.50 +0400>,<she>,<DPX200>,
      <abs ABSG = 5 
       data hash MD5: 64K
       57 E3 F3 86 EF 8D 4C C1 11 27 07 37 E2 B0 63 EE>)
$$ ##END=
$$ 
$$ hash MD5
$$ 9E 61 0D 7A 04 C0 84 0D 22 84 37 B9 53 5A 98 13
##$RELAX= 
##$RELAX= 
##$RELAX= 
##$RELAX= 
##$RELAX= 
##$RELAX= 
##$RELAX= 
##$RELAX= 
$$ Bruker specific parameters
$$ --------------------------
##$DU= <F:/spectra>
##$EXPNO= 2
##$NAME= <P31>
##$PROCNO= 1
##$TYPE= <nmr>
##$USER= <she>
##$AMP= (0..31)
100 100 100 100 100 100 100 100 100 100 100 100 100 100 100 100 100 100 
100 100 100 100 100 100 100 100 100 100 100 100 100 100 
##$AQSEQ= 0
##$AQ_mod= 1
##$AUNM= <au_zg>
##$AUTOPOS= <>
##$BF1= 81.014009
##$BF2= 200.13
##$BF3= 200.13
##$BF4= 200.13
##$BF5= 200.13
##$BF6= 200.13
##$BF7= 200.13
##$BF8= 200.13
##$BYTORDA= 1
##$CFDGTYP= 0
##$CFRGTYP= 5
##$CHEMSTR= <none>
##$CNST= (0..31)
1 1 145 1 1 1 1 1 1 1 1 1 1 1 1 1 1 1 1 1 1 1 1 1 1 1 1 1 1 1 1 1 
##$CPDPRG= <waltz16>
##$CPDPRG1= <>
##$CPDPRG2= <waltz16>
##$CPDPRG3= <>
##$CPDPRG4= <mlev>
##$CPDPRG5= <mlev>
##$CPDPRG6= <mlev>
##$CPDPRG7= <mlev>
##$CPDPRG8= <mlev>
##$CPDPRGB= <>
##$CPDPRGT= <>
##$D= (0..31)
0 1 0 0 0 0 0 0 0 0.06 0 0.03 2e-05 3e-06 0 0 0.0002 0 0 0 0 0 0 0 0 0 
0 0 0 0 0 0 
##$DATE= 1770805044
##$DBL= (0..7)
120 120 120 11 120 120 24 19 
##$DBP= (0..7)
150 150 150 150 150 150 150 150 
##$DBP07= 0
##$DBPNAM0= <>
##$DBPNAM1= <>
$$ [...]
##$SUBNAM3= <"">
##$SUBNAM4= <"">
##$SUBNAM5= <"">
##$SUBNAM6= <"">
##$SUBNAM7= <"">
##$SUBNAM8= <"">
##$SUBNAM9= <"">
##$SW= 400.765351723535
##$SWIBOX= (0..15)
0 1 3 0 0 0 0 0 0 0 0 0 0 0 0 0 
##$SW_h= 32467.5324675325
##$TD= 32768
##$TD0= 1
##$TE= 0
##$TE2= 300
##$TE3= 300
##$TEG= 300
##$TL= (0..7)
0 120 53 12 22 120 120 120 
##$TP= (0..7)
150 150 150 150 150 150 150 150 
##$TP07= 0
##$TPNAME0= <>
##$TPNAME1= <>
##$TPNAME2= <>
##$TPNAME3= <>
##$TPNAME4= <>
##$TPNAME5= <>
##$TPNAME6= <>
##$TPNAME7= <>
##$TPOAL= (0..7)
0.5 0.5 0.5 0.5 0.5 0.5 0.5 0.5 
##$TPOFFS= (0..7)
0 0 0 0 0 0 0 0 
##$TUNHIN= 0
##$TUNHOUT= 0
##$TUNXOUT= 0
##$USERA1= <user>
##$USERA2= <user>
##$USERA3= <user>
##$USERA4= <user>
##$USERA5= <user>
##$V9= 5
##$VALIST= <valist>
##$VCLIST= <CCCCCCCCCCCCCCC>
##$VD= 0
##$VDLIST= <DDDDDDDDDDDDDDD>
##$VPLIST= <PPPPPPPPPPPPPPP>
##$VTLIST= <TTTTTTTTTTTTTTT>
##$WBST= 1024
##$WBSW= 4
##$XGAIN= (0..3)
0 0 0 0 
##$XL= 0
##$YL= 0
##$YMAX_a= 145435
##$YMIN_a= -161231
##$ZGOPTNS= <>
##$ZL1= 120
##$ZL2= 120
##$ZL3= 120
##$ZL4= 120
##$ABSF1= 198.0616
##$ABSF2= -202.7028
##$ABSG= 5
##$ABSL= 3
##$ALPHA= 0
##$AQORDER= 0
##$ASSFAC= 0
##$ASSFACI= 0
##$ASSFACX= 0
##$ASSWID= 0
##$AUNMP= <proc_1d>
##$AZFE= 0.1
##$AZFW= 0.5
##$BCFW= 0
##$BC_mod= 2
##$BYTORDP= 0
##$COROFFS= 0
##$CY= -3
##$DATMOD= 1
##$DC= 0
##$DFILT= <>
##$DTYPP= 0
##$F1P= 0
##$F2P= 0
##$FCOR= 1
##$FTSIZE= 65536
##$FT_mod= 6
##$GAMMA= 0
##$GB= 0
##$INTBC= 1
##$INTSCL= 9.790993e-09
##$ISEN= 30
##$LB= 1.5
##$LEV0= 0
##$LPBIN= 0
##$MAXI= 10000
##$MC2= 0
##$MEAN= 0
##$ME_mod= 0
##$MI= 50
##$NCOEF= 0
##$NC_proc= -2
##$NLEV= 6
##$NOISF1= 182.463
##$NOISF2= 159.3651
##$NSP= 0
##$NTH_PI= 0
##$NZP= 0
##$OFFSET= 198.0616
##$PC= 4
##$PHC0= 1404.313
##$PHC1= 82.50091
##$PH_mod= 1
##$PKNL= yes
##$PPARMOD= 0
##$PSCAL= 0
##$PSIGN= 0
##$REVERSE= no
##$SF= 81.0140089999434
##$SI= 65536
##$SIGF1= 159.3651
##$SIGF2= -187.1042
##$SINO= 113.3802
##$SIOLD= 16384
##$SREGLST= <1H.CDCl3>
##$SSB= 0
##$STSI= 65536
##$STSR= 0
##$SW_p= 32467.5324675325
##$SYMM= 0
##$S_DEV= 0
##$TDeff= 32768
##$TDoff= 0
##$TI= <>
##$TILT= no
##$TM1= 0
##$TM2= 0
##$TOPLEV= 0
##$USERP1= <user>
##$USERP2= <user>
##$USERP3= <user>
##$USERP4= <user>
##$USERP5= <user>
##$WDW= 1
##$XDIM= 65536
##$YMAX_p= 278642564
##$YMIN_p= -716310
$$ End of Bruker specific parameters
$$ ---------------------------------
##NTUPLES= NMR SPECTRUM
##VAR_NAME=  FREQUENCY,     SPECTRUM/REAL,   SPECTRUM/IMAG
##SYMBOL=    X,             R,               I
##VAR_TYPE=  INDEPENDENT,   DEPENDENT,       DEPENDENT
##VAR_FORM=  AFFN,          ASDF,            ASDF
##VAR_DIM=   65536,         65536,           65536
##UNITS=     HZ,            ARBITRARY UNITS, ARBITRARY UNITS
##FACTOR=    0.49542278885378, 1,            1
##FIRST=     16045.7642231865, 0,            0
##LAST=      -16421.768244346, 0,            0
##MIN=       -16421.768244346, -716310,      0
##MAX=       16045.7642231865, 278642564,    0
$$ Real data points
##PAGE= N=1
##DATA TABLE= (X++(R..R)), XYDATA
$$ [...]
44125 -61005 -73585 -66888 -49417 -43074 -49304 -43289 -9686 31716 47687 27956 -10871 -47848
44113 -47848 -71473 -77737 -68143 -49906 -32006 -22086 -26945 -46653 -66005 -65412 -46452 -32112 -34230
44100 -34230 -39489 -40278 -56624 -103085 -151168 -156572 -116689 -70266 -43269 -27377 -13537 -11328 -23035
44087 -23035 -28698 -14666 5425 14652 17041 20342 14135 -13525 -52020 -81510 -98897 -110626 -111523
44074 -111523 -94907 -76816 -83977 -116455 -144059 -144457 -126611 -110157 -98381 -83062 -65920 -62021
44062 -62021 -82860 -122893 -163365 -186145 -183687 -159440 -123480 -88582 -63862 -45785 -20475 14827
44050 14827 36372 15233 -43906 -100978 -123449 -116155 -100868 -84025 -60604 -37142 -29798 -41755
44038 -41755 -57686 -61108 -48125 -26812 -11953 -16572 -39182 -62081 -69390 -62499 -51897 -41747
44026 -41747 -30803 -19805 -7686 11405 36775 56067 63096 70477 89971 109995 109291 84926
44014 84926 49760 11369 -26090 -47299 -38601 -13987 -4453 -19397 -39367 -48550 -52179 -57242 -57303
44001 -57303 -44772 -22008 5783 33958 51673 48832 33723 26379 30356 29463 16817 6582 9368
43988 9368 15963 15244 10149 6154 1418 -2447 1098 3979 -16087 -60650 -95863 -91205 -56656 -23074
43974 -23074 -2095 12610 19017 9075 -9626 -21165 -29158 -52842 -91713 -116183 -103360 -67065
43962 -67065 -40594 -38457 -47022 -49665 -48277 -53734 -63204 -61765 -49476 -50535 -81152 -119354 -127084
43949 -127084 -97931 -61800 -44018 -43095 -49597 -59834 -64506 -51248 -29466 -26886 -49119 -69105
43937 -69105 -70364 -70792 -85132 -96826 -93897 -99804 -131579 -154834 -126273 -63549 -23747 -20227 -11167
43924 -11167 26804 61827 56974 18136 -24978 -54795 -66940 -62431 -54585 -60947 -75286 -70447 -41765
43911 -41765 -23119 -42314 -81065 -98946 -82064 -49779 -24679 -12951 -8052 -1672 5179 -1227
43899 -1227 -29861 -62925 -68009 -38116 -3040 6325 -11269 -38942 -64422 -80776 -82900 -76255 -73498
43886 -73498 -71653 -51003 -9573 21846 17256 -10050 -30992 -41307 -53647 -63627 -55558 -37511
43874 -37511 -38960 -67675 -94396 -91667 -69572 -58748 -68592 -77594 -64029 -35109 -18820 -29676
43862 -29676 -52583 -67070 -77540 -102375 -136437 -149371 -130101 -108649 -113870 -127866 -109713 -56018
43850 -56018 -8809 -2031 -26424 -55105 -80342 -108747 -135207 -142529 -124893 -96804 -76030 -67291
43838 -67291 -66316 -70966 -80313 -87835 -86540 -80871 -82271 -89630 -86493 -65212 -41371 -32410 -33564 -30300
43824 -30300 -22928 -18495 -8969 15192 36233 27533 2671 9762 64976 124414 139311 110527 70033
43811 70033 38093 22210 29899 52742 60775 43202 33037 58662 93216 91968 61738 46362
43799 46362 53504 47681 17360 -2202 13646 41858 49525 32573 -84 -44533 -82494 -78976
43787 -78976 -28394 23107 30749 5033 -15956 -26527 -49535 -85983 -108742 -107331 -104365 -118048
43775 -118048 -134799 -133074 -116067 -105289 -111806 -127307 -138638 -139433 -127825 -102292 -64573 -22983
43763 -22983 12394 37767 54941 62350 53655 29661 5126 -4716 -1133 3180 3228 5446 12975 18294
43749 18294 13698 1836 -6840 -3126 12872 28002 25248 3975 -15150 -14798 -2340 5460 7474
43736 7474 8162 -6734 -55200 -121530 -165137 -172131 -168031 -170375 -161801 -127843 -89972 -73494 -66045
43723 -66045 -40308 -3492 10002 -8566 -26839 -13039 27893 64932 73009 50965 18621 -1283
43711 -1283 -3986 -3395 -8426 -8649 7804 33851 54907 71286 92933 117923 131930 125832 102076
43698 102076 69666 44186 43309 67319 92595 99511 96784 101620 108933 103242 89713 84948 83577
43685 83577 65242 33643 16748 23997 33845 31720 30693 41616 48845 32461 -3577 -37742 -48723
43672 -48723 -20341 47873 124248 162968 152191 122797 99866 76048 48748 45435 79094 109960
43660 109960 94796 53972 42981 69593 89926 83999 80870 97657 106478 88676 78411 113693
43648 113693 171563 192805 158350 105874 76741 77670 92676 102841 90307 48845 -862 -26255
43636 -26255 -21631 -14848 -27822 -48637 -54323 -44245 -34666 -33202 -37839 -52132 -78773 -100918 -94246
43623 -94246 -62528 -38850 -40875 -45731 -26785 2354 6272 -19090 -41518 -41018 -32635 -32086 -29955
43610 -29955 -20384 -27936 -72961 -125682 -132802 -87202 -35048 -9237 6289 31227 45990 25357
43598 25357 -9717 -12606 24434 60045 58662 26810 -10516 -43648 -76621 -109884 -137842 -154174
43586 -154174 -152277 -129494 -96154 -71279 -64198 -66313 -61329 -36881 8143 54771 70094 43477
43574 43477 11396 17903 50659 51668 756 -51211 -54506 -28640 -23534 -41761 -44279 -19120 928
43561 928 -11992 -49463 -85107 -93306 -54281 22665 81649 66602 -6998 -63376 -58326 -22730
43549 -22730 -4039 -7220 -14785 -24372 -34874 -27391 5528 36333 40951 37725 53494 73254 64133
43536 64133 33086 16598 21914 23661 16786 26557 58180 79064 67288 42751 30658 23236 642
43523 642 -31460 -48885 -41285 -19232 3063 19401 33130 54981 90560 124611 129033 92267
43511 92267 30331 -32598 -79395 -96209 -78031 -46504 -37793 -57866 -70903 -48772 -10855 6484
43499 6484 495 -4294 2367 11541 21893 38477 47987 29548 -5160 -15558 11691 38872 27270
43486 27270 -12966 -44647 -55103 -58810 -61984 -56366 -45094 -43145 -45932 -26443 21732 62370 58785
43473 58785 21706 -9016 -19659 -31310 -55937 -74228 -66553 -41444 -18020 1556 23940 42246
43461 42246 42136 24223 3513 -9768 -15012 -12836 -8115 -16663 -49600 -90681 -107155 -86650 -48256
43448 -48256 -14289 12116 35484 51247 52677 44158 35218 26243 10000 -14109 -34402 -37691 -24983
43435 -24983 -14473 -23272 -44351 -51486 -34494 -17336 -26534 -52700 -65481 -60030 -60597 -76744 -86551
43422 -86551 -74435 -58178 -60145 -73139 -76869 -72886 -79043 -97142 -108592 -100788 -80849 -62722 -53076
43409 -53076 -49991 -45952 -32352 -7674 20274 43897 62379 75515 79658 75188 68585 61162 46916
43396 46916 28941 24639 43284 70265 86427 91471 93365 86051 57422 14120 -20208 -30143 -17792
43383 -17792 9912 47003 81153 95280 81931 50284 18037 -1178 -7289 -14210 -32935 -51170
43371 -51170 -43395 -8080 22274 21122 1393 -6831 4919 26964 55563 85805 94056 61189
43359 61189 8915 -18900 -11046 4378 7893 10202 20447 26623 21148 17800 26582 34727 29485
43346 29485 19446 15408 8075 -14800 -41453 -46581 -23855 5704 14885 -6619 -43105 -62422
43334 -62422 -45277 -9540 7591 -3842 -14697 873 30473 45064 39483 33216 40406 55841
43322 55841 65650 59626 37692 13108 3329 11395 24827 36382 50267 60310 42669 -12141
43310 -12141 -75208 -107598 -103084 -84640 -69455 -59344 -57829 -70541 -87409 -86080 -58839 -22184
43298 -22184 3422 11800 8736 3816 5307 12131 11059 -7744 -34737 -52662 -61111 -74079 -93804
43285 -93804 -104509 -96539 -81648 -77182 -85728 -96083 -95141 -75130 -39934 -8906 -2713 -18000 -26617
43272 -26617 -9447 17679 23267 -604 -31350 -46147 -44839 -38481 -27860 -5636 24002 40841
43260 40841 28430 -8459 -50731 -83381 -101298 -103228 -90436 -69995 -50197 -32676 -16645 -8734
43248 -8734 -17447 -37371 -50439 -45532 -27497 -6988 6075 -359 -31884 -71615 -90599 -81614 -66050
43235 -66050 -60987 -60438 -58437 -64454 -78007 -74275 -42155 -15192 -30925 -73987 -96378 -85293 -70889
43222 -70889 -69398 -63256 -47282 -51133 -91917 -136292 -139257 -102423 -67631 -63975 -83164 -100173 -99428
43209 -99428 -83698 -69678 -71156 -79496 -69999 -35545 -691 10217 5802 11098 27977 33775 17646
43196 17646 -2312 -4296 8693 14873 1814 -20702 -36983 -47650 -65725 -88518 -88269 -47666
43184 -47666 3755 15245 -19863 -52921 -47631 -30867 -49690 -98108 -122318 -93049 -38057 1734
43172 1734 17636 22909 23253 17592 13464 21234 37728 49188 47500 33794 10152 -21465 -53191
43159 -53191 -73302 -76371 -67618 -57862 -56827 -68359 -88031 -107934 -126908 -150861 -177248 -185878 -157408
43146 -157408 -100921 -50986 -32355 -36400 -38296 -28402 -16577 -12011 -13761 -22077 -43989 -78716 -107013
43133 -107013 -108113 -85888 -66771 -67517 -72559 -51231 3614 61187 80964 52356 1454 -39397
43121 -39397 -59150 -62687 -51729 -26141 1270 10175 -3294 -22625 -35368 -45870 -56917 -57332
43109 -57332 -41957 -28157 -33073 -45325 -40617 -18785 -3212 -6242 -16769 -21883 -19521 -7633 18341
43096 18341 52509 81424 103786 129219 155294 167651 167286 172910 187852 190854 173007 157784
43084 157784 166006 185075 195670 206890 236756 274061 289565 274813 241878 194329 129433 64339
43072 64339 28435 27650 41536 55575 70947 83774 84272 78915 83447 89138 67841 19360 -19542
43059 -19542 -27619 -27480 -41618 -52981 -38160 -12645 -7666 -21082 -28838 -31919 -50582 -76926 -77123
43046 -77123 -47460 -27212 -39442 -54891 -39892 -11987 -15121 -55365 -95941 -112113 -118499 -134719
43034 -134719 -150324 -141053 -106813 -75911 -72822 -91716 -104219 -90214 -59573 -42279 -55717 -85295
43022 -85295 -102373 -96587 -79786 -60871 -34378 -517 21518 17005 1659 3482 21960 26821
43010 26821 1001 -34810 -49343 -36274 -11435 11030 24402 21904 2204 -21121 -31896 -32347
42998 -32347 -37353 -47876 -46243 -22487 8628 24870 20786 6517 -9377 -25549 -39966 -45873
42986 -45873 -36873 -12615 19311 44537 48871 30498 5287 -5231 6149 25741 33446 22419
42974 22419 3091 -10596 -14830 -14543 -13760 -13839 -18821 -32766 -49123 -52185 -35697 -13510 -4563 -12279
42960 -12279 -25704 -35488 -39894 -38852 -31259 -16807 4831 31984 53625 54894 40259 38391 66490
42947 66490 100437 104033 80883 67686 76458 77812 51766 21621 16856 29908 35570 31234 28068
42934 28068 19097 -9775 -45958 -62108 -59284 -63799 -78191 -71338 -30228 10610 13314 -12565 -28562
42921 -28562 -21860 -15008 -26966 -49112 -63089 -64404 -60598 -56605 -50270 -39013 -25635 -16825 -17248
42908 -17248 -26960 -45385 -72769 -101408 -110794 -85757 -41242 -13703 -19813 -36677 -33830 -12785
42896 -12785 365 -6692 -19665 -20801 -9007 3107 -1245 -35158 -93229 -142875 -148049 -108553
42884 -108553 -61723 -38130 -30413 -15261 10162 30427 39475 45800 53099 54131 45449 32827 18391
42871 18391 -3287 -29165 -39970 -20266 18609 45919 41970 15439 -9184 -15484 -4960 11143
42859 11143 22962 24767 14044 -5007 -19272 -16608 -108 13648 11333 -10059 -51960 -113447
42847 -113447 -173882 -195068 -160774 -104476 -75404 -80785 -84239 -60907 -28916 -19290 -37358 -65899
42835 -65899 -88854 -99148 -96964 -91837 -94384 -98336 -86465 -61851 -51591 -66249 -79607 -69319
42823 -69319 -54576 -65005 -90712 -97692 -81669 -70083 -75291 -82583 -85084 -93254 -103334 -92410 -56888
42810 -56888 -23314 -6495 11929 45448 73459 72655 51849 30802 7407 -26626 -57036 -64109
42798 -64109 -54942 -50174 -50164 -42618 -33276 -38486 -54258 -63103 -66149 -76264 -83146 -62772 -25679 -16646
42784 -16646 -51428 -87955 -83160 -52047 -42812 -70032 -100636 -99422 -65388 -24541 -4429 -15978
42772 -15978 -46415 -68209 -64045 -43051 -25836 -17458 -5782 14372 27471 13463 -27598 -73007
42760 -73007 -99320 -103412 -99705 -99529 -100598 -98943 -100849 -112456 -123829 -117728 -93478 -68972 -58959
42747 -58959 -65024 -86116 -119414 -146056 -138471 -95810 -54062 -42878 -46685 -30721 4178 19685
42735 19685 -6869 -52105 -78365 -78834 -78805 -100860 -139905 -170695 -174127 -154895 -133175 -120444 -111028
42722 -111028 -101244 -104449 -132697 -170790 -187961 -175227 -152832 -138378 -127491 -113111 -103935 -110049
42710 -110049 -124486 -132832 -129677 -113760 -81766 -43542 -28478 -52755 -88803 -93438 -63307 -36359
42698 -36359 -38223 -55306 -66230 -69898 -69303 -55778 -30413 -18696 -37813 -64320 -60884 -25575 11106
42685 11106 30795 41387 50467 54653 59195 79958 115147 137089 124905 88957 52608 26444
42673 26444 12334 16714 43038 79670 108700 121668 119075 103178 80342 62706 58919 68525
42661 68525 88558 115415 137212 139136 122964 106528 96932 81616 54523 31142 25213 31195
42649 31195 44326 73641 114074 131148 103654 61529 47382 57758 61347 60393 85211 131743
42637 131743 157370 148335 141477 159304 169177 137127 86157 64992 83447 113907 139043 161966
42625 161966 178021 171018 139710 104863 86719 89272 104206 116607 110507 82468 48034 25475
42613 25475 17292 14336 10167 4498 2570 16566 52666 90438 96535 70950 54794 73038 96341
42600 96341 88400 65866 70521 98418 105975 84792 79873 119262 168250 178249 150690 125035 123684
42587 123684 135241 139834 126994 94780 51201 14961 635 3381 6739 2427 -5023 -8932 -7233
42574 -7233 -471 10914 27384 49171 71406 82691 77100 66983 71898 91265 99755 76133 27396
42561 27396 -21339 -50538 -52878 -28612 11514 43844 47082 23579 -1117 -2874 19156 45444
42549 45444 57860 55026 44104 22418 -19979 -74449 -106033 -89255 -44457 -17262 -22843 -33318
42537 -33318 -24838 -11954 -20185 -43678 -51552 -28158 10762 37654 34171 -3595 -64924 -127258
42525 -127258 -169938 -189473 -197621 -205687 -214778 -217694 -204081 -166877 -111248 -55823 -17923 3364
42513 3364 24476 56135 87557 94587 65601 19181 -8798 321 30979 55339 63304 59832 43426
42500 43426 9736 -25521 -33465 -9526 18443 29512 33728 42147 38090 4114 -39457 -53688
42488 -53688 -32175 -5684 1863 -4072 -11112 -18924 -28111 -30928 -23899 -15518 -12377 -8977 540 9673
42474 9673 6307 -12568 -36347 -47372 -34117 -4831 15794 13667 4500 12833 36451 49375 38656
42461 38656 17549 -229 -17259 -35939 -46761 -45512 -44493 -51876 -54549 -37323 -7622 14743
42449 14743 22772 22038 14772 1238 -10075 -11591 -11727 -23666 -41650 -45988 -31451 -13807 -5903
42436 -5903 -2736 5549 18920 30254 31843 16526 -15287 -46572 -55665 -43315 -34635 -46999 -69590
42423 -69590 -84311 -91963 -101829 -106656 -89173 -50364 -10949 17521 43992 73324 88211 70791
42411 70791 32576 5465 3922 10815 4666 -11863 -20686 -17519 -16771 -25008 -24785 1615 39449 51200
42397 51200 22950 -15354 -26410 -8992 10332 17567 20378 20020 1440 -39401 -79927 -97046
42385 -97046 -93110 -81717 -63692 -36169 -12387 -8979 -20100 -26603 -26133 -30624 -36758 -25576 5926
42372 5926 38426 60229 77739 89596 79622 47834 19337 5515 -13563 -45944 -59790 -32824
42360 -32824 -1442 -14661 -56278 -65052 -27353 5390 -4 -12578 2066 22988 11852 -24923
42348 -24923 -52022 -59382 -59683 -48948 -14599 22538 18859 -31617 -83370 -98978 -92865 -98587 -117266
42335 -117266 -121896 -98988 -63081 -33826 -15363 1260 25339 56456 81620 84997 64908 36505
42323 36505 12867 -8975 -34939 -54762 -50755 -24485 485 7517 5732 10560 16159 3537 -26326
42310 -26326 -46793 -41945 -33804 -55064 -99598 -121804 -92776 -40536 -19591 -49128 -97395 -123120
42298 -123120 -114489 -85675 -54383 -33765 -32558 -46565 -55097 -40886 -12898 3771 1850 1891 22864
42285 22864 55853 78111 84646 90736 104586 112036 94290 52240 6466 -22934 -31641 -29291 -27073
42272 -27073 -27219 -24100 -16320 -14212 -28953 -56000 -78701 -89005 -92926 -92386 -77046 -44669 -15731
42259 -15731 -10956 -22753 -27519 -20947 -20168 -32114 -43056 -44577 -47248 -57523 -60810 -43323 -16617
42246 -16617 -3642 -10283 -25796 -41738 -53787 -53259 -36440 -18536 -19296 -35252 -42923 -29247 -2046
42233 -2046 28932 60929 84409 82142 52793 18886 -1063 -14713 -37744 -66453 -83908 -84181
42221 -84181 -74748 -61790 -49118 -45927 -57720 -71515 -67822 -48138 -34200 -38380 -51453 -61848
42209 -61848 -67071 -60137 -27517 25003 64231 67691 55444 60874 80880 82698 55697 26477 19308
42196 19308 29726 45137 63275 76136 62534 18800 -23314 -34342 -28608 -43373 -87662 -136957
42184 -136957 -169387 -180085 -167011 -133367 -102026 -96091 -102972 -89047 -53936 -35406 -50369 -67832
42172 -67832 -59075 -40019 -37687 -45606 -45373 -46765 -66554 -84332 -63074 -8728 30656 27323 997
42159 997 -18917 -24014 -13988 11231 33096 19868 -30838 -79745 -93897 -83850 -74572 -64664 -41593
42146 -41593 -18000 -18801 -39148 -47012 -29312 -8827 -8464 -21108 -26681 -22880 -23757 -35669 -49468
42133 -49468 -56524 -61112 -70783 -79638 -71106 -40802 -8669 1382 -9238 -17158 -10052 -982 -2921
42120 -2921 -5154 8547 27489 21447 -17637 -59950 -73147 -60826 -52401 -60845 -66639 -46672 -5655
42107 -5655 31193 48958 53160 51886 44195 31062 22309 21399 14816 -9052 -38321 -50268 -40028
42094 -40028 -20896 -1347 19212 34489 32592 15239 -3995 -21911 -43990 -58870 -43785 -5770
42082 -5770 12725 -11205 -46059 -50021 -27708 -14459 -22400 -35939 -48758 -66974 -77552 -52218
42070 -52218 7295 58118 64945 38643 13736 6261 8145 8732 5756 975 -4621 -12595 -24462
42057 -24462 -31863 -15687 29499 74316 80920 53658 37959 58299 82859 69794 28099 4627
42045 4627 19514 42512 35302 -4782 -50408 -77903 -84905 -82509 -79941 -77151 -68570 -52152 -33761
42032 -33761 -23133 -27609 -48392 -77763 -99836 -101202 -83795 -61689 -43343 -24400 -1240 17543
42020 17543 20674 9804 -1717 -3064 5752 16903 21847 16880 3065 -19678 -52698 -85699 -92193
42007 -92193 -56416 -3595 19941 4210 -10803 6285 30125 14952 -37111 -76739 -71918 -40460
41995 -40460 -14697 -3333 207 -3577 -14867 -22888 -17889 -7151 -5766 -17569 -35285 -51370 -57136
41982 -57136 -40438 -606 39433 54293 48726 50333 67221 75820 63053 57587 91596 142133
41970 142133 146669 85600 17714 10554 56274 86675 61444 7457 -30316 -41079 -36602 -17446
41958 -17446 22036 69229 99181 100783 81340 52939 30319 31372 57025 76537 57455 9337
41946 9337 -26636 -33414 -37857 -67646 -113500 -147635 -158504 -149826 -122552 -80098 -42411 -32900 -51413
41933 -51413 -73651 -76628 -55679 -21625 6980 13247 -2709 -19199 -16037 -1190 -1866 -28675 -61867
41920 -61867 -76184 -66883 -45516 -21439 2600 23455 37731 48608 64128 85668 102321 100800
41908 100800 80870 58189 49513 55657 61767 54369 33700 7914 -17762 -39158 -45539 -25914
41896 -25914 13955 49393 58153 40765 16224 2044 3686 18639 40438 57161 55731 35472
41884 35472 13437 8366 19900 30756 30393 28303 39342 62645 82817 88635 82423 72391 64737
41871 64737 64700 76032 93375 100924 86720 58262 38599 44562 70498 95204 104039 100932 96719
41858 96719 90801 73948 50214 42973 68207 108531 127096 105980 60004 14652 -15809 -27269
41846 -27269 -18859 4546 32137 55741 71833 73296 51850 14924 -12306 -12012 6716 20834
41834 20834 17237 -2966 -32011 -55952 -57634 -32902 2237 31230 55282 80641 99354 100692
41822 100692 92857 90980 87520 59484 8060 -33289 -40491 -29459 -30912 -47973 -55454 -35901 -1329
41809 -1329 23326 29651 31843 43342 54223 42167 6224 -25841 -33415 -31184 -44348 -68098 -75968
41796 -75968 -62234 -48442 -47874 -52339 -59535 -83043 -121758 -146876 -139469 -120413 -121700 -143937 -163111
41783 -163111 -166141 -158687 -148250 -139619 -138488 -142124 -136641 -120153 -113863 -128050 -133395 -97209 -37469
41770 -37469 -4038 -8920 -14883 671 12300 -4099 -25382 -16669 9990 8373 -38208 -96828
41758 -96828 -129262 -131144 -120841 -109880 -97247 -82942 -74244 -78485 -94441 -111521 -117179 -106726
41746 -106726 -86173 -64109 -41563 -13067 21384 48779 52262 29422 -2116 -21807 -27672 -35362
41734 -35362 -55520 -78269 -82639 -57022 -9874 33945 48860 31613 9566 12249 32367 33849
41722 33849 5596 -16588 1800 46113 76090 77207 59302 22492 -36023 -90075 -102651 -77413
41710 -77413 -52952 -43436 -27779 -3570 -1292 -26761 -39860 -20074 -5993 -30287 -58321 -42260
41698 -42260 -2718 2531 -30116 -52867 -50726 -57336 -82044 -84810 -44379 1469 12044 -1787
41686 -1787 -9026 -8523 -13977 -17199 -3258 14948 11494 -12070 -29385 -27531 -19315 -20190 -31693 -45613
41672 -45613 -50258 -36694 -10863 7103 7992 8935 28405 54012 54149 19093 -26799 -54772 -59245
41659 -59245 -52943 -45895 -35306 -13213 17803 38781 31453 2850 -17535 -11295 7852 14126 1541
41646 1541 -13809 -16247 -6124 2858 -2451 -17474 -17461 14050 54722 63795 38665 22845 42691
41633 42691 67137 57028 26252 15214 22954 12008 -25995 -57074 -61522 -59450 -67700 -72507 -64512
41620 -64512 -64231 -86127 -106520 -97395 -70473 -56554 -57210 -50114 -33532 -31449 -52804 -74705 -75458
41607 -75458 -63735 -62381 -75361 -83692 -71235 -45565 -29155 -31083 -34293 -18734 6831 10358 -23646
41594 -23646 -74794 -113681 -132735 -140744 -143836 -148203 -167196 -203225 -229973 -216222 -167121 -121391
41582 -121391 -105028 -105892 -98262 -74728 -45557 -21025 -5543 -172 -392 3279 13606 18605 2993
41569 2993 -32442 -68021 -83119 -74718 -56725 -42398 -32100 -21422 -14894 -19409 -24366 -5353 42488
41556 42488 88475 99209 78331 55859 44253 27713 -3788 -33627 -42607 -36698 -35899 -45807 -55664
41543 -55664 -59571 -63869 -71786 -73454 -58900 -35045 -20414 -22626 -29996 -30736 -31750 -45925 -65762
41530 -65762 -69361 -56277 -55151 -82107 -111669 -110437 -83882 -61885 -48305 -19314 28744 66115
41518 66115 73780 67987 64607 50117 13320 -18857 -11116 25681 42150 12019 -40221 -77619
41506 -77619 -94753 -113090 -145764 -179357 -188999 -166173 -128256 -97876 -76848 -50804 -17618 7118
41494 7118 18000 30623 50152 51909 18580 -19832 -16092 29952 69960 71627 52876 43319 41945
41481 41945 30553 7243 -13990 -23807 -20013 725 37372 76812 105201 122665 136082 142783
41469 142783 133375 107965 78878 57634 46389 40735 34354 22590 8197 3550 21403 60666
41457 60666 102257 120924 105156 69063 41569 38695 49607 55501 54725 56588 57046 42151 18079
41444 18079 14313 44094 79112 81167 49560 20472 23796 54443 84397 91461 75243 52662
41432 52662 40431 41252 48041 56735 65642 66424 52095 33994 30643 35825 21880 -15308 -41053
41419 -41053 -29112 844 16289 18052 22390 17556 -21149 -81867 -122749 -128370 -123055 -125288 -125559
41406 -125559 -116727 -109997 -107136 -88294 -42657 16769 82817 169173 279689 393495 502566
41395 502566 637420 832475 1090734 1405379 1789194 2257742 2815076 3485312 4308724 5232718
41385 5232718 6020389 6356148 6093548 5381199 4533621 3804349 3281292 2934812 2703835
41376 2703835 2543195 2438187 2402965 2463627 2637363 2927841 3340868 3900439 4629528 5477079
41366 5477079 6246604 6641568 6456205 5751036 4815641 3943554 3255751 2723772 2293015
41357 2293015 1939508 1647902 1399246 1186604 1011549 864570 732406 620597 544190 497932
41347 497932 457475 407942 351552 292183 235174 197385 191270 200726 199055 188782 192506 203445
41335 203445 183723 124750 71858 64370 80702 73052 34510 -2132 -18277 -26389 -37587 -45609
41323 -45609 -46274 -45619 -43006 -29815 -11730 -10008 -30678 -51568 -51163 -34252 -17870 -7237 1606
41310 1606 8718 13644 20598 27481 21962 3050 -7089 7271 25528 15901 -15506 -30353 -14884
41297 -14884 -777 -17510 -50633 -66888 -60579 -50640 -44382 -31310 -9871 4448 1987 -8642
41285 -8642 -16616 -21779 -24494 -16853 4723 26800 30709 14414 -5896 -15623 -16650 -20199 -28491 -29145
41271 -29145 -11249 17036 36383 42252 49198 62400 61603 30545 -11344 -32332 -35931 -52431 -81642
41258 -81642 -83086 -40835 -2575 -21593 -82668 -123616 -119412 -104858 -112780 -128359 -119704 -86135
41246 -86135 -55253 -45966 -51314 -52064 -37573 -16128 -6324 -13055 -17711 -5641 4006 -19720 -68025
41233 -68025 -92717 -67880 -22246 5899 16553 25647 22131 -15020 -70991 -106265 -111061 -112173
41221 -112173 -122312 -118841 -85084 -41506 -16892 -11227 -6553 3648 16156 34845 64731 98073
41209 98073 125302 152991 192115 232037 244730 217494 170407 140291 153274 206660 266728 290070
41197 290070 260849 205123 158698 127709 94194 50889 8473 -27123 -57939 -72233 -48752
41186 -48752 5009 44970 40775 14158 4014 9665 -815 -33086 -52066 -32867 1547 10763
41174 10763 -11984 -38221 -45246 -39235 -36816 -39661 -36894 -26651 -23768 -41029 -67328 -73854 -46211
41161 -46211 -4237 17867 8503 -12978 -24393 -26367 -34777 -56101 -80042 -94342 -97315 -92496 -77740
41148 -77740 -47964 -9069 18781 18777 -4259 -30699 -50438 -70773 -97678 -120852 -125484 -110414 -85457
41135 -85457 -58777 -37470 -31438 -41213 -48378 -36119 -15128 -8608 -14139 -6086 20805 39103 31808
41122 31808 20382 30474 53385 66175 70173 79271 84176 63476 24953 341 -3168 -12125 -39994
41109 -39994 -64770 -68433 -67969 -84153 -103871 -102661 -89679 -98472 -136838 -173672 -179575 -159283 -137217
41096 -137217 -127623 -128067 -130809 -130094 -122607 -107429 -84928 -55503 -22893 2677 11416 4943 -6085
41083 -6085 -17250 -36723 -72431 -117241 -151731 -160222 -141297 -104396 -60456 -17339 18548 41097
41071 41097 47481 39996 22082 -4542 -33607 -49056 -37989 -12096 -4256 -34345 -85728 -125727
41059 -125727 -142284 -146486 -144055 -125819 -92546 -69154 -76456 -98459 -98619 -68677 -41280 -45270 -65427
41046 -65427 -64535 -37034 -17565 -32919 -67099 -87078 -86515 -83871 -87050 -85608 -78269 -81850 -101855
41033 -101855 -115577 -102094 -74504 -61312 -64337 -59009 -35859 -17124 -21997 -33784 -19291 25706
41021 25706 66327 65216 19435 -41442 -84987 -98107 -86869 -65620 -47826 -39043 -33243 -20451
41009 -20451 -2598 3443 -14727 -47548 -74456 -88491 -98484 -109006 -113020 -107270 -100758 -101437 -105501
40996 -105501 -106012 -102217 -95651 -88523 -89837 -107531 -127756 -120702 -79638 -36618 -23638 -35329 -48743
40983 -48743 -60784 -78726 -88904 -70199 -34368 -18732 -35706 -59423 -66748 -62283 -57410 -56234
40971 -56234 -71811 -121597 -187530 -211706 -159853 -69408 -8471 -2471 -25737 -49245 -65373 -72494
40959 -72494 -66526 -51926 -40319 -34518 -28675 -23638 -26411 -34354 -35030 -23099 -5624 8155 10398
40946 10398 -7923 -46869 -85554 -97416 -80509 -58422 -48232 -42716 -30374 -18681 -25284 -51720
40934 -51720 -76289 -74806 -45843 -13351 -1974 -10931 -18938 -14600 -8833 -11692 -13921 -6608 -4614
40921 -4614 -27548 -64785 -84795 -78660 -69184 -72190 -73091 -52918 -18069 9763 19000 10195 -15006
40908 -15006 -51370 -83768 -98282 -98240 -99416 -109641 -119391 -112601 -84410 -49611 -32575 -43676 -67047
40895 -67047 -79581 -80446 -89408 -113999 -133111 -121982 -83664 -45713 -30430 -35463 -40820 -31261 -14572
40882 -14572 -16844 -52696 -101925 -127492 -117799 -97719 -94062 -104495 -107631 -90837 -59229 -27601
40870 -27601 -11382 -16020 -29391 -35375 -38461 -58883 -98103 -130385 -139924 -142735 -152806 -150542 -114681
40857 -114681 -69125 -61091 -96732 -133835 -142389 -139598 -153359 -179265 -192221 -181453 -154848 -120923
40845 -120923 -85092 -58081 -52231 -68187 -91863 -104033 -91637 -56088 -14573 12220 17396 9238
40833 9238 -3697 -19948 -36888 -47476 -51373 -58865 -74696 -85114 -71477 -34495 3039 17978
40821 17978 6792 -15776 -33527 -41477 -42597 -37354 -24354 -11139 -11919 -26889 -35412 -23121 -6510
40808 -6510 -12460 -38593 -55191 -46140 -26096 -13667 -10259 -13480 -29316 -57763 -84248 -99057 -108928
40795 -108928 -115446 -100238 -51617 7645 41093 39312 21613 6210 -1370 1394 12135 15873
40783 15873 1130 -18395 -19511 -5092 -1215 -17957 -36277 -37482 -23494 -3568 15127 16807
40771 16807 -16617 -74542 -115650 -114217 -90116 -76090 -74660 -68582 -55745 -45764 -33308 -5238
40759 -5238 29150 43674 32423 15012 746 -24715 -65817 -95771 -88609 -57073 -38182 -49156
40747 -49156 -75223 -95867 -105331 -107107 -103594 -96584 -88999 -80914 -68107 -47449 -22194 -2594 -2395
40734 -2395 -29196 -71848 -102065 -99090 -72911 -53500 -55640 -64872 -61768 -47518 -35618 -28546 -19026
40721 -19026 -10938 -19573 -45228 -63375 -54474 -32587 -27135 -41614 -50582 -39435 -25941 -31847 -50951
40708 -50951 -62729 -65614 -74827 -91727 -99200 -92065 -91187 -115560 -153642 -175314 -165361 -135657 -109903
40695 -109903 -103630 -113433 -119439 -104383 -74856 -55703 -59926 -76920 -96288 -124949 -167045 -205595
40683 -205595 -225478 -238755 -259527 -266434 -227116 -157596 -116307 -127891 -149719 -134018 -91756 -67990
40671 -67990 -77652 -96281 -99221 -80670 -44542 -5094 10289 -12692 -48799 -58711 -40225 -29870
40659 -29870 -53201 -96951 -131899 -140027 -117067 -73606 -39560 -42960 -74457 -93256 -76551 -42290
40647 -42290 -15242 4325 24196 36564 31676 18552 11576 8254 -1382 -13365 -15027 -3587 14974
40634 14974 36750 55877 59731 43073 18616 713 -11626 -24234 -35128 -46843 -73752 -116526
40622 -116526 -145819 -136622 -105005 -83177 -71841 -50799 -26062 -25057 -45859 -53822 -37103 -24988
40610 -24988 -35530 -43139 -22232 8545 15184 -1136 -12413 -7407 1805 7154 11450 12241 1624
40597 1624 -18424 -37444 -51628 -64060 -73728 -77562 -79274 -83555 -86411 -83695 -83209 -94069 -108340
40584 -108340 -107312 -83751 -47169 -11988 8182 1895 -28744 -61564 -74088 -68301 -63728 -69785
40572 -69785 -78596 -81803 -79763 -75291 -71368 -73541 -82400 -86230 -73946 -52679 -39804 -40751 -47613 -55263
40558 -55263 -64083 -70665 -70921 -68565 -66285 -55826 -34130 -19754 -30350 -52524 -61502 -62863 -80328
40545 -80328 -106214 -106760 -82902 -79931 -118260 -157349 -156157 -131570 -121722 -123976 -112530 -94159 -97658
40532 -97658 -118221 -119243 -89010 -54115 -32437 -11861 14411 26659 8879 -26253 -57634 -78719
40520 -78719 -87500 -77035 -53446 -43790 -64401 -92008 -85651 -33948 31259 65556 50021 4219
40508 4219 -33798 -45390 -49501 -74517 -115592 -137507 -121203 -85992 -58596 -43079 -34822 -41494
40496 -41494 -67631 -93106 -91712 -64885 -36502 -19220 -5901 8755 18555 18999 13117 2206 -14612
40483 -14612 -30415 -35102 -32211 -36236 -49674 -57704 -51738 -44786 -55180 -85581 -126013 -168007 -206645
40470 -206645 -236323 -254130 -262265 -259396 -236095 -189125 -135740 -101122 -90949 -87266 -75129 -63737
40458 -63737 -73090 -104423 -133948 -138174 -118506 -95062 -79709 -64052 -36512 -3024 17957 19184
40446 19184 14497 22041 43293 63024 66781 53988 35709 24281 25085 33715 38993 32107 16297
40433 16297 5560 9456 20299 21837 12186 9747 28841 55438 59569 32669 772 -5024 17462
40420 17462 43730 50890 34222 1230 -37488 -69933 -85817 -84286 -75321 -70769 -76280 -91577 -112379
40407 -112379 -128795 -127705 -104294 -70756 -46713 -38217 -31882 -15164 2983 2606 -16645 -29912
40395 -29912 -19372 1191 7303 -1700 -8320 -10688 -26347 -60769 -96760 -122896 -148810 -179976
40383 -179976 -200777 -200376 -193856 -194951 -187497 -153257 -112582 -101151 -113056 -106861 -71917 -48547 -66670
40370 -66670 -99102 -101836 -76599 -61898 -72828 -80796 -56719 -13412 6398 -21929 -76506 -110893
40358 -110893 -103484 -78591 -73261 -92579 -112223 -118213 -120904 -127564 -126253 -108612 -88188 -79448 -72622
40345 -72622 -46854 -839 43014 60066 41977 2978 -25586 -19398 10867 27446 10481 -17535
40333 -17535 -21633 5340 42347 64242 54710 13217 -35266 -54144 -36180 -15695 -24794 -56684
40321 -56684 -89189 -118072 -139957 -129761 -75438 -16435 -1233 -16276 -5876 39340 65930 38947
40309 38947 -9673 -33604 -30891 -25549 -25983 -30196 -44480 -67951 -79608 -67178 -50918 -54326 -67654
40296 -67654 -65203 -45639 -31596 -38422 -62048 -88550 -101297 -91565 -75226 -81331 -109216 -119235
40284 -119235 -86802 -41608 -24986 -30798 -25400 -10241 -20535 -64590 -106778 -118853 -113131 -111384
40272 -111384 -109030 -87975 -47023 -3444 26448 38737 39957 37802 30908 12557 -11073 -20611
40260 -20611 -14646 -22786 -63095 -102801 -96606 -55639 -36507 -59643 -82134 -64701 -24244 2968
40248 2968 14176 25155 30232 14344 -10182 -15078 -263 2915 -25708 -70828 -102040 -102311 -75835
40235 -75835 -42365 -24867 -31272 -47616 -56050 -54767 -51990 -49029 -42682 -37394 -38895 -39945 -29419
40222 -29419 -14313 -15579 -39333 -66564 -75462 -62279 -37295 -13200 -3086 -17128 -50270 -79335
40210 -79335 -82948 -63797 -44676 -42131 -49157 -46328 -26632 -4150 2385 -11237 -36211 -64987 -93895
40197 -93895 -114168 -114212 -94473 -67839 -39586 170 54593 102904 119725 105272 82530 68433
40185 68433 61588 56420 54876 61095 73974 88159 97585 99249 98176 103917 115518 117575 102453
40172 102453 89007 103103 142794 180038 196482 199470 200522 197520 185538 168222 148701 123782
40160 123782 97414 85559 94846 109060 111518 109858 121514 143405 156487 156672 159990 175323 191874
40147 191874 199680 204739 213633 217623 205654 184300 171689 177211 198934 235343 284546 333116
40135 333116 361531 365392 359947 359016 360514 358363 355385 353054 339632 305568 265600 246717 253514
40122 253514 264083 265110 270917 294500 316233 302607 250091 190186 150846 130613 114053 95059
40110 95059 75932 57435 42660 42288 62381 90210 104072 97106 82374 74208 73021 69882 58376
40097 58376 39243 19307 7937 8739 12759 6360 -11854 -29408 -37988 -42782 -47199 -40684 -16307
40084 -16307 7638 3688 -27444 -55790 -63532 -67379 -88452 -118539 -134522 -132903 -127904 -123224 -110618
40071 -110618 -94969 -94243 -107594 -107015 -74104 -27487 1891 8802 8905 6111 -12522 -49298 -83111
40058 -83111 -92629 -81221 -69395 -67810 -67803 -60285 -56276 -79488 -136846 -203878 -245787 -248724 -224357
40045 -224357 -190927 -161727 -146538 -146320 -145090 -124386 -90277 -69249 -71320 -75482 -61342 -36687
40033 -36687 -19744 -11090 -1231 7241 5237 -3705 -8510 -8644 -11484 -19094 -32168 -55973 -84329 -90670
40019 -90670 -59531 -17586 -5745 -26003 -45060 -46796 -46892 -52278 -42867 -7863 30393 48554 55366
40006 55366 72351 98488 113631 105776 80387 53079 43417 62487 96153 115451 113433 113136 126908
39993 126908 131645 106327 73277 71122 97239 109330 83063 39355 9412 -1923 -6945 -8672
39981 -8672 -100 18215 34002 37687 34436 38166 53312 65431 54409 16543 -31836 -71293 -91111
39968 -91111 -85583 -53363 -6837 29847 40826 29823 8769 -13097 -25553 -18981 2584 24675
39956 24675 45281 76527 115711 138383 135306 132135 150917 174794 178094 170837 179364 197445 194908
39943 194908 168143 143944 134282 124554 109898 105565 111622 102193 65342 25200 8024 9913 12957
39930 12957 10861 3549 -12113 -30355 -34574 -22219 -12742 -17325 -22005 -16453 -15916 -33329 -51002
39917 -51002 -45628 -24417 -9741 -2742 8489 16608 4538 -17533 -18931 4737 22675 15004 -155
39904 -155 981 12189 12307 -495 -9919 -8230 -2566 2773 13179 29521 39853 32893 13023 -6767
39890 -6767 -24727 -53432 -98492 -140463 -147372 -107087 -42624 6662 17743 543 -12534 4982
39878 4982 49190 89404 100511 88569 77445 76211 73754 62754 50035 39559 24554 5813
39866 5813 -33 14716 28553 12205 -35057 -82586 -97107 -66819 -6535 50046 71723 56215
39854 56215 30710 19325 19779 18969 14721 8264 -6564 -25331 -20461 24992 81367 101948 84346
39841 84346 69417 78936 91436 88938 89092 108539 125162 107551 63103 25611 5997 -13452
39829 -13452 -39448 -52898 -39793 -13203 5874 12835 14321 12857 9394 11502 24591 38746 37569
39816 37569 20929 8335 15961 37791 53860 51532 34271 15035 6624 12818 21227 10303 -25425
39803 -25425 -60584 -63524 -35314 -8218 -3248 -9485 -13975 -28695 -66989 -109706 -122213 -99357
39791 -99357 -68928 -53601 -54696 -72372 -111097 -156701 -177204 -163072 -143060 -140094 -132590 -86373
39779 -86373 -10869 47821 65845 63293 63496 60010 37592 3080 -24964 -43716 -61649 -74423
39767 -74423 -69477 -55577 -62810 -100815 -136238 -132154 -99245 -82460 -97526 -108399 -80391 -33406
39755 -33406 -19204 -55608 -106875 -128003 -107338 -61887 -11062 33154 62800 74759 71500 54464
39743 54464 22269 -18234 -46185 -42966 -13809 14982 23193 17129 19452 39739 60282 56416 28858
39730 28858 5985 10021 31313 45125 44230 40126 37749 27469 3738 -24080 -43911 -52397 -52161
39717 -52161 -50173 -59890 -89472 -123897 -134417 -112329 -80254 -65745 -78879 -118296 -176284 -227921
39705 -227921 -240052 -210490 -179456 -180573 -196621 -188235 -152476 -123020 -118553 -121752 -111432 -89315
39693 -89315 -69109 -59916 -65702 -82583 -92985 -82368 -66205 -78233 -123320 -163978 -167494 -147595
39681 -147595 -141587 -160294 -181399 -185231 -176484 -169771 -169551 -170328 -168677 -168620 -174980 -182834 -177414 -150031
39667 -150031 -112488 -87665 -85637 -97717 -113292 -129647 -143170 -146424 -140617 -136549 -135400 -124888
39655 -124888 -105546 -102004 -129084 -161802 -163377 -133245 -100687 -77495 -49484 -16836 -7137 -32522
39643 -32522 -62462 -62780 -42835 -38639 -60510 -82711 -80589 -56189 -28312 -16250 -32709 -73466
39631 -73466 -111485 -119001 -100167 -86728 -97336 -116867 -121034 -104537 -76591 -44872 -15703 2683
39619 2683 8933 9871 4114 -20156 -57850 -75137 -47236 3023 28741 14897 -13575 -35197 -54224
39606 -54224 -75539 -85722 -72620 -44591 -17279 3942 17407 15521 -5727 -37661 -68061 -89357
39594 -89357 -93179 -73350 -42873 -29569 -41247 -51646 -36221 -5608 14189 17992 14923 870
39582 870 -32771 -70117 -82222 -68820 -60535 -74171 -91956 -94381 -88602 -88169 -83731 -55568 -7824
39569 -7824 28616 29730 5405 -11284 -602 20378 16073 -23981 -69586 -86843 -79755 -78216 -92147
39556 -92147 -100810 -87893 -63005 -41168 -22623 -4735 4235 -1695 -11668 -10480 3102 21006 38761
39543 38761 52576 53227 35966 10609 -8589 -17529 -19002 -13342 -2078 6929 8212 5702 2348
39530 2348 -8416 -30793 -56326 -77962 -103867 -140250 -167952 -157020 -105180 -45199 -10519 -4899
39518 -4899 -7589 1885 25199 42268 27076 -24505 -84040 -116786 -115593 -97483 -70951 -24487
39506 -24487 48681 129417 184964 196473 172163 140564 130771 149058 172619 174944 157864 148282
39494 148282 163150 190558 207721 204127 182757 152516 126291 113588 106929 87603 53478 28228
39482 28228 31642 52636 65559 63138 57369 55920 56371 60074 72552 89245 97645 96366 97230 105474
39468 105474 112587 112404 108316 99082 75479 41611 21994 31033 48846 47387 31468 31169 57579
39455 57579 90366 110916 123090 133564 135622 127357 126028 144448 167469 174073 172274 186749 216811
39442 216811 234512 227080 214466 215698 221822 216231 201164 186384 168963 145232 128212 127974 124773
39429 124773 91747 42054 21447 46988 83363 94849 92465 104443 121162 104366 45648 -17199
39417 -17199 -47208 -44253 -24839 6889 48016 76058 67016 29727 -141 -1730 12419 20530
39405 20530 16489 5730 -6703 -14455 -9354 6369 17200 14096 8118 13113 23585 23590 11303 -777
39391 -777 -7421 -17454 -38506 -67115 -94475 -111523 -109585 -87516 -56757 -27227 8505 61106
39379 61106 116872 144555 132552 99757 65630 32305 4510 1292 29766 66432 84848 87302
39367 87302 89822 90926 78231 53693 26895 -7041 -54986 -98001 -107598 -89462 -78926 -87665
39355 -87665 -87250 -57302 -17995 5633 23792 57609 94145 100623 77492 63572 82244 109289
39343 109289 107432 74795 43050 37698 56105 81064 101579 118218 138777 173522 226998 287793
39331 287793 331596 343469 336259 338982 365699 402997 429615 439297 439510 436857 433693 434866 447605
39318 447605 473812 507243 537558 555444 559788 564257 588232 632030 668585 672484 652910 643957
39306 643957 664133 699399 725890 734449 730385 723865 726123 742697 763713 770590 757500 736341
39294 736341 716385 691792 657136 623520 607938 613779 631467 652087 671031 683783 688175 688098
39282 688098 687877 686537 683201 681660 681712 672916 647971 617559 599482 595185 589371 571917 546379 515272
39268 515272 473332 424010 388599 383440 394385 390566 363311 334956 323716 315847 286049 235588
39256 235588 192900 178582 185130 191867 184737 158940 119188 85181 81706 111909 150854 173872
39244 173872 178369 169576 144525 107799 85306 96875 125059 135507 119831 93034 59242 14199
39232 14199 -22717 -19788 16145 37895 21686 -1571 2603 23266 31666 28352 30457 34020 24787
39219 24787 12983 21843 48100 66548 70424 75066 81584 70864 41539 22586 32346 49101 42389
39206 42389 16897 2496 8221 9162 -16658 -54227 -65860 -35223 13333 42099 39417 26027
39194 26027 28011 52323 84248 96522 65111 -4954 -67478 -70718 -14964 43846 58900 40914
39182 40914 27253 26077 18019 -1203 -11765 -1321 20027 38253 49258 53619 55637 67796
39170 67796 98355 133504 148539 137973 119416 108167 104225 104212 108763 116256 124160 136495 154872
39157 154872 164828 150372 121392 105722 112632 125515 132692 140955 152283 152267 133286 107617 85168
39144 85168 59576 31421 23262 49246 84844 91429 63417 29210 10477 3218 -1005 1224 10872
39131 10872 13304 -4682 -31291 -38275 -14272 22095 47688 62928 83316 109950 125588 120479
39119 120479 104182 86631 66421 47780 49289 78890 116366 138913 148166 151390 135944 94215
39107 94215 59284 75158 133087 175562 168582 135055 109897 99221 98336 115161 152343 190200
39095 190200 209017 210568 201991 178919 142404 113476 110381 123705 129425 115245 84068 47340
39083 47340 25619 37679 76063 109141 117360 110025 99396 82991 62985 55724 64712 69054 56645
39070 56645 43764 43247 40975 25971 14896 20020 21622 3558 -11199 3354 29065 32403 19481
39057 19481 18995 27114 16816 -7270 -11426 10857 28155 18700 -9144 -44165 -81482 -102902 -87275
39044 -87275 -46558 -17384 -12907 -16199 -20936 -38699 -62259 -64596 -44375 -31563 -35584 -28929 1816
39031 1816 29566 32665 30343 48372 81910 115917 150318 179517 178546 139711 96344 79854 77382
39018 77382 62666 44396 47527 65094 67942 52328 40997 41546 38293 26374 22889 37537 56225
39005 56225 63289 64429 78954 115924 160167 180059 156795 111442 91171 118785 167675 197304
38993 197304 198589 189159 179792 168445 158682 159815 169186 172066 160735 142805 132274 139322 161640
38980 161640 178128 163140 118752 80658 78222 100981 119887 127362 136094 149516 156531 149891
38968 149891 130642 100488 67177 48586 52208 60349 57225 59513 92458 142697 165726 140952
38956 140952 92721 55607 44425 59515 93148 124100 130919 118960 114053 125580 138716 145663
38944 145663 155376 164343 149688 108471 76173 83193 113211 127484 113977 89418 66998 47821
38932 47821 36423 39918 53733 67750 84689 114370 151072 175498 181788 186271 203798 227515
38920 227515 238343 226466 198542 169350 149730 139002 128035 112416 99892 99431 106809 110696
38908 110696 111436 120905 139811 148021 128560 94403 77797 92891 121074 137326 139298 140100 140912
38895 140912 127979 98479 73512 75438 100747 125284 130941 118277 98159 82213 78719 86208
38883 86208 90929 80748 61738 51289 55466 65442 77034 97828 128405 151783 153811 142696
38871 142696 133183 119965 87445 45060 29496 59715 105748 120855 97928 73684 76256 91028
38859 91028 90025 76479 77983 102784 126898 126613 103025 68648 30261 -4152 -20354 -15983 -9834
38846 -9834 -16324 -23361 -14711 -1859 -8105 -27514 -28870 -2481 24740 29545 23341 29585 50053
38833 50053 70107 82549 88327 83985 67359 50900 51955 69435 82899 76113 51883 23142
38821 23142 -559 -14533 -15397 -2927 16515 33474 44500 56226 76303 98742 104415 84043
38809 84043 56953 53936 78746 100243 91854 67282 61559 81706 95422 74342 33376 14300
38797 14300 37135 81691 116288 130656 135300 140667 148352 156874 164354 167557 167672 173372 186928
38784 186928 192674 176290 152734 152219 175531 189638 177929 166383 180283 202344 203969 196433
38772 196433 211760 244038 253747 231311 212759 219902 224970 198179 159535 152420 182958 215137
38760 215137 219320 201872 188272 194937 219281 245423 257200 251479 239242 232240 231753 229236 210959
38747 210959 165093 97601 40998 30193 64285 106651 127063 127150 120075 107723 91185 84312
38735 84312 98110 122738 139831 143008 134892 116648 94051 81800 87102 98938 105635 110391 116739
38722 116739 115028 101236 93970 110308 135810 141614 122783 96396 69953 39341 14829 18295
38710 18295 47383 67124 50235 10253 -17053 -14576 4974 22969 38098 60903 89401 103300
38698 103300 94655 94569 142735 226187 277873 252317 176761 106515 58040 18602 -2788 18625
38686 18625 73344 117827 128532 119853 105684 82342 59463 69043 123244 190532 233322 248149
38674 248149 252738 254759 251472 243395 231445 213046 192543 181963 183050 184854 186276 200974 231287
38661 231287 260339 281609 310865 352616 381286 378684 366757 375191 395411 398334 384595 382855
38649 382855 403080 423649 426421 417122 406836 397814 394293 405426 427218 438428 426325 405703
38637 405703 401784 420243 442089 445759 429719 412879 412094 420460 415057 389169 366016 370583 396302
38624 396302 413326 405149 382291 360956 343635 325367 308079 300761 308229 323256 330666 321902
38612 321902 306120 301118 311574 325095 333753 347180 374467 404263 417603 414358 412723 426051
38600 426051 452472 483026 507004 513723 503787 495497 504521 519161 512748 480758 447274 430642
38588 430642 421059 401868 378702 373183 392937 419409 427256 412273 397412 407283 435958 449108
38576 449108 425106 383530 359490 358996 359365 348108 335384 325307 302919 263120 230313 230028 255116
38563 255116 278703 290103 298691 309324 314389 309341 299024 286743 270709 253405 242339 238875
38551 238875 237182 236497 242364 251064 245334 215493 177402 158205 166371 184998 194866 195470 199344 211582
38537 211582 222836 223170 215868 210446 203814 179299 131584 84905 72367 96793 126189 133671 127337
38524 127337 128591 134696 125333 102467 97244 127701 169572 184101 162239 127666 108053 118285
38512 118285 158714 208344 228646 199859 151127 129803 141958 151925 142991 141831 166726 187603
38500 187603 169502 132161 127573 167583 211332 225668 223685 233030 254520 270684 278170 291864
38488 291864 322985 367162 412715 451837 482922 506703 523002 532699 541434 554837 567404 565023
38476 565023 545791 529423 534983 556594 573862 579049 578263 572522 558589 547530 560341 599256
38464 599256 640253 660228 657810 643602 625365 607742 591429 567811 530358 495791 494545 531510
38452 531510 575301 597768 605567 618688 636523 644372 638920 626037 604059 571341 543069 537537
38440 537537 548190 550320 535969 523118 527497 542616 553268 555095 554045 555668 560379 563853 560621
38427 560621 551886 546859 549508 550034 541527 539187 563842 604798 619388 580464 511463 461933 455377
38414 455377 472237 479455 464384 438343 416926 404886 399314 400364 412433 435772 463626 488955
38402 488955 506945 509387 487758 448910 416730 406433 405137 390877 363317 339723 326470 314238
38390 314238 299606 290164 285485 274442 258492 257075 278092 300174 298834 277338 257085 248640
38378 248640 248694 257374 280091 313744 345604 367308 380073 385126 376920 348989 305432 267010 260592
38365 260592 291335 327392 330776 308133 308643 358908 422722 446224 422634 385121 353673 325582
38353 325582 308440 318949 345086 350460 328775 317127 337262 358577 345390 311952 298476 312546
38341 312546 327565 327118 319066 311807 305289 303414 311012 319755 317533 308481 304279 302363 295227 293720
38327 293720 313617 343666 356717 350834 348054 352811 348087 338117 354153 401776 440309 438552 418615
38314 418615 415945 424206 414615 389821 380643 398407 424068 441734 455392 473129 496402 522304
38302 522304 538322 522997 473565 424639 414816 440800 468740 482540 491042 493379 473985 436895
38290 436895 411856 415197 430307 435916 429516 415582 397359 389681 411525 452082 471573 453033
38278 453033 427589 428223 443289 441531 422637 412082 417605 421809 415429 412233 427431 457967 487071
38265 487071 498698 490205 479331 491974 532941 576344 595320 591653 584382 581251 578212 577729 588053
38252 588053 608002 627768 640632 641146 620188 578604 538544 522581 526213 528707 525661 530910 549863
38239 549863 572074 589679 604056 614757 620345 628557 646319 662927 665882 669775 700073 747202
38227 747202 771937 766993 776867 833831 905012 935183 921403 908829 922636 941940 942847 932493
38215 932493 927653 926085 918664 914200 931069 969388 1008582 1032795 1045983 1059540 1076415 1093806
38203 1093806 1113283 1138709 1167336 1192555 1215747 1246413 1287647 1329354 1360895 1384529 1410992
38192 1410992 1446653 1489723 1533696 1569635 1591330 1603979 1620780 1644846 1663971 1671674 1680927 1702619
38180 1702619 1722450 1720762 1707750 1712493 1737611 1753487 1744709 1733893 1744219 1763637 1769498 1770113
38168 1770113 1792554 1837102 1873554 1884994 1889456 1908672 1936395 1954740 1970206 2012581 2096196
38157 2096196 2196877 2276215 2322704 2359475 2412581 2482614 2553670 2622502 2706673 2822728 2964495
38146 2964495 3106211 3222501 3304398 3362540 3419052 3492528 3586338 3691205 3798532 3908363
38136 3908363 4023937 4140971 4243414 4311244 4337732 4340854 4349746 4373797 4393145 4388500 4370921
38125 4370921 4367736 4386733 4414160 4444617 4487778 4540566 4578889 4593401 4614999 4683672 4800712
38114 4800712 4930156 5042573 5139822 5238183 5345657 5462783 5593933 5746742 5921971 6110089
38104 6110089 6300197 6491002 6690909 6907400 7139843 7384432 7640768 7908500 8182988
38095 8182988 8462589 8756671 9077595 9428455 9808223 10223067 10677862 11160026 11649763
38086 11649763 12147276 12672931 13239256 13841665 14480415 15171153 15926070 16742823 17619634
38077 17619634 18562636 19571372 20640241 21786248 23051363 24460139 25997272 27648219
38069 27648219 29441693 31427031 33626971 36042166 38691152 41616438 44857364 48444825
38061 48444825 52419878 56832427 61724531 67141161 73158232 79877374 87392924 95785140
38053 95785140 105141328 115553253 127086365 139771628 153623749 168625235 184656411
38046 184656411 201428774 218461948 235077718 250395032 263372694 272942928 278209433
38039 278209433 278642564 274209940 265390962 253055358 238258863 222051668 205348553
38032 205348553 188851347 173025340 158146345 144379558 131812413 120437482 110164396
38025 110164396 100888062 92536640 85046873 78326158 72269005 66795919 61852362 57382895
38017 57382895 53330267 49650581 46307922 43262166 40481174 37954421 35671906 33596731
38009 33596731 31680851 29902498 28265689 26766828 25384935 24103295 22917400 21819819
38001 21819819 20798818 19854639 18995237 18210065 17468272 16750972 16067705 15432632 14841919
37992 14841919 14285244 13763289 13279480 12826291 12393970 11983470 11596572 11221582 10846302
37983 10846302 10482246 10158325 9886186 9643370 9395879 9129291 8853726 8587415 8343913
37974 8343913 8130004 7944296 7774875 7605839 7431743 7262401 7108796 6967673 6827201
37965 6827201 6686193 6557509 6449009 6351463 6254562 6168385 6115871 6103663 6111574 6114691 6106784
37954 6106784 6096197 6087033 6074238 6053237 6023382 5982017 5926495 5865326 5814483 5772424 5709319
37943 5709319 5598743 5456513 5325979 5219170 5096335 4921602 4719742 4548836 4424669
37934 4424669 4306560 4163414 4018848 3909845 3827314 3730365 3608536 3495671 3419213 3365154
37924 3365154 3305692 3238909 3180687 3129259 3061029 2962872 2852397 2760346 2703104 2678083 2675056
37913 2675056 2679284 2668265 2622289 2545192 2464979 2405198 2361314 2313404 2256266 2205219 2173882
37902 2173882 2158248 2144407 2121874 2086857 2042896 2003642 1986987 1999319 2027427 2046971 2036682
37891 2036682 1990858 1929540 1891758 1899468 1925389 1916512 1857201 1788656 1754273 1748265 1738384 1718322
37879 1718322 1706590 1704896 1693814 1670648 1656745 1656474 1639981 1586951 1524378 1494574 1498342 1497806
37867 1497806 1472905 1448683 1458531 1499162 1534580 1533723 1491893 1423882 1353463 1308779 1308421 1340628
37855 1340628 1367203 1361702 1338097 1328537 1338787 1345008 1334144 1323244 1328583 1337390 1329085 1309272
37843 1309272 1299554 1301937 1297893 1280864 1265636 1261508 1257791 1244354 1228283 1218684 1209239 1189136 1161536
37830 1161536 1138422 1124041 1115609 1115330 1128323 1148791 1159157 1146601 1114940 1077812 1044264 1014547
37818 1014547 988979 976818 991124 1031934 1077926 1101435 1093531 1071388 1060404 1071457 1094726
37807 1094726 1112572 1118719 1125857 1150447 1188422 1214822 1215039 1206895 1218403 1250678 1281004 1299414
37795 1299414 1319792 1350288 1374483 1372853 1346123 1306310 1261537 1223405 1211490 1229964 1252130
37784 1252130 1250955 1236413 1238146 1257045 1263392 1245004 1225961 1224900 1221613 1186440 1124785 1068616
37772 1068616 1034879 1017036 1011114 1021275 1036152 1028037 991264 962383 981451 1041908 1097624 1115912
37760 1115912 1105621 1093104 1089900 1091960 1095594 1100766 1105099 1105647 1103695 1099988 1088813 1065059 1034171
37747 1034171 1006153 981588 953577 923545 903742 898916 893939 867823 818244 767584 745142 763924
37735 763924 810543 854286 869487 855154 834097 829806 842327 847904 823698 772168 719370 689877
37723 689877 686738 696762 709140 722626 738579 756517 776050 793822 799083 785322 769043 780551
37711 780551 825541 869347 874302 843961 814813 811331 826759 844022 855504 860148 858103 853340
37699 853340 849715 842478 825962 809688 810997 828909 841534 834402 815930 799469 787351 781244
37687 781244 790695 817641 845396 857286 857323 860910 874363 893872 912896 918128 891534 834892 783115
37674 783115 772567 799776 829827 842395 849362 867177 893981 920880 946871 970809 982360 975980
37662 975980 967604 983095 1028685 1081591 1114206 1124347 1136782 1173508 1226642 1267075 1278903 1275282
37650 1275282 1276253 1283077 1286458 1291068 1312513 1348699 1372457 1362746 1332836 1316177 1329344 1359753
37638 1359753 1388525 1413274 1441925 1471743 1487623 1484783 1482639 1504955 1550429 1597531 1639899 1699151
37626 1699151 1790867 1892170 1964278 2004920 2058222 2166075 2323672 2491730 2641540 2776749
37616 2776749 2919512 3092417 3315146 3602361 3952494 4344108 4755538 5190135 5674622
37607 5674622 6229400 6843911 7477716 8071806 8553471 8846817 8900568 8711112 8315517 7769763
37597 7769763 7140633 6500927 5903613 5357421 4846192 4371900 3957041 3605109 3289726
37588 3289726 2994595 2736171 2529096 2355676 2194378 2055935 1959494 1887686 1800384 1687231
37578 1687231 1573320 1473793 1377363 1282445 1217549 1206817 1233242 1252835 1236040 1185926 1125278
37567 1125278 1074522 1036265 997784 954104 924491 931309 963033 977550 949196 896949 857159
37556 857159 842119 836602 824544 805874 791099 789280 801007 818362 831250 833917 825290 808256
37544 808256 792395 789296 797241 799596 788909 780753 788257 797511 792694 792610 826596 878020 893672
37531 893672 858436 819588 817607 831439 822442 800352 804598 838154 863107 858273 843798 843932 856664
37518 856664 871218 892306 931831 988590 1047829 1095884 1130386 1160316 1197976 1247523 1301676
37507 1301676 1351395 1394341 1431635 1464701 1500523 1550094 1613837 1678207 1734933 1791656 1852098
37496 1852098 1898677 1911460 1895076 1868931 1837048 1785837 1708608 1616795 1530434 1471019 1455545
37485 1455545 1478269 1503662 1498927 1471761 1455414 1458268 1452309 1414201 1352871 1287719 1221552 1148951
37473 1148951 1075735 1014984 971016 936394 899759 854218 806745 779296 787638 817740 837598
37462 837598 833597 817762 798183 767085 727198 703777 711382 727935 723066 697194 670251 645743
37450 645743 614171 584561 580827 603483 622911 620499 613123 622379 638722 636776 616083 604305
37438 604305 619995 650150 670702 676366 680572 693514 711681 726539 731361 717246 675387 613746
37426 613746 564034 557100 589687 626542 639213 633508 633876 650778 673027 686008 685949 677648 668797
37413 668797 668725 684097 710526 732256 734906 718357 696129 683068 682923 684914 672306 638389 595714
37400 595714 565164 552195 538025 501439 448209 409203 404533 417513 413435 379645 334681 298658
37388 298658 271351 247940 240832 266178 312985 346704 349385 339654 341817 349260 337141 305431
37376 305431 286200 301377 332075 344903 336200 329406 333672 331131 312213 298166 308573 323344
37364 323344 304364 249803 199805 185434 196927 210276 220440 232728 241878 241950 245228 268383
37352 268383 303578 322316 308812 276703 253106 255717 282011 310257 315045 292767 267794 263691
37340 263691 275513 282912 281115 280267 279981 267000 239441 214110 205495 211725 222651 227597 216545
37327 216545 191836 179124 205848 263961 313096 327229 320440 319821 331648 344339 348786 344464
37315 344464 337070 337761 353094 371406 373343 358390 342579 328017 300462 265130 255211 286976
37303 286976 331900 354750 356436 355092 347622 321665 289775 277438 285101 293212 298640 314100 334396
37290 334396 336757 318183 302274 302503 306096 302096 298262 298666 289933 265548 242732 236937 236038 219812
37276 219812 193985 184211 200292 224266 235953 237625 247335 273141 300929 310530 300325 286954
37264 286954 278669 263064 233163 212326 229722 273667 295198 266399 215018 187918 194498 202265
37252 202265 182275 144730 127000 150681 193474 209186 179932 139589 133768 165643 200412 216332
37240 216332 223037 227270 213349 174064 135765 130164 156106 187999 208021 211243 193760 160043
37228 160043 133642 136908 163505 190015 208564 225703 233890 212328 161885 116018 105824 128544
37216 128544 158007 172394 164958 142568 124650 132147 164959 196456 200491 179698 158616 152499
37204 152499 152660 143961 129505 130392 157662 189222 187051 143230 96343 87742 110718 124722 116490
37191 116490 117523 150789 188715 188857 154249 128055 133333 148327 147291 138910 147553 172785 187920
37178 187920 174289 141118 111158 98728 105148 126215 156709 189896 218067 235606 241267 237310
37166 237310 226655 211493 194947 181954 175226 170988 163029 151389 141621 133780 119540 95312
37154 95312 71049 57508 50693 41040 34614 49101 85961 122831 142062 152671 171134 192005
37142 192005 195389 177990 157813 148342 146479 149841 167041 199304 225332 220629 188715 161699
37130 161699 168175 203818 232129 215048 151512 87897 77924 125071 177560 190776 178766 184548
37118 184548 213678 229163 210939 184557 176725 173450 148296 110595 92766 100102 108006 108349 122935
37105 122935 161023 196709 208809 215853 242770 272355 266451 229416 212881 249348 311270 350518
37093 350518 354491 344822 339500 339112 339864 337697 323258 291504 255322 234193 229942 227576 218871 209860
37079 209860 204043 193653 172410 145542 122805 109755 106160 103152 84371 45281 11213 16857
37067 16857 62083 106646 117613 104033 93802 96410 106289 124230 149298 160351 135471 89084
37055 89084 62866 74801 100540 112393 113343 119247 128176 127642 119753 117653 122068 120871 111253 104363
37041 104363 104348 98374 75519 45388 29145 37114 60400 79326 76604 50587 22196 20504 51618
37028 51618 88496 102536 97466 95410 95934 75335 31361 -360 6952 30695 31710 11967 5951
37015 5951 20921 25097 3514 -11793 10981 54500 79002 78239 76382 80913 75283 58649 56987
37002 56987 82040 107741 107762 96810 109849 149384 178537 168761 135600 118527 136125 171058
36990 171058 194789 197350 190961 190750 198455 205475 206535 205697 210591 225806 251999 285340 314234
36977 314234 321496 297696 254272 218949 214000 239238 277237 311899 337094 349342 342502 316260
36965 316260 283855 262132 255247 254815 252764 244670 224335 190419 160044 158163 184557 206230 195695
36952 195695 165966 153113 172380 206725 231713 233870 208603 161165 113659 94380 112747 153509
36940 153509 196005 226469 232227 204329 155715 121051 124133 152527 174485 174722 165293 167560 191706
36927 191706 228755 255791 254578 230932 209052 201924 198457 188669 187452 214291 255679 270565
36915 270565 238366 185169 153554 157795 179077 196795 209971 226241 241254 239717 216423 186342
36903 186342 166383 152819 129452 98075 84436 104455 137829 151034 138966 125200 123603 121335
36891 121335 105675 87553 84068 90787 89565 79036 79353 103514 137096 153914 145441 128209 124838
36878 124838 142592 169734 188750 190965 179077 159170 135558 114820 108318 123067 151167 175340
36866 175340 186110 188281 190755 197643 210500 228965 244418 244538 233427 235766 265691 300132 304193
36853 304193 279790 262875 266859 258252 207810 142326 115354 137306 166551 169002 155830 155019
36841 155019 173619 202306 233387 254757 245437 202890 163605 168243 208327 234648 223399 207299
36829 207299 226597 271443 297998 291160 281150 293600 311524 306219 287381 292688 330072 360942
36817 360942 352911 325135 320583 349665 386795 413256 434242 455122 471962 493107 540820 615989
36805 615989 685051 721053 737551 760427 785200 790773 783483 795074 837922 889824 926379 945106
36793 945106 953114 952649 945950 936997 922625 896996 866533 842403 818258 779794 739585 732110 761976
36780 761976 787351 775176 745927 737425 748083 749204 735741 725347 714995 680726 624789 585239
36768 585239 585913 607023 619811 622852 625580 620551 597561 570891 566987 588776 608871 596324 541972
36755 541972 465675 406750 394213 414347 421093 392142 357497 352489 361700 342600 294749 264352
36743 264352 274422 289846 271355 233163 218047 233911 247437 235096 210423 195032 186058 166880
36731 166880 137803 118580 120030 126191 113697 83995 64133 72836 97750 114623 118070 119884
36719 119884 126021 133441 143706 157705 159935 134801 100876 98285 131498 155829 138910 105264
36707 105264 93466 97007 84294 57788 49678 65909 77612 70644 63573 67395 64713 44992 28745
36694 28745 35862 54343 61719 58018 56785 59591 60058 60476 65259 68580 66186 69036 86576 104906
36680 104906 101087 75119 51385 50944 75347 113542 151250 175910 183296 177578 160211 128737
36668 128737 94357 84764 111910 148114 154930 129273 100748 89038 87297 86227 89223 97595 102286
36655 102286 100600 105473 127078 156102 175041 178858 177388 182956 200112 222118 234739 229140 212764
36642 212764 202496 208072 228310 259111 293276 314784 309013 281667 254161 236622 219601 197331
36630 197331 182344 185564 195156 190750 171645 155921 154647 160892 164445 164710 165683 168533 174291 184865
36616 184865 193659 183216 145524 102901 92736 124616 165826 181215 175902 180024 198807 204379
36604 204379 180667 149112 135973 137459 137969 143835 170367 204950 214702 193696 176798 197088
36592 197088 247380 294454 319160 331473 350971 379783 396167 377702 332376 297441 299194 323150
36580 323150 335684 325248 306403 292404 284364 281959 282553 272140 239915 201346 183329 184842
36568 184842 176689 144466 107121 85934 79502 79691 89351 110548 133567 150175 162321 169515 166784
36555 166784 163657 181352 216521 230698 196230 135263 91698 77698 69568 48160 23102 18821
36543 18821 47987 95758 126495 116576 83508 66308 73880 76834 59278 49121 76175 124487
36531 124487 152382 143481 114349 86396 72459 76440 84368 70820 34942 11505 23149 43565
36519 43565 36882 10980 -3632 -6357 -14583 -16163 14621 59245 66031 24435 -19933 -34495 -37283
36506 -37283 -49902 -58221 -44932 -25161 -21737 -31518 -40075 -45724 -47104 -31182 2263 25033 13819
36493 13819 -17181 -37714 -38044 -23228 9564 60599 107270 122398 108209 90739 84820 83036
36481 83036 74840 59477 43089 36480 50356 80071 102301 100499 86218 81101 86031 84750 71580
36468 71580 57288 50066 47565 47586 52190 60311 68701 81117 104854 135371 153687 143806 108972
36455 108972 68729 41232 27850 15013 -7443 -33821 -54391 -72702 -96294 -113789 -102994
36444 -102994 -66364 -35764 -31079 -35230 -25373 -8332 -3662 -7597 483 24261 47318 59059 61572
36431 61572 53899 32145 5642 -8601 -11446 -22566 -49787 -74141 -74410 -54263 -35112 -29674 -32229
36418 -32229 -32556 -31845 -40956 -63143 -83687 -84421 -67395 -52553 -49131 -43913 -25839 -6907 -4510 -15553
36404 -15553 -25937 -36701 -59863 -91733 -111041 -106134 -87851 -71306 -57519 -38255 -11126 13887
36392 13887 20474 1623 -27765 -42352 -36479 -30670 -38132 -41513 -22774 -1574 -13622 -53973 -73417
36379 -73417 -39554 23149 66005 68999 47149 19891 -7115 -34318 -56807 -64509 -52060 -28701
36367 -28701 -15251 -24934 -47897 -60252 -47004 -12169 28037 55838 64009 66815 89332 133633
36355 133633 166740 159541 127428 110523 121771 140911 155004 172924 195297 201232 178175 141747
36343 141747 112461 91987 75134 67680 78442 106551 145965 189165 220308 222600 200775 178313
36331 178313 164764 147134 122314 110584 119360 120412 89614 48845 37380 54628 64195 49824
36319 49824 34864 41954 60395 65058 51174 38595 48183 79941 112599 125594 121851 120630 125395
36306 125395 115098 78898 42327 37392 57102 65000 46868 27848 34828 63533 90182 98244
36294 98244 85246 57879 30314 16766 16585 14706 3712 -3454 8211 31477 42067 27389
36282 27389 1763 -9564 2907 25520 38373 34538 21147 7715 543 5243 23380 44032
36270 44032 49159 33993 15788 16501 41084 75603 100339 102565 85736 70726 79205 110546 142627
36257 142627 157470 155173 142177 124370 117898 144315 199328 244058 245797 213722 177397 146857
36245 146857 116500 92569 87010 92068 90632 88254 105454 137859 153364 135293 103866 86860
36233 86860 89081 97508 98423 84369 61450 52462 73739 107305 117905 99969 82764 84946 93089
36220 93089 94740 101250 119469 128339 108637 76647 63136 72413 85077 89781 89560 85172 74260
36207 74260 62270 55733 49387 36441 25977 32909 55041 76722 91685 105881 119982 125116
36195 125116 116356 98582 80218 70537 77473 95856 104087 87435 60081 48825 59175 74051
36183 74051 82379 89742 100608 108977 110743 109824 108058 102417 94863 91138 87865 76212 60752 56512
36169 56512 62068 56305 33853 23919 53180 101265 117339 80894 26742 4048 24764 60848
36157 60848 81310 78618 62287 42552 28291 31275 57730 94789 117590 115844 104935 104436 114874
36144 114874 125440 135794 154777 180544 198366 200818 196791 196335 198701 201085 207752 221990 237848
36131 237848 249458 262189 283699 306508 309898 281383 231183 184467 162686 171435 199822 227139
36119 227139 232742 207226 160841 120580 110542 128409 145418 137852 116322 112945 137967 162239
36107 162239 152204 113619 86226 95922 126407 144171 139901 132467 137373 148076 151955 148543 140909
36094 140909 122555 91509 69731 84087 125770 152672 141700 117293 114155 132672 151755 167662
36082 167662 191700 219177 231241 226273 221480 221083 210301 186800 171217 176016 188251 195474 204284
36069 204284 216820 213259 181621 146749 141654 159979 163989 135572 94547 66657 56465 55923
36057 55923 60263 67821 76776 87359 98243 100331 85618 62664 50785 57615 74167 91535 106884
36044 106884 111631 93297 58003 34303 40743 60794 64670 48458 35757 43189 59868 64344
36032 64344 50237 28278 9497 -5688 -22981 -44985 -68138 -84714 -84738 -59892 -12692 38252
36020 38252 70264 77642 74537 73845 72452 63819 53633 49450 42984 20854 -9846 -26050 -20720
36007 -20720 -11379 -11783 -14576 -11255 -9585 -15758 -16200 1995 23705 22494 -116 -16061 -11797 -3714
35993 -3714 -5684 -4336 17717 49725 63715 51546 33512 30518 42204 55844 65308 74520 88337
35980 88337 105845 120228 122826 110861 93279 84669 90735 104326 118674 137941 168146 203264
35968 203264 229812 242679 247130 248053 249609 263712 300563 344888 360302 331554 289155 275212
35956 275212 294757 319951 334535 349757 376215 403774 416863 412120 393901 368049 346451 341561
35944 341561 348980 351236 344958 344905 352571 345134 312392 281934 283551 305939 315470 304281 290349
35931 290349 279937 262866 241164 229297 225121 212895 198456 207436 240997 268852 279479 299898
35919 299898 343058 371334 346593 290499 255347 251075 242946 214559 189611 185971 187444 176224
35907 176224 162340 160247 158394 135626 95969 66516 65580 87410 114181 130474 129582 118524 116274
35894 116274 134957 160079 159457 118600 61869 29904 35458 49154 34682 -6719 -36963 -26730
35882 -26730 11351 42037 49992 50615 63172 87766 111015 122711 120790 106901 84577 61322
35870 61322 49009 58785 90685 127387 145672 139669 126766 124865 131827 135292 131980 123696 104626
35857 104626 72581 46500 48269 67161 67841 39104 9268 3427 11331 13728 15394 27456 36061
35844 36061 19760 -10650 -20734 -722 22519 27028 24184 34067 52323 58909 49776 42623 51570
35831 51570 67588 69207 49498 26700 23107 35025 34418 6537 -25533 -28640 -5569 6836 -11731
35818 -11731 -36422 -31607 -519 17815 -877 -34675 -41494 -7933 38168 62573 60561 51584
35806 51584 48134 46281 45842 58723 85725 101961 85101 49951 33638 48411 70010 75350 70282
35793 70282 70679 74159 66573 47164 31222 29001 32887 27723 8893 -12022 -18976 -7986 10936
35780 10936 29193 48914 70611 82225 75931 69071 86700 122882 142287 126317 94799 71529
35768 71529 52848 29210 16103 34831 73029 93858 83897 67359 69337 86202 98962 98110
35756 98110 86172 68869 53358 46387 46673 45668 40796 40383 50106 61922 63799 56186 51470 57525
35742 57525 66989 66289 55410 54082 80642 124935 153982 150676 134747 134610 151074 165890 175045
35729 175045 188462 200569 190250 156099 125353 116590 117393 113202 113337 126080 129721 100162 56302
35716 56302 43314 70244 95904 85637 54913 40685 50667 63194 66335 72829 94693 121378
35704 121378 132480 123642 110036 106207 111339 117645 125435 139978 155881 158318 144961 133604 136962
35691 136962 140828 123960 93087 77197 86682 100013 98180 92124 102425 127333 148294 157431
35679 157431 161440 163057 156078 138620 117708 99886 88155 87090 98884 114506 121117 119075 119565
35666 119565 125198 127111 122845 120557 120634 110896 89575 76016 84224 99446 98306 82133 71373
35653 71373 73286 75044 66967 54423 46535 49406 69564 105273 133244 125787 88598 62264 75838
35640 75838 115496 149747 167787 177643 182429 178876 170149 161389 149317 133031 126487 140347 159109
35627 159109 160043 150010 155406 174915 174240 138279 98242 87244 93592 84259 57415 40767 45405
35614 45405 52624 48681 44809 53416 66637 72288 74957 85048 96747 93695 73483 52610 45864
35601 45864 50215 51239 38979 15751 -6463 -14547 -4578 13979 26895 29088 27508 30107 36395
35588 36395 41267 44061 48686 55124 55128 38855 5595 -32576 -58477 -63169 -53154 -43172 -40895 -40568
35574 -40568 -32741 -16347 2286 18183 29114 31196 21618 5625 -7436 -14843 -17517 -7228 27047
35561 27047 74069 99436 84507 53808 46578 70591 102803 125791 137726 130671 91115 30044
35549 30044 -15304 -23761 -12698 -5451 -519 8622 8126 -13398 -34190 -24565 6244 22626 19393
35536 19393 30064 70693 107969 100619 50455 -5467 -37431 -41334 -27787 -11142 -3240 -4604
35524 -4604 -4986 915 6271 6864 10967 23744 33242 26762 13736 16174 38827 62696 68308 54751
35510 54751 35638 26108 35007 61143 92959 114622 114743 91817 56785 30252 27868 44016 57730
35497 57730 58157 54247 55484 57181 53029 46808 39102 17950 -19603 -49953 -48702 -24816 -6408
35484 -6408 -136 9812 27692 40775 48375 65597 91434 102380 89440 74658 75561 77435 59286
35471 59286 26462 -2478 -23136 -38574 -41991 -29491 -17053 -21181 -33147 -35241 -31559 -37060 -46038
35458 -46038 -41729 -32049 -42322 -69924 -78483 -46480 5889 49072 76880 93292 93476 79508 74349
35445 74349 94320 119678 117637 88329 64378 66300 80006 81556 65507 41725 19064 3019
35433 3019 884 16938 42604 58863 52534 29430 8642 2139 2810 -2470 -10494 -2983 25700
35420 25700 52754 50239 20258 -4911 818 30279 56041 62674 58276 56964 60241 60932 58949
35407 58949 61942 69346 67550 48042 20720 -1497 -22380 -50841 -75594 -72782 -40392 -3280
35395 -3280 22905 50925 92483 130004 137216 114168 81966 53796 32153 24998 38989 59482
35383 59482 61473 41594 18092 -720 -22945 -44260 -40637 -3337 41330 64478 69816 78403
35371 78403 92532 95777 80820 57180 34785 17121 8989 15136 30184 42492 48420 51685 49954
35358 49954 35899 13047 -3388 -6684 -8574 -22595 -45886 -64520 -70933 -69112 -65726 -62107 -55121
35345 -55121 -44258 -37429 -46082 -69571 -88321 -82818 -59209 -43580 -46997 -50084 -31948 -2080 12484
35332 12484 5201 -3565 1396 10225 7607 -2191 -2249 12970 32543 44686 47619 46295 46139 49404
35318 49404 52910 52792 55744 76798 115494 143218 131631 89734 53158 38354 31592 25664 35464
35305 35464 61577 70617 42613 15201 40385 106985 149606 137221 109074 107337 115310 92983
35293 92983 44849 12818 13817 22601 17842 12616 26678 50225 53145 22809 -20713 -48338 -54911
35280 -54911 -62903 -89635 -115669 -100028 -32178 45859 82771 73521 56070 60196 79214 90748
35268 90748 85212 68825 54261 54923 75753 102761 111742 93419 61633 33700 14512 4983 11466
35255 11466 34435 57053 59498 42312 24853 21164 25943 25375 15511 7535 16864 46889 82432
35242 82432 101400 94617 72387 51803 42250 43857 52583 62047 66261 67149 75830 99800 130714
35229 130714 151008 151960 139958 125599 112922 101141 91103 84596 78751 66684 46654 28241
35217 28241 25130 40647 63296 77800 77744 66489 51038 39227 38159 48072 59157 60725 52837
35204 52837 43200 34128 20318 244 -17882 -24396 -16609 3932 36955 80179 121151 137533
35192 137533 112608 56223 7027 1415 34538 62452 51126 12723 -17824 -29143 -36607 -47612
35180 -47612 -49324 -32791 -6881 17111 35479 41501 25130 -8322 -37021 -48151 -47546 -38907 -17420
35167 -17420 5793 798 -39330 -76661 -72786 -37279 -6993 6031 17111 32606 43696 50550
35155 50550 61949 72537 68368 54571 50854 59514 64668 63737 71433 89375 100082 96660 91485
35142 91485 89952 83570 74904 78319 87468 76169 45163 32342 56252 83935 80570 57597 40269
35129 40269 20799 -14178 -36588 -9257 48542 81585 82034 98407 152519 199482 193341 150599
35117 150599 117856 106858 95171 71306 45649 26201 11907 6327 15411 33808 51868 73165
35105 73165 106371 141388 153702 135964 108132 89960 77576 55715 21635 -13998 -42572 -61719
35093 -61719 -67124 -53421 -27382 -10488 -19089 -44661 -62188 -58401 -43299 -31090 -20133 -1235
35081 -1235 21142 30694 23967 20895 43007 86214 121099 118803 75392 14882 -29158 -38347 -19877
35068 -19877 5893 24538 31927 26964 11129 -6154 -13599 -11852 -11529 -16048 -18270 -16785 -20507 -30061
35054 -30061 -30281 -13383 4346 5053 -3231 -1976 3162 -11437 -46104 -68766 -56431 -24830 -2937
35041 -2937 5071 13722 23010 14587 -17466 -50317 -56468 -36270 -17408 -23089 -46635 -60251 -46202
35028 -46202 -13575 17317 38733 54420 60585 44638 6718 -32114 -51129 -47456 -25166 16172
35016 16172 66500 94512 77158 34289 8932 14486 26934 29583 33224 41928 33094 -5021 -42785
35003 -42785 -46520 -27426 -19709 -23498 -8388 30648 62012 68117 68497 77930 76939 47078 8310
34990 8310 -5584 9213 30849 43178 40350 17358 -17590 -35804 -21503 -624 -7051 -32350
34978 -32350 -43744 -41953 -57627 -90636 -101262 -75636 -55119 -75382 -113393 -126958 -117561 -116502
34966 -116502 -128708 -131005 -117550 -108075 -109459 -102494 -75761 -47621 -42013 -57720 -72072 -67063 -46436
34953 -46436 -31370 -38230 -56277 -54467 -18526 28219 52416 47923 30550 8832 -17536 -39412
34941 -39412 -44891 -40784 -42088 -42764 -24211 8464 29351 33058 39943 53566 49750 22862 6547
34928 6547 24468 51586 53668 39443 40083 56202 60782 42794 14510 -15758 -45567 -59988 -45685
34915 -45685 -21191 -19972 -42423 -57327 -54059 -58190 -84665 -107779 -94811 -45493 16799 70244
34903 70244 96161 80236 34135 -1484 2366 30346 47368 42432 29758 19817 12377 11286 23316
34890 23316 42589 53191 48547 37139 30815 36325 52864 67741 61487 29108 -10467 -36905
34878 -36905 -50168 -56761 -49248 -21872 4662 3140 -18703 -26337 -9765 4116 -2370 -11559 -5871
34865 -5871 1459 -4054 -3340 27262 66590 67282 24108 -12231 -946 39160 65505 73572 93096
34852 93096 132374 160418 152467 126023 112638 111883 99569 73896 61685 72214 75013 43499
34840 43499 -1172 -16666 3636 30645 49068 70917 95426 92525 45049 -19235 -59524 -66147
34828 -66147 -52914 -27257 4154 16683 -10861 -60916 -93867 -99068 -100764 -113081 -120529 -109906
34816 -109906 -91561 -76937 -61662 -45242 -42269 -56373 -66030 -56177 -42283 -40757 -37844 -16689
34804 -16689 4274 -4128 -31769 -43382 -36866 -44005 -69941 -77748 -48859 -16936 -16112 -30812 -28985
34791 -28985 -16450 -19984 -37018 -44565 -46703 -68212 -102184 -108881 -76810 -44563 -43746 -55197 -47122
34778 -47122 -27878 -28300 -50011 -66600 -69076 -76811 -101092 -126136 -134671 -130245 -122681 -109026 -84002
34765 -84002 -58663 -52428 -68612 -89376 -96133 -87707 -76382 -71773 -73265 -76069 -77975 -76431 -64345
34752 -64345 -38131 -10044 -1781 -20093 -47041 -61686 -63713 -66195 -72458 -73625 -65869 -56247 -51283
34739 -51283 -51747 -59043 -74525 -91222 -98722 -98006 -98283 -97132 -80328 -47602 -21718 -20844 -35851 -47496
34725 -47496 -52728 -58630 -62858 -60656 -63732 -88833 -127957 -151770 -147343 -134108 -135243 -149045 -157633
34712 -157633 -150776 -131497 -109869 -101781 -122609 -168170 -209101 -218576 -202312 -188646 -192469 -203960
34700 -203960 -212892 -226748 -256241 -294255 -321062 -327203 -322809 -325053 -342566 -372590 -407936 -442675
34688 -442675 -471508 -487306 -484752 -469392 -458720 -466615 -486397 -496995 -488659 -474352 -469527 -468336
34676 -468336 -451447 -414954 -377948 -357138 -345350 -324917 -295437 -273925 -266008 -251304 -209139 -152091
34664 -152091 -116789 -116907 -121321 -93778 -44380 -19009 -36673 -62719 -57494 -29862 -18958 -36342
34652 -36342 -55587 -55547 -43432 -30168 -12310 9504 20778 19316 28279 61993 98745 111999 110427
34639 110427 117847 128888 120458 98191 90341 95171 78016 32570 3349 23300 62173 67477
34627 67477 33846 -148 -8724 -321 9921 19205 28608 37825 49667 64500 73415 71471 70767
34614 70767 83042 97132 94358 79469 72380 73633 65229 46034 38023 51285 69087 77032 82021
34601 82021 89155 83236 52412 14387 141 20763 63585 110103 144163 153927 142253 128472
34589 128472 126330 126871 115240 95540 83583 81213 74501 55464 31650 14904 11756 22894 41499
34576 41499 55358 61875 76208 110056 145994 151664 121721 87381 76606 80465 71137 42527
34564 42527 17405 16614 34429 48735 48465 43799 48815 59707 57745 35465 11101 7742 22381
34551 22381 28895 14148 -1884 9012 46563 82050 92128 80301 63166 48102 33277 21299
34539 21299 19225 25797 31468 34991 47893 73986 94672 88289 58996 31556 18963 11327 -1002
34526 -1002 -11327 -12383 -12515 -21480 -29801 -18840 11736 40944 51310 45356 35856 29848 26582 25127
34512 25127 29060 43875 69126 92657 97652 79925 53824 35735 26762 18715 11389 12267 20556
34499 20556 23717 13760 -474 -1394 20016 54851 80353 75661 40925 1295 -14224 771 27986
34486 27986 46558 51455 51377 55261 62061 61205 45565 25572 21616 35400 40429 16153 -17462 -21737
34472 -21737 6539 28521 17457 -5826 -6681 15223 33642 38000 42285 56459 73202 84552
34460 84552 89877 82389 49884 842 -29283 -17304 13547 21264 2918 -101 39517 95050
34448 95050 120238 106661 83951 72380 63606 50811 49725 74671 112728 139874 150638 154192
34436 154192 151417 136034 112593 92639 75487 53346 34733 39252 63030 71372 38624 -19549
34424 -19549 -65877 -81737 -76218 -65652 -57961 -52084 -41923 -23212 -2245 7231 370 -12556 -20277
34411 -20277 -20994 -13862 5747 31511 39971 15966 -23381 -47327 -49862 -52075 -67906 -86025 -89618
34398 -89618 -78152 -61857 -46652 -34018 -27747 -29930 -32609 -22774 1322 23055 21745 -4244 -32149
34385 -32149 -37497 -20488 -1774 7987 21050 47596 71720 69713 46515 33288 45410 61157
34373 61157 51744 18810 -11386 -21678 -15357 2440 34820 77521 109122 112483 99873 100484 122913
34360 122913 145750 149174 138402 125594 106372 74303 47020 51445 84440 113262 119413 118768
34348 118768 131108 153384 174725 194551 209045 200786 163573 121216 98899 90063 76292 66193
34336 66193 83012 119649 139026 121934 86549 55718 31825 11979 2216 3226 1871 -9380
34324 -9380 -19735 -18196 -10434 -7533 -11406 -21010 -39361 -63820 -81454 -83763 -74954 -58271 -28117
34311 -28117 15087 56558 84288 101439 112245 111411 99331 90779 92605 88415 64127 35207 27307
34298 27307 39686 49038 42575 27379 13419 7140 15936 39311 61542 72336 85651 114053
34286 114053 134302 111088 53140 11282 15785 48755 86179 129456 177160 202682 191997 178848
34274 178848 206027 263959 301283 291386 258033 234964 228212 225200 219302 214818 219441 237470 262568
34261 262568 278405 277291 274372 288511 312750 323022 315519 312534 325946 338114 330946 314629
34249 314629 311956 328684 355090 384253 411228 423906 414160 393744 382666 385177 392497 404460
34237 404460 429191 461297 480069 476095 465990 473813 506986 554460 599388 630452 649676 671477
34225 671477 705816 742646 763817 768503 771495 776782 773619 764295 772970 813481 867475 911663 950549
34212 950549 1001106 1057527 1096951 1117197 1145811 1207340 1295623 1380885 1435162 1453320 1458981 1485349
34200 1485349 1540759 1601530 1650006 1705335 1796045 1914670 2027422 2121974 2213983 2308103 2388934
34189 2388934 2458556 2548170 2675887 2820580 2953849 3070986 3172756 3246840 3294443 3350241
34179 3350241 3443017 3553186 3641568 3705795 3772365 3842455 3886644 3894939 3893152 3898689 3892710 3852383
34167 3852383 3784304 3706356 3617134 3506459 3383504 3270210 3169752 3062085 2935606 2808558
34157 2808558 2707877 2631961 2548065 2432976 2306396 2208433 2146092 2083166 1991014 1887183
34147 1887183 1805082 1743548 1673869 1587712 1508094 1453033 1415229 1380976 1344063 1295624 1225528
34136 1225528 1143411 1076344 1034813 1000667 958521 917905 891606 872449 847206 816566 786539
34125 786539 756226 727879 710506 697749 663332 600766 548778 549111 590234 619728 604463 553477
34113 553477 491452 440954 426315 458450 506757 515052 461218 384380 342120 353555 390721 411736
34101 411736 395731 357987 336799 355064 392799 409943 395552 377002 379181 395915 408536 411734
34089 411734 409152 400442 386146 372664 361179 343587 318804 299459 292293 286380 272136 256734
34077 256734 247447 235362 211898 187076 173450 165603 155530 154292 173297 194807 190651 166726
34065 166726 159460 185769 223192 244760 248255 242870 230720 213786 200552 194423 191063 194235 214166
34052 214166 240920 243421 211758 178747 177697 196950 201783 186341 173112 169451 158827 136065
34040 136065 118250 112119 100681 77536 68086 93417 130459 134668 95168 43604 10968 133
34028 133 5445 34515 92555 157844 194506 191012 171711 166030 177685 190876 195512 193021 182955
34015 182955 160743 130940 107829 96583 86498 70713 59108 59725 60644 47863 31051 29513
34003 29513 38347 34460 16323 9306 24245 40086 43397 57032 103113 157534 173600 141990
33991 141990 96764 66600 51948 50960 72355 109541 131716 121318 99972 97381 111971 124470
33979 124470 134461 154445 174601 164696 115770 55983 17351 6495 15739 40842 71971 85294
33967 85294 66742 37195 32662 59957 89606 94222 76911 57477 47900 51191 69174 95890
33955 95890 112283 105022 87578 86358 105522 121849 118623 108292 111378 125544 129864 113588 86679
33942 86679 63891 50782 46116 47293 50867 55623 66366 86166 104127 102336 79886 59189 60228
33929 60228 77191 90770 95929 102864 113232 112967 94526 72314 64863 70124 71873 66977 71148
33916 71148 94150 122314 134371 126471 110863 94946 75115 52311 40445 51136 76110 92858
33904 92858 86680 63072 39712 29299 28918 24628 8497 -8503 -5258 25484 66317 91262 88545
33891 88545 65819 40519 30009 42527 67596 80080 65025 37746 29481 52293 86423 103656
33879 103656 95345 74932 59768 55635 57092 59258 65699 80820 96878 99578 90304 88771 102213
33866 102213 105339 71286 15926 -13208 4952 40062 51696 36654 22360 27475 44864 57101
33854 57101 55585 45415 38548 41758 50389 57976 69244 92546 119983 130290 115916 92313 74015
33841 74015 57363 36617 21446 24176 41061 60211 78648 97602 109156 102106 76574 42851
33829 42851 12534 -1432 11740 44715 71508 77460 78303 94226 118943 134754 144523 161235
33817 161235 173679 154231 102766 54730 37521 40344 35301 10380 -25390 -53142 -53934 -22609
33805 -22609 21545 50187 55155 50158 45039 36955 27865 28322 37482 40007 31346 26833 36027 46858
33791 46858 46791 42560 45813 54070 59582 64916 76846 93454 106279 107424 91943 66405 55402
33778 55402 78205 114397 118367 78000 32103 15318 15766 9716 8680 38161 88801 124802 131196
33765 131196 121172 104714 82084 63714 64608 78316 83376 75336 66851 58826 41502 25193 36863
33752 36863 76867 108329 104940 88085 99653 149898 204022 214869 167380 98754 69358 99909
33740 99909 145534 150650 117797 93445 95628 96108 75608 53013 46680 46332 41992 44514 55534
33727 55534 52212 27832 13509 28787 43779 28170 7617 24743 65902 79526 57224 43337
33715 43337 63072 91111 100360 96027 86738 64117 32182 20747 43648 71837 73657 57722
33703 57722 49881 50259 44139 38931 55533 88964 109545 104708 92870 90643 89664 76003 54871
33690 54871 43259 48729 66783 92078 120795 144596 153035 145324 134709 137152 156271 180188
33678 180188 191135 176922 137989 91044 65015 81706 132418 179819 191635 169772 141326
33667 141326 128607 136676 160408 187892 202322 198470 194677 209758 230773 227994 204146 200719
33655 200719 244428 313114 369929 405927 427744 428143 401456 374736 388475 446987 514591 561456
33643 561456 589437 611967 633564 655729 683157 716066 749382 781795 812607 832115 832593 826042
33631 826042 830173 839360 834298 818428 812819 811435 780119 715504 666802 671025 696770 686987 635762
33618 635762 584647 556825 536448 510612 491772 488945 486563 465648 427087 384346 348474 326290
33606 326290 318159 312016 293435 265694 246448 242883 245959 250389 260401 270564 262277 230217 194294
33593 194294 172368 156641 131856 103323 88583 88673 85456 66118 37491 15859 11487 22827
33581 22827 39140 49320 52737 59609 77366 100260 116548 122406 124145 128340 132688 126827 104257
33568 104257 75492 63004 75340 93498 96437 93876 112871 152161 175170 157790 120612 98270
33556 98270 95049 90125 73583 56098 49088 53113 62845 70476 69118 64570 76104 111627 149507
33543 149507 161538 149043 139271 148351 163768 163426 138625 97971 59613 38815 34267 30167 19505
33530 19505 16017 30771 48514 46779 30319 23247 30599 32876 20777 10899 19360 39588 55065
33517 55065 58570 52043 42455 43582 65468 94560 100703 74237 42468 37501 57798 73203 62197
33504 62197 35023 21812 40834 76992 95726 83603 65575 69131 83561 78793 57287 54830
33492 54830 86267 123051 136688 135741 143627 164829 190592 214496 223175 195139 132321 72925
33480 72925 48370 45217 34842 22303 34981 76157 122615 160473 192251 214123 218263 216032
33468 216032 227981 249734 256735 244138 232160 228960 220211 202705 195610 205261 209652 196206 187546
33455 187546 206877 239996 257233 256044 254310 252994 235160 199505 168353 157705 158865 156208
33443 156208 148546 145453 152180 164562 172919 167647 147029 122582 111023 117515 131201 139959 144207
33430 144207 151064 159052 157206 140952 121558 114041 119180 124048 118889 106547 95528 91089 93186
33417 93186 94600 81541 48718 15414 9558 28929 38158 18327 -1118 16511 58606 79735
33405 79735 67146 53805 63271 77313 71608 53150 42354 41210 41039 43944 53580 58045 45812
33392 45812 30642 38105 70372 103003 114987 106460 89009 73662 67136 66165 56605 30387 594
33379 594 -13513 -13487 -18755 -38135 -59869 -70642 -69622 -62410 -56367 -63760 -91885 -124031 -127782 -93950
33365 -93950 -54759 -49553 -78792 -103478 -87631 -34330 17653 28977 -4143 -46755 -64453 -64148
33353 -64148 -80134 -116993 -131558 -90369 -23883 8192 -3691 -11355 15700 45787 34699 -11533
33341 -11533 -52696 -71895 -82275 -87309 -72802 -41048 -18914 -20703 -30098 -32596 -41036 -70332 -107036
33328 -107036 -126333 -125959 -121739 -119093 -109894 -91271 -68487 -43809 -19049 -3061 -99 1466 10630
33315 10630 13925 -2780 -22757 -19133 -2419 -12121 -57658 -103766 -124925 -137501 -158511 -166746
33303 -166746 -134975 -77799 -35505 -23801 -27584 -33992 -43252 -51965 -51870 -45338 -42368 -42955 -38535 -27669
33289 -27669 -14936 34 15794 18860 559 -21624 -21768 -1752 12349 8241 -1665 -7115 -12060
33276 -12060 -15173 -3344 25615 54084 68229 72818 74404 69005 56416 46801 39951 17216 -28996
33263 -28996 -74203 -90045 -80987 -71933 -68731 -54312 -20676 17922 46067 62686 70763 67963 55156
33250 55156 41756 33630 24820 10404 186 8199 31302 49209 47417 31456 15031 2678
33238 2678 -8392 -16057 -15212 -10638 -13787 -22121 -15450 16685 54839 71391 65588 60330 68147 80504
33224 80504 92145 112948 144513 164462 152922 123912 110060 119917 129940 119993 97427 78433
33212 78433 63137 44904 33132 44466 70644 76345 40492 -14175 -47297 -47191 -34167 -24955
33200 -24955 -16461 -5217 1621 3381 12301 29743 35655 18935 843 7014 30377 45794 49984
33187 49984 59222 74140 76751 62251 46315 38515 34383 36284 54164 79858 89157 78608 72338
33174 72338 80826 81901 58964 30120 18105 16116 8241 2226 13669 33873 42761 42599 50226
33161 50226 63066 60880 39086 15904 5966 6091 6605 719 -14236 -30324 -30601 -13131 -3366 -22283
33147 -22283 -51647 -54984 -26369 6933 25385 34164 42455 53263 72743 101759 117796 94463
33135 94463 41592 -3425 -27276 -51319 -84861 -104494 -94185 -71494 -54560 -34848 -6188 9394
33123 9394 -5050 -26358 -22815 -3429 -953 -16448 -16579 14613 51201 58053 27903 -17787 -49913
33110 -49913 -52330 -33002 -13577 -2024 14330 41202 62217 67837 77042 103490 120781 98887
33098 98887 61509 61283 99585 119339 88521 45233 38126 61306 77945 77774 76810 80675 82118
33085 82118 82287 84765 78957 57486 39962 49280 72134 76400 64613 73591 115489 155214 161320
33072 161320 148623 148963 163971 173108 172313 175676 185039 184523 166786 143724 126990 115513 108212
33059 108212 112242 127844 138027 128608 112643 118543 152292 185550 188905 166858 148051 146448
33047 146448 148061 137296 118435 100740 78118 42612 9134 2459 19877 32135 28655 35883
33035 35883 74243 119400 131602 109024 82807 66904 46170 16582 3389 24014 57831 72264
33023 72264 62250 45778 35041 32158 41897 65745 89048 95448 91320 95494 107139 107383 94533
33010 94533 91271 106952 117920 104054 85556 97722 138646 169553 167736 153980 158877 182542
32998 182542 202447 206553 199730 184933 159603 132257 122541 134380 142311 118426 66967 19788
32986 19788 484 4843 16139 27341 43591 69616 98666 112222 94547 53941 23232 26723
32974 26723 51290 66785 70669 87287 119660 132900 102106 50162 13974 -4140 -21178 -28989
32962 -28989 -5638 35857 52902 32533 7025 764 5 -7162 688 39594 78825 75884 37630
32949 37630 10695 18110 39129 51111 58834 73860 89991 92598 78308 56225 38607 33252
32937 33252 34705 23202 -13100 -53331 -58940 -21002 22797 30452 5260 -9902 15267 62961
32925 62961 87038 64304 20429 -332 11595 22356 5979 -14021 2920 50339 75321 48680
32913 48680 4020 -10633 3315 5015 -24832 -60685 -68953 -45693 -12291 10558 16866 13365
32901 13365 11671 18760 31115 39396 37889 26349 5633 -21727 -47425 -60484 -55783 -36011 -7023
32888 -7023 23310 44258 49057 43688 41014 44362 45059 39534 39008 52894 68385 59969 21926 -19199
32874 -19199 -32558 -17826 -1982 -2697 -8000 1172 19447 22456 407 -29579 -47645 -52733 -52101
32861 -52101 -43544 -23154 -2762 -1102 -17394 -29863 -24849 -13138 -9438 -8194 6996 36896 64812
32848 64812 80541 90845 100337 95467 61739 12073 -18781 -13635 5439 4849 -18818 -37979 -31369
32835 -31369 -6419 17666 32454 37080 27419 4349 -14985 -11566 11578 34830 50653 70024
32823 70024 96645 112365 99660 67664 43229 41359 54420 66226 66548 53775 33292 15206
32811 15206 7692 10273 15369 15452 7522 -5162 -12122 -587 33040 78348 120251 149151 159529
32798 159529 147040 115559 81394 59865 49611 38778 23819 12198 8491 9424 13317 23767
32786 23767 41868 63530 85066 102133 104322 84600 56373 45976 61828 84539 95266 99351
32774 99351 110178 123023 122365 108585 100031 108997 128199 141291 137355 116266 88772 69831 63812
32761 63812 59211 46291 34515 40277 60993 75557 69906 48787 22415 -3832 -24391 -32916
32749 -32916 -31191 -26121 -14639 13592 52936 77874 73446 56265 51471 58832 57721 40282 22717
32736 22717 22298 36028 46896 43679 29208 12366 -2611 -16125 -23812 -13700 20210 63586
32724 63586 89120 79760 40415 -9386 -45761 -49486 -21746 9211 15708 8184 25130 79115
32712 79115 135576 157424 147383 127782 102040 64371 31044 27399 48011 59838 45417 17779
32700 17779 -6703 -24122 -31764 -29344 -34203 -64791 -101469 -95607 -32694 41503 76051 70770 56286
32687 56286 43579 23221 -1524 -13876 -11172 -6935 -6772 -4127 966 -598 -9718 -16227 -13524 -1258
32673 -1258 23293 58225 83462 75812 40803 10038 1589 1296 -10135 -30236 -45393 -52373 -56290
32660 -56290 -58680 -60133 -65816 -76946 -84254 -80408 -71801 -68012 -66842 -60340 -48633 -36496 -23381
32647 -23381 -9862 -6826 -21858 -41026 -43381 -32919 -35027 -56349 -69691 -50617 -10897 20851
32635 20851 37108 48665 53447 34988 -5759 -40661 -46374 -29695 -10519 5576 23532 39375
32623 39375 43765 41554 49820 72729 91125 83450 50208 13490 -3071 7910 33718 51683
32611 51683 46607 21388 -8873 -30101 -34381 -18905 10821 39779 56404 66662 84555 108075
32599 108075 117465 101495 73012 51061 38577 28131 21514 30065 56383 85096 94489 75390
32587 75390 40717 17485 23414 47286 57822 36915 -456 -23109 -14434 17811 54192 77242
32575 77242 77394 55745 23162 -6140 -20801 -15845 1884 12899 1990 -20743 -28465 -11578
32563 -11578 11900 26470 40250 62338 78809 73812 60992 67621 94246 115561 117330 106047
32551 106047 83933 44905 1733 -11804 19003 67089 94315 89935 68973 49347 41719 45748
32539 45748 44301 16876 -29062 -56841 -45220 -17697 -9727 -22790 -33245 -33242 -35152 -41912 -42877 -40911
32525 -40911 -55008 -85818 -101584 -74350 -15741 38616 69521 82562 83809 69103 41572 20631
32513 20631 18802 19000 -6560 -55235 -90676 -87803 -62859 -43797 -27466 8672 60912 96717
32501 96717 100575 92345 89771 81740 56720 32117 30337 43648 49297 46037 48010 51804 39110
32488 39110 9199 -17929 -30659 -34313 -31166 -16128 6174 23080 34092 46393 50184 26405
32476 26405 -16776 -44938 -44312 -39632 -53539 -76761 -93273 -104244 -105738 -73567 -2129 64268
32464 64268 75058 35682 -6287 -25301 -31659 -28836 -392 52452 96082 103347 83009 58011
32452 58011 37097 21130 15616 19968 21181 14823 18309 47101 90329 126752 153299 179132 200839
32439 200839 205554 195278 186667 184663 175447 152172 132131 136994 163327 182936 171623 133071
32427 133071 94219 78233 82407 84881 73143 58550 56825 62361 55056 30461 7898 4117 11681
32414 11681 12149 1940 -5266 2543 23725 47640 62925 61924 45121 23307 10048 9823 16381
32401 16381 22293 25761 28355 31880 38586 48209 52720 42146 22305 20005 58261 125234 178297
32388 178297 185079 154745 122944 111838 114788 117747 121057 131987 144906 142958 120670 94404
32376 94404 84576 93536 107694 117542 126302 137435 141960 125384 86247 42654 17420 16340 21827
32363 21827 10447 -20603 -46058 -37268 3727 40623 38655 78 -42762 -65761 -72653 -75192
32351 -75192 -69185 -43678 -7465 10923 -4901 -37487 -53779 -40997 -18538 -17107 -51286 -109748
32339 -109748 -165026 -192208 -184583 -155547 -124642 -101403 -83400 -66138 -47913 -25256 6784 43718
32327 43718 67546 63409 39690 23161 31304 54610 68960 61168 38852 18455 8027 1634
32315 1634 -11450 -32409 -48579 -46040 -25748 -2308 13657 24511 34186 37938 33098 32330 50840
32302 50840 81550 99235 93725 83524 87570 98372 98422 91970 98369 116054 116559 82608 34439
32289 34439 5587 4832 16657 30167 48560 70763 81851 69692 41417 15438 2560 1435
32277 1435 8495 23926 46374 67091 74558 66699 56604 61707 84900 109030 113400 94361 67545
32264 67545 52915 60067 81826 95259 75797 24121 -22010 -18604 35675 93203 107393 78487
32252 78487 41386 20838 14378 11627 9527 5802 -5785 -25302 -41794 -46586 -45396 -50808 -67223
32239 -67223 -88481 -105827 -112008 -100496 -68400 -22155 23438 55104 70516 77009 79797 72993
32227 72993 46960 6161 -26908 -32626 -15927 522 3132 -1359 -1381 3112 4578 1543 2402 16693
32213 16693 42785 62532 54001 18778 -8762 3740 42134 56746 26012 -12593 -12601 18793 33933
32200 33933 10115 -28422 -52596 -60749 -60765 -50884 -37232 -45338 -86740 -129574 -133077 -103977 -85926
32187 -85926 -92924 -89871 -52057 -8595 1168 -11401 -5022 22594 30930 5506 -13017 11113 54494
32174 54494 70917 57058 44293 39665 18779 -21868 -48155 -38545 -16665 -12089 -16171 -4350
32162 -4350 17691 22457 5869 -7146 -1480 11195 18237 24411 35635 44135 41661 33298 26608
32149 26608 18346 3809 -9125 -7941 6330 18444 14575 -7116 -36914 -57403 -51731 -18503
32137 -18503 21395 40914 32184 11746 879 6385 21197 35858 43837 40671 26978 12992
32125 12992 12190 25437 36500 30031 11573 2033 12613 33795 51305 63501 76228 87384
32113 87384 86571 69551 46389 33390 38000 49945 47583 19524 -17448 -30205 -5797 30122
32101 30122 39348 10870 -32686 -61860 -63058 -40145 -8239 13246 14271 5280 6365 22187 35491
32088 35491 29143 7338 -10696 -13657 -8409 -7738 -13743 -18654 -20550 -28256 -43993 -51880 -39311 -22518
32074 -22518 -27486 -46908 -46250 -19435 -2766 -14663 -19538 13971 51779 40332 -6257 -21315
32062 -21315 17993 66344 87038 95363 108337 106793 78259 52361 56217 68690 55959 24794
32050 24794 4422 -66 394 11634 41958 71045 70846 46245 21382 -1488 -34285 -66497 -75141
32037 -75141 -65233 -63991 -78249 -90552 -92620 -89646 -78175 -55770 -46022 -72983 -113140 -115764 -73172
32024 -73172 -28503 -10453 -5638 -2364 -11927 -31246 -33489 -18140 -23280 -60137 -81344 -50800 -4118
32011 -4118 4299 -19257 -30662 -25024 -35612 -66403 -80133 -59204 -35292 -44445 -80955 -107627
31999 -107627 -94003 -40250 21149 48656 33188 12151 23796 54947 58307 17405 -33348 -55336
31987 -55336 -46304 -28118 -17405 -19076 -31979 -49365 -62488 -68817 -69670 -62191 -46414 -37352 -52375
31974 -52375 -84862 -107221 -104229 -88546 -78818 -76659 -71203 -54540 -26750 4848 26924 28897 14220
$$ [...]
##END NTUPLES=NMR SPECTRUM
##END=
