##TITLE=31Pdec_DE-127_1R
 , 24 sc
 11.2.2026
##JCAMPDX= 6.0         $$ Bruker NMR JCAMP-DX V2.0
##DATA TYPE= NMR SPECTRUM
##DATA CLASS= NTUPLES
##ORIGIN= UXNMR, Bruker Analytische Messtechnik GmbH
##OWNER= root
$$ XWIN-NMR		Version 3.5
$$ Wed Feb 11 14:07:42 2026 Russian Standard Time (UT+4h)  she@DPX200
##.OBSERVE FREQUENCY= 81.013821
##.OBSERVE NUCLEUS= ^31P
##.ACQUISITION MODE= SIMULTANEOUS
##.ACQUISITION SCHEME= undefined
##.AVERAGES= 24
##.DIGITISER RES= 17
##SPECTROMETER/DATA SYSTEM= spect
##.PULSE SEQUENCE= zgpg30
##.SOLVENT NAME= DMSO
##.SHIFT REFERENCE= (INTERNAL, DMSO, 0, 198.062)
##AUDIT TRAIL= $$ (NUMBER, WHEN, WHO, WHERE, WHAT)
$$ ##TITLE= Audit trail, XWIN-NMR		Version 3.5
$$ ##JCAMPDX= 5.01
$$ ##ORIGIN= Bruker BioSpin GmbH
$$ ##OWNER= she
$$ F:/spectra/data/she/nmr/P31/2/pdata/1/auditp.txt
$$ ##AUDIT TRAIL=  $$ (NUMBER, WHEN, WHO, WHERE, WHAT)
(   1,<2026-02-11 14:05:38.82 +0400>,<she>,<DPX200>,
      <created by zg, POWCHK disabled, PULCHK disabled
       configuration hash MD5:
       00 E9 B6 7A A2 85 ED C7 34 08 36 98 17 FE 4E 26
       data hash MD5: 32K
       55 25 95 88 C8 21 7D BF C1 27 18 C8 99 26 09 36>)
(   2,<2026-02-11 14:06:18.75 +0400>,<she>,<DPX200>,
      <Start of raw data processing
       efp BC_mod = 2 LB = 1.5 FT_mod = 6 PKNL = 1 PHC0 = 1344.562 PHC1 = 173.3009 SI = 64K 
       data hash MD5: 64K
       DA 0E AB 2E 96 E9 63 90 91 55 D2 37 14 05 A7 16>)
(   3,<2026-02-11 14:06:46.34 +0400>,<she>,<DPX200>,
      <pk PHC0 = 38.95967 PHC1 = -32.6 
       data hash MD5: 64K
       10 18 43 D8 3C 5A F5 B5 BE 4C AD BB AC FD E6 94>)
$$ ##END=
$$ 
$$ hash MD5
$$ BE 90 22 3E 8D 47 C7 B2 3A EF E1 54 18 37 B4 BE
##$RELAX= 
##$RELAX= 
##$RELAX= 
##$RELAX= 
##$RELAX= 
##$RELAX= 
##$RELAX= 
##$RELAX= 
$$ Bruker specific parameters
$$ --------------------------
##$DU= <F:/spectra>
##$EXPNO= 2
##$NAME= <P31>
##$PROCNO= 1
##$TYPE= <nmr>
##$USER= <she>
##$AMP= (0..31)
100 100 100 100 100 100 100 100 100 100 100 100 100 100 100 100 100 100 
100 100 100 100 100 100 100 100 100 100 100 100 100 100 
##$AQSEQ= 0
##$AQ_mod= 1
##$AUNM= <au_zg>
##$AUTOPOS= <>
##$BF1= 81.014009
##$BF2= 200.13
##$BF3= 200.13
##$BF4= 200.13
##$BF5= 200.13
##$BF6= 200.13
##$BF7= 200.13
##$BF8= 200.13
##$BYTORDA= 1
##$CFDGTYP= 0
##$CFRGTYP= 5
##$CHEMSTR= <none>
##$CNST= (0..31)
1 1 145 1 1 1 1 1 1 1 1 1 1 1 1 1 1 1 1 1 1 1 1 1 1 1 1 1 1 1 1 1 
##$CPDPRG= <waltz16>
##$CPDPRG1= <>
##$CPDPRG2= <waltz16>
##$CPDPRG3= <>
##$CPDPRG4= <mlev>
##$CPDPRG5= <mlev>
##$CPDPRG6= <mlev>
##$CPDPRG7= <mlev>
##$CPDPRG8= <mlev>
##$CPDPRGB= <>
##$CPDPRGT= <>
##$D= (0..31)
0 1 0 0 0 0 0 0 0 0.06 0 0.03 2e-05 3e-06 0 0 0.0002 0 0 0 0 0 0 0 0 0 
0 0 0 0 0 0 
##$DATE= 1770804338
##$DBL= (0..7)
120 120 120 11 120 120 24 19 
##$DBP= (0..7)
150 150 150 150 150 150 150 150 
##$DBP07= 0
##$DBPNAM0= <>
##$DBPNAM1= <>
##$DBPNAM2= <>
##$DBPNAM3= <>
##$DBPNAM4= <>
##$DBPNAM5= <>
##$DBPNAM6= <>
##$DBPNAM7= <>
##$DBPOAL= (0..7)
0.5 0.5 0.5 0.5 0.5 0.5 0.5 0.5 
##$DBPOFFS= (0..7)
$$ [...]
##$SUBNAM2= <"">
##$SUBNAM3= <"">
##$SUBNAM4= <"">
##$SUBNAM5= <"">
##$SUBNAM6= <"">
##$SUBNAM7= <"">
##$SUBNAM8= <"">
##$SUBNAM9= <"">
##$SW= 400.765351723535
##$SWIBOX= (0..15)
0 1 3 0 0 0 0 0 0 0 0 0 0 0 0 0 
##$SW_h= 32467.5324675325
##$TD= 32768
##$TD0= 1
##$TE= 0
##$TE2= 300
##$TE3= 300
##$TEG= 300
##$TL= (0..7)
0 120 53 12 22 120 120 120 
##$TP= (0..7)
150 150 150 150 150 150 150 150 
##$TP07= 0
##$TPNAME0= <>
##$TPNAME1= <>
##$TPNAME2= <>
##$TPNAME3= <>
##$TPNAME4= <>
##$TPNAME5= <>
##$TPNAME6= <>
##$TPNAME7= <>
##$TPOAL= (0..7)
0.5 0.5 0.5 0.5 0.5 0.5 0.5 0.5 
##$TPOFFS= (0..7)
0 0 0 0 0 0 0 0 
##$TUNHIN= 0
##$TUNHOUT= 0
##$TUNXOUT= 0
##$USERA1= <user>
##$USERA2= <user>
##$USERA3= <user>
##$USERA4= <user>
##$USERA5= <user>
##$V9= 5
##$VALIST= <valist>
##$VCLIST= <CCCCCCCCCCCCCCC>
##$VD= 0
##$VDLIST= <DDDDDDDDDDDDDDD>
##$VPLIST= <PPPPPPPPPPPPPPP>
##$VTLIST= <TTTTTTTTTTTTTTT>
##$WBST= 1024
##$WBSW= 4
##$XGAIN= (0..3)
0 0 0 0 
##$XL= 0
##$YL= 0
##$YMAX_a= 63979
##$YMIN_a= -67839
##$ZGOPTNS= <>
##$ZL1= 120
##$ZL2= 120
##$ZL3= 120
##$ZL4= 120
##$ABSF1= 0
##$ABSF2= 0
##$ABSG= 0
##$ABSL= 0
##$ALPHA= 0
##$AQORDER= 0
##$ASSFAC= 0
##$ASSFACI= 0
##$ASSFACX= 0
##$ASSWID= 0
##$AUNMP= <proc_1d>
##$AZFE= 0.1
##$AZFW= 0.5
##$BCFW= 0
##$BC_mod= 2
##$BYTORDP= 0
##$COROFFS= 0
##$CY= -3
##$DATMOD= 1
##$DC= 0
##$DFILT= <>
##$DTYPP= 0
##$F1P= 0
##$F2P= 0
##$FCOR= 1
##$FTSIZE= 65536
##$FT_mod= 6
##$GAMMA= 0
##$GB= 0
##$INTBC= 1
##$INTSCL= 9.790993e-09
##$ISEN= 30
##$LB= 1.5
##$LEV0= 0
##$LPBIN= 0
##$MAXI= 10000
##$MC2= 0
##$MEAN= 0
##$ME_mod= 0
##$MI= 50
##$NCOEF= 0
##$NC_proc= -4
##$NLEV= 6
##$NOISF1= 182.463
##$NOISF2= 159.3651
##$NSP= 0
##$NTH_PI= 0
##$NZP= 0
##$OFFSET= 198.0616
##$PC= 4
##$PHC0= 1383.522
##$PHC1= 140.7009
##$PH_mod= 1
##$PKNL= yes
##$PPARMOD= 0
##$PSCAL= 0
##$PSIGN= 0
##$REVERSE= no
##$SF= 81.0140089999434
##$SI= 65536
##$SIGF1= 159.3651
##$SIGF2= -187.1042
##$SINO= 113.3802
##$SIOLD= 16384
##$SREGLST= <1H.CDCl3>
##$SSB= 0
##$STSI= 65536
##$STSR= 0
##$SW_p= 32467.5324675325
##$SYMM= 0
##$S_DEV= 0
##$TDeff= 32768
##$TDoff= 0
##$TI= <>
##$TILT= no
##$TM1= 0
##$TM2= 0
##$TOPLEV= 0
##$USERP1= <user>
##$USERP2= <user>
##$USERP3= <user>
##$USERP4= <user>
##$USERP5= <user>
##$WDW= 1
##$XDIM= 65536
##$YMAX_p= 371667957
##$YMIN_p= -5513268
$$ End of Bruker specific parameters
$$ ---------------------------------
##NTUPLES= NMR SPECTRUM
##VAR_NAME=  FREQUENCY,     SPECTRUM/REAL,   SPECTRUM/IMAG
##SYMBOL=    X,             R,               I
##VAR_TYPE=  INDEPENDENT,   DEPENDENT,       DEPENDENT
##VAR_FORM=  AFFN,          ASDF,            ASDF
##VAR_DIM=   65536,         65536,           65536
##UNITS=     HZ,            ARBITRARY UNITS, ARBITRARY UNITS
##FACTOR=    0.49542278885378, 1,            1
##FIRST=     16045.7642231865, 0,            0
##LAST=      -16421.768244346, 0,            0
##MIN=       -16421.768244346, -5513268,     0
##MAX=       16045.7642231865, 371667957,    0
$$ Real data points
##PAGE= N=1
##DATA TABLE= (X++(R..R)), XYDATA
$$ [...]
41299c23039j66832p2509O1137J21556J24598J25151J00677J3829q3118j02350
$$ -323039 -489871 -562380 -501243 -379687 -255089 -129938 -29261 -15432 -98550 -200900
41289b00900m2467K1162M1561K6504j3754o6136p5233O879J19103J27308J384
$$ -200900 -243367 -222205 -180644 -154140 -167894 -234030 -309263 -302384 -183281 -55973 -54589
41278e4589j18566r5180K2741O9523j3391j10808r4904K5461J42788J77044J26862
$$ -54589 -173155 -268335 -245594 -176071 -189462 -300270 -395174 -369713 -226925 -49881 76981
41267G6981L9608k8893n0377m8152o3189q4651n5743L1520R9745Q1083J186p3364
$$ 76981 116589 87696 37319 -10833 -74022 -158673 -214416 -182896 -83151 -2068 -882 -74246
41255g4246j20343j42255j15754l3522M4208N8428L8116L8375L2557l1459r9747
$$ -74246 -194589 -336844 -452598 -486120 -441912 -383484 -345368 -306993 -274436 -305895 -405642
41244d05642o5698M9854J09582P1819M8687J01892J25467K4458j11738j36878
$$ -405642 -471340 -421486 -311904 -240085 -191398 -89506 35961 60419 -51319 -188197
41234a88197o3148j7353l5127l3152L0188Q7257O8394j0141q2502r6301l5308
$$ -188197 -251345 -268698 -303825 -336977 -306789 -219532 -151138 -161279 -243781 -340082 -375390
41223c75390O3925J17076O7587l7107q5639k0845J06403J84727J24415o4949k44028
$$ -375390 -311465 -194389 -126802 -163909 -249548 -270393 -163990 20737 145152 80203 -163825
41212a63825k47353p4056Q0923N6422p4349j24075n1977K1718K7289K2546M9996
$$ -163825 -411178 -485234 -404311 -347889 -422238 -546313 -598290 -576572 -549283 -526737 -476741
41201d76741O1487L0766K0348P2413J27067J14808N5925R132j1612j3576J6719
$$ -476741 -415254 -384488 -364140 -291727 -164660 -49852 6073 15205 3593 -9983 6736
41190F736P3096J01347O6197J658m6020p2453p6868l9246J7328J7440n2248r6320
$$ 6736 79832 181179 247376 249034 203014 130561 53693 14447 31775 49215 -3033 -99353
41178i9353n2707m58k6515o1015J9247J66168J94534M6615j21507j57528r2024
$$ -99353 -152060 -152518 -179033 -240048 -220801 -54633 139901 186516 65009 -92519 -184543
41167a84543l7814j6942K2843Q7142J23726J02786L9222m3340j15185j31613p8327
$$ -184543 -222357 -239299 -216456 -129314 -5588 97198 136420 93080 -22105 -153718 -232045
41156b32045p608K3272K9125N6060Q8141P1138K0720J7848P9649J23511R6523
$$ -232045 -239653 -216381 -187256 -131196 -43055 28083 48803 66651 146300 269811 366334
41145C66334N1770L5553j2038j45315k69199k38618p6905M3519M6899L8685J02821
$$ 366334 418104 453657 441619 296304 27105 -211513 -288418 -244899 -198000 -159315 -56494
41134e6494J58223J04278j0717q0587j06278j40250j42613m5747Q2300J02915
$$ -56494 101729 206007 195290 114703 8425 -131825 -274438 -320185 -237885 -134970
41124a34970K3775j0877M3270O9599L443o0643m6041k4584p0211j16861q2853
$$ -134970 -111195 -122072 -78802 -9203 -5760 -66403 -112444 -137028 -207239 -324100 -406953
41113d06953k2203j4618j038J12223K51136K47775R1895n2863q4497o2721n5171
$$ -406953 -429156 -443774 -444812 -332589 -81453 166322 258217 205354 120857 58136 2965
41102B965l2999K8374O9351L8765k1436m6980l6683j7279P994K7672P468m1883
$$ 2965 -30034 -1660 67691 106456 85020 38040 1357 -15922 -7928 19744 27212 -14671
41090a4671m8869J0835N4075K244j00250j47806j11004m4674N078L2665L8263
$$ -14671 -63540 -52705 1370 3614 -96636 -244442 -355446 -400120 -395042 -362377 -324114
41079c24114K8259L4098P3664J10917J04937P3412N0293J2497p5232j63863j59537
$$ -324114 -295855 -261757 -188093 -77176 27761 101173 151466 163963 88731 -75132 -234669
41068b34669o2839J8259J4752k3085k3818j338j4194o6977j00731n8705N8356
$$ -234669 -297508 -279249 -264497 -287582 -311400 -312738 -326932 -393909 -494640 -553345 -494989
41057d94989J72679J68443J5118j41725j08560R8117K30592J25444o8894j07504
$$ -494989 -322310 -153867 -138749 -280474 -389034 -290917 -60325 65119 -3775 -111279
41047a11279p03L3010p0189j21968N150J70014J82737P3856n462l1776q0198j24181
$$ -111279 -111982 -78972 -149161 -271129 -265979 -95965 86772 160628 155166 123390 43192 -80989
41035h0989o5269N5541P2774m4971j26039n0160Q0860J17272P4025N3198N7984
$$ -80989 -146258 -90717 -17943 -62914 -188953 -239113 -158253 -40981 33044 86242 144226
41024A44226K2626l5062l3199K5289M9229L805m9980o9349q3219j11065j18846
$$ 144226 166852 131790 98591 123880 173109 176914 126934 57585 -25634 -136699 -255545
41013b55545q8173n3345l3434O397Q6169J58147J61431Q8049k8490j38911j71575
$$ -255545 -343718 -397063 -430497 -424100 -337931 -179784 -18353 69696 41206 -97705 -269280
41002b69280p1921J04103K00388J29375j6685q8358o5575l9460m5849k6642M0360
$$ -269280 -341201 -237098 -36710 92665 75980 -12378 -77953 -117413 -163262 -189904 -149544
40991a49544Q1681M0749l1239n5389l8933m4088p8793q5568k7571O9260J56890
$$ -149544 -67863 -27114 -58353 -113742 -152675 -196763 -275556 -361124 -388695 -319435 -162545
40980a62545K00701J74566P0410o9948j67513j72953j05860k3012L0419L7434
$$ -162545 38156 212722 283132 213184 45671 -127282 -233142 -256154 -225735 -188301
40970a88301J0065j4608p835J0116p262n8485q2210m0770K7547P2734J04519J48877
$$ -188301 -178236 -192844 -200679 -190563 -197825 -256310 -338520 -379290 -351743 -279009 -174490 -25613
40958b5613J73135J27366M2941Q529M0104N1493j7289j07276j19531m2915M0578
$$ -25613 147522 274888 317829 326358 366462 417955 400666 293390 173859 130944 171522
40947A71522M9980k8284j40992k04281j65206n7670K4346L1921J0714K2698N8543
$$ 171522 221502 193218 52226 -152055 -317261 -374931 -350585 -318664 -307950 -285252 -226709
40936b26709O6918L5490q150n2765j04764j41878j18442k4959R1223J69793J82002
$$ -226709 -159791 -124301 -132451 -185216 -289980 -431858 -550300 -575259 -484036 -314243 -132241
40925a32241J40675Q9513O8922O8234L2177n6267j27714j04156j574R4568J34658
$$ -132241 8434 97947 166869 235103 267280 211013 83299 -20857 -22431 72137 206795
40914B06795J27167P6299k1904j17266j25797m7323P505m0859j24963j19185j1498
$$ 206795 333962 410261 388357 271091 145294 97971 105476 64617 -60346 -179531 -191029
40903a91029Q4593Q4473L0087Q327K4700J1890n3105j03217p6091p617J8339j1221
$$ -191029 -106436 -21963 8124 16451 41151 53041 -64 -103281 -179372 -186989 -168650 -179871
40891a79871l1232n683K5690K2593r94k4314n2633o2840O836J47582K30656J55367
$$ -179871 -211103 -216786 -191096 -168503 -169497 -193811 -246444 -309284 -302448 -154866 75790 231157
40879B31157l767r0487o5708j3699J1523K8034L5280Q671j6667J6680O0475O630
$$ 231157 227390 136903 71195 57496 69019 97053 132333 141004 124337 141017 201492 208122
40867B08122j16846j45031k3725Q9847N7687m1016n1257K9223Q7768Q0490N0464
$$ 208122 91276 -53755 -77480 12367 70054 29038 -22219 7004 94772 175262 225726
40856B25726J9536j8906m0600k7476k2211n2944o1609j1289O283r2523j98991
$$ 225726 245262 226356 185756 158280 136069 83125 21516 10227 16510 -76013 -275004
40845b75004j34504O6687J78608J01505j9933m2708j5831l7003o9850l0530M3575
$$ -275004 -409508 -342821 -164213 -62708 -82641 -125349 -141180 -178183 -248033 -278563 -234988
40834b34988M5046l5245j02692r4701l4424L0963P3380Q1743P5089R9095J61069
$$ -234988 -189942 -225187 -327879 -422580 -457004 -426041 -352661 -270918 -195829 -96734 64335
40823F4335J95178J40688K4576q1243j46815j74620j50759q0843l6558p5993j38723
$$ 64335 259513 400201 424777 343534 196719 22099 -128660 -209503 -246061 -322054 -460777
40812d60777j16812k1560K8122m630j5009O6197J48604J23838M6853N7397J58581
$$ -460777 -577589 -599149 -571027 -575657 -590666 -524469 -375865 -252027 -205174 -147777 10804
40801A0804J98982Q6757q3188j57709j05721j6640K9775L1536K6259L7606N7698
$$ 10804 209786 296543 213355 55646 -50075 -66715 -36940 -5404 20855 58461 116159
40790A16159N4623L628p3422j18929j07176p2801n0148k5230J4003K7931q581
$$ 116159 170782 174410 100988 -17941 -125117 -197918 -248066 -273296 -259293 -231362 -239943
40779b39943k9100M3744J53725J52516O292j38945j44064m1625M6161P4752Q1224
$$ -239943 -269043 -225299 -71574 80942 87234 -51711 -195775 -237400 -191239 -116487 -35263
40768c5263Q0962N7215K6162K4626M1321L1412p640l7822m8298n9006o6035m5563
$$ -35263 45699 102914 129076 153702 195023 226435 218795 180973 132675 73669 7634 -37929
40756c7929k940M1977R9596J68923J75316M9772j32001k02470j20932l0140m6911
$$ -37929 -40869 1108 100704 269627 444943 494715 362714 160244 39312 9172 -37739
40745c7739j03829p8282J2203N3613K2832J2168P1447J26770Q6655l4483j35433
$$ -37739 -141568 -219850 -207647 -154034 -131202 -119034 -47587 79183 165838 131355 -4078
40734d078j39526o1117K4253N8225M5027K0154q684n6699j01642q3070R196R3861
$$ -4078 -143604 -204721 -180468 -122243 -77216 -57062 -65746 -122445 -224087 -307157 -297961 -204100
40722b04100R3815M0072K3442O2880Q8057N4229Q518J3627N3974O4238L1485J7618
$$ -204100 -110285 -70213 -46771 16109 104166 158395 166913 180540 234514 298752 330237 347855
40710C47855O5605J19049P7464o8986k03773k11000j07438n285L4238M8628P8713
$$ 347855 413460 532509 609973 540987 337214 126214 18776 13491 47729 96357 175070
40699A75070R9777P8184L5797R695j0570n2763r6601r3714m3984n998k6746q7373
$$ 175070 274847 353031 388828 398523 387953 335190 238589 144875 100891 94893 68147 -19226
40687a9226j22021q0024K2763J11531J29323J00958Q4573P0402k075j14810j51592
$$ -19226 -141247 -221271 -198508 -86977 42346 143304 227877 298279 296204 181394 29802
40676B9802n9063N8255Q0674L4858J4878J1329m8149j26406j00959K8294J03274
$$ 29802 -29261 28994 109668 144526 159404 170733 122584 -3822 -104781 -76487 26787
40665B6787K9072r2828j21660o4795k3581l0681l6145r133L2204O8320Q9327P7315
$$ 26787 55859 -36969 -158629 -223424 -247005 -277686 -313831 -322964 -290760 -222440 -133113 -55798
40653e5798L0039j7010l3200l1102k6932k266N0868R0066Q1146N5353M9199L0112
$$ -55798 -25759 -42769 -75969 -107071 -134003 -136269 -85401 4665 85811 141164 190363 220475
40641B20475m5499j35202j54254r6455l1562J954J9269J7393k6435q2953q8507
$$ 220475 174976 39774 -114480 -210935 -242497 -240543 -221274 -203881 -230316 -313269 -401776
40630d01776m5223j7205j8986n525J4802k2366q9798n4565J07022K08815R8629
$$ -401776 -446999 -464204 -483190 -488715 -473913 -496279 -586077 -640642 -533620 -324805 -226176
40619b26176r0418r4236J15051K81845K02649l2557j85765j51295k2259N4483
$$ -226176 -316594 -410830 -295779 -13934 188715 156158 -29607 -180902 -203161 -148678
40609a48678J9491p4214j29212j00436l0666K2093O4384J24526J58558Q6973o8248
$$ -148678 -129187 -203401 -332613 -433049 -463715 -441622 -377238 -252712 -94154 -7181 -75429
40598g5429j71296j26962K1153J66324K34135J83160J3986j70338k12593q7180
$$ -75429 -246725 -373687 -352534 -186210 47925 231085 245071 74733 -137860 -225040
40588b25040M3535L7195m8990p9522m8587l4642k1231O6932J76076J52658j4645
$$ -225040 -181505 -144310 -193300 -272822 -321409 -356051 -377282 -310350 -134274 18384 3739
40577C739j43980j06374J5054P8381O6316L1028k5962j05743j33265n2547N6431
$$ 3739 -140241 -246615 -231561 -153180 -86864 -55836 -81798 -187541 -320806 -373353 -316922
40566c16922P7897L7189N1423J24603J29098J0034j18016j33377o8994l6080n1549
$$ -316922 -239025 -201836 -150413 -25810 103288 113322 -4694 -138071 -207065 -243145 -294694
40555b94694l2995N5432J37558J27119M1101k9047l6050j9668k6018l2742M039
$$ -294694 -327689 -272257 -134699 -7580 33521 4474 -31576 -51244 -77262 -110004 -105965
40544a05965N6499M5347l9250j04116p7059r326K548m1751n5967n359M1516J6667
$$ -105965 -49466 -4119 -43369 -147485 -224544 -233870 -231322 -273073 -329040 -334399 -292883 -276216
40532b76216n1539q0127l2620N3723J18185J25042P7744J3691k0700j3671o634
$$ -276216 -327755 -407882 -440502 -386779 -268594 -143552 -65808 -52117 -72817 -86488 -93122
40521i3122m6511j13841j25321l4348Q6842J11824J9172o2087q469J32809J98934
$$ -93122 -139633 -253474 -378795 -413143 -326301 -214477 -195305 -257392 -265861 -133052 65882
40510F5882J17293j7773q0944n2715N372L7875J4830o8333j54551j49983n0979
$$ 65882 183175 165402 84458 31743 37115 74990 89820 21487 -133064 -283047 -334026
40499c34026J1991o0184j75035j56541J2278J66038J77606R4365L0659K4371M7747
$$ -334026 -322035 -382219 -557254 -713795 -701517 -535479 -357873 -263508 -232849 -208478 -160731
40488a60731Q1261J15742J29749J13763Q1899L0360o8009j93371k55511j91950
$$ -160731 -79470 36272 166021 279784 361683 392043 324034 130663 -124848 -316798
40478c16798n5557M2232N1304J0609j4509J3735Q3551J26072O1103j02283k35383
$$ -316798 -372355 -330123 -278819 -268210 -282719 -268984 -185433 -59361 1742 -100541 -335924
40467c35924k12601n2735J08685J75794J67683J39417R2058j914j15674j61029
$$ -335924 -548525 -601260 -492575 -316781 -149098 -9681 82377 80463 -35211 -196240
40457a96240q2204O0927J35847P9592k7498o4368k2681K837k9097m5740J0951
$$ -196240 -278444 -217517 -81670 -2078 -29576 -93944 -116625 -113788 -142885 -188625 -177674
40446a77674Q0537P6925J8428k1034l8396p4218r3652k3276R1351J01703k5559
$$ -177674 -97137 -20212 -1784 -22818 -61214 -135432 -229084 -252360 -161009 -59306 -84865
40435h4865j30900q0589M2064P1169L923k5216K0830K7681o3844j33355m5984
$$ -84865 -215765 -296354 -254290 -183121 -179198 -204414 -183584 -155903 -219747 -353102 -399086
40424c99086J38340K19613J00230j02568j94199j06801M8433J08991K7102q8600
$$ -399086 -260746 -41133 59097 -43471 -237670 -344471 -296038 -187047 -159945 -248545
40414b48545r6230K2096J45354J54468N5176n3686r7719p7431k5216L7140R0086
$$ -248545 -344775 -322679 -177325 -22857 32319 -21367 -119086 -196517 -221733 -184593 -94507
40403i4507J03546O2511K12j8840L1085Q8967O1618n6646j56757j48980q5560
$$ -94507 9039 71550 71762 52922 84007 172974 234592 177946 21189 -127791 -213351
40392b13351p5561j05144n6662Q1230J58344Q3886k4196j9133N3455N8255J1706
$$ -213351 -288912 -394056 -450718 -369488 -211144 -127258 -151454 -170587 -117132 -58877 -47171
40381d7171M2260J46495J75801P7282l0123n6923n4097p0906o4934k5562l0702
$$ -47171 -4911 141584 317385 394667 364544 307621 253524 182618 117684 92122 61420
40370F1420r3269j02817j9968K6505m0388q6766J1445J30706P8371r6571j80722
$$ 61420 -31849 -134666 -154634 -128129 -168517 -255283 -243838 -113132 -34761 -131332 -312054
40359c12054j10826r08Q7536J77702K11214Q8633j11087j75907o3119M8726N0109
$$ -312054 -422880 -423788 -336252 -158550 52664 141297 30210 -145697 -208816 -160090 -109981
40348a09981K9891N5721M7733k9639n7170K8867R7807M0362m0076j1356N6923
$$ -109981 -80090 -24369 23364 -6275 -63445 -34578 63229 103591 63515 52159 109082
40337A09082K4529p5658j13095q9196r8231j20752n3794P7643J27178N4910j2847
$$ 109082 133611 57953 -55142 -144338 -242569 -363321 -417115 -339472 -212294 -157384 -170231
40326a70231J9070R1368J03101M1380m1474r9819j10985p7186k8123J6743P2729
$$ -170231 -151161 -59793 43308 84688 43214 -56605 -167590 -244776 -272899 -256156 -183427
40315a83427J32394J26901K0465r4870r3056J7628J11711J16371P1218K9204m955
$$ -183427 -51033 75868 96333 1463 -91593 -73965 37746 154117 225335 254539 249584
40304B49584l3603m8565o0603p6871o1886K064M1906j7970j12902j03237J5419
$$ 249584 215981 167416 106813 29942 -31944 -29880 12026 -5944 -118846 -222083 -206664
40293b06664R4142M8020l4083m5501r879J343L585N4866J32881J51731Q6194R162
$$ -206664 -112522 -64502 -98585 -144086 -153965 -152622 -149037 -94171 38710 190441 276635 285797
40281B85797k405M0243N5302o764r2455j04509l4918J6283j1537m5084l691N0626
$$ 285797 283392 323635 378937 372173 279718 175209 140291 156574 145037 99953 96262 146888
40269A46888P828r0937r7376P497P8802L8434j7117j530K0057k5962o6599k508
$$ 146888 154716 63779 -33597 -26100 52702 91136 74019 72489 92546 66584 -15 -2523
40257b523J05125J12385J3330n2187j930R1610J20040O6999n134l4582n439M7050
$$ -2523 102602 214987 228317 176130 174200 265810 385850 452849 447715 413133 407694 454744
40245D54744O8602N0032M5328Q8824J18646M5628j03877j85106j07866L6101P2261
$$ 454744 523346 573378 618706 707530 826176 871804 767927 582821 474955 511056 583317
40234E83317m4283j71901j58939k9957O1265M3525N588L7198Q8938O9891J1130
$$ 583317 539034 367133 208194 178237 239502 283027 288615 325813 414751 484642 495772
40223D95772J3452O7851O3779k1025p8029n2150l3532r2055j38916o2631P7107
$$ 495772 509224 577075 640854 619829 541800 489650 456118 364063 225147 162516 239623
40212B39623J16485J5822r0379p2280N0516J58053J65161Q5936m292m9611n5400
$$ 239623 356108 371930 281551 209271 259787 417840 583001 668937 664645 615034 559634
40201E59634n1621m0208j5749j2918o1451j02399m6274O7686Q3296m9180j73961
$$ 559634 508013 467805 452056 439138 377687 275288 229014 296700 379996 330816 156855
40190A56855j39819r520N3470K5390Q548K7487M88q4784j21083n2732K6866J8590
$$ 156855 17036 7516 60986 86376 94924 122411 122899 38115 -82968 -135700 -108834 -90244
40178i0244l5553l3698K2676M5492J3493O120O2826R5187Q329j33115j55003l252
$$ -90244 -125797 -159495 -136819 -91327 -77834 -71714 -8888 86299 94628 -38487 -193490 -196742
40166a96742J64159J71317M4448m5720j8021M7201N6747J5129k8014m2799j0489
$$ -196742 -32583 138734 183182 137462 119441 166642 223389 238518 210504 167705 157216
40155A57216N6558P1127m2902j98030k07393m9268P2838J0404j29712j67184r4979
$$ 157216 213774 284901 241999 43969 -163424 -212692 -139854 -129450 -259162 -426346 -521325
40144e21325j4830M9547J18316J36980O4090j753M1329J05053M3944p9776q0959
$$ -521325 -536155 -486608 -368292 -231312 -167222 -168975 -127646 -22593 21351 -58425 -139384
40133a39384L2792O8376k2868o9108J3872P7972R532p1829k4238P5493O4914m9729
$$ -139384 -106592 -38216 -61084 -130192 -116320 -38348 -28816 -100645 -124883 -49390 15524 -34205
40121c4205j30768j18943o4737j0204L5323M6680J6761k08L3529O6942M6873J4403
$$ -34205 -164973 -283916 -348653 -358857 -323534 -276854 -260093 -260301 -226772 -159830 -112957 -98554
40109i8554K1684J9099n8785j44280j05265N1783J67683J30054o047j09005j06137
$$ -98554 -76870 -57771 -116556 -260836 -366101 -314318 -146635 -16581 -22628 -131633 -237770
40098b37770k0056O4992O8434k797m7384J849P6908P8089L8862P3595J72645J86356
$$ -237770 -257826 -192834 -124400 -127197 -174581 -172732 -95824 -17735 21127 94722 267367 453723
40086D53723N0429r9429j15225m1211k7244r7055j20758j2297J43442J91871Q2927
$$ 453723 504152 404723 289498 248287 221043 123988 3230 -9067 134375 326246 409173
40075D09173q4981j67883j09135J1587O0936k68p0744m4807L5534L9430m8008
$$ 409173 324192 156309 47174 58761 119697 119429 48685 3878 39412 78842 30834
40064C0834q4821J7789J45214J34411R637o2216k2856R315o1399j68310j92169
$$ 30834 -53987 -36198 109016 243427 253064 190848 167992 177307 115908 -52402 -244571
40053b44571j10789J5141J18286J36267M0914q2648q1908O3552J83043J39546
$$ -244571 -355360 -340219 -221933 -85666 -44752 -127400 -209308 -145756 37287 176833
40043A76833J2641m6853l9051n3167p3787j8837Q1085J12695O4008K0386P68m0961
$$ 176833 189474 142621 103570 50403 -23384 -42221 38864 151559 215567 235953 236721 195760
40031A95760p4351k7802M6852L2818l0324J1375J45274J76316M3035p8031o7318
$$ 195760 121409 93607 140459 173277 142953 154328 299602 475918 518953 440922 373604
40020C73604l6480r1272j35967o6359L1186M3098K6205O6417R2370J9044n9458
$$ 373604 337124 245852 109885 43526 74712 117810 144015 210432 302802 321846 262388
40009B62388k2484M9882J2927p7747n5839P4176J57967J35847O5092l8859j70954
$$ 262388 239904 289786 302713 224966 169127 243303 401270 537117 602209 563350 392396
39998C92396k08181n0339J47605J32663o6532j69004o2899O2793N6114J1680M5363
$$ 392396 184215 133876 281481 414144 347612 178608 115709 178502 234616 246296 291659
39987B91659Q7555L1454q6077j72051k04428j78464o7267P9034J35717Q2797L8245
$$ 291659 379214 410668 324591 152540 -51888 -230352 -297619 -218585 -82868 -71 38174
39976C8174M8531J8974o8749p1191O2446J49376N0981q5250n5333P7814J05846
$$ 38174 86705 105679 36930 -34261 28185 177561 228542 143292 87959 165773 271619
39965B71619O176p3469q1388q5013p7652R559J18833J08324k660l5545O3284J31728
$$ 271619 277795 204326 122938 37925 -39727 -30168 88665 196989 194329 158784 222068 353796
39953C53796N1142p2103p7747K2317Q9537M7405n9467j39853j28840k9273P9512
$$ 353796 404938 332835 255088 277405 366942 414347 354880 215027 86187 56914 136426
39942A36426J10656O3888Q103k4913o0397r5348q3069k6919n180o1601j35931
$$ 136426 247082 310970 319073 294160 233763 138415 55346 28427 23247 -38354 -174285
39931a74285j41663o1286N9592J56522J67178P6230l5787n8152P281M4210l263
$$ -174285 -315948 -377234 -317642 -161120 6058 82288 46501 -11651 -4370 39840 36577
39920C6577m3217J3739R9197P8412m8764j41964j08853j2457K8754j5134p4286
$$ 36577 -6640 7099 106296 184708 135944 -6020 -114873 -127330 -98576 -113710 -187996
39909a87996p6282j8952M6449P8950P8917O0818K4120k5325m8355j2228M7942
$$ -187996 -264278 -283230 -236781 -157831 -78914 -18096 6024 -19301 -67656 -79884 -31942
39898c1942N7641J869n2117m7023m062K2482J5008j0130l4507l8009n131M1735
$$ -31942 25699 27568 -24549 -71572 -75634 -53152 -38144 -48274 -82781 -120790 -125921 -84186
39886h4186N5625L8558N1603J12688J39821N7566q0474j46719r4855O577P7972
$$ -84186 -28561 9997 61600 174288 314109 371675 291201 144482 49627 56204 134176
39875A34176R4873N9480j4322p2751m8918M9729J28480J10957K3158n3377q0736
$$ 134176 229049 288529 274207 201456 152538 202267 330747 441704 464862 411485 330749
39864C30749q7379j10441j43892j46499r5237k4879L219k2541n0539m6206l7401
$$ 330749 243370 132929 -10963 -157462 -252699 -277578 -274359 -296900 -347439 -393645 -431046
39853d31046l8527J0435J47500K76295K63277J32804L9881L9600K5198o3114j22719
$$ -431046 -469573 -459138 -311638 -35343 227934 360738 400619 440219 465417 402303 279584
39842B79584p3899j8514p5589j67824j40733k4381J1802o0138q4798J5834J21269
$$ 279584 205685 187171 111582 -56242 -196975 -221356 -209554 -269692 -354490 -338656 -217387
39831b17387J14963N3471M4145P6043P3912L0581j2255m6643p3283n3950K5835
$$ -217387 -102424 -48953 -4808 71235 145147 175728 163473 116830 43547 -10403 15432
39820A5432R7608R3345M3069J7753K5317L5751N1292O6629J9361j14856k25976
$$ 15432 113040 206385 249454 267207 292524 328275 379567 446196 465557 350701 124725
39809A24725j89063n2155K2565m449r030P9770J57388J02371m3908j38950j21384
$$ 124725 -64338 -116493 -93928 -98377 -107407 -27637 129751 232122 188214 49264 -72120
39798g2120n5863k4641l5242l4141J5934P6807O2247n4657j80865j94665q6498
$$ -72120 -127983 -152624 -187866 -222007 -206073 -129266 -67019 -121676 -302541 -497206 -583704
39787e83704M3034J14884J34700J24617P2344k0996j03808j26121r4310m9678
$$ -583704 -540670 -425786 -291086 -166469 -94125 -115121 -218929 -345050 -439360 -489038
39777d89038k3053k3470l8884m0652j8891q259l8730p4269n4093J7674Q4014J19485
$$ -489038 -512091 -535561 -574445 -615097 -633988 -642247 -680977 -755246 -809339 -791665 -707651 -588166
39765e88166J30256R2901p610q8937m0718J00514J68094R1290j7968n0142l7527
$$ -588166 -457910 -365009 -372619 -461556 -502274 -401760 -233666 -142376 -160344 -210486 -248013
39754b48013l8555j8564M8189P6206L94q1708m3568O1698P9236k809m6335P214
$$ -248013 -286568 -305132 -256943 -180737 -180343 -262051 -305619 -243921 -164685 -167494 -213829 -206615
39742b06615N5979J5258n6284o3797j3326K2730J7685J0290L8792R1223J16322
$$ -206615 -150636 -135378 -191662 -255459 -268785 -246055 -228370 -218080 -179288 -88065 28257
39731B8257P9652J0852k8973l6661p4136j54959j86438q6696R0635K18100K37088
$$ 28257 107909 118761 89788 53127 -21009 -175968 -362406 -449102 -358467 -140367 96721
39720I6721J70457M7865r1006j65174j28737n0032j7601l144P1590J67424J62697
$$ 96721 267178 315043 224037 58863 -69874 -119906 -137507 -140651 -69061 98363 261060
39709B61060M5559o3494q6986n9861j7562M7317R7892O4499k4518o1717m0888
$$ 261060 306619 243125 156139 96278 78716 126033 223925 288424 263906 202189 161301
39698A61301o4040j28296r0595P1388J55143K8035j42625j31730O437N0451l3453
$$ 161301 97261 -31035 -121630 -50242 104901 132936 -9689 -141419 -134982 -84531 -117984
39687a17984p8573j8234L2400O135j8272K213j4191j00027j37643l8389J02507
$$ -117984 -196557 -214791 -182391 -176256 -194528 -192315 -206506 -306533 -444176 -482565 -380058
39676c80058J42543Q5786K8466m768m4968n9650J2136J26037J61919R3712J7330
$$ -380058 -237515 -151729 -123263 -128031 -172999 -232649 -220513 -94476 67443 161155 178485
39665A78485r572m2514j19058j58460p6348O9334J43841J12010N4579K3861j4128
$$ 178485 168913 126399 7341 -151119 -227467 -158133 -14292 97718 152297 176158 162030
39654A62030p6373j00991m4717K7224K2373m3520o3821J5915J28834J63581P4235
$$ 162030 85657 -15334 -60051 -32827 -10454 -53974 -117795 -101880 26954 190535 264770
39643B64770q0854j79633j33226J8547J26802R3675q716l6745K9138O9490Q271
$$ 264770 183916 4283 -128943 -110396 16406 110081 101365 64620 93758 163248 171519
39632A71519q3468j04185o2934l9946n5817n2396R611R0330J16725O4262j2646
$$ 171519 88051 -16134 -79068 -119014 -174831 -227227 -217616 -127286 -10561 53701 41055
39621D1055l0181L2563R6782O9595l6879j16554j04761m7656j6643j2552O188
$$ 41055 10874 43437 140219 209814 172935 56381 -48380 -96036 -112679 -125231 -119043
39610a19043M9372R7617J41177J64788J24395j934j50206k08843j28888K5645
$$ -119043 -69671 27946 169123 333911 458306 456372 306166 97323 -31565 -5920
39600e920J32504J06980k9325j53884j46628j4410J14522J39156Q6481L8121J7135
$$ -5920 126584 233564 204239 50355 -96273 -110683 3839 142995 229476 267597 284732
39589B84732L413P111M5187P5150L9729l2282n4041j0872K1717L594j3458J2193
$$ 284732 288145 295256 340443 415593 455322 423040 368999 358127 379844 383438 369980 382173
39577C82173L6567J3986j0084L2613J09716J17092K5171p8153j08118q5748q4290
$$ 382173 418740 432726 422642 455255 564971 682063 707234 629081 520963 435215 350925
39566C50925j15304j19703o1771J4316L6352j2448p9425j01180o4089j1210N913
$$ 350925 235621 115918 54147 68463 104815 92367 12942 -88238 -152327 -163537 -157624
39555a57624j3020j0188O0234J59274J92729J22446J0652o6293j03606j29463
$$ -157624 -170644 -180832 -120598 38676 231405 353851 364503 298210 194604 65141
39545F5141j27315o4337K5657O4686L7740R212K2513M9501N7611O0557O9916N3983
$$ 65141 -62174 -126511 -100854 -36168 1572 10784 33297 82798 140409 200966 270882 324865
39533C24865j1518q9181j14312o2180L4660J07873R0718j8279j22397j14526j0370
$$ 324865 313347 224166 109854 47674 82334 190207 280925 262646 140249 25723 15353
39522A5353O7026M8439q214k4654K519M7292J05289J49243J20763K7361l6804
$$ 15353 82379 130818 122604 97950 100469 147761 253050 402293 523056 550417 513613
39511E13613l1372l6418r9598j25424l5486N8453j50j53556j91759n8372P7508
$$ 513613 482241 445823 346225 220801 185315 243768 243618 90062 -101697 -160069 -82561
39500h2561P7982P652p760L6073O1776M3841J8808Q854O76j7252l2358k0443J8346
$$ -82561 -4579 3073 -4687 31386 93162 137003 155811 164665 165341 148089 115731 95288 113634
39487A13634L0889m1988j58641j77542l3614J43228J77960O9749m5516j01271
$$ 113634 144523 102535 -56106 -233648 -267262 -124034 53926 123675 78159 -23112
39477b3112j31438j30131m7256P0261R8651L1024l799M3132O4743o402q7673j08736
$$ -23112 -154550 -284681 -331937 -261676 -163025 -132001 -135800 -92668 -27925 -34327 -122000 -230736
39465b30736j24616j67520j41653N199J40205J22399J3761l1681O972N0698Q4924
$$ -230736 -355352 -522872 -664525 -659326 -519121 -396722 -382961 -414642 -407670 -356972 -272048
39454b72048J28142J18760J1279p8859j5654J18101J21219j2722r5470n6674k7460
$$ -272048 -143906 -25146 -13867 -92726 -108380 9721 130940 118218 22748 -33926 -61386
39443f1386p0172n9086O9929J60661P5022p1795q2805L0946J04793Q2336M5295
$$ -61386 -131558 -190644 -120715 39946 114968 43173 -39632 -8686 96107 178443 223738
39432B23738K6947k6313j07833j23812m7325K6879K8272R106M1532R8949J07351
$$ 223738 250685 224372 116539 -7273 -54598 -27719 553 9659 51191 150140 257491
39421B57491O1218K1517K4331M5735N1034M3673N9158J15639J66952J24494l6191
$$ 257491 318709 340226 364557 410292 461326 504999 564157 679796 846748 971242 935051
39410I35051k02628k21964q3439O1893R3984O3492Q1189J37363J27922K7533o9970
$$ 935051 732423 510459 427020 488913 582897 646389 727578 864941 992863 1020396 950426
39399I50426q7163m5900J369L5358L9474o422o1960m1035N7445J17106O7239o784
$$ 950426 863263 817363 818732 854090 893564 887142 825182 784147 841592 958698 1025937 1019153
39387A019153j070M3018K7905j6630J4013R8247J04572J5896k8611L4833P6045
$$ 1019153 1018083 1061101 1089006 1072376 1086389 1184636 1289208 1305104 1276493 1311326 1387371
39376A387371k3390j66731j65148M654J78408K06906R3654m7089j00218l6985
$$ 1387371 1363981 1197250 1032102 1036756 1215164 1422070 1515724 1468635 1368417 1331432
39366A331432N4404N0618n3737j21179n1743O9146Q1822l1832j37512j34298n9060
$$ 1331432 1385836 1436454 1382717 1261538 1209795 1278941 1360763 1328931 1191419 1057121 998061
39355I98061m665j6501q3333j59003j72281p9188O2177J18808K7222j14876j42896
$$ 998061 993396 976895 893562 734559 562278 483090 545267 664075 691297 576421 433525
39344D33525j2371J36113J22561o3735k35428k16118m5386Q4406P3676L461l2001
$$ 433525 421154 557267 679828 616093 380665 164547 119161 203567 277243 280704 248703
39333B48703o1471j37395j98991j43207J5883J57220J96287J40234L4509n9933
$$ 248703 187232 49837 -149154 -292361 -276478 -119258 77029 217263 251772 191839
39323A91839o6964L3228J48294J72495J20878Q0920O3143J0146o3853p2746j2347
$$ 191839 124875 158103 306397 478892 599770 680690 743833 753979 690126 617380 605033
39312F05033R760o3072j51680j67631j28356q8599m3100L1233R9584J08155O1178
$$ 605033 614793 551721 400041 232410 104054 15455 -27645 3588 103172 211327 272505
39301B72505L817m1647p9128j03840r8889n2153L2164J14941J28831N5603j6944
$$ 272505 276322 234675 155547 51707 -47182 -99335 -67171 47770 176601 232204 215260
39290B15260Q713R0244Q8022k7339j19980q7153n334k013o8820r7050m2064M1254
$$ 215260 223973 314217 402239 374900 254920 167767 162433 160420 91600 -5450 -47514 -6260
39278f260R2897R6229N4145j4932p0670q7106p3299k8596O9513J86743K09098
$$ -6260 86637 182866 237011 222079 151409 64303 -8996 -37592 31921 218664 427762
39267D27762P8219r8256j59130q2067J8944N9490N5815M3586K1148j3314l8940
$$ 427762 505981 407725 248595 166528 185472 244962 300777 344363 365511 352197 313257
39256C13257m0944j6176L8366R0959O2210p1626j88945j44646J8504R8056J452
$$ 313257 272313 256137 294503 385462 447672 376046 187101 42455 60959 159015 160467
39245A60467j26655j06361M5278J66418J64176Q3091J991m2994m3310n784L3556
$$ 160467 33812 -72549 -27271 139147 303323 386414 388405 345411 302101 296317 329873
39234C29873L7140J8338K7954Q0866J26317R9209j4455j57532k35169j90187o7358
$$ 329873 367013 385351 413305 494171 620488 719697 705242 547710 312541 122354 54996
39223E4996K3860L7240M0432R3440J30052N1352r0016j23406k697J07177N6172
$$ 54996 78856 116096 156528 249968 380020 431372 341356 217950 215253 322430 378602
39212C78602q1891j31713p2472l5634p6733r6760j7792Q7121J03254L1990k7148
$$ 378602 296711 164998 92526 56892 -19841 -116601 -134393 -47272 55982 87972 60824
39201F0824l872Q2723J55427J41094M1823m1889j6109O8620O5523o0215j72159
$$ 60824 56952 139675 295102 436196 478019 436130 420021 488641 554164 493949 321790
39190C21790j56755o7502n425K9923O9426O3740k2923r6045n8912J1462j9162
$$ 321790 165035 97533 92108 122031 191457 255197 232274 136229 77317 88779 69617
39179F9617j05824r1412J9729N9685k3434q8180m3734K2759K9286K9229P3323
$$ 69617 -36207 -127619 -107890 -48205 -71639 -159819 -203553 -180794 -151508 -122279 -48956
39168d8956J04704Q5524P5735Q8011J8399j62383k94055k36070o6481N7713J13366
$$ -48956 55748 141272 217007 305018 323417 161034 -133021 -369091 -435572 -377859 -264493
39157b64493J46886J27801L2235l6518J3215Q9937N7524l9851o8772l7796m2673
$$ -264493 -117607 10194 42429 5911 19126 109063 166587 126736 57964 20168 -22505
39146b2505n5650J5130J10121Q9976r857l0209K2761j0355j30876j48463j2603
$$ -22505 -78155 -63025 47096 137072 127215 97006 119767 109412 -21464 -169927 -182530
39135a82530Q4216K9927k6819M9309J48971J23270L0708j545o232p2489j37706
$$ -182530 -98314 -68387 -95206 -45897 103074 226344 257052 255507 249275 176786 39080
39124C9080q5170L2798O2965q039n6942l5080j0631j2404J4777Q6269J35423J18201
$$ 39080 -46090 -13292 49673 41634 -15308 -50388 -61019 -73423 -58646 27623 163046 281247
39112B81247O5951J9744j1231k2913j5950j6605l8371m2386J764M6231K8877k3001
$$ 281247 347198 366942 355711 332798 316848 300243 261872 219486 221250 267481 296358 273357
39100B73357l4105j500J1857j3973m0111n1059o6880p7073m5585J4338M6035L5429
$$ 273357 239252 237752 249609 235636 195525 144466 77586 513 -45072 -30734 15301 50730
39088E0730K0658J2209k2991q3963j09015n1111O3414J62800J83417J05326k0761
$$ 50730 71388 83597 60606 -23357 -132372 -183483 -120069 42731 226148 331474 310713
39077C10713r4498o3345J4120M9633M2759N3192Q4611Q2327L7309L432N201J1777
$$ 310713 216215 152870 166990 216623 259382 312574 397185 479512 516821 520253 525454 537231
39065E37231J2995L6145O8813N1705k0427p2347o3528n2825r4329j35890r1514
$$ 537231 550226 586371 655184 706889 686462 614115 550587 497762 403433 267543 176029
39054A76029K6640J18187J19285O1984J3006m671k0227o4029j18352j27670o7786
$$ 176029 202669 320856 440141 502125 515131 510460 490233 426204 307852 180182 112396
39043A12396J3491N4215N8501P1495Q7015M9305m0425r1629m1038M8237N5307
$$ 112396 125887 180102 238603 310098 397113 446418 405993 314364 273326 321563 376870
39032C76870n5367j98222k57800j88298l9801Q7415J23413Q1457L0109J9654N2259
$$ 376870 321503 123281 -134519 -322817 -362618 -275203 -151790 -70333 -40224 -20570 31689
39021C1689J05094J40060J03617j9536j46780j61939o2543K8684L5116K7923R0556
$$ 31689 136783 276843 380460 360924 214144 52205 -10338 18346 53462 81385 171941
39010A71941J58116J02552n3856j35271m4952J02167J34219L4414p5329j13650
$$ 171941 330057 432609 378753 243482 198530 300697 434916 469330 394001 280351
39000B80351j08998r7687n1996M3909J16186P9241l1764q6505k6548O2812P4089
$$ 280351 171353 73666 21670 65579 181765 261006 229242 142737 116189 179001 253090
38989B53090Q346n6384p0679l2277N1267J44929J63979N5253j05271j73821j05633
$$ 253090 261436 205052 134373 102096 153363 298292 462271 517524 412253 238432 132799
38978A32799L088M4416O484n2555p3596l3116K7904J6987r2700j72844p8464J19687
$$ 132799 135887 180303 186787 134232 60636 27520 55424 72411 -20289 -193133 -271597 -151910
38966a51910J83712L8747r5694o338K12306L01090J88782L3222m1302o8174r6075
$$ -151910 31802 70549 -25145 -31483 180823 481913 670695 703917 662615 594441 498366
38955D98366q8415j7598N8418P2835K5262n1577j21329j22881k0118R6308P0029
$$ 498366 409951 392353 450771 523606 548868 497291 375962 253081 232963 329271 399300
38944C99300j00776k14879j24014O1807J34744P2772K2895M6873M7153l8098j15239
$$ 399300 298524 83645 -40369 21438 156182 228954 251849 298722 345875 307777 192538
38933A92538p8150L3480J03512R8566O8690L1368m6340j52026k02625j49242n2418
$$ 192538 114388 147868 251380 349946 418636 450004 403664 251638 49013 -100229 -152647
38922a52647q747l0653m2588J1388R5522J28937Q0894J156l6870p916N0246Q0322
$$ -152647 -161394 -192047 -234635 -223247 -127725 1212 82106 83262 46392 38476 88722 169044
38910A69044N5852l422n0899m5442J8491R7564J26016P8004M340j6946K4641N2277
$$ 169044 224896 221474 170575 125133 143624 241188 367204 445208 449548 432602 457243 509520
38898E09520l243j10452j70329j31858l9477L3953O3511O8089O2373M0969k43
$$ 509520 506277 395825 225496 93638 54161 88114 151625 219714 282087 323056 322813
38887C22813m6550o8946m6182P423M1549K0670k5601l4873Q13K3274K735o667
$$ 322813 276263 207317 161135 168558 210107 230777 205176 170303 171116 194390 197125 190458
38875A90458M9042J24871J29061N5534j2634l5653o5512j22798j11855M6580K39590
$$ 190458 239500 364371 493432 548966 536332 500679 435167 312369 200514 247094 486684
38864D86684K43844J2544k25835k34765o3345M0481k2383q8857n796J31375J30303
$$ 486684 730528 743072 517237 282472 219127 259608 237225 148368 142572 273947 404250
38853D04250k111p7687j6575N0251O485p1932n3157M8524J20681J30256J30904
$$ 404250 402139 324452 307877 358128 364613 292681 239524 288048 408729 538985 669889
38842F69889J32173Q6697O256k1212L9845J06183P4469o0118k02178k37691j22000
$$ 669889 802062 888759 895015 873803 913648 1019831 1094300 1034182 832004 594313 472313
38831D72313O6567J71517J13513j1649n5569j5775j6596r8948j51959q8023L1608
$$ 472313 538880 710397 823910 812261 756692 740917 724321 625373 473414 385391 416999
38820D16999J06403J25500J11804M1998p5193j31991o1002K5868j7469j33646
$$ 416999 523402 648902 760706 802704 727511 595520 534518 560386 542917 409271
38810D09271j36250r752N1728n1199j60929j05639M3425R8772L8940m0L5930N9434
$$ 409271 273021 263269 314997 263798 102869 -2770 40655 139427 178367 178327 214257 273691
38798B73691K3482N178N9728J16844R6518L5286J2656J8044j6412q7253j16220
$$ 273691 297173 302351 362079 478923 575441 610727 623383 641427 625015 537762 421542
38787D21542o9682p037K061m2364q6300q3393l4617J3010J7370P537O1878J81611
$$ 421542 351860 344823 346884 304520 218220 134827 100210 113220 130590 138127 200005 381616
38775C81616K38379J26500o8227j55662q7569j575o671n3644o4888o0093o6599
$$ 381616 619995 746495 678268 522606 435037 433462 426791 373147 308259 248166 181567
38764A81567k4142R8960J85309J07844o5011j48298r1902q748K6858M9987O8687
$$ 181567 157425 256385 441694 549538 484527 336229 244327 235579 262437 312424 381111
38753C81111K4582o4177p2326M5877J63732J56419O1518j4907m9441o7978n5554
$$ 381111 405693 341516 269190 315067 478799 635218 696736 681829 632388 564410 508856
38742E08856j635L9981L2924K7635N6432M4987n7040j40933p8316O5330J14355
$$ 508856 507221 547202 580126 607761 664193 709180 652140 511207 432891 498221 612576
38731F12576M1907k2464k6793n3800j21470j12297K5301J59996J62183Q6625O2158
$$ 612576 654483 632019 605226 551426 429956 317659 342960 502956 665139 751764 813922
38720H13922R2280Q4990K2083k0583j544L4153L3036l500m0853n4423m8855n4272
$$ 813922 906202 991192 1013275 992692 991148 1025301 1058337 1054837 1013984 959561 910706 856434
38708H56434r0080j22922r4727p436O5509P4216M6447J8781k0768p2711p5835
$$ 856434 766354 643432 548705 541269 606778 680994 727441 746222 725454 652743 576908
38697E76908N781R1353O9634m1348j08215n9055L2786O2838K6270n558M715K5001
$$ 576908 582689 674042 743676 702328 594113 535058 567844 630682 656952 651394 656109 681110
38685F81110J8513J269J4995N8990Q0528M4364j6440m8339n1393n8795o0617j6737
$$ 681110 699623 700892 715887 774877 855405 899769 883329 834990 783597 724802 664185 647448
38673F47448N1952O5153L477m9768l2472K673j9327p2911q0250l5931L260K3920
$$ 647448 699400 764553 768030 718262 685790 688463 669136 596225 515975 480044 483304 507224
38661E07224O1061J07336J04750L9495k4496k8108J5084M8772L5536j7943o7239
$$ 507224 568285 675621 780371 819866 795370 767262 782346 831118 866654 848711 781472
38650G81472o4556j4039K0937n591o2652r3957r3432q1427m7525J5060N3927J9591
$$ 781472 716916 702877 723814 718223 655571 561614 468182 386755 339230 354290 408217 427808
38638D27808m0432l9493J1876K7279k092J1776R7047J55790J03740j0999q4539
$$ 427808 387376 347883 359759 387038 384946 396722 493769 649559 753299 742300 657761
38627F57761q3218m1424M955L1580K3472L081J2459L6176L814r3816j61177j22563
$$ 657761 574543 533119 538074 569654 593126 596207 608666 644842 648656 554840 393663 271100
38615B71100k5710L6130M3311K7577o939o2632r7874p9066m3824l2891k551R8612
$$ 271100 245390 281520 324831 352408 345469 282837 184963 105897 62073 29182 26631 125243
38603A25243J99178J69949K1091q3244m2996M5859L9623m8617p9307R879J18324
$$ 125243 324421 494370 515461 432217 389221 435080 474703 426086 346779 356658 474982
38592D74982J18650J9914n2583k1710N3275P3458L4958P353L815l6849j21209
$$ 474982 593632 613546 560963 539253 592528 665986 700944 708297 712112 675263 554054
38581E54054j51296o7819L3734K7041n0947m7007P3084J59980R5896k8229l7310
$$ 554054 402758 334939 368673 395714 344767 297760 370844 530824 626720 598491 561181
38570E61181Q2805J68303J02403l5227q6111j7826N9335N7816J2964j274J8798
$$ 561181 643986 812289 914692 879465 793354 775528 834863 892679 905643 904369 923167
38559I23167L6391N5324R2252J02666L1322p1811r1379k0653J2106o2606j39846
$$ 923167 959558 1014882 1107134 1209800 1241122 1169311 1077932 1057279 1069385 1006779 866933
38548H66933r6877J8475N9778n426o1572j2242J05923J85595J65948P6425k382
$$ 866933 770056 788531 848309 842883 781311 769069 874992 1060587 1226535 1302960 1300578
38537A300578j8516J57o186l5253l2941K5J937k3774Q279R6811R9849m4928j71795
$$ 1300578 1282062 1282219 1276033 1240780 1207839 1207864 1209801 1186027 1194306 1291117 1390966 1346038 1174243
38524A174243j07761O2608J32284Q7382P3291R6972J6221j60179k19917p6603
$$ 1174243 1066482 1129090 1261374 1348756 1422047 1519019 1535240 1375061 1155144 1078541
38514A078541P5656N9944k6533p743P9215P2607l8539j16655j01660o5515n6782
$$ 1078541 1154197 1214141 1187608 1179865 1259080 1331687 1293148 1176493 1074833 1009318 952536
38503I52536l5436K3872P2711O0610M77n2866n3523k511M1571K1362l0749k1426
$$ 952536 917100 940972 1013683 1074293 1074770 1021904 968381 965870 1007441 1028803 998054 976628
38491I76628N6499Q5855q782j36979j63385q5502l736K7670K6458P083k5247m0836
$$ 976628 1033127 1118982 1110200 973221 809836 724334 720598 748268 774726 781809 756562 715726
38479G15726l0476m3471r7369j04020R133J51796J70266O8452k788K4550M9021
$$ 715726 685250 641779 544410 440390 449523 601319 771585 840037 837249 861799 910820
38468I10820k6808j46601j75557n8610J30154K50797K06501M0719q5278o7988
$$ 910820 884012 737411 561854 503244 633398 884195 1090696 1131415 1046137 978149
38458I78149J4894K9673j3851o674M8086K7879q5449j37458k9457J17423J26266
$$ 978149 993043 1022716 1008865 1002191 1050277 1078156 992707 855249 825792 943215 1069481
38447A069481j989j22550j45448r5142j6866O8176J22805R9022M721q3190r1800
$$ 1069481 1067492 944942 799494 704352 687486 755662 878467 977489 982210 899020 807220
38436H07220k1562N6910O8201Q447m2166j1044O3500O8511l0327j28094j10193
$$ 807220 785658 842568 910769 919216 877050 866006 929506 998017 967690 839596 729403
38425G29403K003Q3806O0825j6996m8915K545P6621Q3359P372o6086m7723M3263
$$ 729403 731406 815212 876037 859041 810126 812671 889292 972651 980023 913937 866214 909477
38413I09477R7754M7979n6207j09471n8595N6784J42269J27325L3630m1905l8503
$$ 909477 1007231 1055210 999003 889532 830937 887721 1029990 1157315 1190945 1149040 1110537
38402A110537q5Q978J4055P6422J58183J50026L8838o3583q6258q2232j00181
$$ 1110537 1110452 1119430 1133485 1209907 1368090 1518116 1556954 1493371 1407113 1324881 1224700
38391A224700q7919m278O9605L7730n3529p4989J681Q2385J00576R4011J18600
$$ 1224700 1136781 1132503 1202108 1239838 1186309 1111320 1113001 1195386 1295962 1389973 1508573
38380A508573J57516J45500N0366q4725j69722j50534p4144m1221p7670r8878
$$ 1508573 1666089 1811589 1861955 1777230 1607508 1456974 1382830 1341609 1263939 1165061
38370A165061l3347O9184J02934L9115n9236j20635j11375l5244N5202Q1695L4366
$$ 1165061 1131714 1200898 1303832 1342947 1283711 1163076 1051701 1016457 1071659 1153354 1187720
38359A187720M454N5030J04973L7743j04847j58716p4021Q609l2839j21871r7206
$$ 1187720 1192174 1247204 1352177 1389920 1285073 1126357 1052336 1060945 1028106 906235 809029
38348H09029N8189J98619K06806J18122M0051J3645k508m1334p3819n7574l270
$$ 809029 867218 1065837 1272643 1390765 1430816 1444461 1441953 1400619 1326800 1269226 1265956
38337A265956M0317N5063O8705R6706J08159P1219L658m8312o1038l9990J504
$$ 1265956 1306273 1361336 1430041 1526747 1634906 1706125 1709783 1661471 1600433 1560443 1561947
38326A561947M0879M4046J606m0281j9590O6357J45522J36801K7603j05415j50910
$$ 1561947 1602826 1646872 1648478 1608197 1588607 1654964 1800486 1937287 1964890 1859475 1708565
38315A708565n9554R9689J94046J47666j158j53639k29177j96468p9212M8232
$$ 1708565 1649011 1748700 1942746 2090412 2089254 1935615 1706438 1509970 1430758 1478990
38305A478990J10752J00974P0317M9854K8532J3070L7167Q5327Q4105J5184l4023
$$ 1478990 1589742 1690716 1761033 1810887 1839419 1852489 1889656 1974983 2059088 2074272 2040249
38294B040249P134Q1460Q4935R765o3461p6075k8309N3959J24849J30667P8267
$$ 2040249 2047383 2128843 2213778 2223543 2160082 2084007 2055698 2109657 2234506 2365173 2443440
38283B443440M6498P0674P8501J5586m1392k636P2774O6956O609K1644J19314
$$ 2443440 2489938 2560612 2639113 2654699 2613307 2610671 2683445 2750401 2757010 2778654 2897968
38272B897968J63313R4462J6530J9536N8273O7078O9585R7158J01621L5050n7355
$$ 2897968 3061281 3155743 3172273 3191809 3250082 3317160 3386745 3483903 3585524 3620574 3563219
38261C563219r6911o5006J4207J15418J86128J56547L8226n5956n1415j495K4115
$$ 3563219 3466308 3401302 3415509 3530927 3717055 3873602 3911828 3855872 3804457 3802962 3827077
38250C827077N6957J45839K27565K00120R2378M3188J08654J89591J75239Q1925
$$ 3827077 3884034 4029873 4257438 4457558 4549936 4593124 4701778 4891369 5066608 5148533
38240E148533J0024J5626P1023J27110J67217J92605J89804J47783J01055J10191
$$ 5148533 5158557 5174183 5245206 5372316 5539533 5732138 5921942 6069725 6170780 6280971
38230F280971J79400K36743K30488J98045J89303J78219J31523J11945J95678
$$ 6280971 6460371 6697114 6927602 7125647 7314950 7493169 7624692 7736637 7932315
38221G932315L15133L22946K14428J38530J61502J79498J25216R4843J63181K20451
$$ 7932315 8247448 8570394 8784822 8923352 9084854 9264352 9389568 9484411 9647592 9868043
38211I868043J38702q739n4369J1510N8533L9585L3990Q3567J36156J60063J85701
$$ 9868043 10006745 9998006 9943637 9955147 10013680 10053265 10087255 10170822 10306978 10467041 10652742
38200A0652742K20194K36178K55736L27725M04472L65116K02472P4918J14671
$$ 10652742 10872936 11109114 11364850 11692575 12097047 12462163 12664635 12739553 12854224
38191A2854224K74183M19304M89520M98203M52075L64164L07732L64427N16091
$$ 12854224 13128407 13547711 14037231 14535434 14987509 15351673 15659405 16023832 16539923
38182A6539923O47967O70783O03815N31755N14157N55058O37416P50435Q73076
$$ 16539923 17187890 17858673 18462488 18994243 19508400 20063458 20700874 21451309 22324385
38173B2324385R59181R73262R36530R07709R22146R82234J093043J248067J383389
$$ 22324385 23283566 24256828 25193358 26101067 27023213 28005447 29098490 30346557 31729946
38164C1729946J426599J409914J447718J570641J686387J760544J911282K215567
$$ 31729946 33156545 34566459 36014177 37584818 39271205 41031749 42943031 45158598
38156D5158598K531602K670588K679805K784278L074595L425173L726360M026690
$$ 45158598 47690200 50360788 53040593 55824871 58899466 62324639 66050999 70077689
38148G0077689M405210M853101N341458N881282O455408P003143P532350Q139938
$$ 70077689 74482899 79336000 84677458 90558740 97014148 104017291 111549641 119689579
38140A19689579Q861946R613098J0343374J1141841J2095216J3139363J4149251
$$ 119689579 128551525 138164623 148507997 159649838 171745054 184884417 199033668
38133A99033668J5094090J5996813J6800374J7377148J7629735J7496520J6895887
$$ 199033668 214127758 230124571 246924945 264302093 281931828 299428348 316324235
38126C16324235J5740721J3974868J1549816Q443057M778446Q56814l022056o704355
$$ 316324235 332064956 346039824 357589640 366032697 370811143 371667957 368645901 361941546
38118C61941546j0075981j2924593j5055594j6480663j7339649j7684327j7501091
$$ 361941546 351865565 338940972 323885378 307404715 290065066 272380739 254879648
38111B54879648j6908400j6138112j5309088j4392446j3415881j2506735j1677488
$$ 254879648 237971248 221833136 206524048 192131602 178715721 166208986 154531498
38104A54531498j0768704r717626q721538p995060p486434o980232o391288n811138
$$ 154531498 143762794 134045168 125323630 117328570 109842136 102861904 96470616 90659478
38096I0659478n328500m948782m653951m410462m138180l784376l412294l120844
$$ 90659478 85330978 80382196 75728245 71317783 67179603 63395227 59982933 56862089
38088E6862089k905748k696421k486903k314592k151356j951841j778018j720428
$$ 56862089 53956341 51259920 48773017 46458425 44307069 42355228 40577210 38856782
38080C8856782j712190j597729j395811j298330j357615j377112j212002r91753
$$ 38856782 37144592 35546863 34151052 32852722 31495107 30117995 28905993 27914240
38072B7914240r04027r17928q92338q27738q11870q07370p09861n72681n58635
$$ 27914240 27010213 26092285 25199947 24372209 23560339 22752969 22043108 21470427 20911792
38063B0911792o69651p23359o26448m92312m41732m50608m55528m60263m63186
$$ 20911792 20242141 19518782 18892334 18400022 17958290 17507682 17052154 16591891 16128705
38054A6128705m11890l11534k61237l00073l26816k61781j85864k16887l30311
$$ 16128705 15716815 15405281 15144044 14843971 14517155 14255374 14069510 13852623 13522312
38045A3522312m06416l94893l40725k95039k74369k62362k02372n6646Q6122O6054
$$ 13522312 13115896 12721003 12380278 12085239 11810870 11548508 11346136 11289490 11375612 11441666
38035A1441666j21443k74491k49793j50107j28633j46062r4078m0234j23834k71750
$$ 11441666 11320223 11045732 10795939 10645832 10517199 10371137 10277059 10236825 10112991 9841241
38025I841241k66135r7617j3170j52443l40517l43508j77306m6625p5676k01606
$$ 9841241 9575106 9477489 9464319 9311876 8971359 8627851 8450545 8403920 8328244 8126638
38015H126638k80669k33273j16185o9553j50210k39952j99079p3912k6879q5425
$$ 8126638 7845969 7612696 7496511 7426958 7276748 7036796 6837717 6763805 6736926 6651501
38005F651501j22920r4967j08181k03119k54350j79120q2486q1519j27529j26430
$$ 6651501 6528581 6433614 6325433 6122314 5867964 5688844 5606358 5524839 5397310 5270880
37995E270880j04680j16945j06065j1867P3463K4622j08116j72392j47629j41281
$$ 5270880 5166200 5049255 4943190 4931323 5004786 5029408 4921292 4748900 4601271 4459990
37985D459990j80242j73250q4671M632L3488L2045L2646K2335R629L0758N9260
$$ 4459990 4279748 4106498 4021827 4026459 4059947 4091992 4124638 4146973 4156602 4187360 4246620
37974D246620J4419j00708j70518j29426o1222o5763j03799o7625L8302R2550
$$ 4246620 4261039 4160331 3989813 3860387 3799165 3733402 3629603 3561978 3600280 3692830
37964C692830L5387l9481j6845P6125J10375M0084l7849l3968P164k331m2531
$$ 3692830 3728217 3688736 3671891 3748016 3858391 3898475 3860626 3826658 3833822 3831491 3788960
37953C788960k8343L2789M9443Q158n890K6404J2449p7300j25199m4114P8997
$$ 3788960 3760617 3793406 3842849 3851007 3845117 3871521 3883970 3806670 3681471 3637357 3716354
37942C716354J19131Q6591N1179m676j18951k16003j91362q2739j6380k1762l4086
$$ 3716354 3835485 3922076 3973255 3968579 3849628 3633625 3442263 3359524 3343144 3321382 3287296
37931C287296m1081q1765j25456j00126k9496j810j4872L278L2255j9398j25241
$$ 3287296 3246215 3164450 3038994 2938868 2909372 2907562 2892690 2895968 2928223 2908825 2783584
37920B783584j43624m0671N2453N1218K8066M8819N1764k5150j26731j79552j96212
$$ 2783584 2639960 2599289 2651742 2702960 2731026 2779845 2831609 2806459 2679728 2500176 2303964
37909B303964j97756j43169k5640O4463O6226M3514O4053Q1771L8615j6387k6721
$$ 2303964 2106208 1963039 1937399 2001862 2068088 2111602 2175655 2257426 2296041 2279654 2252933
37898B252933n4026j65032k65081k03242r625J27705J19648O5211O3227P3043
$$ 2252933 2198907 2033875 1768794 1565552 1555927 1683632 1803280 1868491 1931718 2004761
37888B004761K2896m8473m7493K7124P5120K8372o0232q2748r174P6087P9107
$$ 2004761 2027657 1979184 1931691 1958815 2033935 2062307 2002075 1919327 1910153 1986240 2065347
37877B065347R146m6890m3596j7563j1168j8704k4585l3493l5814k911N0194N9089
$$ 2065347 2074493 2027603 1984007 1966444 1955276 1936572 1911987 1878494 1842680 1839769 1889963 1949052
37865A949052Q651k6094O034L8198j7169j16712j21768J6243J76477J95459L9730
$$ 1949052 1957703 1931609 1937643 1975841 1958672 1841960 1720192 1736435 1912912 2108371 2148101
37854B148101j60610k39586j59433m4338k8919q8510p9588M9101J73160J63613
$$ 2148101 1987491 1747905 1588472 1544134 1515215 1426705 1347117 1396218 1569378 1732991
37844A732991O1038L517L4811P3236M9483q838l7636k0894N980P450j4321k9503
$$ 1732991 1794029 1797546 1832357 1905593 1955076 1946238 1908602 1887708 1893688 1901138 1886817 1857314
37832A857314k8353m3962j00241j54105j40770o9697j2089N182J6353K5118n868
$$ 1857314 1828961 1784999 1684758 1530653 1389883 1320186 1308097 1313279 1329632 1354750 1348882
37821A348882n2895k9805O4861J10674M1533m8565n6884k1479j8706j6559M0042
$$ 1348882 1295987 1266182 1331043 1441717 1483250 1434685 1377801 1356322 1337616 1321057 1361099
37810A361099Q3191J3613j12951j44963n9848J3733j363l4175P921J14455J94755
$$ 1361099 1444290 1457903 1344952 1199989 1140141 1153874 1152511 1118336 1126257 1240712 1435467
37799A435467J63364J3290j40916j40652K0044J41583O6364r6746j34964m5691
$$ 1435467 1598831 1612121 1471205 1330553 1350597 1492180 1558544 1461798 1326834 1281143
37789A281143l995n9634q3656k2680J9276M486M6857J78124K32024R9676o8522
$$ 1281143 1277148 1217514 1133858 1111178 1130454 1134940 1181797 1359921 1591945 1691621 1623099
37778A623099q0005J4646L5750k3779j4700Q9908J33366K0144j35273j67368o4153
$$ 1623099 1543094 1557740 1593490 1569711 1555011 1644919 1778285 1798429 1663156 1495788 1431635
37767A431635N4155R5566O9020K6347q941m3982p6421q3217n9540m2816o3701
$$ 1431635 1485790 1581356 1650376 1676723 1667782 1623800 1547379 1464162 1404622 1361806 1298105
37756A298105q6211m3573O3806J52658J50045O4958l5464q0006l0766P5658J27805
$$ 1298105 1211894 1168321 1232127 1384785 1534830 1599788 1564324 1484318 1453552 1529210 1657015
37745A657015N1682o9883p1956P6229K13870J87272K9934j05496j28096o4536
$$ 1657015 1708697 1638814 1566858 1643087 1856957 2044229 2074163 1968667 1840571 1776035
37735A776035J1992M8859M1671L3925O0830Q2751L0954o8094r4676L041J29263
$$ 1776035 1788027 1836886 1878557 1912482 1973312 2056063 2087017 2018923 1924247 1927288 2056551
37724B056551J67767J13699L0975m0970p9413n7011M868L3931J8708L6025R8446
$$ 2056551 2224318 2338017 2368992 2328022 2248609 2191598 2196466 2230397 2249105 2285130 2383576
37713B383576Q3819p4460k29651k01119m0006M9873J4663q261M9303P5700r304
$$ 2383576 2467395 2392935 2163284 1962165 1922159 1972032 1986695 1978434 2027737 2103437 2094133
37702B094133r2279k6099J43119K26023J31615l2566j02153l8970M9170N0451
$$ 2094133 2001854 1975755 2118874 2344897 2476512 2443946 2341793 2302823 2351993 2402444
37692B402444j7886m1420L6245J42833J86105J74180J72638J92342J97170J90387
$$ 2402444 2384558 2343138 2379383 2522216 2708321 2882501 3055139 3247481 3444651 3635038
37682C635038K05972K29301K16034J88964K25852L33905M17552M02761L32398
$$ 3635038 3841010 4070311 4286345 4475309 4701161 5035066 5452618 5855379 6187777
37673F187777L07192L76191N04512O11156O33295N93767N96343O99094Q06104
$$ 6187777 6494969 6871160 7375672 7986828 8620123 9213890 9810233 10509327 11315431
37664A1315431P61562N50317L14872J55437J0909k13856m88919p00567p95999
$$ 11315431 12076993 12627310 12942182 13097619 13108528 12894672 12405753 11705186 10909187
37655A0909187q11660p89846p38958o67003n96378n39487m95355m71573m78164
$$ 10909187 10097527 9307681 8568723 7901720 7305342 6765855 6270500 5798927 5320763
37646E320763m94446m70370l81049k70940k18857k44587k69495k06025q0755j4071
$$ 5320763 4826317 4355947 3974898 3703958 3485101 3240514 2971019 2764994 2684239 2670168
37636B670168o0909j36256j41923j01569r7674j29419j31136j00479r7175j19929
$$ 2670168 2609259 2473003 2331080 2229511 2131837 2002418 1871282 1770803 1673628 1553699
37626A553699r8018k3738J4233l2661r5927r4412l3857M1375J12195J48285R2743
$$ 1553699 1455681 1431943 1446176 1413515 1317588 1223176 1189319 1230694 1342889 1491174 1583917
37615A583917m6206j58127j60451j06878r1338j04572p7251j5873J3546J4747
$$ 1583917 1537711 1379584 1219133 1112255 1020917 916345 839094 823221 836767 851514
37605H51514O1516J61067K18527J69941P0888R504p243k9769p2650j04096j10761
$$ 851514 913030 1074097 1292624 1462565 1533453 1542957 1535714 1505945 1433295 1329199 1218438
37594A218438j17902j37234j34575p4028K3815R5926J07515Q1974N2342J5633
$$ 1218438 1100536 963302 828727 754699 778514 874440 981955 1063929 1116271 1131904
37584A131904l4505n5811O551J25753J86397J05321o3662j76017j42796j6185
$$ 1131904 1097399 1041588 1048139 1173892 1360289 1465610 1401948 1225931 1083135 1066950
37574A066950O7781K5966r0443j54614j04152r83N9810O3175N9279P2215Q4458
$$ 1066950 1134731 1160697 1070254 915640 811488 810505 870315 933490 992769 1064984 1149442
37563A149442Q9879Q8545L9620r1129k26030k16598l4795J59689K04918J23187
$$ 1149442 1239321 1327866 1367486 1276357 1050327 833729 798934 958623 1163541 1286728
37553A286728N2633M9212M5089k0993j18043j73593j51010o6112L0831Q1093N9489
$$ 1286728 1339361 1388573 1433662 1412669 1294626 1121033 970023 903911 934742 1015835 1075324
37542A075324K575k3518R434O3650P3592J1923p6041j12759p8710m0791n6341
$$ 1075324 1077899 1054381 1063815 1127465 1201057 1212980 1136939 1024180 945470 904679 848338
37531H48338p8548k3631Q5350J34888R0498M4859N8074N8557k2449j11570r2357
$$ 848338 769790 746159 831509 966397 1056895 1101754 1159828 1218385 1195936 1084366 992009
37520I92009J7327R4808Q2912K8082k7292q4808j25327j02750k1664N1991P5824
$$ 992009 1009336 1104144 1187056 1215138 1187846 1103038 977711 874961 853297 905288 981112
37509I81112O9091N7906M0005J3381j3476m9679j11511j75723j89628j37506n6664
$$ 981112 1050203 1108109 1148114 1161495 1148019 1098340 986829 811106 621478 483972 427308
37498D27308J9426R4674J76536K39246K34970J37012j6105j19554q9271K8926
$$ 427308 446734 541408 717944 957190 1192160 1329172 1313067 1193513 1104242 1133168
37488A133168R1450L3882m8746n1271r899j6047m9117j8174P0735J25159J28557
$$ 1133168 1224618 1258500 1209754 1158483 1148584 1132537 1083420 1065246 1135981 1261140 1389697
37477A389697J49011J78004J12606n6126j79235j52644o5962n1224p9529l0382
$$ 1389697 1538708 1716712 1829318 1773192 1593957 1441313 1375351 1324127 1244598 1214216
37467A214216R3872J56667Q7573j6950l0324L8125P0493N809q1646q8644k6995
$$ 1214216 1308088 1464755 1552328 1535378 1505054 1543179 1613672 1619481 1537835 1449191 1422196
37456A422196o208p6522j57565j54605q1803j6641R063L383m1705j09939j15386
$$ 1422196 1415988 1339466 1181901 1027296 945493 928852 937915 941298 899593 789654 674268
37445F74268p217J18450J33486P2734P3492J42707J54355Q4255N4765R6558O4541
$$ 674268 667051 785501 918987 991721 1065213 1207920 1362275 1446530 1501295 1597853 1662394
37434A662394j08549k53373j98240k3054P0593L2572m1611r1363j07067m7412
$$ 1662394 1553845 1300472 1102232 1079178 1149771 1182343 1140732 1049369 942302 894890
37424H94890R0190J74030Q1686r8687j72570j12620n9312o9970n5011K0475N8023
$$ 894890 985080 1159110 1240796 1142109 969539 856919 797607 727637 672626 693101 751124
37413G51124L672n5189m4781k1573m9871p7486k8759O4863J19284J16366Q3467
$$ 751124 754796 699607 654826 633253 583382 505896 477137 542000 661284 777650 861117
37402H61117J3361j01451j87576j40315L3450J81339J47555n6793k38344k00180
$$ 861117 874478 773027 585451 445136 478586 659925 807480 750687 512343 312163
37392C12163M7423K85395L27508K17604J23879R4421L6603q3516j74173j84730
$$ 312163 359586 644981 972489 1190093 1313972 1408393 1444996 1361480 1187307 1002577
37382A002577j93589k50895k56544j07293J16848K32014J70850K3665j00328j52535
$$ 1002577 808988 558093 301549 194256 311104 543118 713968 737633 637305 484770
37372D84770j17644j6640O5968N2059k3244m9062J2841Q9186J08301P6793L1181
$$ 484770 367126 350486 416454 468513 445269 396207 409048 498234 606535 683328 714509
37361G14509j2974m0745l2359n932j0320n2102q4438q6603q7123q2692j8507R7413
$$ 714509 701535 660790 628431 622499 612179 560077 475639 389036 301913 219221 200714 298127
37349B98127J46240N3944o9119n7939P1236J40908O6947l9083n7238k0567j5936
$$ 298127 444367 498311 429192 371253 442489 583397 650344 611261 554023 533456 517520
37338E17520l3498k0464m663m0369q0278l4731O2203Q2095K871n5407k5187J1406
$$ 517520 484022 463558 458895 418526 338248 303517 365720 447815 450686 395279 370092 381498
37326C81498k3933p9128p8737m9538m3769l1264K2729N5056N942m4547J5098J27634
$$ 381498 357565 278437 199700 150162 106393 75129 97858 152914 158856 114309 129407 257041
37314B57041J33930K5246l8245J6570O5755k061j09527j22755n4626k1162n6317
$$ 257041 390971 416217 377972 394542 460297 458236 348709 225954 171328 150166 93849
37303I3849q0521l0307O8097J49003J67752J14884K2007m4563l6502K1866N4755
$$ 93849 13328 -16979 51118 200121 367873 482757 504764 460201 423699 445565 500320
37292E00320J6980n5559q1532k3537N8801O7200j0323p0569k9087N9978Q4268
$$ 500320 517300 461741 380209 356672 415473 482673 472350 401781 372694 432672 516940
37281E16940L7035N435J1324j7174r4582j22086m3693M4852K8474o1300j04914
$$ 516940 553975 559410 570734 553560 458978 336892 293199 338051 366525 305225 200311
37270B00311o5943r579J6003K2084J4333k5961q0899q4532n104R8536J35915Q9208
$$ 200311 134368 124789 140792 162876 177209 151248 70349 -14183 -19287 79249 215164 304372
37258C04372L0841K4647L1443l9067j75363k37028j36045K6884J02882J07956
$$ 304372 335213 359860 391303 352236 176873 -60155 -196200 -169316 -66434 41522
37248D1522J55472K16940J41243o6263j87501r9019M6904O9810K4579N8512J41871
$$ 41522 196994 413934 555177 488914 301413 202394 249298 319108 343687 402199 544070
37237E44070J33742K9430n3001q1619j19300j54035j05716J140M4430m28k8501
$$ 544070 677812 707242 654241 572622 453322 299287 193571 194711 239141 238713 210212
37226B10212Q866L4780j951m2587l1118M463K6199M0579M7178K9211J5241M8294
$$ 210212 219078 253858 251907 209320 178202 182665 208864 249443 296621 325832 341073 389367
37214C89367Q1040J9771j06652j50847n8325N0893O3715J9364J2504N6582J07205
$$ 389367 470407 490178 383526 232679 174354 225247 288962 308326 320830 377412 484617
37203D84617J30367R4049j8084j39038j59589p8714j2462j7741k6281M067J0776
$$ 484617 614984 709033 690949 551911 392322 313608 301146 283405 257124 261191 271967
37192B71967l6592o2622k9886j3822m0043j74J45978K35842J33222l5810o0921
$$ 271967 235375 172753 142867 129045 89002 88828 234806 470648 603870 568060 507139
37181E07139L9172Q1733K5175p467K1976J1593p1443j19701o9303O01L718m2690
$$ 507139 546311 628044 653219 645752 667728 679321 607878 488177 418874 419475 423193 380503
37169C80503q3118q8186k7307J05519K10763J53994l6338j58969q8306O7421J22141
$$ 380503 297385 209199 181892 287411 498174 652168 615830 456861 368555 435976 558117
37158E58117L9967o4491q8953l5860K0875J1719o3767j29360j17829n8407k9421
$$ 558117 598084 533593 444640 408780 429655 441374 377607 248247 130418 72011 42590
37147D2590l9042k8436J3478K9574k453l8127n1032n5022k8604P0370J84943J79315
$$ 42590 3548 -24888 -11410 18164 15711 -22416 -73448 -128470 -157074 -86704 98239 277554
37135B77554L7818p5444l6950O5747Q4092K8828J0971L5198M899r0611j43404
$$ 277554 315372 239928 202978 268725 352817 381645 392616 427814 432713 342102 198698
37124A98698j02868n8799r3799j44211q7970P0850J85605J44171R292n8838k419
$$ 198698 95830 37031 -56768 -200979 -288949 -218099 -32494 111677 120969 62131 59712
37113E9712P0050M2853m6520p7454l5379k0210o4168o8447K4726J12254P7187
$$ 59712 129762 172615 126095 48641 13262 -6948 -71116 -139563 -114837 -2583 74604
37102G4604k7951n8981R965P2962O3270J9189j7901n4469p3284k1606Q3216J30372
$$ 74604 46653 -12328 -2363 70599 133869 153058 135157 80688 7404 -14202 69014 199386
37090A99386O2284k8505k4503M9466P2444J0701m3323k2172J8645j790n9866o2515
$$ 199386 261670 233165 208662 258128 330572 341273 297950 275778 294423 292633 232767 170252
37078A70252J6685J03877J25052Q2342K0331l0033n0662k7751K0430M3338K1333
$$ 170252 186937 290814 415866 498208 518539 488506 437844 410093 430523 473861 495194
37067D95194n368p304k1355q0666j29759q6948K7722J08074J01374N2782P301
$$ 495194 489826 482522 461167 380501 250742 163794 191516 299590 400964 453746 461047
37056D61047m5470j05205j20944o0623L4356R7903R8896L8651n3251j08573p4924
$$ 461047 415577 310372 189428 128805 163161 261064 359960 398611 345360 236787 161863
37045A61863K989L1108P066J8479P9135Q7038j390q0384o1312j1857k2791m7901
$$ 161863 164852 195960 203026 221505 300640 387678 386288 305904 244592 232735 209944 162043
37033A62043r194L7943M388m6062P142J07364Q5022n4458j17112k8166N2104j307
$$ 162043 152849 190792 195180 149118 156260 263624 348646 294188 177076 148910 201014 199707
37021A99707p7781k3213J10994J56073P2421k9047n8652k5571K1785M0415O925
$$ 199707 121926 98713 209707 365780 438201 409154 350502 324931 346716 387131 394056
37010C94056m2264k7326N3288P8675l3992j86279k16371j09323J7867R2590J23123
$$ 394056 351792 324466 377754 456429 422437 236158 19787 -89536 -71669 20921 144044
36999A44044J00140J3338m7181K6692J58424J41991m6697j76674j01186J0609
$$ 144044 244184 257522 210341 237033 395457 537448 490751 314077 212891 223500
36989B23500n4457j99556j62979O2931K14712J58323N3966N5195P9649J0439p2175
$$ 223500 169043 -30513 -193492 -130561 84151 242474 296440 351635 431284 441723 369548
36978C69548m0670M2907M1955n116L0621R9424L0326j52884k21780r6943K3650
$$ 369548 328878 371785 413740 408624 439245 538669 568995 416111 194331 97388 121038
36967A21038j5124r2171l6598R5823J46831J13885R3251P2976j2102r0255l1129
$$ 121038 105914 13743 -22855 72968 219799 333684 426935 499911 487809 397554 366425
36956C66425J16766J70690Q9770J0063m974m2142j24067j26537k241R5572L9261
$$ 366425 483191 653881 743651 753714 748740 706598 582531 455994 453753 549325 588586
36945E88586o9318o4934K2898L6304n4654j19885p3657J9447N3132L718o7777
$$ 588586 519268 454334 477232 513536 458882 338997 265340 284787 337919 341637 273860
36934B73860q1772r912Q3455R3913Q640n7874j1199Q9900J17322M6909l5625p2036
$$ 273860 192088 182176 265631 359544 368184 310310 299111 389011 506333 553242 517617 445581
36922D45581q2563q8639p3940l4917J245K5746N6546Q3051N9688k0518r1028q2162
$$ 445581 363018 274379 200439 165522 166767 192513 249059 332110 391798 371280 280252 198090
36910A98090k483P3981R0855O4100N1322O9361O0949k7443j45655j74810p8161
$$ 198090 195607 269588 360443 424543 475865 545226 606175 578732 433077 258267 180106
36899A80106M4758R0747P7670Q0681J00578P5938l669p7507r7183o4203O022R3060
$$ 180106 224864 315611 393281 473962 574540 650478 646809 569302 472119 407916 413938 506998
36887E06998J50641J40436Q7719N1030M3093L5615K9526N3763R5913J00812M9005
$$ 506998 657639 798075 885794 936824 979917 1015532 1045058 1098821 1194734 1295546 1344551
36876A344551j5627m2858j8796L8958Q2664N4595l2786o7683K5566J47382J27529
$$ 1344551 1328924 1286066 1267270 1306228 1388892 1443487 1410701 1343018 1368584 1515966 1643495
36865A643495l7563j74085j72976j10660q4329o4272L793O5658M4738j6271j9236
$$ 1643495 1605932 1431847 1258871 1148211 1063882 999610 1003403 1069061 1113799 1097528 1078292
36854A078292L2862N4573J7620l5476q7289j38817j24537K9860K41508K94569
$$ 1078292 1111154 1165727 1183347 1147871 1060582 921765 797228 827088 1068596 1363165
36844A363165J02240j49691k13236p5767N1253J7171j00898j41485p8669k3710
$$ 1363165 1465405 1315714 1102478 1026711 1077964 1095135 994237 852752 774083 750373
36834G50373m7843r6327r4060n8398n2412p3492n9727P611P3861Q5453M0520l5993
$$ 750373 702530 606203 512143 453745 401333 327841 268114 275725 349586 435039 475559 439566
36822D39566j11909j40475r5521k1861J1656J1269L2726N6898L943r9566j03580
$$ 439566 327657 187182 91661 69800 81456 92725 125451 182349 186292 86726 -16854
36811a6854L9070J61197J14214m799j6392M6008Q290j20488j30579M8097K06310
$$ -16854 22216 183413 297627 292828 276436 322444 330734 210246 79667 127764 334074
36800C34074J52600k3776j12958p3681j8767n082R806M7074P6008Q6541Q9576
$$ 334074 486674 462898 349940 276259 257492 252410 262216 309290 385298 471839 561415
36789E61415O2856j3275q8576j00367p4465p7400r4754o2470j004L258m5567m1963
$$ 561415 624271 610996 522420 422053 347588 270188 175434 112964 111960 115218 69651 27688
36777B7688M5171J07368O2213k3925n2128l7452m8384p1274m2157K3075L6281
$$ 27688 72859 180227 242440 218515 166387 128935 80551 9277 -32880 -9805 26476
36766B6476k7488q6698o1930L0098J08409J14587N6038r683k6993M735L5193L1260
$$ 26476 -1012 -87710 -149640 -119542 -11133 103454 159492 149809 122816 127551 162744 194004
36754A94004J9006L6952P5700R6101Q2390M2495j7705p9923j00733o1277o223
$$ 194004 213010 249962 325662 421763 504153 546648 528943 449020 348287 287010 280787
36743B80787J6139K3863N0615N7033j9672j37310j68916p2285M9269R1622P4921
$$ 280787 296926 320789 371404 428437 408765 271455 102539 30254 79523 171145 246066
36732B46066P4692R9918J06400Q0943M2183r411p4629j09655o4819L3603R7307
$$ 246066 320758 420676 527076 608019 650202 640791 566162 456507 391688 425291 522598
36721E22598P9582K1950j2007j0819m399o136L995L7629O1881L1047m3121q7509
$$ 522598 602180 624130 612123 601304 596905 590769 594764 632393 694274 725321 682200 594691
36709E94691o2999l3394q7094k04860k69540k10121p2939N7348J36291J44516
$$ 594691 531692 498298 411204 206344 -63196 -273317 -346256 -288908 -152617 -8101
36699h101P8716m307j3800N4596R6754M9630j6026j4800K7287M6265N1867O4095
$$ -8101 70615 66308 52508 107104 203858 253488 237462 222662 249949 296214 348081 412176
36687D12176K6964q1215j29252N217K00598K11902K4066j17790p1996J0939m1675
$$ 412176 439140 357925 228673 233890 434488 646390 670456 552666 480670 491609 449934
36676D49934j51732j39279j4622N4413L009o3969m5460M6038J45294J98415J63501
$$ 449934 298202 158923 144301 198714 201723 137754 92294 138332 283626 482041 645542
36665F45542L9959r2570j39408j01858n8279l8045P006R2523J42396Q2653n1175
$$ 645542 685501 592931 453523 351665 293386 255341 262347 354870 497266 579919 528744
36654E28744j44144j23834k8635L9575K1346m2692o7261l1484j297l0691q3206
$$ 528744 384600 260766 232131 271706 293052 250360 183099 151615 150318 119627 36421
36643C6421q7569l6607J6984L9240L6730J4680l0554p6769q1517l1717M3534J08894
$$ 36421 -51148 -87755 -70771 -31531 5199 19879 -10675 -87444 -168961 -200678 -157144 -48250
36631d8250J40587J15904K7350q5281j49466j19785j2304J11655J78092J37753
$$ -48250 92337 208241 235591 150310 844 -118941 -131245 -19590 158502 296255
36621B96255R938j14834j49129q8260K116O3783Q2212O0291n53q4599j52653j60678
$$ 296255 306193 191359 42230 -46030 -43914 19869 102081 162372 161819 77220 -75433 -236111
36609b36111r0296K2443R1039N6445k0188r44J46142K65099J89385l5119j94593
$$ -236111 -326407 -303964 -212925 -156480 -176668 -177612 -31470 233629 423014 387895 193302
36598A93302j61936j5302J01243J38919J34072J19124R7894O2424n803j12903
$$ 193302 31366 16064 117307 256226 390298 509422 607316 669740 663937 551034
36588E51034k05115j96490q3008K0212Q871p7211j08414l3917O4964R2202N2686
$$ 551034 345919 149429 66421 86633 95504 18293 -90121 -124038 -59074 33128 85814
36577H5814K4020M7253Q7236R7546Q3147P2440N4947k583p9780j02778m7639J0831
$$ 85814 109834 157087 244323 341869 425016 497456 552403 549820 470040 367262 319623 330454
36565C30454r13n3276p0391m7471l5520l7217q521M3142N6841K6986K3013P1845
$$ 330454 329541 276265 205874 158403 122883 85666 77145 120287 177128 204114 227127 298972
36553B98972J06335P2890J1952k2744n3202j13802j53145q7382O3425J66978J21665
$$ 298972 405307 478197 490149 467405 414203 300401 147256 59874 123299 290277 411942
36542D11942l0220j45838j26705j9241L4128m0758j52054j49714j5941J17867
$$ 411942 381722 235884 109179 89938 124066 83308 -68746 -218460 -234401 -116534
36532a16534J44190Q7912K3610k2908m5577k0173L8161N6453J5606K669O5047
$$ -116534 27656 115568 139178 116270 70693 50520 88681 145134 160740 163409 228456
36521B28456R6923o087j45583j30805L4367J43620Q6673r859j809O2180N3656
$$ 228456 325379 319292 173709 42904 77271 220891 307564 297705 295896 358076 411732
36510D11732k6256p9806q4934j00029j28740j10018m2978l479j2945J565P2606
$$ 411732 385476 305670 220736 120707 -8033 -118051 -161029 -164508 -177453 -175888 -103282
36499a03282J18110P3174J1453L3185Q8187M0515j00229j54865l1942J15163Q9226
$$ -103282 14828 88002 99455 132640 220827 261342 161113 6248 -25694 89469 178695
36488A78695p5618j68597r6588J5589L2922j2369j1633M9512R6294Q4766L6133
$$ 178695 103077 -65520 -162108 -146519 -113597 -125966 -137599 -88087 8207 92973 129106
36477A29106j7622n3008m1662J6146N6316J3717p7316j02785p325J27036J64666
$$ 129106 111484 58476 16814 32960 89276 102993 25677 -77108 -84433 42603 207269
36466B07269O1334r0953j59535j03025n34N1179M2824K6215J4702k0752o2314
$$ 207269 268603 177650 18115 -84910 -85444 -34265 8559 34774 49476 28724 -33590
36455c3590m2625L8436Q1248K4731o0559q4224o4528n9829m4786L0515J08027
$$ -33590 -76215 -37779 43469 68200 7641 -76583 -141111 -200940 -245726 -215211 -107184
36444a07184Q1973k3275o5486J3826J15435J32411O8917j8029r2591j18652o1545
$$ -107184 -25211 -48486 -113972 -100146 15289 147700 216617 198588 105997 -12655 -74200
36433g4200M0898R2975P1540N8565R8491J15333L6512q3351j38985j09081m1374
$$ -74200 -33302 59673 131213 189778 288269 403602 440114 356763 217778 108697 67323
36422F7323L3558R5286R8665L3712k2426K414O6686P8136K9322j4247k8285l9926
$$ 67323 100881 196167 294832 328544 306118 308532 375218 453354 482676 468429 440144 400218
36410D00218m7307k5290L48j9812o1126n1181J985Q932n5171j04354p7399k5087
$$ 400218 352911 327621 327969 308157 247031 195850 197835 206767 151596 47242 -30157 -55244
36398e5244j0332o204L7424R1466R0606L7015j3312m0857o8234r0213o8248k93
$$ -55244 -65576 -71780 -34356 57110 147716 184731 171419 130562 62328 -27885 -96133 -96426
36386i6426N9627O7019L3989j551k0653k2271n503K4068M3605L0660p967l8884
$$ -96426 -36799 30220 64209 62658 42005 19734 14231 38299 81904 112564 104597 65713
36374F5713m0518l0406m0242o5573o4528k0394K1721J5878m524L8391J44230K02520
$$ 65713 25195 -5211 -45453 -111026 -175554 -195948 -174227 -158349 -162873 -124482 19748 222268
36362B22268J19271o0449j99018k15547j47297p3128k2896K4128Q2203J27049
$$ 222268 341539 281090 82072 -133475 -280772 -353900 -376796 -352668 -270465 -143416
36352a43416J20425N7673j8241n9638o5698p0379p9570n5612J7139Q6784R1148
$$ -143416 -22991 34682 16441 -43197 -108895 -179274 -258844 -314456 -297317 -210533 -119385
36341a19385M0516K808J5369M9326N7702K3545l7494q7649q2750j6003N3575N7927
$$ -119385 -78869 -76061 -60692 -11366 46336 69881 32387 -55262 -138012 -154015 -100440 -42513
36329d2513Q543j6594J9298P0089Q6880P7557N4592r842j16691j80157j16940
$$ -42513 -33970 -50564 -31266 38823 125703 203260 257852 248010 131319 -48838 -165778
36318a65778K6362J14864R1036K3484j5755m0298q3125j14375q6109j8738K0232
$$ -165778 -139416 -24552 66484 89968 74213 33915 -49210 -163585 -249694 -268432 -248200
36307b48200J0472J012L6529R7636J24230Q1542K71m3691l228P5675Q7233j0883
$$ -248200 -237728 -236716 -200187 -102551 21679 103221 103492 59801 56573 132248 219481 208598
36295B08598j28885j39971l6654N6461L9567l8460n0200M3162J46211J52215O3797
$$ 208598 79713 -60258 -96912 -40451 -884 -39344 -89544 -46382 99829 252044 315841
36284C15841l2842p6583p2645m7097j4656O449m92j5651l93L1422J5860n5342
$$ 315841 282999 206416 133771 86674 72018 78467 77975 62324 61931 93353 109213 53871
36272E3871r5821m7159K2428K3045q325K5209R8587Q7887j8266p5570j900R3282
$$ 53871 -41950 -89109 -66681 -43636 -51961 -26752 71835 159722 141456 65886 63986 157268
36260A57268P8794p606m0173L840M2764K6986k2591p2774q8162k4914J00981J83501
$$ 157268 236062 228456 188283 192123 234887 261873 239282 166508 78346 53432 154413 337914
36248C37914J49519O1302Q224l4379j20215j77277r9768M1919O2412o4865j68669
$$ 337914 487433 548735 556959 522580 402365 225088 125320 167239 229651 164786 -3883
36237c883j38498n0898M458N0383J04267J00555K5344j8096K1594N0008Q123l206
$$ -3883 -142381 -193279 -188821 -138438 -34171 66384 91728 73632 95226 145234 153357 150151
36225A50151Q6388J50766O2381p4793q6743j9317l8228j11825n6460J15699J69064
$$ 150151 236539 387305 449686 374893 288150 268833 230605 118780 62320 178019 347083
36214C47083K0011j15227n9803N7790L5806p6356q0960M6613J37413Q8140k9957
$$ 347083 367094 251867 192064 249854 285660 209304 128344 174957 312370 400510 370553
36203C70553j15717j49211j42200r4136l0009K905O018L1454R1622J27792R1788
$$ 370553 254836 105625 -36575 -130711 -160720 -157815 -151797 -120343 -28721 99071 190859
36192A90859O389p5323j19675j03444j4994J00502J49179R0956p40k9030P577
$$ 190859 197248 121925 2250 -101194 -116188 -15686 133493 224449 223709 194679 202256
36181B02256L9387L8394L2600J9670l9450j15644r7615M6743J68714J02128j05371
$$ 202256 241643 280037 312637 332307 292857 177213 79598 126341 295055 397183 291812
36170B91812k36141j76267l3532M3053M7332N7402Q9912J05459R7946Q3072L7264
$$ 291812 55671 -120596 -154128 -111075 -63743 -6341 83571 189030 286976 370048 407312
36159D07312n7678j34323j01120K0192J06233Q8532K2040j3233o054J0072J2017
$$ 407312 349634 215311 114191 134383 240616 329148 351188 337955 331901 341973 353990
36148C53990o590l8942o0482n6589n0274o0641n4555n99N4066M3193k976m492
$$ 353990 347400 308458 247976 191387 141113 80472 25917 25318 79384 122577 119601 115109
36136A15109J7487l4176j42804j61572m0912P5373P1530L7132R3805J66633J03711
$$ 115109 132596 98420 -44384 -205956 -246868 -171495 -99965 -62833 30972 197605 301316
36125C01316m9006r1042K4956J17736N0331q3489j23555o8513l4079o4809r3077
$$ 301316 252310 161268 186224 303960 354291 270802 147247 78734 44655 -20154 -113231
36114a13231n3831M0048J25890J43094P3476k6914n7720J6911J06828R4070j7726
$$ -113231 -167062 -127014 -1124 141970 215446 188532 130812 147723 254551 348621 330895
36103C30895j08261r7478l6357j5829m1827n3877l1992j2527l569L5040R9288
$$ 330895 222634 125156 88799 72970 31143 -22734 -54726 -67253 -70822 -35782 63506
36092F3506J05190P182j05424j15876m8474k5995o8622n7707O6409J89468J81972
$$ 63506 168696 175878 70454 -45422 -93896 -119891 -188513 -246220 -179811 9657 191629
36081A91629Q0547J2120J521l0086j02617j29058m5963Q9348J60278J07511k1574
$$ 191629 272176 284296 285817 255731 153114 24056 -21907 67441 227719 335230 313656
36070C13656j09968p5777K6869N3125l8240j02699j2943J23256R3483r7507k10697
$$ 313656 203688 127911 154780 207905 169665 66966 54023 177279 270762 173255 -37442
36059c7442j08014O5678J12398M1195j4645j4931m024K7010J10793J81891J40600
$$ -37442 -145456 -79778 32620 73815 59170 44239 40215 67225 178018 359909 500509
36048E00509K6115j7162M6300R7270N3343k3398n3361n1876n0714j8243N5785
$$ 500509 526624 509462 555762 653032 706375 682977 629616 577740 527026 508783 564568
36037E64568Q7091J1986q9300r2685r021M6780L2976P216j0216o3511j30401j02317
$$ 564568 651659 663645 574345 481660 472639 519419 552395 559611 549395 485884 355483 253166
36025B53166M0527J52330J13291M656j9967L4565L8754l7782q9827o6346m4387
$$ 253166 293693 446023 559314 563970 544003 578568 617322 579540 489713 423367 378980
36014C78980p1325p4054j695O1726K9610l6661k6229M4170P8678P3188R4557J18151
$$ 378980 307655 233601 231906 293632 323242 286581 260352 304522 383200 456388 550945 669096
36002F69096M5043j06816j83422j16569l1184n7589j46454j58904n7613Q0936
$$ 669096 714139 607323 423901 307332 276148 218559 72105 -86799 -144412 -63476
35992f3476J79769K02100J34094J2255p2599p1745l8621l2344k3899K3368N1829
$$ -63476 116293 318393 452487 464742 392143 320398 281777 249433 225534 248902 300731
35981C00731j974p3850n6871J7138K5003l4159l2428N9878J03410Q742j16618
$$ 300731 298757 224907 168036 185174 210177 176018 143590 203468 306878 315620 199002
35970A99002j33316o9447m5563q2053r7770n4709K084L0274L3639K9563L2017
$$ 199002 65686 -3761 -49324 -131377 -229147 -283856 -281772 -251498 -217859 -188296 -156279
35959a56279N1733P0398M5839j5783l9958J2314P5840Q1999O7764R6417J24099
$$ -156279 -104546 -34148 11691 -4092 -44050 -31736 44104 126103 193867 290284 414383
35948D14383N9948o8135j30203p7368N424M3528N6885O8424L7833n2913j32795
$$ 414383 474331 406196 275993 198625 204049 247577 304462 372886 410719 357806 225011
35937B25011j32745q7207p6704j05332r8540j0393J09582J57380P3702q2428j65233
$$ 225011 92266 5059 -71645 -176977 -275517 -285910 -176328 -18948 54754 -27674 -192907
35926a92907q4538Q4477J77798J26632J1540o4265q2112p0758l6904K5035J00002
$$ -192907 -277445 -192968 -15170 111462 123002 58737 -23375 -94133 -131037 -106002 -6000
35915f000J58989J67296R0513n0654j46378j08856j4655k1623j29170j60872l4601
$$ -6000 152989 320285 410798 360144 213766 104910 90255 68632 -60538 -221410 -256011
35904b56011J00942R0902m397l6185M892L2950L9462O0405M9439m3408j24580
$$ -256011 -155069 -64167 -68564 -104749 -99857 -66907 -27445 32960 82399 38991 -85589
35893h5589p0407N1443O3786l6671p7982m16O2640K9452r787J0787Q478p3773
$$ -85589 -155996 -104553 -40767 -77438 -155420 -155836 -93196 -63744 -73531 -62744 -54266 -128039
35881a28039j37424r3176j2509J2751L2949J20525J96441J36003k1455j18997
$$ -128039 -265463 -358639 -371148 -358397 -325448 -204923 -8482 127521 106066 -12931
35871a2931r5784k4784K6312M8520L2891k4043o9062m6547Q610J9159j5496l6583
$$ -12931 -108715 -133499 -107187 -58667 -25776 -49819 -118881 -165428 -156818 -137659 -153155 -189738
35859a89738l5614m9405o3590k3098O2359J14852R7525N1505K0130M899j398K167
$$ -189738 -225352 -274757 -338347 -361445 -299086 -184234 -86709 -35204 -15074 -10175 -11573 -9406
35847i406J0292K6271O9084J19526J05842R884o8280m2488J8118n723q4650q9722
$$ -9406 886 27157 96241 215767 321609 331493 263213 220725 238843 233120 148470 58748
35835E8748j6102N611o3851r8523j3984R6974J15079O2597K8982K2638m039m6527
$$ 58748 42646 48257 -15594 -114117 -128101 -31127 83952 146549 175531 198169 194130 147603
35823A47603n7943k7520K0385O8890R6346O8410k310l9401o917K0368l6484j28165
$$ 147603 89660 62140 82525 151415 247761 316171 313861 274460 267543 287911 251427 123262
35811A23262j38571n5171J4542Q15l8846j8500N1815R0519O0425O012k1246k4254
$$ 123262 -15309 -70480 -55938 -55123 -93969 -112469 -60654 29865 90290 96302 75056 50802
35799E0802k4461p481M3229Q0166L5825n6094p0253L3371J27327R2258J332J3668
$$ 50802 26341 18860 62089 142255 178080 121986 51733 85104 212431 304689 306021 319689
35787C19689J26444J69927M9870j33898k38859k36635j75551q6154J4727R2456
$$ 319689 446133 616060 665930 532032 293173 56538 -119013 -205167 -190440 -97984
35777i7984J19985R6761K9882n1553p3883N656J07000J12166L8504M050J8241
$$ -97984 22001 118762 148644 97091 23208 28864 135864 248030 286534 290584 308825
35766C08825l3542j61193k05656q8309M6087N5331J1632L7153O9806j5518j51297
$$ 308825 275283 114090 -91566 -179875 -133788 -78457 -66825 -29672 40134 24616 -126681
35755a26681j53988r765J15310J35537J28408J45978J20264M523j29098j89067
$$ -126681 -280669 -290434 -175124 -39587 88821 234799 355063 359586 230488 41421
35745D1421j62636p9390L1393J16700J16084L2038p2526j44590j50702n6345J06466
$$ 41421 -121215 -200605 -169212 -52512 63572 95610 23084 -121506 -272208 -328553 -222087
35734b22087J90887Q6907r5195j36642n251J14622J01986L8772K3594K1592j2785
$$ -222087 -31200 55707 -39488 -176130 -181381 -66759 35227 73999 97593 119185 106400
35723A06400k1734L0100M7567m2357j33842q4667N6931J15410L6558o3756p9571
$$ 106400 84666 114766 162333 119976 -13866 -98533 -41602 73808 110366 46610 -32961
35712c2961k0771N5139J07743J05315M5082j1138j740L5701J3792n8980q0106
$$ -32961 -53732 1407 109150 214465 259547 248409 246669 282370 296162 237182 157076
35701A57076j7543K9367j8810r3366p1574N0639J52488J35611K0479r8451j46976
$$ 157076 139533 168900 150090 56724 -14850 35789 188277 323888 344367 245916 98940
35690I8940j15070m2350K3309O4015R3859J19185J11797M6016m4807q6334n1104
$$ 98940 -16130 -58480 -35171 28844 122703 241888 353685 399701 354894 268560 217456
35679B17456N284K0479M082j950j0231o3551j29578j11315J485P7425J2451j09919
$$ 217456 222740 243219 247301 245351 235120 171569 41991 -69324 -67839 9586 22037 -87882
35667h7882j23365q689Q9031O9003r892n0091m9619n3695m7879J4653J09547J44654
$$ -87882 -211247 -219936 -130905 -61902 -71794 -121885 -171504 -225199 -273078 -258425 -148878 -4224
35655d224P5266l3545q0508m0816J7408K5199n840j9997j6435n1049j24377j44230
$$ -4224 71042 37497 -43011 -83827 -66419 -41220 -47060 -67057 -83492 -134541 -258918 -403148
35643d03148n8674M0858M0157k3185k1796N0639O8347j5645q9737o2203J0720
$$ -403148 -461822 -420964 -380807 -403992 -425788 -375149 -306802 -322447 -412184 -474387 -463667
35632d63667M4234N1769O4763M1834k5678j9929J40189L08307K56816p21k01165
$$ -463667 -419433 -367664 -302901 -261067 -286745 -306674 -166485 141822 398638 397917 196752
35621A96752j71683k4932M3904J5548j132K3606J5675n2212j06772q7126k4585
$$ 196752 25069 137 44041 59589 58457 82063 97738 45526 -61246 -148372 -172957
35610a72957K2198M5751O0301M6543j1769o3928l8146M6290Q2961J9663o7089
$$ -172957 -150759 -105008 -44707 1836 -9933 -73861 -112007 -65717 17244 36907 -30182
35599c0182q1694l7535j5053l7350o4503q1839j04471j04274k8613R4324J58164
$$ -30182 -111876 -149411 -164464 -201814 -266317 -348156 -452627 -556901 -585514 -491190 -333026
35588c33026J15170L3711j0268k0471k1246P083P4758J26944J04455J8591p9217
$$ -333026 -217856 -184145 -194413 -214884 -236130 -229047 -154289 -27345 77110 95701 16484
35577A6484j54859j79946j24552j5205N6651M2979N402J7212N6394O2541M3610
$$ 16484 -138375 -318321 -442873 -458078 -401427 -358448 -353046 -335834 -279440 -216899 -173289
35566a73289M5031N5936L2035j5928l5887j6466J3041M0475O3547N6319J2943
$$ -173289 -128258 -72322 -40287 -56215 -92102 -108568 -95527 -55052 8495 64814 77757
35555G7757j1352J7193K6509o2435j78327j60712J3640J79102J91167R3063K0357
$$ 77757 66405 83598 110107 47672 -130655 -291367 -277727 -98625 92542 185605 205962
35544B05962J4311L074o3974j32275j08662J3057J22175J07668p287r1064o9161
$$ 205962 220273 223347 159373 27098 -81564 -68507 53668 161336 154049 62985 -6176
35533f176m633J2088j5672l0911k1225r533M164K2923J8225j9900m5626l2797
$$ -6176 -10809 1279 -14393 -45304 -66529 -76062 -71898 -48975 -30750 -50650 -96276 -129073
35521a29073k5806m4056j6354R0227J61182Q9022l2140k8107Q0945J03895l1511
$$ -129073 -154879 -198935 -215289 -125062 36120 125142 93002 64895 145840 249735 218224
35510B18224j85264k19251j46496m0522N2751Q1067J3049o2899j2353J36191K08884
$$ 218224 32960 -186291 -332787 -373309 -320558 -239491 -226442 -289341 -301694 -165503 43381
35499D3381J49818R0943J00064N6589j09879k40975j70434J0752Q2462p45r6441
$$ 43381 193199 284142 384206 440795 330916 89941 -80493 -69741 12721 11976 -84465
35488h4465j04515n8797j8772M191K1316M8687R3448J10940L8022q2324j06061
$$ -84465 -188980 -247777 -266549 -262358 -241042 -192355 -98907 12033 50055 -32269 -138330
35477a38330Q406J09421O2973n4114r2356n6382m8412p2381n6046n539K4015O2030
$$ -138330 -129924 -20503 42470 -11644 -104000 -160382 -208794 -281175 -337221 -342760 -318745 -256715
35465b56715J62304K48208J88202P547j35810j72258j59208j18516j5374R6604
$$ -256715 -94411 153797 341999 349546 213736 41478 -117730 -236246 -251620 -155016
35455a55016R6598k422m5726K5501R4816Q1112N6257P5742O1782l3959r9008k8319
$$ -155016 -58418 -60840 -106566 -81065 13751 94863 151120 226862 288644 254685 155677 127358
35443A27358Q9076R9060K0151J542Q2673J37362O3162q1297j58033j07683M42
$$ 127358 216434 315494 335645 337187 419860 557222 620384 539087 381054 273371 273813
35432B73813N2240J3070l6842j2002N3177N2948j9786m7796L1075J15244P9463
$$ 273813 326053 339123 302281 290279 343456 396404 376618 328822 359897 475141 554604
35421E54604n1518j51902j62139j19609o1837N234N3401L4683m3478j00167o0699
$$ 554604 503086 351184 189045 69436 7599 12833 66234 100917 57439 -42728 -103427
35410a03427O6949J94178K14966Q9588j03822k19534j80816n7237J9641K435l8922
$$ -103427 -36478 157700 372666 462254 358432 138898 -41918 -99155 -79514 -77079 -116001
35399a16001j7971O7125J38218J27173N0924j2208k1039j4947l3899l9015K2207
$$ -116001 -133972 -66847 71371 198544 249468 237260 216221 201274 167375 128360 150567
35388A50567R9913Q4656k9862j24468j21849p8604o2548l7373M8487J34593J14976
$$ 150567 250480 335136 305274 180806 58957 -19647 -82195 -119568 -71081 63512 178488
35377A78488l475j04182j11783o2394k3446q906J0915N4617J00143J03105N5442
$$ 178488 175013 70831 -40952 -103346 -126792 -135698 -124783 -70166 29977 133082 188524
35366A88524J9512N7606J22700R2382n5475j81187j58179l6816M5451N1764M2196
$$ 188524 208036 265642 388342 480724 425249 244062 85883 49067 94518 146282 188478
35355A88478L1149k6579j13389j29879l0517J00115J41436O1259o7050j33249
$$ 188478 219627 193048 79659 -50220 -80737 19378 160814 222073 155023 21774
35345B1774q0889K8530N8923m3535j65083j61119m5643M4669N2302N2419R9367
$$ 21774 -59115 -30585 28338 -15197 -180280 -341399 -387042 -342373 -290071 -237652 -138285
35334a38285J38344J11157N1214J6242K318j7481l0547j7099L997J0246J2969
$$ -138285 59 111216 162430 178672 180990 163509 132962 115863 119860 130106 143075
35323A43075K0646J2941r640k524N0625R1864O5174n125n9562p9779o8328o217
$$ 143075 163721 176662 167022 164498 215123 306987 372161 367036 307474 227695 159367 153150
35311A53150R8431J61335J06016k0820r4574o6882n408J7148K491j5064k5286
$$ 153150 251581 412916 518932 498112 403538 336656 331248 348396 350887 335823 310537
35300C10537l2925l6703l7461l6221j9986J3642K1873l9051j29047j47968o9609
$$ 310537 277612 240909 203448 167227 147241 160883 182756 143705 14658 -133310 -202919
35289b02919J2435J9055P434Q2968K19445K62393J32390n3507j20563n1507J2015
$$ -202919 -190484 -171429 -163995 -81027 138418 400811 533201 479694 359131 307624 319639
35278C19639k5261q8982n8781M6646Q8889J315j22623j58838j00586k5115L2886
$$ 319639 294378 205396 146615 193261 282150 283465 160842 2004 -98582 -123697 -90811
35267i0811R4698J45266J18362o46j23344j53814r8008l7385k1657l1646l2396
$$ -90811 3887 149153 267515 266869 143525 -10289 -108297 -145682 -167339 -198985 -231381
35256b31381j4856J8058O5929J13198J22189O8701k0014p8232n8758K2249R6086
$$ -231381 -246237 -228179 -162250 -49052 73137 141838 121824 43592 -15166 7083 103169
35245A03169J00131L2852m6381p3951l9830Q822J7776k0758o0738m9663J1822
$$ 103169 203300 236152 189771 115820 75990 84812 102588 81830 21092 -28571 -16749
35234a6749O4205N6581J3410P878O4626J21343J06230K4679n9813j05401j13838
$$ -16749 47456 104037 117447 125325 189951 311294 417524 442203 382390 276989 163151
35223A63151r3408n0710j3564j0125k2161j0080J2500o295n2477l7357O1455J27351
$$ 163151 69743 19033 5469 -4656 -26817 -36897 -24397 -30692 -83169 -120526 -59071 68280
35211F8280N1746r8549j53609n3661J00409J92955J92319J08873l2692j52998
$$ 68280 120026 21477 -132132 -185793 -85384 107571 299890 408763 376071 223073
35201B23073j57109o3375j110k5875l5696N2825J47103J15236M422k5647M5033
$$ 223073 65964 2589 1479 -24396 -60092 -7267 139836 255072 259494 233847 278880
35190B78880P1219j6975j01873o6634L0767O1766J3842l0240m0344n6579q2620
$$ 278880 350099 333124 231251 164617 195384 257150 270992 240752 200408 143829 61209
35179F1209o3927J6799R7143J09706N1252l5455j06090j29402r6961l4753K0832
$$ 61209 -2718 14081 111224 220930 272182 236727 130637 1235 -95726 -130479 -109647
35168a09647O3026J02535J20726Q1431k570o5704p3504o1469o0703l9091L1644
$$ -109647 -46621 55914 176640 258071 255501 189797 116293 54824 -5879 -44970 -13326
35157a3326R7329Q5848K6296J5581O4624P2715j1927r5962p0168L3036R2742O3111
$$ -13326 84003 169851 196147 211728 276352 349067 337140 241178 171010 204046 296788 359899
35145C59899n694p5344j41118j57066o1059R7077J63875P4098n8236j04289q4485
$$ 359899 354205 278861 137743 -19323 -80382 16695 180570 254668 196432 92143 7658
35134G658q2606q1617q378J04381J34997M8973n5409q8929n9124l438O1297R5988
$$ 7658 -74948 -156565 -164943 -60562 74435 123408 67999 -20930 -80054 -83492 -22195 73793
35122G3793M9863m1436o4778O249M8294l5185j56906j63382n2450L4571J0676
$$ 73793 123656 82220 17442 23691 71985 36800 -120106 -283488 -335938 -301367 -290691
35111b90691o9451j13563q9998j2016R3214J74595J78756J11083L4975k758p004
$$ -290691 -360142 -473705 -563703 -575719 -482505 -307910 -129154 -18071 16904 14146 7142
35100G142M054J7637K414o6762j38935j12145K8487J58049J56405O0785L987K8550
$$ 7142 11196 28833 31247 -35515 -174450 -286595 -258108 -100059 56346 117131 121118 149668
35088A49668M5040k2178j26172j67246j16979k9116L9215O9809O2518J9337m2419
$$ 149668 194708 172530 46358 -120888 -237867 -266983 -227768 -157959 -95441 -76104 -118523
35077a18523q7410q4249k6601N5574R6780L9710q5583j55590q8241L1193M3964
$$ -118523 -205933 -290182 -316783 -261209 -164429 -124719 -210302 -365892 -454133 -422940 -378976
35066c78976n2958q0051O5186K31274K10688L8817o0772m001N8855J0259n1837
$$ -378976 -431934 -511985 -446799 -215525 -4837 33980 -26792 -30793 28062 38321 -13516
35055a3516k614Q1176L8080j10817j80281q8661M4407Q7729N5606K8347K2626
$$ -13516 -16130 65046 103126 -7691 -187972 -276633 -232226 -144497 -88891 -60544 -37918
35044c7918J0810j989O330K1576J5421m456j3640j9392m5323q0493q4145l9878
$$ -37918 -27108 -29097 -22767 -1191 14230 9774 -3866 -23258 -68581 -149074 -233219 -273097
35032b73097K2491N8608M5309q795o7472q2949k8576P1610J48064J32678K0327
$$ -273097 -250606 -191998 -146689 -155484 -222956 -305905 -334481 -262871 -114807 17871 38198
35021C8198j06973j37850m1508Q7257J23556N2471j9807j548P6096J09979N5365
$$ 38198 -68775 -206625 -248133 -160876 -37320 15151 -4656 -6204 69892 179871 235236
35010B35236l1174p1075n1121k0231j9430l6679l3407k129J6993j8993r9741j57263
$$ 235236 204062 132987 81866 61635 42205 5526 -27881 -30010 -13017 -32010 -131751 -289014
34998b89014j26281j8525P0595N7012k6161o1494q590L0850k7708r4972l0564
$$ -289014 -415295 -433820 -363225 -306213 -332374 -393868 -402458 -371608 -399316 -494288 -524852
34987e24852J13747J38577M329q9069q273J10887J03492M7046R3075J62248O6064
$$ -524852 -411105 -272528 -268199 -357268 -365541 -254654 -151162 -104116 -11041 151207 217271
34976B17271j35305j82321k7941Q1334q43j12806q3293P805K4370J5289O7184
$$ 217271 81966 -100355 -128296 -46962 -47805 -160611 -243904 -236099 -211729 -196440 -129256
34965a29256R2623j3341j35352q8685P6841J49298P7419M243R451K9296K5352
$$ -129256 -36633 -49974 -185326 -274011 -197170 -47872 29547 33790 43241 72537 97889
34954I7889L1965K8610m2408j16183n9001Q8405J23709m352r8378j8538J04198
$$ 97889 129854 158464 116056 -127 -59128 29277 152986 148634 50256 31718 135916
34943A35916R1073q833k9137L8256N2886l9246j33711j26008l3695M8384M7673
$$ 135916 226989 218156 189019 227275 280161 240915 107204 -18804 -52499 -4115 43558
$$ [...]
##END NTUPLES=NMR SPECTRUM
##END=
