##TITLE=31Pdec_DE-127_H2
 D2O, 24 sc
 13.2.2026
##JCAMPDX= 6.0         $$ Bruker NMR JCAMP-DX V2.0
##DATA TYPE= NMR SPECTRUM
##DATA CLASS= NTUPLES
##ORIGIN= UXNMR, Bruker Analytische Messtechnik GmbH
##OWNER= root
$$ XWIN-NMR		Version 3.5
$$ Fri Feb 13 15:45:28 2026 Russian Standard Time (UT+4h)  she@DPX200
##.OBSERVE FREQUENCY= 81.013821
##.OBSERVE NUCLEUS= ^31P
##.ACQUISITION MODE= SIMULTANEOUS
##.ACQUISITION SCHEME= undefined
##.AVERAGES= 24
##.DIGITISER RES= 17
##SPECTROMETER/DATA SYSTEM= spect
##.PULSE SEQUENCE= zgpg30
##.SOLVENT NAME= DMSO
##.SHIFT REFERENCE= (INTERNAL, DMSO, 0, 198.062)
##AUDIT TRAIL= $$ (NUMBER, WHEN, WHO, WHERE, WHAT)
$$ ##TITLE= Audit trail, XWIN-NMR		Version 3.5
$$ ##JCAMPDX= 5.01
$$ ##ORIGIN= Bruker BioSpin GmbH
$$ ##OWNER= she
$$ F:/spectra/data/she/nmr/P31/2/pdata/1/auditp.txt
$$ ##AUDIT TRAIL=  $$ (NUMBER, WHEN, WHO, WHERE, WHAT)
(   1,<2026-02-13 15:44:01.57 +0400>,<she>,<DPX200>,
      <created by zg, POWCHK disabled, PULCHK disabled
       configuration hash MD5:
       00 E9 B6 7A A2 85 ED C7 34 08 36 98 17 FE 4E 26
       data hash MD5: 32K
       8A D4 A2 54 FB 7D E0 D7 98 36 6C A4 7F E2 01 E0>)
(   2,<2026-02-13 15:44:04.03 +0400>,<she>,<DPX200>,
      <Start of raw data processing
       efp BC_mod = 2 LB = 1.5 FT_mod = 6 PKNL = 1 PHC0 = 1367.835 PHC1 = 110.5007 SI = 64K 
       data hash MD5: 64K
       48 61 E4 41 61 66 07 96 CA 4C B8 75 6B 1D 60 54>)
(   3,<2026-02-13 15:44:34.15 +0400>,<she>,<DPX200>,
      <pk PHC0 = -15.0696 PHC1 = 18.6 
       data hash MD5: 64K
       C4 3A 58 17 56 73 55 83 1C FA 49 67 E1 8F EB D0>)
(   4,<2026-02-13 15:44:49.20 +0400>,<she>,<DPX200>,
      <abs ABSG = 5 
       data hash MD5: 64K
       15 25 29 E8 03 85 4F 6A 90 12 0E D7 C1 41 F0 99>)
$$ ##END=
$$ 
$$ hash MD5
$$ AF AA B0 FF 76 5B 49 CC A0 8A E2 AE C4 17 3B 65
##$RELAX= 
##$RELAX= 
##$RELAX= 
##$RELAX= 
##$RELAX= 
##$RELAX= 
##$RELAX= 
##$RELAX= 
$$ Bruker specific parameters
$$ --------------------------
##$DU= <F:/spectra>
##$EXPNO= 2
##$NAME= <P31>
##$PROCNO= 1
##$TYPE= <nmr>
##$USER= <she>
##$AMP= (0..31)
100 100 100 100 100 100 100 100 100 100 100 100 100 100 100 100 100 100 
100 100 100 100 100 100 100 100 100 100 100 100 100 100 
##$AQSEQ= 0
##$AQ_mod= 1
##$AUNM= <au_zg>
##$AUTOPOS= <>
##$BF1= 81.014009
##$BF2= 200.13
##$BF3= 200.13
##$BF4= 200.13
##$BF5= 200.13
##$BF6= 200.13
##$BF7= 200.13
##$BF8= 200.13
##$BYTORDA= 1
##$CFDGTYP= 0
##$CFRGTYP= 5
##$CHEMSTR= <none>
##$CNST= (0..31)
1 1 145 1 1 1 1 1 1 1 1 1 1 1 1 1 1 1 1 1 1 1 1 1 1 1 1 1 1 1 1 1 
##$CPDPRG= <waltz16>
##$CPDPRG1= <>
##$CPDPRG2= <waltz16>
##$CPDPRG3= <>
##$CPDPRG4= <mlev>
##$CPDPRG5= <mlev>
##$CPDPRG6= <mlev>
##$CPDPRG7= <mlev>
##$CPDPRG8= <mlev>
##$CPDPRGB= <>
##$CPDPRGT= <>
##$D= (0..31)
0 1 0 0 0 0 0 0 0 0.06 0 0.03 2e-05 3e-06 0 0 0.0002 0 0 0 0 0 0 0 0 0 
0 0 0 0 0 0 
##$DATE= 1770983040
##$DBL= (0..7)
120 120 120 11 120 120 24 19 
##$DBP= (0..7)
150 150 150 150 150 150 150 150 
##$DBP07= 0
##$DBPNAM0= <>
##$DBPNAM1= <>
$$ [...]
##$SUBNAM3= <"">
##$SUBNAM4= <"">
##$SUBNAM5= <"">
##$SUBNAM6= <"">
##$SUBNAM7= <"">
##$SUBNAM8= <"">
##$SUBNAM9= <"">
##$SW= 400.765351723535
##$SWIBOX= (0..15)
0 1 3 0 0 0 0 0 0 0 0 0 0 0 0 0 
##$SW_h= 32467.5324675325
##$TD= 32768
##$TD0= 1
##$TE= 0
##$TE2= 300
##$TE3= 300
##$TEG= 300
##$TL= (0..7)
0 120 53 12 22 120 120 120 
##$TP= (0..7)
150 150 150 150 150 150 150 150 
##$TP07= 0
##$TPNAME0= <>
##$TPNAME1= <>
##$TPNAME2= <>
##$TPNAME3= <>
##$TPNAME4= <>
##$TPNAME5= <>
##$TPNAME6= <>
##$TPNAME7= <>
##$TPOAL= (0..7)
0.5 0.5 0.5 0.5 0.5 0.5 0.5 0.5 
##$TPOFFS= (0..7)
0 0 0 0 0 0 0 0 
##$TUNHIN= 0
##$TUNHOUT= 0
##$TUNXOUT= 0
##$USERA1= <user>
##$USERA2= <user>
##$USERA3= <user>
##$USERA4= <user>
##$USERA5= <user>
##$V9= 5
##$VALIST= <valist>
##$VCLIST= <CCCCCCCCCCCCCCC>
##$VD= 0
##$VDLIST= <DDDDDDDDDDDDDDD>
##$VPLIST= <PPPPPPPPPPPPPPP>
##$VTLIST= <TTTTTTTTTTTTTTT>
##$WBST= 1024
##$WBSW= 4
##$XGAIN= (0..3)
0 0 0 0 
##$XL= 0
##$YL= 0
##$YMAX_a= 12268
##$YMIN_a= -12756
##$ZGOPTNS= <>
##$ZL1= 120
##$ZL2= 120
##$ZL3= 120
##$ZL4= 120
##$ABSF1= 198.0616
##$ABSF2= -202.7028
##$ABSG= 5
##$ABSL= 3
##$ALPHA= 0
##$AQORDER= 0
##$ASSFAC= 0
##$ASSFACI= 0
##$ASSFACX= 0
##$ASSWID= 0
##$AUNMP= <proc_1d>
##$AZFE= 0.1
##$AZFW= 0.5
##$BCFW= 0
##$BC_mod= 2
##$BYTORDP= 0
##$COROFFS= 0
##$CY= -3
##$DATMOD= 1
##$DC= 0
##$DFILT= <>
##$DTYPP= 0
##$F1P= 0
##$F2P= 0
##$FCOR= 1
##$FTSIZE= 65536
##$FT_mod= 6
##$GAMMA= 0
##$GB= 0
##$INTBC= 1
##$INTSCL= 9.790993e-09
##$ISEN= 30
##$LB= 1.5
##$LEV0= 0
##$LPBIN= 0
##$MAXI= 10000
##$MC2= 0
##$MEAN= 0
##$ME_mod= 0
##$MI= 50
##$NCOEF= 0
##$NC_proc= -7
##$NLEV= 6
##$NOISF1= 182.463
##$NOISF2= 159.3651
##$NSP= 0
##$NTH_PI= 0
##$NZP= 0
##$OFFSET= 198.0616
##$PC= 4
##$PHC0= 1352.765
##$PHC1= 129.1007
##$PH_mod= 1
##$PKNL= yes
##$PPARMOD= 0
##$PSCAL= 0
##$PSIGN= 0
##$REVERSE= no
##$SF= 81.0140089999434
##$SI= 65536
##$SIGF1= 159.3651
##$SIGF2= -187.1042
##$SINO= 113.3802
##$SIOLD= 16384
##$SREGLST= <1H.CDCl3>
##$SSB= 0
##$STSI= 65536
##$STSR= 0
##$SW_p= 32467.5324675325
##$SYMM= 0
##$S_DEV= 0
##$TDeff= 32768
##$TDoff= 0
##$TI= <>
##$TILT= no
##$TM1= 0
##$TM2= 0
##$TOPLEV= 0
##$USERP1= <user>
##$USERP2= <user>
##$USERP3= <user>
##$USERP4= <user>
##$USERP5= <user>
##$WDW= 1
##$XDIM= 65536
##$YMAX_p= 374798597
##$YMIN_p= -33419571
$$ End of Bruker specific parameters
$$ ---------------------------------
##NTUPLES= NMR SPECTRUM
##VAR_NAME=  FREQUENCY,     SPECTRUM/REAL,   SPECTRUM/IMAG
##SYMBOL=    X,             R,               I
##VAR_TYPE=  INDEPENDENT,   DEPENDENT,       DEPENDENT
##VAR_FORM=  AFFN,          ASDF,            ASDF
##VAR_DIM=   65536,         65536,           65536
##UNITS=     HZ,            ARBITRARY UNITS, ARBITRARY UNITS
##FACTOR=    0.49542278885378, 1,            1
##FIRST=     16045.7642231865, 0,            0
##LAST=      -16421.768244346, 0,            0
##MIN=       -16421.768244346, -33419571,    0
##MAX=       16045.7642231865, 374798597,    0
$$ Real data points
##PAGE= N=1
##DATA TABLE= (X++(R..R)), XYDATA
$$ [...]
$$ plain form
41563 3834761 4263651 4809806 4734847 3665097 2440217 2089591 2370109 2128891 972401
41554 972401 -116968 83528 1679835 3523763 4254318 3484787 2022599 874498 216560
41545 216560 -308812 -511036 317398 2059716 3277931 2707593 808756 -817395 -1287054
41536 -1287054 -1082844 -1012942 -1212432 -1298754 -1009445 -417834 241254 741677 943681 831012
41526 831012 493389 65519 -345556 -714549 -1035604 -1171113 -932906 -463249 -278034 -590031
41516 -590031 -837966 -429111 214246 96840 -809579 -1319738 -672224 372705 643558
41507 643558 133645 -241379 -14320 477249 868664 1178559 1504113 1849044 2174234 2197913
41497 2197913 1402427 -198285 -1562911 -1625417 -690565 -85529 -423470 -975959 -882930
$$ packed form
41563C834761M28890N46155p4959j069750j224880l50626K80518k41218j156490
41554I72401j089369K00496J596307J843928P30555p69531j462188j148101o57938
41545B16560n25372k02224Q28434J742318J218215n70338j898837j626151m69659
41536a287054K04210O9902j99490q6322K89309N91611O59088N00423K02004j12669
41526H31012l37623m27870m11075l68993l21055j35509K38207M69657J85215l11997
41516e90031k47935M08855O43357j17406r06419n10159O47514J044929K70853
41507F43558n09913l75024K27059M91569L91415L09895L25554L44931L25190K3679
41497B197913p95486j600712j364626o2506R34852O05036l37941n52489R3029
$$ plain form
41488 -882930 -209416 491260 990039 1332411 1445199 1201555 616062 -202357 -971088 -1101352
41478 -1101352 -241012 919033 1136170 282840 -242879 630553 2087181 2548973 1834661
41469 1834661 1171208 1305583 1710125 1725271 1434012 1067573 472298 -268126 -408756 517952
41459 517952 1756829 2054187 1171011 94501 -178494 436401 1358687 1995616 2046233
41450 2046233 1561147 897337 416180 139348 -148978 -487513 -655342 -506075 -160564
41441 -160564 145609 217947 -45580 -534805 -941713 -1159388 -1513820 -2197338 -2648901 -2149627
41431 -2149627 -1036610 -505001 -898995 -1038398 104687 1726946 2103347 833451 -776091
41422 -776091 -1479343 -1286198 -751289 -487 1057258 2183626 3046371 3660692 4137948
$$ packed form
41488h82930O73514P00676M98779L42372J12788k43644n85493q18419p68731j30264
41478a101352Q60340J160045K17137q53330n25719Q73432J456628M61792p14312
41469A834661o63453J34375M04542J5146k91259l66439n95275p40424j40630R26708
41459E17952J238877K97358q83176j076510k72995O14895R22286O36929N0617
41450B046233m85086o63810m81157k76832k88326l38535j67829J49267L45511
41441a60564L06173P2338k63527m89225m06908k17675l54432o83518m51563M99274
41431b149627J113017N31609l93994j39403J143085J622259L76401j269896j609542
41422g76091p03252J93145N34909P50802J057745J126368Q62745O14321M77256
$$ plain form
41413 4137948 4221523 3469510 1802410 -351513 -2309390 -3390746 -3200879 -1959114 -448133
41404 -448133 545828 712830 219202 -466044 -743343 -316280 399584 710692 637187 962390
41394 962390 2037794 3125012 3380720 2957901 2530466 2213960 1752248 1442525 1902387
41385 1902387 2921756 3450688 2946497 1984449 1242367 574742 -477350 -1819387 -2961040
41376 -2961040 -3651948 -3862399 -3426330 -2241086 -697485 562162 1313225 1833192 2330915
41367 2330915 2644900 2612479 2464824 2617080 3096059 3353030 2816433 1662501 827564
41358 827564 1014939 1799551 2056973 1267876 -11759 -1060662 -1853440 -2675850 -3316986
41349 -3316986 -3223818 -2334410 -1246103 -539415 -348723 -625596 -1343291 -2219778 -2622543
$$ packed form
41413D137948Q3575p52013j667100k153923j957877j081356J89867J241765J510981
41404d48133R93961J67002m93628o85246k77299M27063P15864L11108p3505L25203
41394I62390J075404J087218K55708m22819m27435l16506m61712l09723M59862
41385A902387J019369N28932n04191r62048p42082o67625j052092j342037j141653
41376b961040o90908k10451M36069J185244J543601J259647P51063N19967M97723
41367B330915L13985l2421j47655J52256M78979K56971n36597j153932q34937
41358H27564J87375P84612K57422p89097j279635j048903p92778q22410o41136
41349c316986R3168Q89408J088307P06688J90692k76873p17695q76487m02765
$$ plain form
41340 -2622543 -2144477 -1178614 -618334 -922289 -1594711 -1645971 -567128 1117012 2259909
41331 2259909 2117163 973161 -273377 -1031261 -1345351 -1407917 -1144014 -494736 152871
41322 152871 173851 -661243 -1947218 -3015658 -3428532 -3225036 -2876926 -2880785 -3149640 -2958112
41312 -2958112 -1864320 -571079 -314718 -1316530 -2457404 -2772044 -2627824 -2881336 -3429450
41303 -3429450 -3443052 -2778508 -2213781 -2237276 -2486908 -2619558 -2866539 -3256438 -3061047 -1758441
41293 -1758441 -86152 646191 104704 -860866 -1444666 -1684256 -1988467 -2393970 -2488055
41284 -2488055 -1851268 -557581 645717 884120 133830 -656834 -780245 -679194 -1054460
41275 -1054460 -1501858 -982780 499710 1772257 2182595 2332858 2720557 2736966 1792851
$$ packed form
41340b622543M78066R65863N60280l03955o72422n1260J078843J684140J142897
41331B259909j42746j144002j246538p57884l14090o2566K63903O49278O47607
41322A52871K0980q35094j285975j068440m12874K03496L48110l859k68855J91528
41312b958112J093792J293241K56361j001812j140874l14640J44220k53512n48114
41303c429450j3602O64544N64727k3495k49632j32650k46981l89899J95391J302606
41293a758441J672289P32343n41487r65570n83800k39590l04211m05503r4085
41284b488055O36787J293687J203298K38403p50290p90664j23411J01051l75266
41275a054460m47398N19078J482490J272547M10338J50263L87699J6409r44115
$$ plain form
41266 1792851 567981 113392 274626 130892 -318665 -168226 643801 879959 -145854
41257 -145854 -1257961 -856589 861812 2072351 1573931 23065 -1192748 -1514121 -1223276
41248 -1223276 -550955 435015 1223952 981003 -410579 -1911237 -2327344 -1508478 -262804
41239 -262804 633503 967048 870990 572460 305482 82181 -406992 -1321486 -2231251 -2597617
41229 -2597617 -2563593 -2681511 -2900867 -2541149 -1413530 -245168 321340 486016 654922
41220 654922 703867 424974 136767 179907 239076 -121206 -587153 -530469 -80595 57197
41210 57197 -227824 -292857 165415 643109 699092 618479 827173 1127891 938093 30436
41200 30436 -1247951 -2304626 -2686898 -2355129 -1719147 -1250223 -1036696 -910216 -876887 -1015611
$$ packed form
41266A792851j224870m54589J61234j43734m49557J50439Q12027K36158j025813
41257a45854j112107M01372J718401J210539m98420j550866j215813l21373K90845
41248a223276O72321R85970P88937k42949j391582j500658m16107Q18866J245674
41239b62804Q96307L33545r6058k98530k66978k23301m89173r14494r09765l66366
41229b597617L4024j17918k19356L59718J127619J168362N66508J64676J68906
41220F54922M8945k78893k88207M3140N9169l60282m65947N6684M49874J37792
41210E7197k85021o5033M58272M77694N5983q0613K08694L00718j89798r07657
41200C0436j278387j056675l82272L31769O35982M68924K13527J26480L3329j38724
$$ plain form
41190 -1015611 -1042054 -587824 -29038 -348210 -1763170 -3048707 -2842315 -1350625 -135481
41181 -135481 -260304 -1194361 -1655246 -1078991 19577 881261 1316620 1647007 2093790
41172 2093790 2481738 2558652 2379023 2188280 2031937 1690604 986908 -4160 -1026157
41163 -1026157 -1762552 -1918113 -1365468 -258751 1044228 2104839 2463374 1895414 817265
41154 817265 107267 164960 429091 247188 -120304 14450 566422 822914 741554 1155772
41144 1155772 2440366 3806498 4311385 3874992 2921793 1731282 607934 5308 -62931
41135 -62931 -116745 -229389 271393 1477705 2177068 1469249 362276 463693 1555493
41126 1555493 1927165 959794 -144088 -368106 -119593 12141 322757 998883 1221412
$$ packed form
41190a015611k6443M54230N58786l19172j414960j285537K06392J491690J215144
41181a35481j24823r34057m60885N76255J098568Q61684M35359L30387M46783
41172B093790L87948P6914j79629j90743j56343l41333p03696r91068j021997
41163a026157p36395j55561N52645J106717J302979J060611L58535n67960j078149
41154H17265p09998N7693K64131j81903l67492J34754N51972K56492q1360M14218
41144A155772J284594J366132N04887m36393r53199j190511j123348o02626o8239
41135f2931n3814j12644N00782J206312O99363p07819j106973J01417J091800
41126A555493L71672r67371j103882k24018K48513J31734L10616O76126K22529
$$ plain form
41117 1221412 340419 -828201 -977578 -113209 605756 495084 -144980 -959124 -2007820
41108 -2007820 -3228100 -4182710 -4543590 -4348068 -3734460 -2887773 -2232896 -2179675 -2644196
41099 -2644196 -3246119 -3902543 -4698009 -5243787 -4855753 -3493000 -1905302 -692130 164514
41090 164514 662809 449253 -445822 -1221145 -1252819 -913782 -827518 -814226 -374543 167967
41080 167967 -4426 -834906 -1340333 -1055009 -610515 -616114 -862432 -1047061 -1366239 -1727653
41070 -1727653 -1261169 377386 1840577 1480993 -317934 -1479225 -979698 20362 190652
41061 190652 -98297 216295 988743 1190355 659740 249881 235003 -263060 -1830052 -3557201
41051 -3557201 -3929976 -2571710 -597530 618296 627231 -107028 -1005184 -1838898 -2427939
$$ packed form
41117A221412q80993j168620j49377Q64369P18965j10672o40064q14144j048696
41108b007820j220280r54610l60880J95522O13608Q46687O54877N3221m64521
41099b644196o01923o56424p95466n45778L88034J362753J587698J213172Q56644
41090A64514M98295k13556q95075p75323l1674L39037Q6264J3292M39683N42510
41080A67967j72393q30480n05427K85324M44494n599k46318j84629l19178l61414
41070a727653M66484J638555J463191l59584j798927j161291M99527J000060J70290
41061A90652k88949L14592P72448K01612n30615m09859j4878m98063j566992j727149
41051c557201l72775J358266J974180J215826Q935p34259q98156q33714n89041
$$ plain form
41042 -2427939 -2286491 -1090368 508534 1192452 505674 -461773 -537649 -163649 -732177
41033 -732177 -2444436 -3939852 -4241899 -3976987 -4109492 -4386893 -3877151 -2468680 -965776
41024 -965776 -14197 302128 48806 -591494 -1060567 -868102 -281505 35473 -2655 64024
41014 64024 327526 406219 278898 391057 750093 750093 216211 -204215 -165607 -333674 -1282996
41003 -1282996 -2357047 -2509909 -1866371 -1510426 -1906528 -2436428 -2505034 -2249368 -1958490
40994 -1958490 -1524420 -811635 -57847 414076 513932 215064 -517399 -1404762 -1870946 -1644406
40984 -1644406 -982803 -78459 1291241 3145924 4765915 5311573 4756807 3736463 2675080
40975 2675080 1600885 689700 348534 625181 1017219 1079148 898247 822123 1027403 1501525
$$ packed form
41042b427939J41448J196123J598902O83918o86778r67447p5876L74000n68528
41033g32177j712259j495416l02047K64912j32505k77401N09742J408471J502904
41024i65776R51579L16325k53322o40300m69073J92465N86597L16978l8128O6679
41014F4024K63502P8693j27321J12159L59036%n33882m20426L8608j68067r49322
41003a282996j074051j52862O43538L55945l96102n29900o8606K55666K90878
40994a958490M34070P12785P53788M71923R9856k98868p32463q87363m66184K26540
40984a644406O61603R04344J369700J854683J619991N45658n54766j020344j061383
40975B675080j074195r11185l41166K76647L92038O1929j80901p6124K05280M74122
$$ plain form
40965 1501525 2106207 2428641 1896761 425383 -1183999 -1853136 -1271597 -118943 753077
40956 753077 1115952 1266556 1392740 1324723 897134 265725 -327876 -925496 -1658172 -2217254
40946 -2217254 -1967989 -839194 257847 340952 -475596 -1194096 -1242899 -1014346 -992608 -964223
40936 -964223 -515125 107803 218138 -339009 -943411 -985052 -513024 10089 276408 263099
40926 263099 36825 -295010 -516249 -433361 -108996 205803 419421 695902 1100424 1388510
40916 1388510 1436589 1690962 2657949 3899549 4205448 3184275 2105905 2436068 3890927
40907 3890927 4863667 4666161 4251237 4449759 4628776 3854287 2542050 1912967 2221324
40898 2221324 2549940 2243701 1611374 1123668 737554 271502 -170066 -434755 -530500 -375742
$$ packed form
40965A501525O04682L22434n31880j471378j609382o69137N81539J152654Q72020
40956G53077L62875J50604J26184o8017m27589o31409n93601n97620p32676n59082
40946b217254K49265J128795J097041Q3105q16548p18500m8803K28553K1738K8385
40936i64223M49098O22928J10335n57147o04402m1641M72028N23113K66319j3309
40926B63099k26274l31835k21239Q2888L24365L14799K13618K76481M04522K88086
40916A388510M8079K54373R66987J241600L05899j021173j078370L30163J454859
40907C890927R72740j97506m14924J98522J79017p74489j312237o29083L08357
40898B221324L28616l06239o32327m87706l86114m66052m41568k64689r5745J54758
$$ plain form
40888 -375742 259303 1365065 2578078 3573905 4245054 4461267 4123734 3586899 3538920
40879 3538920 4203689 5000496 5182286 4505889 3201938 1725370 662118 370949 478155
40870 478155 182694 -711231 -1549033 -1828866 -1849139 -2002815 -2058928 -1677066 -1095513 -700041
40860 -700041 -386344 -16885 -50513 -905579 -2022615 -2438957 -2113578 -1809025 -1785910 -1580196
40850 -1580196 -1102037 -945989 -1382024 -1975448 -2516315 -3343157 -4243350 -4046387 -2195131
40841 -2195131 -5541 690461 -200653 -1129142 -1070713 -575352 -550807 -960474 -1165558 -903578
40831 -903578 -380689 249191 987746 1699605 2085444 1965152 1443506 841305 509592 552570
40821 552570 661528 440985 27217 123829 1175280 2695786 3715679 3769827 3141910
$$ packed form
40888c75742O35045J105762J213013R95827O71149K16213l37533n36835m7979
40879C538920O64769P96807J81790o76397j303951j476568j063252k91169J07206
40870D78155k95461q93925q37802k79833k0273j53676n6113L81862N81553L95472
40860g00041L13697L69459l3628q55066j117036m16342L25379L04553K3115K05714
40850a580196M78159J56048m36035n93424n40867q26842r00193J96963J851256
40841b195131K189590O96002q91114r28489N8429M95361K4545m09667k05084K61980
40831i03578N22889O29880P38555P11859L85839j20292n21646o02201l31713M2978
40821E52570J08958k20543m13768R6612J051451J520506J019893N4148o27917
$$ plain form
40812 3141910 2273106 1385282 703640 524204 786256 954018 678936 313117 367018 661692
40802 661692 523926 -207807 -877749 -851084 -261959 275659 397991 220156 87160 311397
40792 311397 941546 1571947 1569203 728629 -400424 -996771 -649369 504016 2018726
40783 2018726 3309401 3858368 3597093 2970466 2423343 1996237 1571035 1175017 770028
40774 770028 147104 -527608 -456388 854504 2625820 3480964 3027346 2092908 1430543
40765 1430543 976024 525269 311041 483352 636586 344552 -249416 -757870 -1046311
40756 -1046311 -1033197 -448768 712366 1828683 2239766 1983308 1555908 1202672 860496
40747 860496 543969 312368 26262 -440269 -901587 -1119994 -1111460 -837920 -4838 1277767
$$ packed form
40812C141910q68804q87824o81642j79436K62052J67762k75082l65819N3901K94674
40802F61692j37766p31733o69942K6665N89125N37618J22332j77835j32996K24237
40792C11397O30149O30401k744q40574j129053n96347L47402J153385J514710
40783B018726J290675N48967k61275o26627n47123m27106m25202l96018m04989
40774G70028o22924o74712P1220J310892J771316Q55144m53618r34438o62365
40765A430543m54519m50755k14228J72311J53234k92034n93968n08454k88441
40756a046311J3114N84429J161134J116317M11083k56458m27400l53236l42176
40747H60496l16527k31601k86106m66531m61318k18407Q534K73540Q33082J282605
$$ plain form
40737 1277767 2066970 1648051 757794 741463 1517896 1511626 -80654 -2051467 -2837528 -2475305
40727 -2475305 -2020200 -1758847 -1176556 -355554 -100750 -509452 -522720 624170 2325560
40718 2325560 3536444 4093801 4423130 4490268 3953449 3106321 2704358 2790494 2568702 1692522
40708 1692522 845548 575917 312694 -710658 -2051148 -2459647 -1529066 -154129 659276
40699 659276 770780 639757 716515 1202768 1837277 1837393 684289 -933099 -1686326 -1299230
40689 -1299230 -815040 -809443 -328871 1590907 4114615 5379533 4713591 3108427 1708539
40680 1708539 822856 375941 308015 281493 -206105 -1100278 -1790149 -2056919 -2389324 -3063201
40670 -3063201 -3525782 -3133829 -2066798 -1075676 -618378 -586754 -636574 -475546 -2735 608744
$$ packed form
40737A277767P89203m18919q90257j6331P76433o270j592280j970813p86061L62223
40727b475305M55105K61353N82291Q21002K54804m08702j3268J146890J701390
40718B325560J210884N57357L29329O7138n36819q47128m01963Q6136k21792q76180
40708A692522q46974k69631k63223j023352j340490m08499R30581J374937Q13405
40699F59276J11504j31023P6758M86253O34509J16j153104j617388p53227L87096
40689a299230M84190N597M80572J919778K523708J264918o65942j605164j399888
40680A708539q85683m46915o7926k6522m87598q94173o89871k66770l32405o73877
40670c063201m62581L91953J067031R91122M57298L1624m9820J61028M72811O11479
$$ plain form
40660 608744 1098303 1464796 1911342 2438480 2835182 3095100 3389563 3546626 3119623 2213559
40650 2213559 1678994 2079545 2910650 3283059 2998186 2464529 1877846 1047772 -123976
40641 -123976 -1478100 -2801903 -3795968 -3988531 -3141745 -1683257 -337112 621964 1395532
40632 1395532 2064167 2417302 2361391 2056265 1586410 888987 99740 -397950 -419365 -186806
40622 -186806 36432 235363 407703 330982 -148293 -737682 -916625 -552390 -86120 -8856
40612 -8856 -286745 -458096 -236885 198924 556808 781578 849785 492701 -447865 -1497361
40602 -1497361 -1887898 -1482016 -891137 -568970 -317213 82632 321906 88318 -302375
40593 -302375 -316492 43561 357679 387789 116007 -479645 -1128847 -1065353 155625 1756089
$$ packed form
40660F08744M89559L66493M46546N27138L96702K59918K94463J57063m27003r06064
40650B213559n34565M00551Q31105L72409k84873n33657n86683q30074j171748
40641a23976j354124j323803r94065j92563Q46786J458488J346145R59076P73568
40632A395532O68635L53135n5911l05126m69855o97423p89247m97690k1415K32559
40622a86806K23238J98931J72340p6721m79275n89389j78943L64235M66270P7264
40612h856k77889j71351K21211M35809L57884K24770O8207l57084r40566j049496
40602a497361l90537M05882N90879L22167K51757L99845K39274k33588l90693
40593c02375j4117L60053L14118L0110k71782n95652o49202O3494J220978J600464
$$ plain form
40583 1756089 2350379 1469441 -90710 -1325066 -1725901 -1047159 668330 2570613 3378082
40574 3378082 2758125 1730500 1295645 1297684 1127758 874007 1024370 1468679 1610830 1273165
40564 1273165 767515 199140 -558637 -1206189 -1102878 -229136 557954 550944 -6238 -481030
40554 -481030 -771989 -1196209 -1756773 -2086361 -2060070 -1964609 -1972047 -1856554 -1405715 -778514
40544 -778514 -229979 235046 660263 859162 716410 572810 839348 1314281 1408287 1057775
40534 1057775 826275 974053 1093632 977413 1138194 1885957 2482738 2026288 832394
40525 832394 89828 298186 858544 1117651 948641 284012 -970059 -2296777 -2690553
40516 -2690553 -1794396 -267246 1198563 2419579 3033733 2350745 550011 -933894 -1127500
$$ packed form
40583A756089N94290q80938j560151j234356m00835O78742J715489J902283Q07469
40574C378082o19957j027625m34855K039j69926k53751J50363M44309J42151l37665
40564A273165n05650n68375p57777o47552J03311Q73742P87090p010n57182m74792
40554d81030k90959m24220n60564l29588K6291R5461p438J15493M50839O27201
40544g78514N48535M65025M25217J98899j42752j43600K66538M74933R4006l50512
40534A057775k31500J47778J19579j16219J60781P47763N96781m56450j193894
40525H32394p42566K08358N60358K59107j69010o64629j254071j326718l93776
40516b690553Q96157J527150J465809J221016O14154o82988j800734j483905j93606
$$ plain form
40507 -1127500 -837655 -1254459 -2011321 -1973770 -1415162 -1714623 -2892343 -3196821 -1740267
40498 -1740267 -51904 11879 -1190336 -1867430 -1405947 -817087 -861726 -1164362 -1410599
40489 -1410599 -2114565 -3464329 -4318698 -3397038 -1111612 770203 1268975 1095969 1194812
40480 1194812 1282149 493120 -1103841 -2496512 -3028160 -2900327 -2417098 -1593934 -741991
40471 -741991 -594041 -1293826 -1843601 -1212806 350131 1712289 2272225 2327341 2216739
40462 2216739 1862432 1257107 754439 576004 431603 -74978 -892077 -1603233 -1954358
40453 -1954358 -2153307 -2639295 -3518731 -4238265 -4055325 -2971575 -1870444 -1408759 -1112259
40444 -1112259 -99761 1530747 2737495 2929586 2578230 2246021 1760522 841547 -32315
$$ packed form
40507a127500K89845m16804p56862L7551N58608k99461j177720l04478J456554
40498a740267J688363O3783j202215o77094M61483N88860m4639l02636k46237
40489a410599p03966j349764q54369R21660K285426J881815M98772j73006R8843
40480A194812Q7337p89029j596961j392671n31648J27833M83229Q23164Q51943
40471g41991J47950o99785n49775O30795J562937J362158N59936N5116j10602
40462B216739l54307o05325n02668j78435j44401n06581q17099p11156l51125
40453a954358j98949m85988q79436p19534J82940J083750J101131M61685K96500
40444a112259J012498J630508J206748J92091l51356l32209m85499r18975q73862
$$ plain form
40435 -32315 -132255 337280 306776 -729332 -1896051 -1962232 -898881 138299 391355 409221
40425 409221 948542 1556397 1182140 14475 -520880 33591 224483 -1104927 -2697047
40416 -2697047 -2412956 -343872 1257684 1122369 382297 424462 876476 635072 -260347
40407 -260347 -903165 -943886 -684032 -226411 489439 1103651 1161964 834885 566629 228473
40397 228473 -578467 -1500391 -1562059 -457890 923303 1469083 932687 -46949 -669746
40388 -669746 -647580 -391453 -514939 -1022029 -1219247 -647823 259515 809309 915925 806555
40378 806555 268923 -1007660 -2473202 -2930555 -1906394 -290822 552786 -5223 -1484022
40369 -1484022 -2701826 -2638142 -1357887 -43469 293217 -25768 47189 751823 1295466
$$ packed form
40435c2315r9940M69535l0504j036108j166719o6181J063351J037180K53056J7866
40425D09221N39321O07855l74257j167665n35355N54471J90892j329410j592120
40416b697047K84091K069084J601556j35315p40072M2165M52014k41404q95419
40407b60347o42818m0721K59854M57621P15850O14212N8313l27079k68256l38156
40397B28473q06940r21924o1668J104169J381193N45780n36396r79636o22797
40388f69746K2166K56127j23486n07090j97218N71424R07338N49794J06616j09370
40378H06555n37632j276583j465542m57353J024161J615572Q43608n58009j478799
40369a484022j217804O3684J280255J314418L36686l18985P2957P04634N43643
$$ plain form
40360 1295466 1051983 195254 -894562 -2016357 -2724065 -2329210 -780048 1003824 2082845
40351 2082845 2385421 2366083 2217388 1764482 841787 -462889 -1691014 -2092925 -1252264
40342 -1252264 255299 1260037 1177575 410630 -379168 -809277 -597661 353936 1454740
40333 1454740 1721682 906257 -276408 -1234003 -2050137 -2719786 -2786508 -2216527 -1687744
40324 -1687744 -1378776 -435581 1511796 3223426 3348797 2350026 1717294 1812859 1849269
40315 1849269 1684209 2116855 3268665 4009150 3430895 1923006 367706 -904359 -1925367
40306 -1925367 -2534931 -2480401 -1695561 -298050 1304294 2343363 2322306 1722170 1442693
40297 1442693 1577465 1502821 1131484 1076539 1404012 1318206 530013 -90428 127969 554324
$$ packed form
40360A295466k43483q56729j089816j121795p07708L94855J549162J783872J079021
40351B082845L02576j9338j48695m52906r22695j304676j228125m01911Q40661
40342a252264J507563J004738q2462p66945p89798m30109K11616R51597J100804
40333A454740K66942q15425j182665r57595q16134o69649o6722N69981N28783
40324a687744L08968R43195J947377J711630J25371r98771o32732R5565L6410
40315A849269j65060M32646J151810P40485n78255j507889j555300j272065j021008
40306a925367o09564N4530P84840J397511J602344J039069k1057o00136k79477
40297A442693J34772p4644l71337n4945L27473q5806p88193o20441K18397M26355
$$ plain form
40287 554324 302710 -398251 -828071 -1172516 -2202304 -3805655 -4883305 -4764764 -3925805
40278 -3925805 -3145568 -2597552 -2016177 -1298606 -644585 -303778 -353720 -649951 -953514 -1109759
40268 -1109759 -1015823 -476395 607521 1870379 2697072 2940964 3000037 3004885 2483320 1197550
40258 1197550 -211011 -927067 -901072 -562251 -26586 728371 1216583 789481 -394163
40249 -394163 -1395998 -1546655 -980789 -185000 440882 595694 240339 -144580 55104
40240 55104 817178 1467671 1487505 992448 427888 163496 352133 781146 895075 369338
40230 369338 -405212 -813670 -806577 -637074 -32534 1505092 3510214 4600972 4127640
40221 4127640 3068778 2784887 3418984 4054072 4023182 3480122 2897937 2509910 2198534
$$ packed form
40287E54324k51614p00961m29820l44445j029788j603351j077650J18541Q38959
40278c925805P80237N48016N81375P17571O54021L40807m9942k96231l03563j56245
40268a109759R3936N39428J083916J262858Q26693K43892N9073M848n21565j285770
40258A197550j408561p16056K5995L38821N35665P54957M88212m27102j183644
40249c94163j001835j50657N65866P95789O25882J54812l55355l84919J99684
40240E5104P62074O50493J9834m95057n64560k64392J88637M29013J13929n25737
40230C69338p74550m08458P093J69503O04540J537626K005122J090758m73332
40221D127640j058862k83891O34097O35088l0890n43060n82185l88027l11376
$$ plain form
40212 2198534 1648824 674505 -476508 -1298453 -1556907 -1372487 -796362 190473 1116001
40203 1116001 1082683 -173579 -1733046 -2474760 -2275277 -1772455 -1286337 -598630 326521
40194 326521 1035299 1156757 927022 946799 1517347 2291123 2621280 2342071 2088820 2556381
40184 2556381 3511949 3988169 3481286 2418245 1341678 341746 -389716 -238518 919735
40175 919735 2050842 2012574 964683 855 -350429 -450571 -533694 -272561 476896 1217169
40165 1217169 1418279 1156948 902171 943788 1184124 1303253 1064678 556717 60977 -343720
40155 -343720 -751527 -948294 -519799 297228 586245 92893 -196462 362241 732568 -293745
40145 -293745 -1839094 -1824863 2450 1647981 1790601 1467014 2104868 3331783 3831191
$$ packed form
40212B198534n49710r74319j151013q21945k58454J84420N76125R86835R25528
40203A116001l3318j256262j559467p41714J99483N02822M86118O87707R25151
40194C26521P08778J21458k29735J9777N70548P73776L30157k79209k53251M67561
40184B556381R55568M76220n06883j063041j076567r99932p31462J51198J158253
40175I19735J131107l8268j047891r63828l51284j00142q3123K61133P49457P40273
40165A217169K01110k61331k54777M1617K40336J19129k38575n07961m95740m04697
40155c43720m07807j96767M28495Q17027K89017m93352k89355N58703L70327j026313
40145b93745j545349J4231J827313J645531J42620l23587O37854J226915M99408
$$ plain form
40136 3831191 3325727 2539639 1903613 1396792 1164389 1269092 1182043 427940 -536782 -877527
40126 -877527 -534921 -101753 129710 247684 169728 -182844 -403604 -75976 483328 684726
40116 684726 563648 395003 -209068 -1704357 -3297806 -3523373 -2326585 -1350045 -1674273
40107 -1674273 -2360888 -1949406 -531733 565959 631276 152030 -250541 -612749 -1187120
40098 -1187120 -1770154 -1818033 -1092991 835 755650 787792 282198 -324637 -696729 -610732
40088 -610732 6105 787363 1036106 550334 53725 291493 965207 1219287 994267 1088703
40078 1088703 1879154 2826608 3425623 3805877 4060437 3784026 2812584 1777090 1289011
40069 1289011 1033109 314037 -792901 -1451935 -1104786 -44293 959887 1286349 862308
$$ packed form
40136C831191n05464p86088o36026n06821k32403J04703q7049p54103r64722l40745
40126h77527L42606M33168K31463J17974p7956l52572k20760L27628N59304K01398
40116F84726j21078j68645o04071j495289j593449k25567J196788R76540l24228
40107a674273o86615M11482J417673J097692O5317m79246m02571l62208n74371
40098a187120n83034m7879P25042J093826P54815L2142n05594o06835l72092Q5997
40088f10732O16837P81258K48743m85772m96609K37768O73714K54080k25020R4436
40078A088703P90451R47454N99015L80254K54560k76411r71442j035494m88079
40069A289011k55902p19072j106938o59034L47149J060493J004180L26462m24041
$$ plain form
40060 862308 251135 223259 1013006 2123332 2937321 3206654 2862228 1905065 824955
40051 824955 576854 1569864 3016582 3829681 3871741 3744036 3618187 3023199 1778690
40042 1778690 470839 -190476 -63825 512999 1149183 1583584 1713395 1650517 1697339 2175044
40032 2175044 3157006 4204091 4484183 3589269 2284225 1874710 2583724 3170912 2591043
40023 2591043 1396954 855016 1233672 1800312 2082641 2157103 1940867 1262804 602717
40014 602717 717877 1409391 1633066 1031071 387792 298492 398063 326173 429045 878796
40004 878796 1046079 559377 178993 663493 1406396 1276070 401877 -6909 504663 1023327
39994 1023327 583677 -730095 -2150226 -3032415 -3178385 -2917965 -2927653 -3458838 -3826410
$$ packed form
40060H62308o11173k7876P89747J110326Q13989K69333l44426r57163j080110
40051H24955k48101R93010J446718Q13099M2060j27705j25849n94988j244509
40042A778690j307851o61315J26651N76824O36184M34401J29811o2878M6822M77705
40032B175044R81962J047085K80092q94914j305044m09515P09014N87188n79869
40023B591043j194089n41938L78656N66640K82329P4462k16236o78063o60087
40014F02717J15160O91514K23675o01995o43279q9300R9571p1890J02872M49751
40004H78796J67283m86702l80384M84500P42903j30326q74193m08786N11572N18664
39994A023327m39650j313772j420131q82189j45970K60420r688n31185l67572
$$ plain form
39985 -3826410 -3279745 -2238983 -1832192 -2226567 -2420084 -1904349 -1464574 -1795401 -2274690
39976 -2274690 -1896700 -725444 413494 1146210 1602545 1715148 1415720 1243614 1786691
39967 1786691 2640013 2848634 2324484 1862104 1730508 1313453 365374 -459356 -767921
39958 -767921 -1095290 -1784080 -2145960 -1582146 -762020 -689709 -1163114 -1225463 -767185 -566337
39948 -566337 -918956 -1326654 -1530596 -1816001 -2204230 -2346087 -2358697 -2724505 -3116376 -2456031
39938 -2456031 -626887 959201 1212629 818888 980139 1586307 1758099 1564451 1849881
39929 1849881 2561879 2586560 1492559 393418 589314 2000895 3395596 3750717 3034346
39920 3034346 1915781 1022908 436399 -159258 -827774 -1095578 -521576 663708 1764683
$$ packed form
39985c826410N46665J040762M06791l94375j93517N15735M39775l30827m79289
39976b274690L77990J171256J138938P32716M56335J12603k99428j72106N43077
39967A786691Q53322K08621n24150m62380j31596m17055r48079q24730l08565
39958g67921l27369o88790l61880N63814Q20126P2311m73405o2349M58278K00848
39948e66337l52619m07698k03942k85405l88229j41857j2610l65808l91871O60345
39938b456031J829144J586088K53428l93741J61251O06168J71792j93648K85430
39929A849881P11998K4681j094001j099141J95896J411581J394701L55121p16371
39920C034346j118565q92873n86509n95657o68516k67804N74002J185284J100975
$$ plain form
39911 1764683 2229089 1755642 191148 -2098604 -4001866 -4511781 -3809366 -2951106 -2520450
39902 -2520450 -2183326 -1582669 -990528 -825660 -984472 -908838 -106438 1393732 2848760
39893 2848760 3233954 2281535 923462 247749 257786 218045 -135122 -568406 -1253093 -2576888
39883 -2576888 -4036474 -4477880 -3731697 -2953448 -2924053 -3010491 -2347513 -1122391 -32703
39874 -32703 735011 1297610 1538362 1462376 1500359 1850600 2091073 1957108 1808554 1789974
39864 1789974 1383211 512533 183450 1051066 2152276 2200268 1497623 1324053 1903040
39855 1903040 2288720 2000698 1486907 1069726 629613 317186 470297 807848 733066 406177
39845 406177 481658 864348 862612 509433 454860 510936 -279882 -1873414 -2949961 -2856740
$$ packed form
39911A764683M64406m73447j564494k289752j903262n09915P02415Q58260M30656
39902b520450L37124O00657N92141J64868j58812P5634Q02400J500170J455028
39893B848760L85194r52419j358073o75713J0037l9741l53167m33284o84687j323795
39883b576888j459586m41406P46183P78249K9395q6438O62978J225122J089688
39874c2703P67714N62599K40752p5986L7983L50241K40473j33965j48554j8580
39864A789974m06763q70678l29083Q67616J101210M7992p02645j73570N78987
39855A903040L85680k88022n13791m17181m40113l12427J53111L37551p4782l26889
39845D06177P5481L82690j736l53179n4573N6076p90818j593532j076547R3221
$$ plain form
39835 -2856740 -2451435 -2459980 -2424134 -2063997 -2241747 -3402557 -4242530 -3343817 -1354606 -153721
39825 -153721 -371327 -1052345 -1376362 -1333646 -851179 365785 1900522 2635295 2075498
39816 2075498 918383 63601 -254202 -150052 351111 1056575 1466398 1338341 1070056
39807 1070056 1170644 1579981 1816860 1671845 1471686 1611865 1963424 1918907 1157273 249609
39797 249609 168779 1111100 2153193 2290802 1526775 699973 536575 1132835 2050039 2577855
39787 2577855 2190484 1124617 286573 271969 769083 1259891 1866945 2920089 4015477
39778 4015477 4272843 3501627 2473843 1949955 1913470 1831475 1248204 68586 -1374763
39769 -1374763 -2507054 -3068235 -3415421 -3953204 -4440303 -4301805 -3463943 -2375856 -1379698
$$ packed form
39835b856740M05305q545L5846L60137j77750j160810q39973Q98713J989211J200885
39825a53721k17606o81018l24017M2716M82467J216964J534737P34773n59797
39816B075498j157115q54782l17803J04150N01163P05464M09823j28057k68285
39807A070056J00588M09337K36879j45015k00159J40179L51559m4517p61634r07664
39797B49609q0830R42321J042093J37609p64027q26802j63398N96260R17204N27816
39787B577855l87371j065867q38044j4604M97114M90808O07054J053144J095388
39778D015477K57366p71216j027784n23888l6485q1995n83271j179618j443349
39769a374763j132291n61181l47186n37783m87099J38498Q37862J088087R96158
$$ plain form
39760 -1379698 -647988 -531733 -1148953 -1670338 -970797 781292 2092662 2080670 1542532
39751 1542532 1526691 1748675 1363739 645393 642147 1325995 1338970 -72632 -1840036 -2411529
39741 -2411529 -1700481 -977116 -1116450 -1700625 -1892954 -1550127 -1128703 -871387 -550593
39732 -550593 54299 796697 1355786 1554039 1409007 1081066 861587 994570 1354924 1473353
39722 1473353 1045622 275496 -433977 -945354 -1331231 -1520127 -1287231 -562949 437999
39713 437999 1335657 1709942 1302128 338298 -519866 -851304 -955788 -1315918 -1742377 -1546517
39703 -1546517 -549090 610043 1315899 1655074 1966141 2095596 1546954 277758 -1015372
39694 -1015372 -1536969 -1228244 -875204 -1297966 -2368260 -2941212 -1969412 291474 2341463
$$ packed form
39760a379698P31710J16255o17220n21385O99541J752089J311370j1992n38138
39751A542532j5841K21984l84936p18346l246O83848J2975j411602j767404n71493
39741b411529P11048P23365j39334n84175j92329L42827M21424K57316L20794
39732e50593O04892P42398N59089J98253j45032l27941k19479J32983L60354J18429
39722A473353m27731p70126p09473n11377l85877j88896K32896P24282J000948
39713D37999Q97658L74285m07814r63830q58164l31438j04484l60130m26459J95860
39703a546517R97427J159133P05856L39175L11067J29455n48642j269196j293130
39694a015372n21597L08725L53040m22762j070294n72952R71800K260886K049989
$$ plain form
39685 2341463 2770634 1514251 -157117 -825601 -195852 734420 865494 326255 256552
39676 256552 1129531 1856752 1141943 -619013 -1596754 -722131 1082480 2101785 1707856
39667 1707856 709050 212883 533714 1086316 1105924 464651 -243716 -498841 -508958 -768845
39657 -768845 -1212016 -1347033 -1134398 -1073572 -1344095 -1501178 -1204291 -650749 -85750 483023
39647 483023 827782 477049 -420707 -896682 -411716 280467 194402 -486219 -875307 -843226
39637 -843226 -1034675 -1558145 -1645151 -812960 388908 1079041 933728 160395 -851959
39628 -851959 -1559929 -1468621 -734293 -205788 -436718 -923852 -777314 51626 761390 909897
39618 909897 1046550 1843627 3020161 3636709 3318899 2636891 2160245 1655340 583513
$$ packed form
39685B341463M29171j256383j671368o68484O29749R30272J31074n39239o9703
39676B56552Q72979P27221p14809j760956r77741Q74623J804611J019305l93929
39667A707856r98806m96167L20831N52602J9608o41273p08367k55125j0117k59887
39657g68845m43171j35017K12635O0826k70523j57083K96887N53542N64999N68773
39647D83023L44759l50733q97756m75975M84966O92183q6065o80621l89088L2081
39637h43226j91449n23470q7006Q32191J201868O90133j45313p73333j012354
39628h51959p07970R1308P34328N28505k30930m87134J46538Q28940P09764J48507
39618I09897J36653P97077J176534O16548l17810o82008m76646n04905j071827
$$ plain form
39609 583513 -952443 -2252319 -2873873 -2977432 -2842415 -2494597 -1912028 -1236216 -612845
39600 -612845 -15144 723941 1816136 3265343 4454596 4342059 2656632 651767 -121523
39591 -121523 284250 423901 -402911 -1307000 -1412422 -1152718 -1291743 -1643854 -1657474 -1466440
39581 -1466440 -1361466 -882781 444942 1962704 2631780 2612823 2909872 3651863 3980390
39572 3980390 3616024 3255678 3225788 2964932 2217941 1625284 1621547 1757185 1704146 1972601
39562 1972601 2857127 3487204 2889226 1501302 687841 959522 1460681 1151210 -127752
39553 -127752 -1722870 -2746159 -2561925 -1192460 584229 1779893 1964837 1470396 947515
39544 947515 834155 1107849 1401032 1421575 1276706 1234087 1244524 1050599 759996 826940
$$ packed form
39609E83513j535956j299876o21554j03559J35017L47818N82569O75812O23371
39600f12845N97701P39085J092195J449207J189253j12537j685427k004865p73290
39591a21523M05773J39651q26812r04089j05422K59704j39025l52111j3620J91034
39581a466440J04974M78685J327723J517762O69076j8957K97049P41991L28527
39572C980390l64366l60346k9890k60856p46991n92657l737J35638n3039K68455
39562A972601Q84526O30077n97978j387924q13461K71681N01159l09471j278962
39553a27752j595118j023289J84234J369465J776689J195664J84944m94441n22881
39544I47515j13360K73694K93183K0543j44869m2619J0437j93925k90603O6944
$$ plain form
39534 826940 1310513 1633714 1338457 638060 -65837 -722685 -1287469 -1347509 -704608 35947
39524 35947 183727 78579 688067 2063276 3023088 2709729 1776792 1465889 1965840 2430548
39514 2430548 2446588 2594656 3279533 3803241 3329575 2317544 2023019 2624541 2909015
39505 2909015 2174441 1381828 1597671 2144859 1523377 -241925 -1509402 -1259248 -153651
39496 -153651 856735 1705428 2461634 2612657 1998353 1598804 2351642 3708685 4347864
39487 4347864 3960938 3361402 3031358 2611131 1949626 1725712 2535418 3850548 4412914
39478 4412914 3616320 2221887 1554855 2023954 2697035 2567459 1892229 1652506 1893242
39469 1893242 1588760 354871 -777820 -867818 -368648 -138737 -38723 445396 918120
$$ packed form
39534H26940M83573L23201k95257p00397p03897o56848n64784o0040O42901P40555
39524C5947J47780j05148O09488J375209R59812l13359r32937l10903M99951M64708
39514B430548J6040J48068O84877N23708m73666j012031k94525O01522K84474
39505B909015p34574p92613K15843N47188o21482j765302j267477K50154J105597
39496a53651J010386Q48693P56206J51023o14304l99549P52838J357043O39179
39487D347864l86926n99536l30044m20227o61505k23914Q09706J315130N62366
39478D412914p96594j394433o67032M69099O73081j29576o75230k39723K40736
39469A893242l04482j233889j132691q9998M99170K29911J00014M84119M72724
$$ plain form
39460 918120 666436 50992 -11036 357511 304019 -9015 476827 1689961 2117699 1091373
39450 1091373 -39032 101236 877116 683326 -747308 -2172211 -2539946 -1886448 -752559
39441 -752559 447677 1474796 2223086 2641909 2479775 1422449 -214423 -1390874 -1422284
39432 -1422284 -766443 -248202 41339 427505 665843 160378 -951644 -1769903 -1785164
39423 -1785164 -1416415 -1293592 -1595482 -2214241 -2966355 -3409955 -3006990 -1828717 -725793
39414 -725793 -452244 -872747 -1295513 -1312681 -1004051 -546005 -17197 461429 716574 711634
39404 711634 584439 502827 623921 1132309 2067674 3059011 3492414 3184400 2797271 3292469
39394 3292469 4850097 6501366 7024099 6148513 4710364 3668466 3236737 3048068 2845309
$$ packed form
39460I18120k51684o15444o2028L68547n3492l13034M85842J213134M27738j026326
39450A091373j130405J40268P75880j93790j430634j424903l67735O53498J133889
39441g52559J200236J027119P48290M18823j62134j057326j636872j176451l1410
39432a422284O55841N18241K89541L86166K38338n05465j112022q18259j5261
39423a785164L68749J22823l01890o18759p52114m43600M02965J178273J102924
39414g25793K73549m20503m22766j7168L08630M58046N28808M78626K55145m940
39404G11634j27195q1612J21094N08388R35365R91337M33403l08014l87129M95198
39394C292469J557628J651269N22733q75586j438149j041898m31729j88669k02759
$$ plain form
39385 2845309 2693848 2656318 2660620 2756340 3136354 3690105 3854687 3299914 2575157 2542228
39375 2542228 3148521 3382161 2724079 2021049 2322478 3329282 3860995 3631163 3490486
39366 3490486 3797181 3733979 2825673 2067077 2526567 3543590 3550870 2375456 1453007 1719399
39356 1719399 2488336 2750798 2521194 2293778 1989723 1242781 284422 -216570 -71960
39347 -71960 218770 209498 130466 659350 2106103 3852795 4814338 4654683 4224902 4348114
39337 4348114 4548709 3793239 2268690 1304986 1389056 1460247 683411 -216481 -197763 487375
39327 487375 943000 1130311 1551682 1959277 1646576 806151 385588 602443 724393 458851
39317 458851 490033 1283642 2223499 2386388 1584694 333785 -666347 -779649 242727
$$ packed form
39385B845309j51461l7530M302R5720L80014N53751J64582n54773p24757l2929
39375B542228O06293K33640o58082p03030L01429J006804N31713k29832j40677
39366C490486L06695o3202r08306p58596M59490J017023P280j175414r22449K66392
39356A719399P68937K62462k29604k27416l04055p46942r58359n00992J44610
39347g1960K90730r272p9032N28884J446753J746692R61543j59655m29781J23212
39337D348114K00595p55470j524549r63704Q4070P1191p76836q99892J8718O85138
39327D87375M55625J87311M21371M07595l12701q40425m20563K16855J21950k65542
39317D58851L1182P93609R39857J62889q01694j250909j000132j13302J022376
$$ plain form
39308 242727 1855318 3057646 3343498 2915608 1956105 377018 -1497653 -2743264 -2792446
39299 -2792446 -2084157 -1363483 -809709 -268765 118319 45936 -474049 -1180298 -1882727 -2407107
39289 -2407107 -2537496 -2379524 -2474230 -3116530 -3763369 -3527203 -2147431 -184842 1589258
39280 1589258 2730493 3245165 3487539 3823386 4194624 4170995 3560429 2701112 2000940
39271 2000940 1537088 1296628 1355668 1502078 1167814 212903 -630313 -629472 4938 646328
39261 646328 1327304 2460065 3667122 3847828 2612068 921423 -22740 -47118 90730
39252 90730 -322915 -1292148 -2133501 -2081631 -1159399 -384594 -694854 -1760422 -2415799 -2185257
39242 -2185257 -1659240 -1361509 -1167343 -1072479 -1500461 -2290013 -2362227 -1245755 -104356
$$ packed form
39308B42727J612591J202328K85852m27890r59503j579087j874671j245611m9182
39299b792446P08289P20674N53774N40944L87084p2383n19985p06249p02429n24380
39289b407107j30389J57972r4706o42300o46839K36166J379772J962589J774100
39280A589258J141235N14672K42374L35847L71238k3629o10566q59317p00172
39271B000940m63852k40460N9040J46410l34264r54911q43216Q41O34410O41390
39261F46328O80976J132761J207057J80706j235760j690645r44163k4378J37848
39252I0730m13645r69233q41353N1870R22232P74805l10260j065568o55377K30542
39242b185257N26017K97731J94166R4864m27982p89552p2214J116472J141399
$$ plain form
39233 -104356 -168925 -793888 -393964 1029457 1792371 1051843 -18181 -65837 652301 1062463
39223 1062463 860598 412250 -173741 -854087 -1022465 -125605 1283127 2027164 1796383
39214 1796383 1374116 1424886 1841287 2303278 2651446 2563260 1702767 515638 119662 949983
39204 949983 2137788 2726748 2913534 3454547 4336382 4842127 4718910 4461361 4370147 4009282
39194 4009282 2880002 1230025 -102097 -487477 -16588 669898 997907 992075 1180046
39185 1180046 1906958 2874216 3498460 3567989 3325051 3033729 2734314 2356816 1850387 1271556
39175 1271556 912008 1137450 1818540 2155572 1513219 303743 -463982 -474625 -372070
39166 -372070 -636012 -817673 -271706 784068 1451077 1255052 677020 584616 1378069 2699117
$$ packed form
39233a04356o4569o24963L99924J423421P62914p40528j070024m7656P18138M10162
39223A062463k01865m48348n85991o80346j68378Q96860J408732P44037k30781
39214A796383m22267N0770M16401M61991L48168q8186q60493j187129l95976Q30321
39204I49983J187805N88960J86786N41013Q81835N05745j23217k57549r1214l60865
39194D009282j129280j649977j332122l85380M70889O86486L28009n832J87971
39185A180046P26912R67258O24244O9529k42938k91322k99415l77498n06429n78831
39175A271556l59548K25442O81090L37032o42353j209476p67725j0643J02555
39166c72070k63942j81661N45967J055774O67009j96025n78032r2404P93453J321048
$$ plain form
39156 2699117 3778166 3991726 3180268 1575422 -407305 -2226172 -3278773 -3250379 -2442129
39147 -2442129 -1509454 -799173 -143403 653091 1408216 1815751 1886672 1885058 1896355 1699992
39137 1699992 1152723 571343 547067 1297470 2340677 3030263 3345939 3820789 4659737
39128 4659737 5381362 5514985 5144772 4440402 3259404 1817589 1154550 1957765 3237570
39119 3237570 3310267 2083703 1176066 1518337 2085681 1639027 609206 247255 651868
39110 651868 796991 199148 -500401 -603370 -180745 291580 552402 693543 1039138 1866649
39100 1866649 2963183 3638347 3521287 3085794 2946831 2932772 2456444 1624210 1293742
39091 1293742 2000507 3366264 4616837 5218678 4982764 4026371 2766012 1638875 776495
$$ packed form
39156B699117J079049K13560q11458j604846j982727j818867j052601K8394Q08250
39147b442129R32675P10281O55770P96494P55125M07535P0921j614J1297j96363
39137A699992n47269n81380k4276P50403J043207O89586L15676M74850Q38948
39128D659737P21625J33623l70213p04370j180998j441815o63039Q03215J279805
39119C237570P2697j226564r07637L42271N67344m46654j029821l61951M04613
39110F51868J45123n97843o99549j02969M22625M72325K60822J41141L45595Q27511
39100A866649J096534O75164j17060m35493j38963j4059m76328q32234l30468
39091A293742P06765J365757J250573O01841k35914r56393j260359j127137q62380
$$ plain form
39082 776495 131940 -256200 -422309 -609068 -806873 -477734 658162 1834022 1994862
39073 1994862 1219357 587704 664028 955845 945684 732421 399106 -318486 -1247946 -1468430
39063 -1468430 -432730 1155844 2199175 2485883 2536447 2590949 2433403 2005312 1574518
39054 1574518 1353573 1381355 1676672 2121273 2326025 2028957 1553187 1492992 1980433 2586216
39044 2586216 2908032 2925989 2751211 2333609 1580466 641087 -82615 -272954 -13573 369532
39034 369532 828297 1668141 2848344 3557000 3074366 1923565 1434447 2063407 2871106
39025 2871106 2922739 2485313 2403678 2919112 3648713 4229450 4434951 4129168 3681504 3927363
39015 3927363 5001116 5656783 4653356 2585936 1376452 1925591 3165627 3643068 3225751
$$ packed form
39082G76495o44555l88140j66109j86759j97805L29139J135896J175860J60840
39073A994862p75505o31653P6324K91817j0161k13263l33315p17592r29460k20484
39063a468430J035700J588574J043331K86708N0564N4502j57546m28091m30794
39054A574518k20945K7782K95317M44601K04752k97068m75770o0195M87441O05783
39044B586216L21816J7957j74778m17602p53143r39379p23702j90339K59381L83105
39034C69532M58765Q39844J180203P08656m82634j150801m89118O28960Q07699
39025B871106N1633m37426q1635N15434P29601N80737K05501l05783m47664K45859
39015C927363J073753O55667j003427k067420j209484N49139J240036M77441m17317
$$ plain form
39006 3225751 2826525 3042267 3631950 4090457 4262866 4344238 4455211 4345352 3661364 2554420
38996 2554420 1744625 1726242 2137124 2260026 1974052 1834819 2351367 3549963 5081651
38987 5081651 6336395 6629629 5822539 4736861 4488088 5382559 6787080 7912917 8291511
38978 8291511 7727711 6463106 5348727 5214006 5981351 6854037 7264689 7100673 6258431
38969 6258431 4817697 3542402 3233310 3529223 3354764 2675851 2652998 3729854 4822900
38960 4822900 5022755 4879634 5122892 5262999 4684802 4225868 5188550 7242769 8735718
38951 8735718 8909886 8519317 8301985 8131334 7842523 7710599 7759395 7579911 7207244 7296191
38941 7296191 8024553 8632800 8511208 8043739 7913345 8191856 8557531 8822749 8803776 8246368
$$ packed form
39006C225751l99226K15742N89683M58507J72409Q1372J10973j09859o83988j106944
38996B554420q09795j8383M10882J22902k85974j39233N16548J198596J531688
38987E081651J254744K93234q07090j085678k48773Q94471J404521J125837L78594
38978H291511n63800j264605j114379j34721P67345Q72686M10652j64016q42242
38969F258431j440734j275295l09092K95913j74459o78913k2853J076856J093046
38960D822900J99855j43121K43258J40107n78197m58934R62682K054219J492949
38951H735718J74168l90569k17332j70651k88811j31924M8796j79484l72667Q8947
38941G296191P28362O08247j21592m67469j30394K78511L65675K65218j8973n57408
$$ plain form
38931 8246368 7363053 6918301 7296198 7975653 8375674 8638096 9016466 9115001 8527703 7785026
38921 7785026 7774131 8456448 9026007 9217686 9570404 10348599 11069834 11351371 11497922 11878631
38911 11878631 12270217 12213360 11618489 10671012 9506602 8382646 7895583 8540403 10056832
38902 10056832 11517240 12156371 12030759 11860268 12265543 13161086 13924992 14147290 14007424
38893 14007424 13799096 13408546 12640222 11813781 11484334 11658046 11895867 12192194 13017687
38884 13017687 14318666 15288655 15553748 15794994 16540934 17072871 16472454 15234529 14674512
38875 14674512 14960191 15031540 14588286 14768041 16249360 17909686 18403397 18221121 18912464
38866 18912464 20684991 22097206 22114445 21245237 20398185 19788134 19536910 20319194 22481636
$$ packed form
38931H246368q83315m44752L77897O79455M00021K62422L78370R8535n87298p42677
38921G785026j0895O82317N69559J91679L52718P78195P21235K81537J46551L80709
38911A1878631L91586n6857n94871r47477j164410j123956m87063O44820J516429
38902A0056832J460408O39131j25612j70491M05275Q95543P63906K22298j39866
38893A4007424k08328l90550p68324q26441l29447J73712K37821K96327Q25493
38884A3017687J300979R69989K65093K41246P45940N31937o00417j237925n60017
38875A4674512K85679P1349m43254J79755J481319J660326M93711j82276O91343
38866A8912464J772527J412215J7239q69208q47052o10051k51224P82284K162442
$$ plain form
38857 22481636 25139598 27092215 28250381 29247349 29982558 29723852 28676601 28238907 29246489
38848 29246489 30924493 32172542 33044342 34201738 35661592 37099372 38900403 41752482
38840 41752482 45362156 48678828 51394222 54135899 57083279 59627771 61810684 64863147
38832 64863147 69549658 75000080 80139919 85420602 92011724 99992735 108698126 118405601
38824 118405601 130123507 143701314 157643414 171161006 185149487 200665934 217645135
38817 217645135 235756541 255309023 276244304 297062369 315910327 332284240 346638770
38810 346638770 358723690 367482065 372532221 374683228 374798597 373010616 369340560 364368948
38802 364368948 358858935 353137201 347158855 340860949 334213196 327201317 320006008 313069553
$$ packed form
38857B2481636K657962J952617J158166R96968P35209k58706j047251m37694J007582
38848B9246489J678004J248049Q71800J157396J459854J437780J801031K852079
38840D1752482L609674L316672K715394K741677K947380K544492K182913L052463
38832F4863147M686511N450422N139839N280683O591122P981011Q705391R707475
38824A18405601J1717906J3577807J3942100J3517592J3988481J5516447J6979201
38817B17645135J8111406J9552482K0935281K0818065J8847958J6373913J4354530
38810C46638770J2084920Q758375N050156K151007J15369j787981l670056m971612
38802C64368948n510013n721734n978346o297906o647753p011879p195309o936455
$$ plain form
38794 313069553 306881664 301759038 297690317 294138607 290166605 285218839 279808368 275044586
38786 275044586 271442607 268561497 265811497 263134722 260751766 258694613 256860335 255215933
38778 255215933 253685478 252036511 250085933 247897867 245698611 243743671 242230573 241020531
38770 241020531 239377057 236319832 231409905 224953313 217329160 208417933 197893146 185859756
38762 185859756 172975446 160010457 147393319 135156651 123329992 112362954 102903887
38755 102903887 94995076 87844271 80775282 74059771 68275922 63233050 58363928 53938653
38747 53938653 50793465 48781873 46660003 43867174 41260178 39471396 37709169 35180777
38739 35180777 32727069 31691423 31697003 30970639 28766603 26187929 24455274 23495376 22605700
$$ packed form
38794C13069553o187889n122626m068721l551710l972002m947766n410471m763782
38786B75044586l601979k881110k750000k676775k382956k057153j834278j644402
38778B55215933j530455j648967j950578k188066k199256j954940j513098j210042
38770B41020531j643474l057225m909927o456592p624153q911227j0524787j2033390
38762A85859756j2884310j2964989j2617138j2236668j1826659j0967038r459067
38755A02903887p908811p150805p068989o715511n783849n042872m869122m425275
38747E3938653l145188k011592k121870k792829k606996j788782j762227k528392
38739C5180777k453708j035646N580p26364k204036k578674j732655r59898q89676
$$ plain form
38730 22605700 21570037 20562447 19580406 18550126 17677427 17274880 17362789 17624736 17685796
38721 17685796 17472356 17405134 17972474 18835650 18781871 17168036 15092380 14329912 15213901
38712 15213901 16371393 16499461 15521550 13970286 12274444 10953103 10521587 10699743 10524568
38703 10524568 9729085 9173973 9362363 9465291 8670270 7688592 7807269 8924420 9689248
38694 9689248 9410523 8741362 8436064 8399932 8206018 7802427 7399019 7144309 7099895 7154927
38684 7154927 6949833 6309416 5673537 5575294 5811069 5803967 5715307 6325377 7665199 8685802
38674 8685802 8669793 8117404 7688408 7107933 5957836 4893969 4956665 5904378 6350506
38665 6350506 5680308 4835324 4780975 5014830 4318408 2581146 1099222 1038179 2152331
$$ packed form
38730B2605700j035663j007590r82041j030280q72699m02547Q7909K61947O1060
38721A7685796k13440o7222N67340Q63176n3779j613835k075656p62468Q83989
38712A5213901J157492J28068r77911j551264j695842j321341m31516J78156j75175
38703A0524568p95483n55112J88390J02928p95021r81678J18677J117151P64828
38694I689248k78725o69161l05298l6132j93914m03591m03408k54710m4414N5032
38684G154927k05094o40417o35879r8243K35775p102q8660O10070J339822J020603
38674H685802j6009n52389m28996n80475j150097j063867O2696R47713M46128
38665F350506o70198q44984n4349K33855o96422j737262j481924o1043J114152
$$ plain form
38656 2152331 3265269 3715744 3986254 4897142 6450196 7759240 8153905 8018269 8191148
38647 8191148 8699064 8646624 7544107 6205202 5815986 6402487 6866349 6506601 5823139
38638 5823139 5576754 5671714 5464926 4773276 3971659 3319275 2853208 2886356 3858333 5464307
38628 5464307 6586511 6532995 5886042 5628859 5811301 5708583 5079533 4509395 4432626 4522855
38618 4522855 4368403 4184355 4350284 4600568 4286781 3359344 2535775 2412234 2879085
38609 2879085 3579980 4454210 5436322 6003019 5641898 4700568 4144177 4291354 4341976 3542264
38599 3542264 2394875 2131789 3121549 4353299 4577158 3568144 2195973 1618625 2488768
38590 2488768 4515141 6535708 7320198 6634532 5433020 4849742 5122592 5591521 5528500
$$ packed form
38656B152331J112938M50475K70510R10888J553054J309044L94665j35636J72879
38647H191148N07916n2440j102517j338905l89216N86501M63862l59748o83462
38638E823139k46385R4960k06788o91650q01617o52384m66067L3148R71977J605974
38628E464307J122204n3516o46953k57183J82442j02718o29050n70138p6769R0229
38618D522855j54452j84048J65929K50284l13787r27437q23569j23541M66851
38609B879085P00895Q74230R82112N66697l61121r41330n56391J47177N0622p99712
38599C542264j147389k63086R89760J231750K23859j009014j372171n77348Q70143
38590B488768K026373K020567P84490o85666j201512n83278K72850M68929o3021
$$ plain form
38581 5528500 4804743 3935058 3649496 4276526 5398848 6232215 6391273 6079663 5535544
38572 5535544 4707842 3669762 2932807 2971371 3645445 4370946 4668847 4378079 3668795
38563 3668795 3092689 3213880 3838859 4024305 3272873 2292559 2063166 2613084 3361133
38554 3361133 4173354 5178064 5868011 5473020 4193113 3056988 2491805 2015889 1435874
38545 1435874 1230614 1473276 1540518 1381637 1904163 3341169 4298133 3431750 1285839
38536 1285839 -553589 -1410613 -1528272 -837848 839854 2673981 3389613 3047014 2989762
38527 2989762 3802581 4514626 4224064 3418666 3083771 3361665 3762834 4055622 4276826
38518 4276826 4300431 3954271 3250709 2159359 604900 -951020 -1491724 -558857 1039414
$$ packed form
38581E528500p23757q69685k85562O27030J122322Q33367J59058l11610n44119
38572E535544q27702j038080p36955L8564O74074P25501K97901k90768p09284
38563C668795n76106J21191O24979J85446p51432r80314k29393N49918P48049
38554C361133Q12221J004710O89947l94991j279907j136125n65183m75916n80015
38545A435874k05260K42662O7242j58881N22526J437006R56964q66383k145911
38536A285839j839428q57024j17659O90424J677702J834127P15632l42599n7252
38527B989762Q12819P12045k90562q05398l34895K77894M01169K92788K21204
38518D276826K3605l46160p03562j091350j554459j555920n40704R32867J598271
$$ plain form
38509 1039414 2169665 2618420 2819396 2766673 2030121 755409 -130731 67628 1010039
38500 1010039 1673535 1324202 224391 -416265 553610 2907428 4994529 5487988 4901211
38491 4901211 4734450 5372721 5754077 5159456 4268785 3952087 3908925 3343076 2436707 2161262
38481 2161262 2776462 3474080 3689855 3928037 4784354 5732378 5628211 4291784 2894396
38472 2894396 2543626 2949502 2921824 1977245 913923 681736 1170284 1535284 1452825 1413470
38462 1413470 1680565 1610266 522437 -1104655 -1990863 -1583928 -589465 184647 814918
38453 814918 1618343 2142261 1678921 585319 105807 670723 1247308 860006 5146
38444 5146 -168154 468587 1068838 1226052 1351980 1673200 1834645 1710794 1705431 1878892
$$ packed form
38509A039414J130251M48755K00976n2723p36552j274712q86140J98359R42411
38500A010039O63496l49333j099811o40656R69875K353818K087101M93459n86777
38491D901211j66761O38271L81356n94621q90671l16698m3162n65849r06369k75445
38481B161262O15200O97618K15775K38182Q56317R48024j04167j336427j397388
38472B894396l50770M05876k7678r44579j063322k32187M88548L65000q2459l9355
38462A413470K67095p0299j087829j627092q86208M06935R94463P74112O30271
38453H14918Q03425N23918m63340j093602m79512N64916N76585l87302q54860
38444E146j73300O36741O00251J57214J25928L21220J61445j23851n363J73461
$$ plain form
38434 1878892 1632099 792591 227595 637483 1347600 1160564 27460 -968758 -1030112
38425 -1030112 -232498 1055926 2426105 3191798 2862785 1964793 1551337 1788524 1882061
38416 1882061 1522467 1361724 1701013 1790474 1104780 391651 589454 1411584 1925946 1957771
38406 1957771 1919655 1717128 954320 -7381 -341143 -82305 -93874 -607649 -833664 -243265
38396 -243265 743421 1642317 2473800 3032322 2637217 1285300 119039 -104632 -195820
38387 -195820 -1156503 -2318526 -2158508 -618402 815900 1392671 2023740 3469597 4853491
38378 4853491 4865385 3610923 2268921 1417346 743094 216209 474522 1781537 3363458
38369 3363458 4208540 4094537 3498486 2873944 2400056 2154790 2076932 1863512 1309247 727934
$$ packed form
38434A878892k46793q39508n64996M09888P10117j87036j133104r96218o1354
38425a030112P97614J288424J370179P65693l29013q97992m13456K37187R3537
38416A882061l59594j60743L39289Q9461o85694p13129J97803Q22130N14362L1825
38406A957771l8116k02527p62808r61701l33762K58838j1569n13775k26015N90399
38396b43265R86686Q98896Q31483N58522l95105j351917j166261k23671r1188
38387a95820r60683j162023J60018J540106J434302N76771O31069J445857J383894
38378D853491J1894j254462j342002q51575o74252n26885K58313J307015J581921
38369C363458Q45082j14003n96051o24542m73888k45266p7858k13420n54265n81313
$$ plain form
38359 727934 670056 1183051 1709820 1833714 1772057 1916643 2202451 2274353 2088368 1958376
38349 1958376 2058758 2215249 2169472 1736711 753866 -685394 -1861509 -1795667 -312381
38340 -312381 1569155 2635292 2662298 2335983 2267029 2486922 2736005 2771348 2413143 1711047
38330 1711047 1109927 1079361 1515896 1870938 1945820 2157654 2848267 3724446 4269451 4388847
38320 4388847 4272587 3841357 2830409 1465266 626099 1033724 2374658 3504242 3635157
38311 3635157 3184733 3204398 3980575 4584965 4080328 2812190 1944495 1876978 1871892 1365796
38301 1365796 804778 688210 540922 -308863 -1380686 -1502662 -519883 500779 947998
38292 947998 1487691 2666316 3628665 3194584 1727669 852194 1340914 2224982 2247351
$$ packed form
38359G27934n7878N12995N26769J23894o1657J44586K85808P1902j85985j29992
38349A958376J00382J56491m5777m32761r82845j439260j176115O5842J483286
38340c12381J881536J066137K7006l26315o8954K19893K49083L5343l58205p02096
38330A711047o01120l0566M36535L55042P4882K11834O90613Q76179N45005J19396
38320D388847j16260m31230j010948j365143q39167M07625J340934J129584J30915
38311C635157m50424J9665P76177O04390n04637j268138q67695o7517n086n06096
38301A365796n61018j16568j47288q49785j071823j21976R82779J020662M47219
38292I47998N39693J178625R62349m34081j466915q75475M88720Q84068K2369
$$ plain form
38283 2247351 1416611 636982 329912 35362 -822145 -2276982 -3877764 -5009092 -5169420
38274 -5169420 -4291391 -2888455 -1668830 -948089 -587652 -410442 -327323 -43202 883676
38265 883676 2396856 3683082 3965355 3408169 2843909 2680388 2535660 2030569 1472331
38256 1472331 1431844 1909149 2311444 2221047 1874953 1786722 2072420 2311322 2071957 1477959
38246 1477959 1124779 1373581 1856644 1882176 1272876 518085 64246 -177948 -444340 -642417
38236 -642417 -652436 -777885 -1313395 -1798982 -1404184 -176135 793005 805517 537770 984737
38226 984737 1910127 2198501 1583997 1077872 1463674 2215975 2410941 2045598 1760892 1705529
38216 1705529 1502746 1147843 1057340 1166469 838700 -22299 -540920 -67553 791051 983935
$$ packed form
38283B247351q30740p79629l07070k94550q57507j454837j600782j131328j60328
38274e169420Q78029J402936J219625P20741L60437J77210Q3119K84121R26878
38265H83676J513180J286226K82273n57186n64260j63521j44728n05091n58238
38256A472331m0487M77305M02295r0397l46094q8231K85698K38902k39365n93998
38246A477959l53180K48802M83063K5532o09300p54791m53839k42194k66392j98077
38236f42417j0019j25449n35510m85587L94798J228049R69140J2512k67747M46967
38226I84737R25390K88374o14504n06125L85802P52301J94966l65343k84706n5363
38216A705529k02783l54903r0503J09129l27769q60999n18621M73367Q58604J92884
$$ plain form
38206 983935 438411 -22774 111639 681159 1535916 2714954 3852256 4220958 3679076
38197 3679076 2929166 2503740 2107828 1386364 729830 707855 1169049 1610966 2112852 3084429
38187 3084429 4220975 4605506 4031781 3444957 3665629 4289423 4428228 4148978 4453081
38178 4453081 5849805 7584396 8556766 8610168 8512648 8848732 9396505 9636623 9402840
38169 9402840 8769273 7714684 6388767 5443077 5425716 5863786 5652706 4545021 3558423
38160 3558423 3536831 3971530 3831606 3040473 2428877 2590865 3509024 4993008 6623475
38151 6623475 7402252 6412130 4005822 1622962 243288 -368197 -802008 -1158012 -1312961
38142 -1312961 -1318024 -1127617 -465191 678162 1846715 2664756 3105419 3071189 2375106 1407407
$$ packed form
38206I83935n45524m61185J34413N69520Q54757J179038J137302L68702n41882
38197C679076p49910m25426l95912p21464o56534k1975M61194M41917N01886R71577
38187C084429J136546L84531n73725n86824K20672O23794J38805k79250L04103
38178D453081J396724J734591R72370N3402r7520L36084N47773K40118k33783
38169I402840o33567j054589j325917r45690j7361M38070k11080j107685r86598
38160C558423k1592M34699j39924p91133o11596J61988R18159J483984J630467
38151F623475P78777r90122k406308k382860j379674o11485m33811l56004j54949
38142a312961n063J90407O62426J143353J168553Q18041M40663l4230o96083r67699
$$ plain form
38132 1407407 1061161 1540269 1962432 1703664 1402198 1876723 2696535 2782818 2030638 1349175
38122 1349175 1282410 1522061 1737374 2003328 2300595 2345961 2111978 1935171 1956504 1944375
38112 1944375 1767496 1589666 1538919 1597288 1794624 2078007 2095894 1647035 1222883 1435899
38102 1435899 1950256 1758017 659532 -285977 -87553 1023625 2101960 2601842 2601970
38093 2601970 2355926 2030823 1648991 1046321 113115 -833447 -1245847 -980167 -358308
38084 -358308 402411 1298167 2024092 2012564 1257167 548027 565205 1167022 1789501 2050737
38074 2050737 1749165 857562 -154609 -548294 -229078 65099 -200874 -704670 -973959
38065 -973959 -1079065 -1163115 -966953 -431878 -175644 -680910 -1496724 -1897828 -1840477 -1601763
$$ packed form
38132A407407l46246M79108M22163k58768l01466M74525Q19812Q6283p52180o81463
38122A349175o6765K39651K15313K65954K97267M5366k33983j76807K1333j2129
38112A944375j76879j77830n0747N8369J97336K83383J7887m48859m24152K13016
38102A435899N14357j92239j098485r45509J98424J111178J078335M99882J28
38093B601970k46044l25103l81832o02670r33206r46562m12400K65680O21859
38084c58308P60719Q95756P25925j1528p55397p09140J7178O01817O22479K61236
38074B050737l01572q91603j012171l93685L19216K94177k65973n03796k69289
38065i73959j05106q4050J96162N35075K56234n05266q15814m01104N7351K38714
$$ plain form
38055 -1601763 -1057359 -171869 304099 -350082 -1597329 -2205014 -1826031 -1061189 -160108
38046 -160108 1204914 2837847 3823550 3750933 3259088 3030177 2962299 2643826 2000318 1180690
38036 1180690 346877 -230671 -389172 -448023 -750024 -833867 113665 1851695 3047039
38027 3047039 2967959 2359218 2204147 2450254 2530827 2402900 2356040 2317889 2024161 1514374
38017 1514374 946936 318077 -188628 -60207 822526 1789806 2247245 2460454 2902379
38008 2902379 3316973 3133207 2418653 1701439 1165150 727118 595135 966059 1411911
37999 1411911 1365056 1028834 980975 1027323 399688 -870714 -1727422 -1474017 -575739 215831
37989 215831 773434 1223803 1358656 998104 508425 386981 544993 445801 -157472 -954990
$$ packed form
38055a601763N44404Q85490M75968o54181j247247o07685L78983P64842R01081
38046a60108J365022J632933R85703p2617m91845k28911o7878l18473o43508q19628
38036A180690q33813n77548j58501n8851l02001q3843R47532J738030J195344
38027C047039p9080o08741j55071K46107Q0573j27927m6860l8151k93728n09787
38017A514374n67438o28859n06705J28421Q82733R67280M57439K13209M41925
38008B902379M14594j83766p14554p17214n36289m38032j31983L70924M45852
37999A411911m6855l36222m7859M6348o27635j270402q56708K53405Q98278P91570
37989B15831N57603M50369J34853l60552m89679j21444J58012r9192o03273p97518
$$ plain form
37979 -954990 -1503701 -1699365 -1809520 -2075869 -2276414 -1849289 -650161 633747 1210147
37970 1210147 1136692 1016383 875446 106784 -1336239 -2486877 -2525607 -1782710 -1097113
37961 -1097113 -705821 -345354 -6404 127615 253652 743720 1432635 1771297 1743092 1985396
37951 1985396 2745481 3226475 2438471 554337 -973547 -811768 814650 2263053 2198907
37942 2198907 1043273 364243 900986 1808432 2080313 1934220 2069583 2180041 1367522
37933 1367522 -117099 -840127 -240043 419045 -189371 -1683979 -2850878 -3498885 -4268996
37924 -4268996 -5053455 -4956681 -3832148 -2617704 -1873886 -1119583 -78731 509221 94050
37915 94050 -550558 -384315 284918 308611 -467815 -928121 -236069 1220188 2528578 3124018
$$ packed form
37979i54990n48711j95664j10155k66349k00545M27125J199128J283908N76400
37970A210147p3455j20309j40937p68662j443023j150638l8730P42897O85597
37961a097113L91292L60467L38950J34019J26037M90068O88915L38662k8205K42304
37951A985396P60085M80994p88004j884134j527884J61779J626418J448403o4146
37942B198907j155634o79030N36743R07446K71881j46093J35363J10458q12519
37933A367522j484621p23028O00084O59088o08416j494608j166899o48007p70111
37924d268996p84459R6774J124533J214444P43818P54303J040852N87952m15171
37915I4050o44608J66243O69233K3693p76426m60306O92052J456257J308390N95440
$$ plain form
37905 3124018 2823495 1748502 500349 -180519 -240382 -364356 -1006045 -1794939 -2069347
37896 -2069347 -1582550 -582908 370550 665859 256424 -14662 609872 1575989 1697259
37887 1697259 1060678 1001775 1867205 2270426 1360268 366673 622166 1326489 987393 150727
37877 150727 627023 2386224 3389124 2679663 1630183 1568782 2019376 2167784 2422503
37868 2422503 3309356 4098454 3901999 3266740 3367062 4236658 5010570 5398410 5663502
37859 5663502 5481597 4131535 1832852 -189125 -1138205 -1334764 -1365198 -1295860 -906053
37850 -906053 -110379 1003144 2123708 2712871 2501092 1928986 1649655 1743850 1933451
37841 1933451 2328082 3247208 4407523 5031167 4761608 3804292 2264157 208243 -1607445
$$ packed form
37905C124018l00523j074993j248153o80868n9863j23974o41689p88894k74408
37896b069347M86797R99642R53458K95309m09435k71086O24534R66117J21270
37887A697259o36581n8903Q65430M03221r10158r93595K55493P04323l39096q36666
37877A50727M76296J759201J002900p09461j049480o1401M50594J48408K54719
37868B422503Q86853P89098j96455o35259J00322Q69596P73912L87840K65092
37859E663502j81905j350062k298683k021977r49080j96559l0434O9338L89807
37850i06053P95674J113523J120564N89163k11779n72106k79331R4195J89601
37841A933451L94631R19126J160315O23644k69559r57316j540135k055914j815688
$$ plain form
37832 -1607445 -2114967 -1368085 -687275 -923993 -1426634 -1288850 -767206 -613801 -630494 80898
37822 80898 1659414 3177432 3778528 3443855 2664515 2014602 2047941 2914216 3921776
37813 3921776 4095117 3372083 2659905 2445161 2017902 611059 -1221808 -2146262 -1760626
37804 -1760626 -971731 -603222 -404391 234653 1262378 2240692 3170512 4296683 5293420
37795 5293420 5450622 4737852 3941921 3523807 3049336 2130452 1225118 887132 808927 439772
37785 439772 168649 877618 2365553 3236271 2652999 1384072 660346 671642 784883
37776 784883 752301 959427 1605874 2245036 2254092 1494342 492410 96994 784497 2073918
37766 2073918 2796771 2228493 840726 -309704 -767019 -923234 -1229486 -1631756 -1863413
$$ packed form
37832a607445n07522P46882O80810k36718n02641J37784N21644J53405j6693P11392
37822H0898J578516J518018O01096l34673p79340o49913L3339Q66275J007560
37813C921776J73341p23034p12178k14744m27259j406843j832867r24454L85636
37804a760626P88895L68509J98831O39044J027725R78314R29820J126171R96737
37795E293420J57202p12770p95931m18114m74471r18884r05334l37986p8205l69155
37785D39772k71123P08969J487935Q70718n83272j268927p23726J1296J13241
37776G84883l2582K07126O46447O39162R056p59750j001932l95416O87503J289421
37766B073918P22853n68278j387767j150430m57315j56215l06252m02270k31657
$$ plain form
37757 -1863413 -1896052 -1876842 -1861520 -1859516 -2016978 -2486509 -3097869 -3385638 -3104894 -2610278
37747 -2610278 -2479999 -2739324 -2768869 -2219550 -1731386 -2226926 -3506922 -4146944 -3105687
37738 -3105687 -1013808 575459 938978 679506 646120 1017634 1586711 2336197 3275623
37729 3275623 4015822 4035888 3359457 2561525 2009933 1448697 539522 -484639 -1083099
37720 -1083099 -1196381 -1313234 -1657422 -1739917 -1020277 277378 1401229 1976337 2260158
37711 2260158 2541857 2741552 2742088 2750314 3053768 3564553 3801386 3301229 2037031 533878
37701 533878 -464534 -631508 -359309 -264770 -472538 -624460 -465666 -36261 623412 1428312
37691 1428312 1885889 1405236 188617 -768444 -884682 -647700 -691711 -840345 -644761
$$ packed form
37757a863413l2639J9210J5322K004j57462m69531o11360k87769K80744M94616
37747b610278J30279k59325k9545N49319M88164m95540j279996o40022J041257
37738c105687K091879J589267L63519k59472l3386L71514N69077P49486R39426
37729C275623P40199K0066o76431p97932n51592n61236r09175j024161n98460
37720a083099j13282j16853l44188q2495P19640J297655J123851N75108K83821
37711B260158K81699J99695N36Q226L03454N10785K36833n00157j264198j503153
37701E33878r98412j66974K72199R4539k07768j51922J58794M29405O59673Q04900
37691A428312M57577m80653j216619r57061j16238K36982m4011j48634J95584
$$ plain form
37682 -644761 -330354 -445823 -923955 -1292362 -1577983 -2136885 -2684705 -2426068 -1286530
37673 -1286530 -198998 72835 -319191 -961882 -1796918 -2686869 -3089627 -2737554 -2131681
37664 -2131681 -1832827 -1714394 -1426292 -1117951 -1096815 -1207345 -1232244 -1499274 -2261143 -2797647
37654 -2797647 -2169070 -799895 -198053 -850262 -1466048 -849182 434299 1073102 956197
37645 956197 1022323 1505871 1489205 346410 -1262346 -2189114 -1996612 -1067792 -54853
37636 -54853 450796 183036 -454284 -667169 -264370 12220 -407914 -889221 -327355 1246711
37626 1246711 2513164 2404366 1227899 74061 -411126 -401447 -416663 -794654 -1451610
37617 -1451610 -1960790 -1990320 -1720608 -1625018 -1836246 -2063419 -2192463 -2535656 -3269786 -3992292
$$ packed form
37682f44761L14407j15469m78132l68407k85621n58902n47820K58637J139538
37673a286530J087532K71833l92026o42691q35036q89951m02758L52073O05873
37664b131681K98854J18433K88102L08341K1136j10530k4899k67030p61869n36504
37654b797647O28577J369175O01842o52209o15786O16866J283481O38803j16905
37645I56197O6126M83548j6666j142795j608756r26768J92502R28820J012939
37636e4853N05649k67760o37320k12885M02799K76590m20134m81307N61866J574066
37626A246711J266453j08798j176467j153838m85187R679j5216l77991o56956
37617a451610n09180k9530K69712R5590k11228k27173j29044l43193p34130p22506
$$ plain form
37607 -3992292 -4107244 -3385869 -1978380 -262148 1082940 1336285 520589 -442653 -825201
37598 -825201 -963343 -1484976 -2089591 -1951837 -1175079 -862687 -1554111 -2460226 -2662675 -2343029
37588 -2343029 -2230929 -2376782 -2222026 -1645583 -1188180 -1181375 -1262667 -1011940 -656047 -748642
37578 -748642 -1287674 -1527596 -792265 707354 2043138 2500428 2166913 1598705 1129443
37569 1129443 654968 -39296 -930440 -1713377 -2009464 -1667696 -906835 -81591 659498
37560 659498 1283784 1523477 1082169 328161 219336 1135014 2265017 2702233 2701989 3134744
37550 3134744 4014325 4458023 4006252 3084130 2127568 1190456 588955 933360 2080175
37541 2080175 2918189 2773209 2318776 2489917 3127079 3355409 2779542 1664179 439857
$$ packed form
37607c992292j14952P21375J407489J716232J345088K53345q15696r63242l82548
37598h25201j38142n21633o04615J37754P76758L12392o91424r06115k02449L19646
37588b343029J12100j45853J54756N76443M57403O805q1292K50727L55893r2595
37578g48642n39032k39922P35331J499619J335784M57290l33515n68208m69262
37569A129443m74475o94264q91144p82937k96087L41768P60861Q25244P41089
37560F59498O24286K39693m41308p54008j08825R15678J130003M37216k44M32755
37550C134744Q79581M43698m51771r22122r56562r37112o01501L44405J146815
37541B080175Q38014j44980m54433J71141O37162K28330n75867j115363j224322
$$ plain form
37532 439857 -323494 -3459 1243439 2229261 2160209 1862342 2623824 4206675 5149288
37523 5149288 4836799 4015072 3240791 2201037 961667 577596 1635852 3097479 3507305
37514 3507305 2790098 1998571 1675812 1348160 558420 -323578 -523113 209433 1229482
37505 1229482 1589676 1128657 796671 1442456 2449826 2437438 1398466 958461 1884405
37496 1884405 2554867 1172643 -1317788 -2180386 -554212 1489666 1848577 814928 -103109
37487 -103109 -455138 -764428 -982475 -415766 900544 1812729 1304613 -388522 -2075657
37478 -2075657 -2704828 -2176131 -1359501 -1257650 -1950584 -2557037 -2430529 -1986603 -1946919 -2239471
37468 -2239471 -2327429 -2268657 -2549246 -2984425 -2772742 -1792927 -908715 -645192 -430924 337570
$$ packed form
37532D39857p63351L20035J246898R85822o9052k97867P61482J582851R42613
37523E149288l12489q21727p74281j039754j239370l84071J058256J461627M09826
37514C507305p17207p91527l22759l27652p89740q81998j99535P32546J020049
37505A229482L60194m61019l31986O45785J007370j2388j038972m40005R25944
37496A884405O70462j382224k490431q62598J626174K043878L58911j033649r18037
37487a03109l52029l09290k18047N66709J316310R12185n08116j693135j687135
37478b075657o29171N28697Q16630J01851o92934o06453J26508M43926L9684k92552
37468b239471q7958N8772k80589m35179K11683R79815Q84212K63523K14268P68494
$$ plain form
37458 337570 1245035 1526238 1196984 831941 673544 628672 728480 872222 466219 -912159
37448 -912159 -2720219 -4016210 -4560354 -4640591 -4164561 -2884805 -1318690 -361699 3763
37439 3763 535920 1220147 1147606 182509 -529675 -296734 60352 -334228 -974515 -994192
37429 -994192 -710403 -957425 -1528392 -1523755 -828468 -26812 840418 2149874 3452361 3672484
37419 3672484 2696600 1584608 937452 163766 -1228438 -2641730 -3270077 -3161972 -2817456
37410 -2817456 -2396603 -1914480 -1653832 -1777046 -1928200 -1711307 -1218004 -731324 -355344
37401 -355344 -297185 -970619 -2310826 -3449143 -3632262 -3117255 -2654002 -2444507 -2149657
37392 -2149657 -1589442 -861450 -26011 786728 1204823 1062174 732907 483496 -149271
$$ packed form
37458C37570R07465K81203l29254l65043j58397m4872R9808J43742m06003j378378
37448i12159j808060j295991n44144q0237M76030J279756J566115R56991L65462
37439C763N32157O84227p2541r65097p12184K32941L57086l94580o40287j9677
37429i94192K83789k47022n70967M637O95287Q01656Q67230J309456J302487K20123
37419C672484r75884j111992o47156p73686j392204j413292o28347J08105L44516
37410b817456M20853M82123K60648j23214j51154K16893M93303M86680L75980
37401c55344N8159o73434j340207j138317j83119N15007M63253K09495K94850
37392b149657N60215P27992Q35439Q12739M18095j42649l29267k49411o32767
$$ plain form
37383 -149271 -1626150 -3325585 -4043732 -3525171 -2706059 -2384341 -2419743 -2414394 -2431847 -2679237
37373 -2679237 -3005787 -3068661 -2656716 -1690665 -310403 929453 1460391 1460628 1673143 2268145
37363 2268145 2524923 1987196 1257714 1080551 1218175 994846 537161 540173 913265 644963
37353 644963 -689784 -2042932 -2045725 -655002 849163 1328381 820821 166352 4013
37344 4013 306663 695434 940823 1076453 1153069 1090687 846039 565138 393810 222699
37334 222699 -147628 -582784 -605705 63479 1121502 1969343 2253182 1995529 1395780 800889
37324 800889 763767 1658896 3038985 3744048 3062108 1634430 759668 805963 836852 44183
37314 44183 -959215 -848192 608668 2115752 2383369 1571596 843420 830052 1066281
$$ packed form
37383a49271j476879j699435p18147N18561Q19112L21718l5402N349j7453k47390
37373b679237l26550o2874M11945R66051J380262J239856N30938K37K12515N95002
37363B268145K56778n37727p29482j77163J37624k23329m57685L012L73092k68302
37353F44963j334747j353148k793J390723J504165M79218n07560o54469j62339
37344D013L02650L88771K45389J35630P6616o2382k44648k80901j71328j71111
37334B22699l70327m35156k2921O69184J058023Q47841K83839k57653n99749n94891
37324H00889l7122Q95129J380089P05063o81940j427678q74762M6295L0889p92669
37314D4183j003398J11023J456860J507084K67617q11773p28176j3368K36229
$$ plain form
37305 1066281 889642 372275 100007 306661 581846 408157 -286573 -1186275 -1957748
37296 -1957748 -2368509 -2185411 -1282552 59902 1178146 1522840 1097293 371574 -122295
37287 -122295 -102729 314391 648463 437346 -262651 -969061 -1472245 -2044140 -2670102 -2616111
37277 -2616111 -1440900 -71322 91074 -905130 -1565865 -1102555 -467360 -668694 -1142081
37268 -1142081 -812022 29239 200551 -418138 -768589 -370097 114535 207462 215302 152347
37258 152347 -612920 -1957876 -2459067 -1242040 532121 1117200 387362 -565706 -1354052
37249 -1354052 -2327833 -3038411 -2393257 -620524 436972 -328330 -1783528 -2181010 -1363947
37240 -1363947 -451354 -55166 104647 168849 -164885 -818809 -1035041 -253750 1100472
$$ packed form
37305A066281j76639n17367k72268K06654K75185j73689o94730q99702p71473
37296a957748m10761J83098R02859J342454J118244L44694m25547p25719m93869
37287a22295J9566M17120L34072k11117o99997p06410n03184n71895o25962N3991
37277b616111J175211J369578J62396r96204o60735M63310O35195k01334m73387
37268a142081L30059Q41261J71312o18689l50451L98492M84632R2927P840o2955
37258A52347p65267j344956n01191J217027J774161N85079p29838r53068p88346
37249a354052r73781p10578O45154J772733J057496p65302j455198l97482Q17063
37240a363947R12593L96188J59813O4202l33734o53924k16232P81291J354222
$$ plain form
37231 1100472 1986895 1775331 817195 51577 36718 404350 418482 -18834 -283170 46515
37221 46515 664036 1076587 1141515 836747 102309 -696946 -761801 118446 1046055 1143819
37211 1143819 698281 441869 236631 -494982 -1364865 -1298826 -275208 424625 70382
37202 70382 -450476 15749 1293014 2289536 2402510 1854591 1076346 387516 3062 -169464
37192 -169464 -501772 -1000726 -1020107 -120926 1054789 1366487 547498 -521363 -940960
37183 -940960 -800831 -963034 -2066101 -3787053 -4986643 -4676344 -2979370 -1036892 120629
37174 120629 430782 477592 667422 978437 1236778 1270059 913583 181119 -615962 -1142906
37164 -1142906 -1404636 -1700615 -2263737 -2979308 -3342609 -2746688 -1110548 744649 1694317
$$ packed form
37231A100472Q86423k11564r58136p65618j4859L67632J4132m37316k64336L29685
37221D6515O17521M12551O4928l04768p34438p99255o4855Q80247R27609R7764
37211A143819m45538k56412k05238p31613q69883O6039J023618O99833l54243
37202G0382n20858M66225J277265R96522J12974n47919p78245o88830l84454j72526
37192a69464l32308m98954j9381Q99181J175715L11698q18989j068861m19597
37183i40960J40129j62203j103067j720952j199590L10299J696974J942478J157521
37174A20629L10153M6810J89830L11015K58341L3281l56476p32464p97081n26944
37164a142906k61730k95979n63122p15571l63301N95921J636140J855197R49668
$$ plain form
37155 1694317 1391739 455663 -406127 -979500 -1224248 -1069920 -832776 -1196084 -2324885
37146 -2324885 -3506105 -4067577 -4092210 -3802835 -2973499 -1646881 -768923 -1180093 -2390359
37137 -2390359 -3245177 -3433736 -3397570 -3108682 -2084413 -517344 699879 1117038 951555
37128 951555 272563 -900901 -1702687 -997532 808895 1867886 1359576 601954 935140
37119 935140 1755442 1764967 1132536 986146 1388613 1346529 630338 123466 186397 -50312
37109 -50312 -1279353 -2857443 -3649164 -3381177 -2604178 -1830150 -1316679 -1345393 -2005129 -2736038
37099 -2736038 -2677970 -1657424 -455097 128324 169231 264302 522573 469536 557 -216457
37089 -216457 276558 832176 490664 -545726 -1063590 -547616 97677 -88262 -759721
$$ packed form
37155A694317l02578r36076q61790n73373k44748J54328K37144l63308j128801
37146b324885j181220n61472k4633K89375Q29336J326618Q77958m11170j210266
37137b390359q54818j88559L6166K88888J024269J567069J217223M17159j65483
37128I51555o78992j173464q01786P05155J806427J058991n08310p57622L33186
37119I35140Q20302R525o32431j46390M02467m2084p16191n06872O2931k36709
37109e0312j229041j578090p91721K67987P76999P74028N13471k8714o59736p30909
37099b736038N8068J020546J202327N83421M0907R5071K58271n3037m68979k17014
37089b16457M93015N55618l41512j036390n17864N15974O45293j85939o71459
$$ plain form
37080 -759721 -894341 -306134 217977 108558 -365088 -710638 -864990 -1002079 -1073974 -880670
37070 -880670 -503048 -408383 -984677 -1992866 -2655291 -2441087 -1627998 -828693 -99209 1030257
37060 1030257 2620183 3959712 4384831 4027943 3445879 2870755 2180399 1304492 293017
37051 293017 -763273 -1536709 -1475319 -456867 746891 1121776 516702 -200358 -82764
37042 -82764 953866 2023024 2007604 638449 -1075404 -1820279 -1447015 -944833 -810011
37033 -810011 -267622 1304604 2946963 3097835 1638499 -14164 -691696 -412433 386524
37024 386524 1504328 2597882 2994517 2334086 956949 -511474 -1511125 -1551748 -640252
37015 -640252 192305 -313642 -1957613 -2987995 -2177986 -250252 1324450 2146649 2656752
$$ packed form
37080g59721j34620N88207N24111j09419m73646l45550j54352j37089p1895J93304
37070h80670L77622R4665n76294j008189o62425K14204Q13089P99305P29484J129466
37060A030257J589926J339529M25119l56888n82064n75124o90356q75907j011475
37051B93017j056290p73436O1390J018452J203758L74885o05074p17060J17594
37042h2764J036630J069158j5420j369155j713853p44875L73264N02182J34822
37033h10011N42389J572226J642359J50872j459336j652663o77532K79263P98957
37024C86524J117804J093554L96635o60431j377137j468423r99651m0623R11496
37015f40252Q32557n05947j643971j030382Q10009J927734J574702Q22199N10103
$$ plain form
37006 2656752 2756324 1886250 352148 -600164 -361379 226137 98599 -590189 -842617
36997 -842617 -273178 460352 642723 364716 206044 439860 893288 1405450 2000615 2577048
36987 2577048 2820075 2636979 2395653 2439410 2545185 2177312 1169572 -149350 -1411748
36978 -1411748 -2447559 -3118231 -3298256 -3083958 -2735312 -2386068 -2078560 -2034129 -2510099
36969 -2510099 -3368158 -4166488 -4712361 -5118611 -5311294 -5043098 -4533393 -4445890 -4855815 -4816185
36959 -4816185 -3524087 -1531452 -147694 166048 162430 614646 1396820 1927273 2024100
36950 2024100 1977614 2011959 1995326 1662848 968150 182408 -324225 -401895 -224617 -89104
36940 -89104 -152700 -339229 -394967 -68108 565213 925844 370763 -1008225 -2253431 -2465344
$$ packed form
37006B656752R9572q70074j534102r52312K38785N87516j27538o88788k52428
36997h42617N69439P33530J82371k78007j58672K33816M53428N12162N95165N76433
36987B577048K43027j83096k41326M3757J05775l67873j007740j318922j262398
36978a411748j035811o70672j80025K14298L48646L49244L07508M4431m75970
36969b510099q58059p98330n45873m06250j92683K68196N09705Q7503m09925L9630
36959d816185J292098J992635J383758L13742l618M52216P82174N30453R6827
36950B024100m6486L4345j6633l32478o94698p85742n06633p7670J77278J35513
36940h9104o3596j86529n5738L26859O33321L60631n55081j378988j245206k11913
$$ plain form
36930 -2465344 -1711291 -777418 -214023 -1632 -32037 -356943 -786404 -740584 61648 1017915
36920 1017915 1245021 715792 288560 487091 782651 459993 -238983 -450256 37315
36911 37315 570269 732044 873105 1231301 1283868 602665 -192805 -130197 754299 1530119
36901 1530119 1687770 1538976 1360869 1024640 636752 699459 1263432 1614629 1246587 575873
36891 575873 243370 227227 148068 -4743 -9693 76496 100246 235992 701532 1268102 1569789
36880 1569789 1717548 2073768 2527374 2524447 1834833 886312 313063 445953 1156990 1906306
36870 1906306 2065154 1509861 764032 272283 -194085 -975509 -1662488 -1460820 -359800
36861 -359800 727084 1106071 1022027 1045964 1254772 1319609 1047426 517870 -98500 -598528
$$ packed form
36930b465344P54053R33873N63395K12391l0405l24906m29461M5820Q02232R56267
36920A017915K27106n29229m27232J98531K95560l22658o98976k11273M87571
36911C7315N32954J61775J41061L58196N2567o81203p95470O2608Q84496P75820
36901A530119J57651j48794j78107l36229l87888O2707N63973L51197l68042o70714
36891E75873l32503j6143p9159j52811m950Q6189K3750J35746M65540N66570L01687
36880A569789J47759L56220M53606k927o89614r48521n73249J32890P11037P49316
36870A906306J58848n55293p45829m91749m66368p81424o86979K01668J101020
36861c59800J086884L78987q4044K3937K08808O4837k72183n29556o16370n00028
$$ plain form
36851 -598528 -759007 -506287 -65248 125478 -290295 -1165960 -1628713 -662291 1646094
36842 1646094 3696219 3831837 2162313 326029 -536893 -788839 -1089865 -1138248 -320955
36833 -320955 992404 1743536 1631898 1475660 2035090 3092153 3904521 4093938 3791489
36824 3791489 3222605 2486127 1640826 794805 119596 -192714 -112500 59559 -72916 -469939
36814 -469939 -569469 37154 979744 1443511 1094889 384598 -122147 -412813 -827073 -1394609
36804 -1394609 -1672755 -1260333 -315710 474489 407927 -664051 -2170910 -3291357 -3681118
36795 -3681118 -3656356 -3618372 -3547328 -3261974 -2884538 -2629970 -2304058 -1553419 -625866 -311811
36785 -311811 -925463 -1823596 -2226495 -2105569 -1907299 -1782797 -1591198 -1450980 -1719717 -2373656
$$ packed form
36851e98528j60479K52720M41039J90726m15773q75665m62753R66422K308385
36842A646094K050125J35618j669524j836284q62922k51946l01026m8383Q17293
36833c20955J313359P51132j11638j56238N59430J057063Q12368J89417l02449
36824C791489n68884p36478q45301q46021o75209l12310Q0214J72059j32475l97023
36814d69939r9530O06623R42590M63767l48622p10291n06745k90666m14260n67536
36804a394609k78146M12422R44623P90199o6562j071978j506859j120447l89761
36795c681118K4762L7984P1044K85354L77436K54568L25912P50639R27553L14055
36785c11811o13652q98133m02899J20926J98270J24502J91599J40218k68737o53939
$$ plain form
36775 -2373656 -2821551 -2529165 -1658688 -940765 -917356 -1337723 -1373045 -524855 772539 1654162
36765 1654162 1811628 1631739 1437010 1132626 714418 520754 654932 672845 262191 -198374
36755 -198374 -200691 161437 468974 584065 491565 -28041 -956927 -1653207 -1586294 -1132136
36745 -1132136 -925532 -785377 -168308 598840 621884 -90947 -603557 -635622 -981287 -1933078
36735 -1933078 -2446126 -1639536 -248803 345299 -35838 -408362 -143387 458672 930254
36726 930254 1088229 689650 -537099 -2208019 -3229432 -2908452 -1845610 -1270245 -1544712
36717 -1544712 -1756088 -981937 367649 933848 106189 -1191075 -1650963 -1031513 -3269
36708 -3269 992843 1985800 2772062 2866143 2324078 1883047 1958982 2066563 1566455 508815
$$ packed form
36775b373656m47895K92386Q70477P17923K3409m20367l5322Q48190J297394Q81623
36765A654162J57466j79889j94729l04384m18208j93664J34178J7913m10654m60565
36755a98374k317L62128L07537J15091r2500n19606r28886o96280O6913M54158
36745a132136K06604J40155O17069P67148K3044p12831n12610l2065l45665r51791
36735a933078n13048Q06590J390733N94102l81137l72524K64975O02059M71582
36726I30254J57975l98579j226749j670920j021413L20980J062842N75365k74467
36717a544712k11376P74151J349586N66199q27659j297264m59888O19450J028244
36708c269R96112R92957P86262R4081n42065m41031P5935J07581n00108j057640
$$ plain form
36698 508815 -598004 -1424305 -1880526 -1928843 -1699997 -1520773 -1549526 -1642686 -1737228 -1968961
36688 -1968961 -2202080 -1903498 -822762 565736 1611332 2152130 2389512 2488720 2575800
36679 2575800 2741328 2783361 2339870 1465867 571388 -365608 -1769642 -3333153 -3864320
36670 -3864320 -2962260 -1961823 -2208711 -3074243 -2883494 -1378104 76439 592897 704426
36661 704426 1027409 1252747 952874 389801 -64732 -535598 -1103834 -1332916 -924911 -287955
36651 -287955 127732 527647 1159339 1487950 823860 -436179 -1042655 -449562 535893
36642 535893 865946 469156 36064 61 191044 361877 614003 1159834 1868322 2227601
36632 2227601 1774467 574166 -668750 -1049718 -233410 1143907 2043466 2108498 1930299
$$ packed form
36698E08815j106819q26301m56221m8317K28846J79224k8753r3160r4542k31733
36688a968961k33119K98582J080736J388498J045596N40798K37382R9208Q7080
36679B575800J65528M2033m43491q74003q94479r36996j404034j563511n31167
36670c864320R02060J000437k46888q65532J90749J505390J454543N16458J11529
36661G04426L22983K25338k99873n63073m54533m70866n68236k29082M08005O36956
36651b87955M15687L99915O31692L28611o64090j260039o06476N93093R85455
36642E35893L30053l96790m33092l6003J90983J70833K52126N45831P08488L59279
36632B227601m53134j200301j242916l80968Q16308J377317Q99559O5032j78199
$$ plain form
36623 1930299 2047989 2066728 1272349 -121067 -1072782 -1124080 -958972 -1258354 -1689987 -1572947
36613 -1572947 -1015621 -713329 -905323 -1179901 -1160529 -810070 -184029 518442 708336 -167668
36603 -167668 -1844819 -3362818 -4081502 -4169520 -4034872 -3776857 -3409940 -3187613 -3329853
36594 -3329853 -3613822 -3545367 -2935157 -2164803 -1835982 -2146691 -2626000 -2559278 -1665904 -241129
36584 -241129 1265574 2479861 2970198 2469102 1444167 870474 1054923 1238087 829138
36575 829138 397281 713227 1377679 1387821 726859 290183 336218 155901 -561906 -1111924
36565 -1111924 -883665 -188543 446765 998091 1458912 1372841 464993 -774440 -1669904
36556 -1669904 -2093036 -2186710 -1855809 -1057780 -208017 220492 218488 -20337 -513446 -1221693
$$ packed form
36623A930299J17690J8739p94379j393416r51715n1298J65108k99382m31633J17040
36613a572947N57326L02292j91994k74578J9372L50459O26041P02471J89894q76004
36603a67668j677151j517999p18684q8018J34648K58015L66917K22327j42240
36594c329853k83969O8455O10210P70354L28821l10709m79309O6722Q93374J424775
36584b41129J506703J214287M90337n01096j024935n73693J84449J83164m08949
36575H29138m31857L15946O64452J0142o60962m36676M6035j80317p17807n50018
36565a111924K28259O95122O35308N51326M60821q6071r07848j239433q95464
36556a669904m23132r3674L30901P98029Q49763M28509k004k38825m93109p08247
$$ plain form
36546 -1221693 -1732828 -1688388 -1266565 -869071 -640027 -627601 -979664 -1523025 -1608222 -958884
36536 -958884 -271019 -290864 -652606 -445669 294886 621207 221882 -29447 596520 1616472
36526 1616472 2131370 2106692 2206943 2695483 3204426 3530984 3979683 4662490 4949140 4114076
36516 4114076 2420367 1099629 1091679 2076253 2959571 3087506 2664376 2142098 1686372
36507 1686372 1345696 1305535 1654183 2110375 2287173 2135441 1882749 1589438 1018919 4203
36497 4203 -1223817 -2177399 -2514961 -2224671 -1470378 -437703 586921 1204334 1281660 1280119
36487 1280119 1810408 2790571 3474898 3477625 3250724 3221005 3020165 2147057 943287 189281
36477 189281 35428 94250 330431 964482 1626427 1604577 1000562 655514 757384 540425
$$ packed form
36546a221693n11135M4440M21823L97494K29044J2426l52063n43361q5197O49338
36536i58884O87865j9845l61742K06937P40555L26321l99325k51329O25967J019952
36526A616472N14898k4678J00251M88540N08943L26558M48699O82807K86650q35064
36516D114076j693709j320738p950R84574Q83318J27935m23130n22278m55726
36507A686372l40676m0161L48648M56192J76798j51732k52692k93311n70519j014716
36497D203j228020r53582l37562K90290P54293J032675J024624O17413P7326j541
36487A280119N30289R80163O84327K727k26901k9719k00840q73108j203770p54006
36477A89281j53853N8822K36181O34051O61945k1850o04015l45048J01870k16959
$$ plain form
36467 540425 -304706 -957502 -749443 -207858 -141825 -446810 -551172 -407360 -264221 20286
36457 20286 642077 1212844 1204418 753523 395414 280743 225864 206014 209730 -49372 -655756
36446 -655756 -1067365 -814860 -292481 -155693 -244177 103262 861016 1278365 1000674 473758
36436 473758 133028 -187356 -857953 -1878713 -2829338 -3197197 -2852014 -2359936 -2509438
36427 -2509438 -3255731 -3580901 -2816596 -1606978 -992517 -1031144 -1041510 -786466 -578243 -495794
36417 -495794 -357023 -312685 -678125 -1279085 -1650287 -1711862 -1598284 -1131801 -250574 377040
36407 377040 78531 -773069 -1386833 -1861071 -2692900 -3319611 -2655133 -1086424 -344295
36398 -344295 -1035193 -1809582 -1564451 -1026454 -1284925 -2012402 -2242364 -1981635 -1910361 -2142282
$$ packed form
36467E40425q45131o52796K08059N41585O6033l04985j04362J43812J43139K84507
36457B0286O21791N70767q426m50895l58109j14671n4879j9850L716k59102o06384
36446f55756m11609K52505N22379J36788q8484L47439P57754M17349k77691n26916
36436D73758l40730l20384o70597j020760r50625l67859L45183M92078j49502
36427b509438p46293l25170P64305J209618O14461l8627j0366K55044K08223Q2449
36417d95794J38771M4338l65440o00960l71202o1575J13578M66483Q81227O27614
36407C77040k98509q51600o13764m74238q31829o26711O64478J568709P42129
36398c44295o90898p74389K45131N37997k58471p27477k29962K60729P1274k31921
$$ plain form
36388 -2142282 -2365778 -2720979 -3473425 -4122403 -3849976 -2775710 -1909090 -1790403 -1847005
36379 -1847005 -1255090 14794 1195935 1547963 1066119 395357 41550 -169417 -642284
36370 -642284 -1290469 -1734636 -1980945 -2189766 -1904868 -456520 1746297 3318194 3620956
36361 3620956 3426968 3425264 3117030 1962713 723273 607877 1585855 2527903 2761343
36352 2761343 2626028 2594749 2569984 2120461 1004934 -525271 -1755291 -2061705 -1594470
36343 -1594470 -1055963 -695731 -66871 1051470 2179341 2870230 3175066 3028657 2058693
36334 2058693 559083 -233407 410155 1705410 2504134 2671081 2554491 1982394 823428
36325 823428 -203808 -422645 -283864 -430105 -330993 818963 2355175 2770023 1829204
$$ packed form
36388b142282k23496l55201p52446o48978K72427J074266Q66620J18687n6602
36379a847005N91915J269884J181141L52028m81844o70762l53807k10967m72867
36370f42284o48185m44167k46309k08821K84898J448348K202817J571897L02762
36361C620956j93988j704l08234j154317j239440j15396R77978R42048K33440
36352B761343j35315l1279k4765m49523j115527j530205j230020l06414M67235
36343a594470N38507L60232O28860J118341J127871O90889L04836j46409r69964
36334B058693j499610p92490O43562J295255P98724J66947j16590n72097j158966
36325H23428j027236k18837J38781j46241R9112J149956J536212M14848r40819
$$ plain form
36316 1829204 653708 -143146 -967471 -1940183 -2542862 -2727525 -3040211 -3407274 -3065849
36307 -3065849 -1979703 -1098242 -879399 -741491 -343477 -216024 -656911 -1120152 -1214537
36298 -1214537 -1271301 -1438057 -1265185 -706337 -457666 -736357 -807935 -345312 -99746 -435923
36288 -435923 -357901 980054 2746671 3482888 2854409 1348998 -821531 -3208489 -4338883
36279 -4338883 -3098333 -599825 862088 677301 324616 823304 1272273 480764 -1140170
36270 -1140170 -2170146 -1972104 -1088366 -199708 591774 1450987 2260275 2625162 2379594
36261 2379594 1919745 1817536 2084948 2134912 1630487 1013112 885595 1201902 1476089 1545266
36251 1545266 1687393 2142076 2876823 3633707 3877124 3010965 1131975 -670539 -1276360
$$ packed form
36316A829204j175496p96854q24325r72712o02679j84663l12686l67063L41425
36307c065849J086146Q81461K18843J37908L98014J27453m40887m63241r4385
36298a214537n6764j66756J72872N58848K48671k78691p1578M62623K45566l36177
36288d35923P8022J337955J766617P36217o28479j505411k170529k386958j130394
36279d338883J240550K498508J461913j84787l52685M98688M48969p91509j620934
36270a140170j029976J98042Q83738Q88658P91482Q59213Q09288L64887k45568
36261B379594m59849j02209K67412M9964n04425o17375j27517L16307K74187O9177
36251A545266J42127M54683P34747P56884K43417q66159j878990j802514o05821
$$ plain form
36242 -1276360 -630282 525166 1654596 2548026 2772378 1912899 404642 -648104 -687878
36233 -687878 -201393 83570 -73746 -596756 -1362832 -2068276 -2318844 -2090472 -1725065 -1384095
36223 -1384095 -969111 -627035 -716976 -1112894 -1199952 -838829 -647475 -909801 -903859 30807
36213 30807 1295275 1698077 1009608 35430 -703197 -1464316 -2350070 -2761667 -2278509 -1506036
36203 -1506036 -1410757 -2049058 -2555398 -2386246 -2031651 -2248954 -2960918 -3344495 -2944548 -2285544
36193 -2285544 -2188314 -2723762 -3142867 -2788867 -1786685 -741421 -4499 516290 922504
36184 922504 1059395 872370 785076 1287724 2082362 2115290 878392 -612242 -772392 614447
36174 614447 2083817 2334020 1694126 1259815 1200701 779464 -240531 -1176953 -1488424
$$ packed form
36242a276360O46078J155448J129430Q93430K24352q59479j508257j052746l9774
36233f87878M86485K84963j57316n23010p66076p05444k50568K28372L65407L40970
36223a384095M14984L42076q9941l95918q7058L61123J91354k62326N942R34666
36213C0807J264468M02802o88469r74178p38627p61119q85754m11597M83158P72473
36203a506036R5279o38301n06340J69152L54595k17303p11964l83577L99947O59004
36193b285544R7230n35448m19105L54000J002182J045264P36922N20789M06214
36184I22504J36891j87025q7294N02648P94638L2928j236898j490634j60150J386839
36174F14447J469370K50203o39894m34311n9114m21237j019995r36422l11471
$$ plain form
36165 -1488424 -1401136 -1219141 -776989 -19862 512596 384203 9191 53273 359032 158638
36155 158638 -714585 -1500086 -1537693 -1071914 -737047 -627205 -289621 485527 1238826 1307906
36145 1307906 569382 -393786 -837075 -503858 262718 957169 1351446 1514601 1532265 1299930
36135 1299930 583780 -698492 -2195512 -3192933 -3188208 -2479707 -2001202 -2402638 -3370409
36126 -3370409 -3979842 -3648562 -2617831 -1555745 -858864 -411291 44998 459635 561831
36117 561831 385705 386276 763597 953941 322991 -732201 -1073363 -392357 237546 -164362
36107 -164362 -1128665 -1564048 -1416335 -1537763 -2159642 -2623456 -2742834 -3284295 -4550089
36098 -4550089 -5398147 -4520104 -2221408 -149648 515072 -23534 -835326 -1162582 -754443
$$ packed form
36165a488424Q7288J81995M42152P57127N32458j28393l75012M4082L05759k00394
36155A58638q73223p85501l7607M65779L34867J09842L37584P75148P53299O9080
36145A307906p38524r63168m43289L33217P66576O94451L94277J63155J7664k32335
36135A299930p16150j282272j497020r97421M725P08501M78505m01436r67771
36126c370409o09433L31280J030731J062086O96881M47573M56289M14637J02196
36117E61831j76126N71L77321J90344o30950j055192l41162O81006O29903m01908
36107a64362r64303m35383J47713j21428o21879m63814j19378n41461j265794
36098d550089q48058Q78043K298696K071760O64720n38606q11792l27256M08139
$$ plain form
36089 -754443 37526 414659 -108555 -983695 -1082488 -1261 1413596 1954108 1220113
36080 1220113 -124675 -997797 -772814 249894 1222521 1713979 2092224 2731393 3251312
36071 3251312 3104012 2587929 2463219 2673626 2402005 1524388 991194 1338574 1771129
36062 1771129 1415207 716435 729585 1543611 2306664 2485880 2251857 1846838 1418728 1342556
36052 1342556 1861655 2452765 2367425 1810848 1726404 2300658 2583949 1894904 758849 -17701
36042 -17701 -474044 -1078593 -1736425 -1939157 -1632725 -1268136 -1050513 -682934 50677 832614
36032 832614 1160724 1028966 1043403 1687489 2501603 2364709 895424 -762057 -1122242
36023 -1122242 -176670 651124 358420 -615231 -1400664 -1864532 -2247177 -2332548 -1714704 -552396
$$ packed form
36089g54443P91969L77133n23214q75140r8793J081227J414857N40512p33995
36080A220113j344788q73122K24983J022708R72627M91458L78245O39169N19919
36071C251312j47300n16083j24710K10407k71621q77617n33194L47380M32555
36062A771129l55922o98772J3150Q14026P63053J79216k34023m05019m28110p6172
36052A342556N19099N91110q5340n56577q4444N74254K83291o89045j136055p76550
36042a7701m56343o04549o57832k02732L06432L64589K17623L67579P33611P81937
36032H32614L28110j31758J4437O44086Q14114j36894j469285j657481l60185
36023a122242R45572Q27794k92704r73651p85433m63868l82645q5371O17844J162308
$$ [...]
##END NTUPLES=NMR SPECTRUM
##END=
