##TITLE=31Pdec_DE-126_oil
 D2O, 24 sc
 9.2.2026
##JCAMPDX= 6.0         $$ Bruker NMR JCAMP-DX V2.0
##DATA TYPE= NMR SPECTRUM
##DATA CLASS= NTUPLES
##ORIGIN= UXNMR, Bruker Analytische Messtechnik GmbH
##OWNER= root
$$ XWIN-NMR		Version 3.5
$$ Mon Feb  9 13:58:19 2026 Russian Standard Time (UT+4h)  she@DPX200
##.OBSERVE FREQUENCY= 81.013821
##.OBSERVE NUCLEUS= ^31P
##.ACQUISITION MODE= SIMULTANEOUS
##.ACQUISITION SCHEME= undefined
##.AVERAGES= 24
##.DIGITISER RES= 17
##SPECTROMETER/DATA SYSTEM= spect
##.PULSE SEQUENCE= zgpg30
##.SOLVENT NAME= DMSO
##.SHIFT REFERENCE= (INTERNAL, DMSO, 0, 198.062)
##AUDIT TRAIL= $$ (NUMBER, WHEN, WHO, WHERE, WHAT)
$$ ##TITLE= Audit trail, XWIN-NMR		Version 3.5
$$ ##JCAMPDX= 5.01
$$ ##ORIGIN= Bruker BioSpin GmbH
$$ ##OWNER= she
$$ F:/spectra/data/she/nmr/P31/2/pdata/1/auditp.txt
$$ ##AUDIT TRAIL=  $$ (NUMBER, WHEN, WHO, WHERE, WHAT)
(   1,<2026-02-09 13:57:23.96 +0400>,<she>,<DPX200>,
      <created by zg, POWCHK disabled, PULCHK disabled
       configuration hash MD5:
       00 E9 B6 7A A2 85 ED C7 34 08 36 98 17 FE 4E 26
       data hash MD5: 32K
       82 47 6A DC 16 BF D3 6D 66 FF B7 1C 92 D9 FB 88>)
(   2,<2026-02-09 13:57:26.53 +0400>,<she>,<DPX200>,
      <Start of raw data processing
       efp BC_mod = 2 LB = 1.5 FT_mod = 6 PKNL = 1 PHC0 = 1341.028 PHC1 = 173.3009 SI = 64K 
       data hash MD5: 64K
       7C 7A D2 94 9C 56 67 5D 3A 85 BE 32 ED 2B EF 60>)
(   3,<2026-02-09 13:57:47.45 +0400>,<she>,<DPX200>,
      <abs ABSG = 5 
       data hash MD5: 64K
       95 59 7E 4F 87 3E 68 83 24 9E C9 AF B0 CE 4C 15>)
$$ ##END=
$$ 
$$ hash MD5
$$ D0 95 8E 48 DC A7 1C 66 2F 42 58 E5 FD 9F D8 D5
##$RELAX= 
##$RELAX= 
##$RELAX= 
##$RELAX= 
##$RELAX= 
##$RELAX= 
##$RELAX= 
##$RELAX= 
$$ Bruker specific parameters
$$ --------------------------
##$DU= <F:/spectra>
##$EXPNO= 2
##$NAME= <P31>
##$PROCNO= 1
##$TYPE= <nmr>
##$USER= <she>
##$AMP= (0..31)
100 100 100 100 100 100 100 100 100 100 100 100 100 100 100 100 100 100 
100 100 100 100 100 100 100 100 100 100 100 100 100 100 
##$AQSEQ= 0
##$AQ_mod= 1
##$AUNM= <au_zg>
##$AUTOPOS= <>
##$BF1= 81.014009
##$BF2= 200.13
##$BF3= 200.13
##$BF4= 200.13
##$BF5= 200.13
##$BF6= 200.13
##$BF7= 200.13
##$BF8= 200.13
##$BYTORDA= 1
##$CFDGTYP= 0
##$CFRGTYP= 5
##$CHEMSTR= <none>
##$CNST= (0..31)
1 1 145 1 1 1 1 1 1 1 1 1 1 1 1 1 1 1 1 1 1 1 1 1 1 1 1 1 1 1 1 1 
##$CPDPRG= <waltz16>
##$CPDPRG1= <>
##$CPDPRG2= <waltz16>
##$CPDPRG3= <>
##$CPDPRG4= <mlev>
##$CPDPRG5= <mlev>
##$CPDPRG6= <mlev>
##$CPDPRG7= <mlev>
##$CPDPRG8= <mlev>
##$CPDPRGB= <>
##$CPDPRGT= <>
##$D= (0..31)
0 1 0 0 0 0 0 0 0 0.06 0 0.03 2e-05 3e-06 0 0 0.0002 0 0 0 0 0 0 0 0 0 
0 0 0 0 0 0 
##$DATE= 1770631043
##$DBL= (0..7)
120 120 120 11 120 120 24 19 
##$DBP= (0..7)
150 150 150 150 150 150 150 150 
##$DBP07= 0
##$DBPNAM0= <>
##$DBPNAM1= <>
##$DBPNAM2= <>
##$DBPNAM3= <>
##$DBPNAM4= <>
##$DBPNAM5= <>
##$DBPNAM6= <>
##$DBPNAM7= <>
##$DBPOAL= (0..7)
0.5 0.5 0.5 0.5 0.5 0.5 0.5 0.5 
##$DBPOFFS= (0..7)
0 0 0 0 0 0 0 0 
##$DE= 6
$$ [...]
##$SUBNAM3= <"">
##$SUBNAM4= <"">
##$SUBNAM5= <"">
##$SUBNAM6= <"">
##$SUBNAM7= <"">
##$SUBNAM8= <"">
##$SUBNAM9= <"">
##$SW= 400.765351723535
##$SWIBOX= (0..15)
0 1 3 0 0 0 0 0 0 0 0 0 0 0 0 0 
##$SW_h= 32467.5324675325
##$TD= 32768
##$TD0= 1
##$TE= 0
##$TE2= 300
##$TE3= 300
##$TEG= 300
##$TL= (0..7)
0 120 53 12 22 120 120 120 
##$TP= (0..7)
150 150 150 150 150 150 150 150 
##$TP07= 0
##$TPNAME0= <>
##$TPNAME1= <>
##$TPNAME2= <>
##$TPNAME3= <>
##$TPNAME4= <>
##$TPNAME5= <>
##$TPNAME6= <>
##$TPNAME7= <>
##$TPOAL= (0..7)
0.5 0.5 0.5 0.5 0.5 0.5 0.5 0.5 
##$TPOFFS= (0..7)
0 0 0 0 0 0 0 0 
##$TUNHIN= 0
##$TUNHOUT= 0
##$TUNXOUT= 0
##$USERA1= <user>
##$USERA2= <user>
##$USERA3= <user>
##$USERA4= <user>
##$USERA5= <user>
##$V9= 5
##$VALIST= <valist>
##$VCLIST= <CCCCCCCCCCCCCCC>
##$VD= 0
##$VDLIST= <DDDDDDDDDDDDDDD>
##$VPLIST= <PPPPPPPPPPPPPPP>
##$VTLIST= <TTTTTTTTTTTTTTT>
##$WBST= 1024
##$WBSW= 4
##$XGAIN= (0..3)
0 0 0 0 
##$XL= 0
##$YL= 0
##$YMAX_a= 12909
##$YMIN_a= -12980
##$ZGOPTNS= <>
##$ZL1= 120
##$ZL2= 120
##$ZL3= 120
##$ZL4= 120
##$ABSF1= 198.0616
##$ABSF2= -202.7028
##$ABSG= 5
##$ABSL= 3
##$ALPHA= 0
##$AQORDER= 0
##$ASSFAC= 0
##$ASSFACI= 0
##$ASSFACX= 0
##$ASSWID= 0
##$AUNMP= <proc_1d>
##$AZFE= 0.1
##$AZFW= 0.5
##$BCFW= 0
##$BC_mod= 2
##$BYTORDP= 0
##$COROFFS= 0
##$CY= -3
##$DATMOD= 1
##$DC= 0
##$DFILT= <>
##$DTYPP= 0
##$F1P= 0
##$F2P= 0
##$FCOR= 1
##$FTSIZE= 65536
##$FT_mod= 6
##$GAMMA= 0
##$GB= 0
##$INTBC= 1
##$INTSCL= 9.790993e-09
##$ISEN= 30
##$LB= 1.5
##$LEV0= 0
##$LPBIN= 0
##$MAXI= 10000
##$MC2= 0
##$MEAN= 0
##$ME_mod= 0
##$MI= 50
##$NCOEF= 0
##$NC_proc= -6
##$NLEV= 6
##$NOISF1= 182.463
##$NOISF2= 159.3651
##$NSP= 0
##$NTH_PI= 0
##$NZP= 0
##$OFFSET= 198.0616
##$PC= 4
##$PHC0= 1341.028
##$PHC1= 173.3009
##$PH_mod= 1
##$PKNL= yes
##$PPARMOD= 0
##$PSCAL= 0
##$PSIGN= 0
##$REVERSE= no
##$SF= 81.0140089999434
##$SI= 65536
##$SIGF1= 159.3651
##$SIGF2= -187.1042
##$SINO= 113.3802
##$SIOLD= 16384
##$SREGLST= <1H.CDCl3>
##$SSB= 0
##$STSI= 65536
##$STSR= 0
##$SW_p= 32467.5324675325
##$SYMM= 0
##$S_DEV= 0
##$TDeff= 32768
##$TDoff= 0
##$TI= <>
##$TILT= no
##$TM1= 0
##$TM2= 0
##$TOPLEV= 0
##$USERP1= <user>
##$USERP2= <user>
##$USERP3= <user>
##$USERP4= <user>
##$USERP5= <user>
##$WDW= 1
##$XDIM= 65536
##$YMAX_p= 536273100
##$YMIN_p= -14250804
$$ End of Bruker specific parameters
$$ ---------------------------------
##NTUPLES= NMR SPECTRUM
##VAR_NAME=  FREQUENCY,     SPECTRUM/REAL,   SPECTRUM/IMAG
##SYMBOL=    X,             R,               I
##VAR_TYPE=  INDEPENDENT,   DEPENDENT,       DEPENDENT
##VAR_FORM=  AFFN,          ASDF,            ASDF
##VAR_DIM=   65536,         65536,           65536
##UNITS=     HZ,            ARBITRARY UNITS, ARBITRARY UNITS
##FACTOR=    0.49542278885378, 1,            1
##FIRST=     16045.7642231865, 0,            0
##LAST=      -16421.768244346, 0,            0
##MIN=       -16421.768244346, -14250804,    0
##MAX=       16045.7642231865, 536273100,    0
$$ Real data points
##PAGE= N=1
##DATA TABLE= (X++(R..R)), XYDATA
$$ [...]
41781a313012K53579L69474M16714M26310L17296J87293J36443m3562n44778j003505
41771g97748q04327K8327P20689O88652J98479j01868L1096L63161O11280O36753
41761A574494L76723j05837n42921o55541m35092j18993N5672k8742l72154p88641
41751a041032r20837n57953O0086M56569M51657K83050J73487M5911j91845l32348
41741a573255j21016K93803M81786L12460J15137J50290K06494l5858m31649n01490
41731a103298j07761L28455L87471J56342j0300k0923o6771k14022k81756j53244
41721a085807N0335J98525L31839M73414M61711J93057r8884q8169J41769J41135
41711G18925k62114o28838m44065J76104O03746M93097J57612O1952K02729K18188
$$ y = [-1313012, -1059433, -689959, -273245, 153065, 470361, 657654, 794097, 750535, 205757, -797748, -1602075, -1573748, -853059, -164407, 34072, -67796, -36700, 326461, 937741, 1574494, 1951217, 1845380, 1302459, 646918, 211826, 92833, 148505, 119763, -252391, -1041032, -1961869, -2519822, -2459736, -2003167, -1551510, -1268460, -1094973, -1049062, -1240907, -1573255, -1694271, -1400468, -918682, -606222, -491085, -340795, -134301, -170159, -601808, -1103298, -1211059, -882604, -495133, -338791, -349091, -370014, -436785, -650807, -932563, -1085807, -1035472, -836947, -505108, -31694, 430017, 623074, 524190, 436021, 577790, 718925, 456811, -172027, -616092, -439988, 163758, 656855, 814467, 876419, 1079148, 1297336]
41701A297336l6552l06761l20559j09095J23743K57551K78874K06410J12317Q3667
41691A586931M7442j97299o02488p28301k89027K78453K16202n29664j103373
41682a321124p70361J74264Q16085P00034J71531j99947j86761M6137J52587j07679
41672e25234n54443o48548j48192M28212L95875j21304l25585R4696N17282L35121
41662e52120j79170l54271n8670L08099M73558M50246K24997k08812n81014n45605
41652a022762j39719K92706N55192O34024M29818q4871n33809m93753j74764j88695
41642g26633n78909o83441j50126N02561O46394L44907J7195k36740n17154o91634
41632b073580n69948k72317m862K91138O61862Q06150N21400K26234M28104Q25438
$$ y = [1297336, 1260784, 954023, 633464, 524369, 648112, 905663, 1184537, 1390947, 1503264, 1586931, 1634373, 1437074, 834586, 106285, -182742, 95711, 311913, -217751, -1321124, -2091485, -1917221, -1101136, -401102, -229571, -429518, -616279, -570142, -417555, -525234, -1079677, -1728225, -1876417, -1448205, -1052330, -1173634, -1499219, -1404523, -887241, -552120, -731290, -1085561, -1144231, -836132, -362574, 87672, 312669, 103857, -477157, -1022762, -1162481, -869775, -314583, 319441, 749259, 664388, 130579, -363174, -537938, -726633, -1305542, -1988983, -2139109, -1636548, -990154, -645247, -628052, -864792, -1381946, -2073580, -2643528, -2915845, -2920707, -2629569, -1967707, -1161557, -640157, -413923, 14181, 839619]
41622H39619O36619j64355o56884k36935N46278P83789L66723j01586k41677k26462
41612A545129k58585k00686J08801M42112L60183j93738o83649n55513K9171L12474
41602I05699r0920o28207m92744L23177J026675R86727L23929m24491q21936o76990
41592D30919r8046M39397M26013r1496n21660m70404j79210o6589j57607k08422
41582d97105j26353P550J36304K07202J33904j6736q511J82138K15437j11693
41572A22137m64400m11635o2574J34732Q1109O5722J81012J79541j2127p5827
41562b62310K06096N60266N62556J75368k63732m68830m41678l39916k51203j19370
41552f42753J28493L88374L99035O7149l00540k91439P2119K97074K8370m64831
$$ y = [839619, 1476238, 1311883, 654999, 418064, 964342, 1748131, 2114854, 2013268, 1771591, 1545129, 1286544, 1085858, 1194659, 1636771, 1996954, 1803216, 1119567, 564054, 593225, 905699, 814779, 186572, -306172, 17005, 1043680, 2030407, 2354336, 1929845, 1107909, 430919, 332873, 772270, 1198283, 1106787, 585127, 114723, -64487, -131076, -288683, -497105, -623458, -615908, -479604, -272402, -138498, -155234, -163745, 18393, 233830, 122137, -342263, -753898, -816472, -681740, -600631, -534909, -353897, -174356, -186483, -262310, -56214, 504052, 1066608, 1241976, 978244, 509414, 67736, -272180, -523383, -642753, -514260, -125886, 273149, 340298, 39758, -251681, -179562, 117512, 145882, -318949]
41542c18949n79008r9893N25744O93498L11109j70073l71697m04475m98083m51723
41532a363550J05392R15922J110365L16428o86024q75891k60832K89614K80781
41523a67795M1127k7760Q874q087J0263Q8665j2197l63061n97475l99596M1594
41512a385448L62792N01589N20418K87634k33646o23134m20657J99740O03690
41503a87022M82536Q2908k68926m53268m08396j41716P6144n2400l55585l43058
41493a568783N7387L48783K06737o6788p6953P8676Q4650o2693j69551k26594
41483a395129k86324j76975K28128O12252N63705K47403K11061M89434M61710
41474I55265j80451q27780p24084j8241M41590K36002j90683k70265m3467Q0678
$$ y = [-318949, -897957, -997850, -472106, 221392, 532501, 362428, -9269, -413744, -911827, -1363550, -1258158, -342236, 768129, 1084557, 398533, -477358, -738190, -448576, -167795, -126668, -154428, -145554, -153641, -143378, -54713, -66910, -429971, -1027446, -1427042, -1385448, -1022656, -521067, -649, 286985, 53339, -569795, -990452, -790712, -187022, 295514, 378422, 109496, -343772, -752168, -893884, -817740, -870140, -1225725, -1568783, -1511396, -1162613, -955876, -1022664, -1099617, -1020941, -936291, -998984, -1168535, -1395129, -1681453, -1858428, -1630300, -1018048, -454343, -206940, 4121, 493555, 955265, 774814, -52966, -777050, -795291, -353701, -117699, -308382, -578647, -622114, -541436]
41464e41436L512K2041L03210N90865N43514J78596j73147k74428k01122j81120
41454B70485l30121n45573n76777k34502L48289P12133N26785N3587j06151J98626
41444C16781M45854K10277j84611j84580P1149p3042p01822j052653n82551K11577
41434a523621M73972J41433j10579R1981L89149L39165K8928j71594j45821n6145
41424e43132L183J16354L17715M28681K21601k65913o56994n81917j14903K65999
41414h09326K29116n1522k18563k35898l21287m83106m51956j06425L10448M97466
41404a641053M19604K45068J33514J58967K79441L16555J15883k27476m54441
41395f53938m58434l24632p7542L15812O52599N66152N2532m00151m26270k30159
$$ y = [-541436, -537924, -515883, -212673, 378192, 921706, 1100302, 927155, 652727, 451605, 270485, -59636, -605209, -1181986, -1416488, -1068199, -356066, 170719, 224306, 118155, 316781, 762635, 972912, 788301, 603721, 674870, 601828, -99994, -1152647, -1735198, -1523621, -1049649, -908216, -1018795, -926814, -537665, -198500, -169572, -341166, -486987, -543132, -539949, -423595, -105880, 322801, 544402, 278489, -378505, -960422, -1075325, -809326, -580210, -631732, -850295, -1086193, -1407480, -1890586, -2342542, -2448967, -2138519, -1641053, -1221449, -976381, -842867, -683900, -404459, -87904, 27979, -199497, -653938, -1112372, -1437004, -1514546, -1198734, -546135, 20017, 72549, -327602, -753872, -984031]
41385i84031j68929j93488n0464K04592L09002K60625K69989L30497K50711P9757
41375C08261P1157J87948P5660l42807o33969m22800J03870M83159N22846L39087
41365F92412O4059k14764l55135k66605p5620J1050k4325l8882J6773N0078J7591
41354a23368j9791o4170k19117m57155n00932j33821M13300O16245K86666j51029
41344c53172k01809L3091L8532l08780n19357k28589K21693K75563q102n6124
41334a107054L52544P50018O15787L9529m24991l90871K9204M30408N37382M09681
41324A241637K39483J8393m00883q71926r02244k87182M62949O91318M05546J18196
41314G15287N1905J2719m8619L7426J40873j10389n86691o18386q670N19222L19325
$$ y = [-984031, -1152960, -1346448, -1396912, -1192320, -883318, -622693, -352704, -22207, 228504, 308261, 379418, 567366, 643026, 300219, -333750, -756550, -652680, -169521, 353325, 692412, 756471, 541707, 186572, -80033, -155653, -144603, -168928, -207810, -191037, -140959, -123368, -143159, -207329, -426446, -883601, -1384533, -1518354, -1105054, -488809, -202143, -353172, -554981, -521890, -483358, -792138, -1311495, -1540084, -1318391, -1042828, -1050930, -1107054, -754510, -4492, 611295, 650824, 225833, -165038, -135834, 294574, 831956, 1241637, 1481120, 1499513, 1098630, 226704, -675540, -962722, -499773, 191545, 597091, 715287, 767192, 779911, 731292, 768718, 909591, 799202, 212511, -405875, -414545, 104677, 424002]
41303D24002k48757m03464l4175L55541M72792M00027J54552k99337o94436o81877
41293e55132l83219k27626k65758j46453K09394M23674K56936n1801j90733j61213
41283a091931j10250p1492k861J36938L90725O63780O43924J80933l21775l16049
41273A01942R4962K45264j36896n67747n74930l21436j79314j26834M7724K71605
41263a145660L27979K61180K68140L17249J97919j24964m51315n77429m25491
41254a352392n6113L08999M26996L19080K23206J66396j02468n65683p06069j86746
41244a524794N39110P46249L64107q0031k80268l62281l27917P5503P46359J029281
41234I25318M87600m47916r62398p93483l55250o4092Q2283K34730L42259K60208
$$ y = [424002, 175245, -228219, -262394, 93147, 565939, 965966, 1120518, 821181, 126745, -555132, -938351, -1165977, -1431735, -1578188, -1368794, -945120, -688184, -739985, -930718, -1091931, -1202181, -1273673, -1276534, -1139596, -748871, -85091, 558833, 739766, 417991, 101942, 196904, 442168, 305272, -262475, -837405, -1158841, -1338155, -1464989, -1417265, -1145660, -817681, -556501, -288361, 28888, 226807, 101843, -349472, -926901, -1352392, -1408505, -1099506, -672510, -353430, -130224, 36172, -66296, -631979, -1338048, -1524794, -985684, -239435, 124672, 44641, -235627, -597908, -925825, -850322, -103963, 925318, 1412918, 965002, 2604, -790879, -1146129, -1210221, -1127938, -893208, -550949, -290741]
41224b90741L6155j30304j67655j79766k04549j38504Q715J8272j73102k29634
41214a451113J20417N27367M05334j33749l07059J85446O24567L05424l94655
41205a18021n84269j57589J87033Q7175q1488j2576M5488j17033j97941Q1607
41195h67614M03971K93476j30502l00887Q338M38249N77160M12806J86016K4282
41185A045295j41231l66317n14159l64095P4760M67923N12266L03768J45003O8181
41175A231394j35939m26918m60962j60878O1897r4585l54088l19096q9848j2547
41165g61570l9405J58167N25377N93065J85198k80452l59045j02071J71115L27355
41155D17734M04320L58911J20462j78499k60683k3480L10132L83532K7981n61422
$$ y = [-290741, -254586, -384890, -552545, -732311, -936860, -1075364, -1066649, -1048377, -1221479, -1451113, -1330696, -803329, -397995, -531744, -838803, -653357, -28790, 276634, -118021, -702290, -859879, -672846, -585671, -667159, -679735, -634247, -751280, -949221, -867614, -463643, -170167, -300669, -601556, -593218, -154969, 422191, 834997, 1021013, 1045295, 904064, 537747, 23588, -340507, -265747, 202176, 714442, 1018210, 1163213, 1231394, 1095455, 668537, 207575, 46697, 108594, 14009, -340079, -659175, -749023, -761570, -800975, -642808, -117431, 475634, 660832, 380380, 21335, -80736, 90379, 417734, 822054, 1180965, 1301427, 1122928, 862245, 838765, 1148897, 1532429, 1560410, 998988]
41145I98988r48360q29235l29075J30137K63707J40659k1115j07563q9741O9584
41135g22014L27296M76386L34872l932k60592l08841k81405l08374l00224r6109
41125a142937K53523M81548L88896O2322k12808k18892K2146K98719M00859K78189
41115F11565L5929k00874l80390m66946l69255m1838L51361N24775L95873J97915
41105F58115J58227J86738O5639j36110j03817K24835M57973K15899l46188o85036
41095F96275n04776p7822J05170j12135m45019n75264n22370m98859m90399k35507
41085b660706L04380P35302P22578M66686L56475L29885M0275m18362n23968j67513
41075h14968R9632p5356k82672m6187L92477N10781L54887L42806M68667L66118
$$ y = [998988, 50628, -778607, -1107682, -977545, -713838, -573179, -594294, -701857, -791598, -722014, -394718, 81668, 416540, 412608, 152016, -156825, -438230, -746604, -1046828, -1142937, -889414, -407866, -18970, 43352, -169456, -388348, -366202, -67483, 333376, 611565, 647494, 446620, 66230, -400716, -769971, -811809, -460448, 64327, 460200, 658115, 816342, 1003080, 1068719, 932609, 828792, 1053627, 1511600, 1727499, 1381311, 696275, 191499, 113677, 218847, 106712, -338307, -913571, -1435941, -1934800, -2425199, -2660706, -2356326, -1621024, -898446, -431760, -75285, 254600, 294875, -123487, -647455, -814968, -715336, -790692, -1073364, -1119551, -727074, -216293, 138594, 481400, 950067, 1316185]
41065A316185N0861o9684O5372O7061j66689k27985Q1765L60510K16574j83236
41055A510734m71582n85499o01873m31054l3222L24273L62083J52440o7734k35163
41045g6597l63698l33710o5123K54218L57821K01602p6203l23108l81197j71401
41035i77396R6258Q4066j57841j90689J13505L00941N4685k63050j92850J08358
41025a024013K25573J94486K85260L74031J65600j49920j21012J77908K25263
41016C53176r5747l31700j89628J27238L84654N89657O98368N36878J36083k49158
41006A959821m98158o22610m83896j4364L53774R4861n65710q48138n05208n1148
40996a180776J52000K87315M24978K79286j17232k81762j28248j43438l83223
$$ y = [1316185, 1367046, 1297362, 1362734, 1429795, 1263106, 1035121, 1116886, 1477396, 1693970, 1510734, 1039152, 453653, -148220, -579274, -612496, -288223, 73860, 226300, 158566, -76597, -440295, -774005, -839128, -584910, -227089, -25487, -101690, -424798, -805995, -977396, -881138, -797072, -954913, -1145602, -1032097, -731156, -676471, -939521, -1132371, -1024013, -798440, -603954, -318694, 55337, 220937, 71017, -49995, 127913, 353176, 257429, -74271, -263899, -136661, 247993, 837650, 1536018, 2072896, 2208979, 1959821, 1461663, 839053, 355157, 340793, 694567, 789428, 223718, -624420, -1129628, -1180776, -1028776, -741461, -316483, -37197, -154429, -436191, -564439, -707877, -1091100]
40987a091100k07682M96721Q10589K11837m21731j70058L93938J67070o07509
40978d17925p18445Q2783Q11014Q29750N20506K95247L5635k60644k30424J45762
40968A093259L54729J46048j38083k10205j72329q3819J26586K18997j55417p03419
40958D76347p30581k68044r1995m14132n07348Q508M80876L43840Q337o625J7269
40947f83548k85227m97301j40735L56366L28256J1107P0045L78627K66255k40349
40937d36504m03589M5046N69129O91543M43530o3248p69146j284813j069022j74738
40927b451812O91484R66027O73993J33628k88895k24530L12220O47600J88779
40918F48494o15627p56141r0256M94759M24397Q9435o1207j96628m63477m81938
$$ y = [-1091100, -1298782, -802061, 8528, 220365, -201366, -371424, 22514, 189584, -417925, -1136370, -1053587, -242573, 587177, 1107683, 1402930, 1438565, 1177921, 947497, 1093259, 1447988, 1594036, 1455953, 1245748, 1073419, 989600, 1116186, 1335183, 1179766, 476347, -254234, -522278, -614273, -1028405, -1535753, -1527245, -1046369, -702529, -694192, -700817, -683548, -968775, -1466076, -1606811, -1250445, -922189, -911082, -841037, -462410, -196155, -436504, -840093, -795047, -225918, 465625, 909155, 845907, 76761, -1208052, -2277074, -2451812, -1760328, -794301, -120308, 13320, -275575, -500105, -187885, 459715, 648494, 32867, -723274, -813530, -318771, 105626, 195061, 133854, -62774, -526251, -1008189]
40908a008189n7642K58828l3294n41097n78696k01985J8383n1078m6856J90528
40898b051098M67009O63671P64173N71819l0971o03263n21027J15610N04685K17774
40888I8382k46216k26374J93979L96260R9635l48672n02027l28211j03234J9563
40878i46915J35819L02454L45433J23495j52569j39325J25891K43329M5282j58135
40868g5241p3576J62864K87076L06324L05943J48233k60106o22096n91327l07027
40858g18933j57624j27253J35667O30282R02229P21869L89918K01278M2889k29199
40848A791123l99878k21170J33282K86820J72919J8818o4998j63134k75806k69747
40838A008229j41470p3139j39527j62639Q508K12068J45237k08087m85574l56371
$$ y = [-1008189, -1065831, -807003, -840297, -1381394, -1960090, -2162075, -2143692, -2194770, -2241626, -2051098, -1584089, -920418, -156245, 415574, 384603, -218660, -739687, -624077, -119392, 98382, -147834, -374208, -180229, 216031, 315666, -33006, -535033, -863244, -966478, -946915, -811096, -508642, -163209, -39714, -192283, -331608, -205717, 37612, 82894, -75241, -148817, 14047, 301123, 607447, 913390, 1061623, 801517, 179421, -411906, -718933, -876557, -1003810, -868143, -237861, 664368, 1386237, 1776155, 1977433, 2020322, 1791123, 1391245, 1170075, 1303357, 1590177, 1763096, 1781914, 1716916, 1553782, 1277976, 1008229, 866759, 793620, 654093, 491454, 499962, 712030, 857267, 649180, 163606, -192765]
40828a92765O9497L69360L31789J92323K55042M22977L20834j37423n49731n11953
40818E69950j31526J28447L5932j86026k27210p7702N9769R6259J07887J10284
40808D86064K246j99026k64360o1565J76170J29062j09827r7838L22152P16216
40798A099294N75663l7648n86062o94662m58970j54720R9102L05101M07886L23318
40788H78302J09968k6744K5734Q8726j40179o49233r61876o20955J98539P94894
40778c02824P21924K40031j19663j85706j36005q2476K4027J67176K31018J81312
40768G38814P8204n7616k10307k66624j46633L1367J14336J46573K13169J80102
40758H21385j04026m40963m72049j92823Q0090K14970L23038L30047R117m52082
$$ y = [-192765, -123268, 246092, 577881, 770204, 1025246, 1448223, 1769057, 1631634, 1081903, 569950, 438424, 566871, 602803, 416777, 189567, 111865, 171634, 267893, 375780, 486064, 488310, 289284, 24924, -36641, 139529, 268591, 158764, 60926, 383078, 1099294, 1674957, 1637309, 1051247, 356585, -102385, -257105, -158003, 147098, 554984, 878302, 988270, 961526, 987260, 1075986, 935807, 286574, -675302, -1296257, -1097718, -302824, 419100, 659131, 539468, 353762, 217757, 135281, 159308, 326484, 557502, 738814, 817018, 759402, 549095, 282471, 135838, 167205, 281541, 428114, 641283, 821385, 717359, 276396, -195653, -388476, -308386, -93416, 229622, 559669, 568786, 116704]
40748A16704m70359Q5158N60226L94156r1509k20024P2138L00875K26833L9808
40738A014006j21607k90983l36357k9717M52516N67964J36302l43289l36009N1388
40728G64214K96921J67632q6732j64713q1606o4504k32038m74319o12243n88002
40718a075390m54223k39957N3001L30329M40299L77526K94930K54397J62804M0850
40708A84566Q7258K97979L18071l3005l62859k33537J32520J72504j23511k21091
40698B18895O2801K94960J95555O0547J42817J82961m3136k08037K0749L01391
40688A229503P9276n05530p77622m90992o4894J23834J38777J21221N0944J614
40678i3869J62286M23103L79898j9196k56001K0402M14404L36808j47732m80953
$$ y = [116704, -353655, -268497, 291729, 685885, 594376, 374352, 446490, 747365, 974198, 1014006, 892399, 601416, 265059, 235342, 687858, 1255822, 1392124, 1048835, 712826, 764214, 1061135, 1228767, 1142035, 977322, 895716, 831212, 599174, 124855, -487388, -1075390, -1529613, -1769570, -1716569, -1386240, -945941, -568415, -273485, -19088, 143716, 184566, 271824, 569803, 887874, 854869, 492010, 258473, 390993, 563497, 439986, 218895, 281696, 576656, 772211, 832758, 975575, 1158536, 1115400, 907363, 928112, 1229503, 1308779, 803249, 25627, -465365, -530259, -406425, -267648, -146427, -95483, -93869, 68417, 491520, 871418, 852222, 596221, 616623, 1031027, 1367835, 1220103, 739150]
40668G39150m47250l62668m60405n53949m22082j56658N6278K25697M12132M94826
40658d74929L25545J4798j58562r2422O9375K04666L52600N24915N63611L47447
40648A677044L9710p5814J452l2709l20966n69167m36141n4524J20592n0675k17979
40637H0823q4047J70198J93275k1663j74121q1849J69562M23717N68834N01816
40627A746545K04277j50590l52352l88587l48053j79732J63988L95209J06244
40618A196949n70352r10752m69610K93111N84470K74925o0929r754J92955J24785
40608F45798k11445m49237l63482j04840L1790o8463k73751l95815l89449l39579
40598a918473k80110j12575K45155O85859R55310Q53606L90750j83256m91349
$$ y = [739150, 291900, -70768, -531173, -1085122, -1507204, -1663862, -1607584, -1381887, -969755, -474929, -149384, -134586, -293148, -385570, -316195, -111529, 241071, 765986, 1329597, 1677044, 1716754, 1640940, 1642392, 1609683, 1288717, 719550, 283409, 228885, 349477, 298802, 80823, -3224, 166974, 360249, 338586, 164465, 82616, 252178, 675895, 1244729, 1746545, 1950822, 1800232, 1447880, 1059293, 711240, 531508, 695496, 1090705, 1196949, 626597, -284155, -753765, -460654, 123816, 398741, 337812, 328058, 521013, 645798, 434353, -14884, -378366, -483206, -451416, -519879, -793630, -1189445, -1578894, -1918473, -2198583, -2311158, -2066003, -1380144, -424834, 428772, 819522, 636266, 144917]
40589A44917l10284J73715N04166M49070K33892J62013J68917j9148l87142n84469
40579E35647l96493j9601K13307K06768J19351J35555K98757M95790N69620M82619
40569B641320L24431J18293k21341n96956o24037j47952L00608N0230p15889j047495
40559H1212m72729L69090O42081L61349O1298j55788n69432j033368r65772k52328
40549a934387M53980N85102L43989K48353L80014M51639L40451J56690n7175l11732
40539F56924m39013k45466J12868K47630O9980j09256p4411L6754R7145K45507
40529E98662N13416N19889m8079q19355j061012n95504K6155L07041L18748L03579
40519F3540K31895N4263J0483K72242N17731K93316l26192q16442q40287m60144
$$ y = [144917, -165367, 8348, 512514, 961584, 1195476, 1357489, 1526406, 1507258, 1120116, 535647, 139154, 119553, 332860, 539628, 658979, 794534, 1093291, 1589081, 2158701, 2641320, 2965751, 3084044, 2862703, 2265747, 1641710, 1493758, 1794366, 1844596, 1128707, 81212, -391517, -22427, 619654, 981003, 1042301, 886513, 317081, -716287, -1682059, -1934387, -1480407, -895305, -551316, -302963, 77051, 528690, 869141, 1025831, 968656, 656924, 217911, -27555, 85313, 332943, 402923, 293667, 219256, 256010, 353155, 598662, 1112078, 1631967, 1583888, 764533, -296479, -891983, -865828, -558787, -240039, 63540, 295435, 349698, 360181, 632423, 1150154, 1443470, 1117278, 300836, -539451, -999595]
40509i99595J32959O67879O97961J3534q23974r13021j23829P05663Q58565N35398
40499G51540L24166L64179M00217K93767R3532j39659k74384j48008Q5440K174
40489A752964m18566o14156l14711r7236n01073j052493r20321k23313J80191
40480b208714N7551K9828L93911O57538N08037L74714N81567O80830K10041m63585
40470H21718p02826n81141o15369p89377n77378J05948O52119O16837L23061L31873
40460d14535O43148P65087M50892K3328j28627j29964m03073r08218r96518k76429
40450a374909O72463Q94947K50943m69872o09391k89746R5972M54537P44828O61549
40440A031321N0809o36072p73570l31964J40614K26761L1315r5603O955J67379
$$ y = [-999595, -866636, -198757, 499204, 512738, -311236, -1224257, -1348086, -642423, 216142, 751540, 1075706, 1439885, 1840102, 2133869, 2227401, 2087742, 1813358, 1665350, 1750790, 1752964, 1334398, 720242, 405531, 308295, -192778, -1245271, -2165592, -2388905, -2208714, -2151163, -2121335, -1727424, -1069886, -561849, -187135, 394432, 1075262, 1285303, 821718, 118892, -462249, -1077618, -1866995, -2444373, -2338425, -1686306, -1069469, -746408, -414535, 228613, 993700, 1444592, 1467920, 1339293, 1209329, 806256, -101962, -1098480, -1374909, -702446, 192501, 443444, -26428, -635819, -925565, -829593, -375056, 369772, 1031321, 1082130, 446058, -327512, -659476, -518862, -292101, -260786, -356389, -349434, -182055]
40430a82055R5932k07337l29963J7355M23207K04797n30215q55943l13806M07216
40420a270812N02735J44558n5976r1899k68412l26819J61336P70221O50688m5121
40410A70499k61497K61081N02229j63365q54320n22965L94890O60662J00906k66676
40400B1444J23955O09209M04842k66711o17080m05827r7486q1532k10114j74081
40390f93381J0724J14263J04973J57883K82265K59863N5661l1898J37840K07576
40380F05769j52133n97862m90357J56065O30407M93755Q4399j03211o5596o2203
40370D99033j47881k42746l52081m22307k64079R3484K63775M1140j99098j5380
40360g46140M15393N48019K50183r8092k12550j95711k12381k39358k09465j37272
$$ y = [-182055, -86123, -293460, -623423, -606068, -182861, 21936, -508279, -1364222, -1678028, -1270812, -768077, -623519, -679495, -771394, -1039806, -1366625, -1205289, -435068, 215620, 170499, -90998, 170083, 672312, 508947, -345373, -868338, -473448, 187214, 288120, 21444, 145399, 754608, 1159450, 892739, 275659, -130168, -227654, -309186, -519300, -693381, -682657, -568394, -463421, -305538, -23273, 236590, 292251, 260353, 398193, 605769, 453636, -144226, -634583, -478518, 151889, 645644, 730043, 626832, 561236, 499033, 351152, 108406, -243675, -665982, -930061, -836577, -572802, -531662, -730760, -746140, -330747, 217272, 467455, 369363, 156813, -38898, -251279, -490637, -700102, -837374]
40350h37374m4207M1837J8700j48463k56300q6835K16051K76381K7292j57693
40340i50611K5938M09949O06003M96865L09345K73099L50629L22256P5169k52325
40330A666317m48781m96217n33959n72361m52706j71404l383j12234k43340p6483
40320a444551K56948L33711O8791j44970J4977L85357N72135M37122J87591O4031
40310G31142N5319m8152l22118n05059k93971J50140K78415r3675m12168j09678
40300e69805N12729O15306j3130o43981o10975j49316Q0658m2664o9037K16641
40290f73574M25853J42410m43919p44819n00105k8386K56257K98214K34872O3619
40280i69578k03944k46603K34567R03766J026404M53050j45208k60174k12216
$$ y = [-837374, -881581, -839744, -821044, -969507, -1225807, -1312642, -1096591, -820210, -792918, -950611, -924673, -514724, 91279, 588144, 897489, 1170588, 1521217, 1843473, 1918642, 1666317, 1217536, 721319, 187360, -385001, -837707, -1009111, -1012494, -1124728, -1368068, -1444551, -1187603, -853892, -785101, -930071, -915094, -529737, 42398, 479520, 667111, 731142, 786461, 738309, 416191, -88868, -382839, -232699, 45716, -47959, -460127, -569805, -57076, 558230, 545100, -98881, -709856, -859172, -778514, -821178, -890215, -673574, -247721, -105311, -549230, -1294049, -1794154, -1822540, -1566283, -1268069, -1033197, -969578, -1173522, -1420125, -1185558, -281792, 744612, 1197662, 1052454, 792280, 580064]
40271E80064m35895o53269l80956J49152L25252J66281J93776M01611K20074m04371
40261A61719p40688l61825K25237L96905K26466P5874m5560k32283k72593o627
40251e73375K69472K39776R1113J38569K36463N7041k90423m15481k42525p740
40241d97110J62474K50360J30195j95718l52429q2405K11975j5048n28274n46646
40231a462626J03241P13837P01330K95976J1115n7858r2827j11317k6924Q0703
40221A54650N8144p7452j69447j01618J30763L89473M07641M4069m39113n95145
40211a98035l47050o3568o957n726J69778L89508L65107R5717j32615j26292J6045
40200A55912P2458l3366j52623j02953O5147J00023q5469k52598k02427r4348
$$ y = [580064, 144169, -509100, -890056, -740904, -415652, -249371, -55595, 346016, 566090, 161719, -578969, -940794, -715557, -318652, -92186, -16312, -61872, -294155, -566748, -573375, -303903, -64127, 26986, 165555, 402018, 459059, 168636, -246845, -489370, -497110, -334636, -84276, 45919, -149799, -502228, -584633, -372658, -387706, -915980, -1462626, -1359385, -645548, 55782, 351758, 362873, 305015, 212188, 100871, 73947, 154650, 212794, 135342, -34105, -135723, -4960, 384513, 792154, 836223, 397110, -198035, -545085, -608653, -615610, -621336, -451558, -62050, 303057, 398774, 266159, 139867, 155912, 228370, 195004, 42381, -60572, 4575, 104598, 19129, -233469, -435896, -530244]
40190e30244j28425j28536J43365M15593J98345l64713n34231j4294O05947P05072
40180C67879M12515J96211J19915m7654k98279m03678k88806n6597J77134K27894
40170D06534r7320n98344o71795p0024O47080Q28495N69716L52321J96414j82611
40160A380466o08488n82233j30025K00475K22903K88401M81067L79352j27285
40151A504633m77256k76881P8700O2454j97789k56695n8559J70808L68746M83162
40141A401323K39118l78886p28340k52454N77537P70125J87701l15831j85597
40132A314696J51636J30284j13097j54479r159O0353J06728L44300O28820N71551
40122C031633J06278m27566p18905o98049m02728L1892K97239J66860j70000l33620
$$ y = [-530244, -658669, -787205, -643840, -228247, -29902, -394615, -928846, -943140, -337193, 367879, 780394, 976605, 1096520, 1048866, 750587, 346909, 58103, 1506, 178640, 406534, 309214, -289130, -960925, -1030949, -383869, 444626, 1014342, 1366663, 1563077, 1380466, 771978, 189745, 59720, 260195, 483098, 771499, 1252566, 1631918, 1504633, 1027377, 750496, 829196, 891650, 693861, 437166, 378607, 549415, 918161, 1401323, 1640441, 1261555, 533215, 280761, 858298, 1628423, 1816124, 1500293, 1314696, 1466332, 1596616, 1483519, 1329040, 1319881, 1380234, 1486962, 1831262, 2460082, 3031633, 3137911, 2710345, 1991440, 1293391, 890663, 922555, 1219794, 1386654, 1216654, 883034]
40112H83034k95816l52974n46928n26742j29163K80692K89883k0224k62669k44715
40102i25622k2827L24177O67330P30169L62565j50974l62002k09887k9814m3266
40092C39849j41004j77272j57473o3935J88491M82457M68025K1644m56682m50817
40082E3283M5567N05534M58143k2150m29782l82234k9309J55551R409r1177J77098
40071D49933M93237L12065k30018m08406j7462K52192j05872n52552l22720L23083
40061A93480M46070j39588o05213l68147J40072K59187K8912j05136n9699p5180
40051b85242j67268j09441J31827L33701L54696K38637K7916k44876m12122l00492
40041d32664j6018J47694J06603N2839R0484O4426j39742l49743l35829j50011
$$ y = [883034, 587218, 234244, -312684, -839426, -968589, -687897, -398014, -418238, -680907, -925622, -948449, -624272, 43058, 773227, 1135792, 984818, 622816, 412929, 383115, 339849, 198845, 21573, -135900, -199835, -11344, 471113, 939138, 960782, 504100, 53283, 98850, 604384, 1062527, 1040377, 610595, 228361, 199052, 354603, 364012, 272835, 449933, 943170, 1255235, 1025217, 616811, 599349, 851541, 745669, 193117, -129603, 193480, 639550, 499962, -105251, -473398, -333326, -74139, -45227, -150363, -210062, -285242, -452510, -561951, -430124, -96423, 258273, 496910, 524826, 279950, -132172, -432664, -448682, -300988, -194385, -141546, -51062, 13364, -126378, -476121, -811950, -961961]
40031i61961n2882j57475k97257k41760N9767M48517O90631O49278M01700J81049
40021G19607J20742P3369j80335n22844n18236j3374M69134K86036m08370p23648
40011f97919j86906N65224O12649k6027n12721l99521j03627p9175j37252N5607
40001i09668K84132J19356l04883m12249l7707L36243K92957K6786j8086K27711
39991c95408M28532K94631j23530n26052o32803m12015j10570p215j07940j67561
39981a759931k8168J98376L47024M44806N88649O69345M34214j20407n82063n12616
39971c20771J5503M32182K94148k26269o10612o36687n04327l60219o5066M07753
39961a574365O92076M86703P0584m8220J25833J48979p6567j30514J69459L77900
$$ y = [-961961, -1014843, -1172318, -1469575, -1711335, -1651568, -1203051, -512420, 136858, 538558, 719607, 840349, 913718, 733383, 210539, -307697, -321071, 148063, 434099, 25729, -697919, -884825, -319601, 293048, 267021, -245700, -645221, -748848, -828023, -965275, -909668, -625536, -506180, -811063, -1223312, -1261019, -924776, -631819, -605033, -623119, -395408, 33124, 327755, 204225, -321827, -954630, -1366645, -1477215, -1484430, -1592370, -1759931, -1788099, -1589723, -1242699, -797893, -209244, 460101, 894315, 773908, 191845, -320771, -305268, 126914, 421062, 194793, -415819, -1052506, -1556833, -1917052, -1982118, -1574365, -882289, -395586, -325002, -373222, -247389, -98410, -174977, -305491, -136032, 241868]
39951B41868J18898k70097k53775O0369J49185l9749n5720J96866K06720l18068
39941C6497r07234r66515n51944r4473L06057P77949J079824P62954j5600m51299
39931b3784j25571L92076L44900j67837m22041j40011K03923J49384j64679l40022
39921b93662k70126j07450O4031K44148L39339K29834k0184k02636k08573j08201
39911c33480m515R0190K28751M23940N52845L97238r8423o21746p52480m82876
39901f00556k32755k38079k35142K3681K80983J98021L836J82943O27491P07322
39891G17745K43531j93342j65929J6977q4921l14594k79540o8606n4462k10636
39881c93777j91209K6134J34728J00669K08606M49427M18634r089m14152m76021
$$ y = [241868, 360766, 90669, -163106, -102737, 46448, 6699, -49021, 147845, 354565, 36497, -870737, -1837252, -2389196, -2483669, -2177612, -1399663, -319839, 443115, 427515, -23784, -149355, 242721, 587621, 419784, -2257, -142268, 61655, 211039, 46360, -293662, -563788, -671238, -607207, -363059, -23720, 206114, 185930, -16706, -225279, -333480, -337995, -247805, -19054, 404886, 957731, 1354969, 1256546, 634800, -117680, -600556, -833311, -1071390, -1306532, -1282851, -1001868, -803847, -800011, -617068, 10423, 717745, 961276, 767934, 602005, 618982, 534061, 219467, -60073, -128679, -183141, -393777, -584986, -558852, -424124, -323455, -114849, 334578, 753212, 744123, 329971, -146050]
39871a46050m04304m22246k93327J91174O33362M99027n1497l80921l20123k98018
39861i92923n08565n65799j89674K95494M62925L67260K75057J75160j5480m7877
39851g44422L34351Q08485P59919J72478k71657j14212K92727L40209n0488m69786
39841A057604n93438m22471j16819J35872J81897N5778m457J26345K40928R1726
39831G52965k21706l96726l58364k68268j62749R6313M72372O57531M54573M9485
39821A075426k29551k74885k01488j12800j0551R9818J20964o3727l96022n60988
39811e53804k74953K60084M25512m2281n49435l09541N69643J139893Q24013R3343
39801A582474k73457j60652L745j1346p4121r4003j54700k71635l42121l30061
$$ y = [-146050, -550354, -972600, -1265927, -1074753, -441391, 57636, 6139, -374782, -694905, -992923, -1501488, -2067287, -2256961, -1961467, -1498542, -1131282, -856225, -681065, -696545, -744422, -410071, 398414, 1158333, 1330811, 1059154, 944942, 1237669, 1577878, 1527390, 1057604, 464166, 41695, -75124, 60748, 242645, 298423, 293966, 420311, 661239, 752965, 531259, 134533, -223831, -492099, -654848, -558535, -86163, 571368, 1025941, 1075426, 845875, 570990, 369502, 256702, 246151, 345969, 466933, 403206, 7184, -553804, -828757, -568673, -143161, -185442, -734877, -1044418, -474775, 665118, 1489131, 1582474, 1309017, 1148365, 1152110, 1140764, 1066643, 972640, 817940, 546305, 204184, -125877]
39791a25877k53485m5729L08281N65845M63073J32680l0466O4129R5897j38434
39781A035914m12865m34165k44668p0709K4239J17752J99071J85994J11731J00541
39771F12835J58419J40621k8366k04838j82028K5495J50956M341k28760j80654
39761B68021J81921M46789K98845l3573j24242J4112o096k80497m12734j17074
39751B35472L07206L50685l8091l98076l02687J93036O16758N23285n1671n58047
39741H77870m88289R142K81757J3200l53951k30461L10192O31155L45863k48561
39731A147917n53829k89224K84970O26331M03913j67330n38612m47110j77402
39722B89624p7889n6401J43373L63698K03822k51592l96151K4701M58406K91601
$$ y = [-125877, -379362, -425091, -116810, 449035, 912108, 1044788, 1014322, 1078451, 1174348, 1035914, 623049, 188884, -55784, -126493, -102254, 15498, 214569, 400563, 512294, 612835, 771254, 911875, 883509, 678671, 496643, 522138, 673094, 677435, 448675, 268021, 449942, 896731, 1195576, 1162003, 1037761, 1051873, 1045777, 765280, 352546, 235472, 542678, 893363, 855272, 457196, 154509, 347545, 964303, 1487588, 1435917, 877870, 389581, 398723, 680480, 693680, 339729, 109268, 419460, 1050615, 1396478, 1147917, 594088, 304864, 589834, 1216165, 1620078, 1452748, 914136, 467026, 289624, 211735, 155334, 298707, 662405, 866227, 614635, 218484, 243185, 701591, 993192]
39712I93192k82405n50639k33505K75900N24714M17915M1265m68009p61471m46003
39702d89046L20088P57000L60087l77531n63913q0022L49677K55800L1778K02391
39692G66309N60880N00367k8872m13337k35558J89661K89019n8896m93291o64516
39682D11766n35281k65836O045K40148M33412N25617L97453K9686l53006m34328
39672D55676j66417J33947J41649j08234l03817k27852P1843M12261O13507N29301
39662A551864J37934l12713m05675K7411O28997Q19066M09253k13463n64821n69173
39652A508680m67310l89148k77471j63694j79756k36687m7401L53685M69293L0343
39642F00534m77081m19995M9776K14592j28897m17496k46130P4935J61587J80920
$$ y = [993192, 710787, 160148, -73357, 202543, 727257, 1145172, 1186437, 718428, -43043, -489046, -168958, 588042, 948129, 570598, 6685, -73337, 276340, 532140, 563918, 766309, 1327189, 1827556, 1798684, 1385347, 1149789, 1339450, 1628469, 1569573, 1076282, 411766, -123515, -389351, -383306, -143158, 290254, 815871, 1213324, 1243010, 890004, 455676, 289259, 423206, 564855, 456621, 152804, -75048, -3205, 409056, 1022563, 1551864, 1689798, 1377085, 971410, 998821, 1627818, 2446884, 2856137, 2642674, 2077853, 1508680, 1041370, 652222, 374751, 211057, 31301, -205386, -252787, 100898, 570191, 600534, 123453, -296542, -246766, -32174, -161071, -578567, -824697, -749762, -588175, -407255]
39632d07255L87335M98624J35565l91250m00284J18816M18538O3193m66854m94203
39622e37775m2268L28627L11651J10761K4459J04884K41715L37374L15465J11430
39612A306323k22152m53881l32819J44507O65545Q60038O35593K19904j22012
39603B701046l37774n30471p36312q41392p11848l73991m8960M6694k6023L3824
39593h25207L26341M89346J52636m28293n92675j78270K49234K52086J15003K28246
39583b11553L43732J6350n13097n53799N563N51847O65952N68819N22457L89938
39573A786209N1674k53778l27893l25055l39966j00669N13357J001532Q00769
39564B806180J13885l21647k08472L5804j4049k53061l60203l15418l49302n07761
$$ y = [-407255, -19920, 478704, 614269, 223019, -177265, -58449, 360089, 423282, -43572, -537775, -580043, -251416, 60235, 170996, 195455, 300339, 542054, 879428, 1194893, 1306323, 1084171, 630290, 297471, 441978, 1107523, 1967561, 2603154, 2823058, 2701046, 2363272, 1832801, 1096489, 255097, -456751, -830742, -879702, -833008, -859031, -825207, -498866, -9520, 143116, -285177, -877852, -1056122, -806888, -554802, -439799, -211553, 132179, 148529, -364568, -918367, -912804, -360957, 304995, 873814, 1396271, 1786209, 1837883, 1584105, 1256212, 931157, 591191, 490522, 1003879, 2005411, 2806180, 2920065, 2598418, 2389946, 2425750, 2411701, 2158640, 1798437, 1483019, 1133717, 625956]
39554F25956n05270q8332N35986Q02217M33320j45616k90549K9964K48288P2044
39544A718008j31488m1303L2440k77949o28385l97255K78222N70378J19748m69880
39534G72536m93240j4356M06739M79361L27430J10005j41345l78694m93353m27499
39524A47584k18242K8436J49705K6255k34463l29169r3727K70770M15482K35335
39514C97966l5168p2078K36536O79237Q86616O84607K89410N1500K9940o152j51442
39503B990972j91675L2431L22566L78426J91620k6570j82080l24677m19445l55076
39493B416492j81874j13700k42972m22361m68642l34263o1917K45677L73540J41206
39483A351186k76687l89946L6438N88636O33321R0187m76993n57318k29451R1204
$$ y = [625956, 120686, 32354, 568340, 1370557, 1803877, 1658261, 1367712, 1397676, 1645964, 1718008, 1586520, 1545217, 1577657, 1299708, 671323, 274068, 552290, 1122668, 1242416, 772536, 279296, 264940, 671679, 1151040, 1478470, 1588475, 1447130, 1068436, 575083, 147584, -70658, -42222, 107483, 133738, -100725, -429894, -523621, -252851, 162631, 397966, 362798, 290720, 527256, 1206493, 2093109, 2777716, 3067126, 3118626, 3148566, 3142414, 2990972, 2799297, 2831728, 3154294, 3532720, 3724340, 3697770, 3515690, 3191013, 2771568, 2416492, 2234618, 2120918, 1877946, 1455585, 986943, 652680, 590763, 836440, 1209980, 1351186, 1074499, 684553, 720991, 1309627, 1942948, 2033135, 1556142, 998824, 769373, 860577]
39473H60577K07826K44011L16155L39835J84057j14539l42768k96580r849J99723
39463A588448L9133l49996m76236j38641K33627J57549j73002j56583K78769N38223
39453A541291K93895J0772J81001M78526K29587n01261r13290n72354L2068K13549
39443I93784m5849k40363q9685J76303K05957l9200k80631k62417m4198P7748
39433D51449m6236k16820j70159M4133J50986L6672j80459m09965o29520o63281
39423a633200k72431L98086P76633N07002p1134l32262j19151J65925J54689n9418
39413d85261j31680O3979K82913K07730j50582m15814k65578J84057N40912O23584
39403D54260N81996N41849L97180O4442k80696l90359k40029j4074R7320J5651
$$ y = [860577, 1068403, 1312414, 1628569, 1968404, 2152461, 2037922, 1695154, 1398574, 1388725, 1588448, 1627581, 1277585, 801349, 662708, 896335, 1053884, 880882, 724299, 1003068, 1541291, 1835186, 1845958, 2026959, 2505485, 2735072, 2233811, 1320521, 748167, 780235, 993784, 947935, 707572, 617887, 794190, 1000147, 960947, 680316, 417899, 373701, 451449, 405213, 188393, 18234, 62367, 213353, 250025, 69566, -340399, -969919, -1633200, -1905631, -1507545, -730912, -223910, -295044, -627306, -746457, -580532, -425843, -485261, -616941, -552962, -270049, -62319, -212901, -628715, -894293, -710236, -169324, 454260, 1036256, 1578105, 1975285, 2039727, 1759031, 1368672, 1128643, 1114569, 1211889, 1227540]
39393A227540j77758k64140j21456N0123k5844k20242j12166L26131N81683L44924
39383A608795m3350k02680l05394n96304p57578l95007J47017K06649j10362p2221
39373e20435M53074P57406M54613N1296N256m399l37982o04893l03707K44007
39363A94236L61368Q9709J0307J85185J01174l33905n45796k41079R1029l9367
39353a27139l71272l26998J61465O44485P45023M50700l359k92159k00949J26676
39343H06473K96381J63903J257M106m8769l56017o17158m23020N4254K38910j5418
39332A04902k23056K1405N07669P43204N46068J37272j71936k47493k04680k71502
39322I41853m77574n32461k16211J93044K22950p0623j23039K72182N91235L69313
$$ y = [1227540, 1049782, 785642, 664186, 714309, 688465, 468223, 356057, 682188, 1263871, 1608795, 1565445, 1362765, 1057371, 461067, -296511, -691518, -544501, -337852, -448214, -520435, -67361, 690045, 1144658, 1195954, 1201210, 1196811, 858829, 253936, -49771, 194236, 555604, 645313, 655620, 840805, 941979, 608074, 62278, -178801, -87772, -127139, -498411, -825409, -663944, -19459, 725564, 1176264, 1172905, 880746, 679797, 806473, 1102854, 1266757, 1268014, 1272120, 1223351, 867334, 250176, -172844, -118590, 120320, 104902, -118154, -96749, 410920, 1154124, 1700192, 1837464, 1665528, 1418035, 1213355, 941853, 464279, -68182, -284393, -91349, 131601, 60978, -62061, 210121, 801356, 1170669]
39312A170669o5928j00805K28651L57290J06952j01712N801J39305k6738l16249
39302A397236l35243m8653J99752J29111k02314m98744n17240l30082k88549n62259
39292a056985p65164l61230N07234J008422O61950M206j56137J70317L20703O0639
39282C93955j35062M9726K41352L0437l05150k01531L14834O55530N09839J77884
39272A731814r083j48054m08248n81496l70428O8785K93398K27870K21560L93117
39262A419235L67696r3235n75811n17569k1465K55242l1546n32442p18544m61359
39252i09798l6138J99445P3742k35817k97671Q6656N28782M90234L0905k80487
39242c50147k11005j15200k19274k18317J16941M58158M65427L57391M30097M14583
$$ y = [1170669, 1104741, 1003936, 1232587, 1589877, 1696829, 1595117, 1600918, 1740223, 1713485, 1397236, 1061993, 1013340, 1213092, 1342203, 1139889, 641145, 123905, -206177, -494726, -1056985, -1822149, -2183379, -1676145, -667723, -5773, -1567, -157704, 12613, 333316, 393955, 258893, 308619, 549971, 580408, 275258, 73727, 388561, 1044091, 1553930, 1731814, 1722731, 1574677, 1166429, 584933, 214505, 283290, 576688, 804558, 1026118, 1419235, 1786931, 1693696, 1117885, 600316, 578851, 834093, 802547, 270105, -448439, -909798, -945936, -746491, -672749, -908566, -1206237, -1119581, -590799, -100565, -69660, -350147, -561152, -676352, -895626, -1113943, -997002, -538844, -73417, 283974, 714071, 1128654]
39232A128654o2846o75673p52928k95119N6571J6351o6504M6096J42222R0735
39222c72441N5707P567l15821p19569n32186L25601R25500N56639j83356k17028
39212d69387M75223R16240N59239j07006m20380l54540k61653k86860l14788k28941
39202d92853j4006K49702L91495K82192J1111j85852j85755o2836N4139R9040
39192A46377Q8028J02669J69119J24723j85288n13056l53683L06732P69001N00418
39182A155040j14437l58597j88005o6610p1785R0317K93396N5138n13527o48706
39172c67776r2817M40705L47096k0239p9015L0752j34627m27910l54304O4296
39162e93839L38614K75024J05993k2907j49967j81069r494J29516m4274k81048
$$ y = [1128654, 1065808, 390135, -362793, -657912, -601341, -584990, -651494, -605398, -463176, -372441, -316734, -309167, -624988, -1344557, -1876743, -1551142, -625642, -69003, -252359, -469387, 5836, 922076, 1481315, 1374309, 953929, 599389, 337736, 50876, -263912, -492853, -506859, -257157, 134338, 416530, 427641, 241789, 56034, -6802, 47337, 146377, 234405, 337074, 506193, 630916, 445628, -67428, -421111, -114379, 654622, 1155040, 1040603, 682006, 494001, 427391, 355606, 445923, 739319, 794457, 280930, -367776, -460593, -19888, 327208, 306969, 227954, 258706, 124079, -303831, -658135, -593839, -255225, 19799, 125792, 102885, -47082, -228151, -237645, -108129, -152403, -433451]
39152d33451r7141L85944N23370J30467k48596k16707m9585p8205j20517Q5009
39142a19412L37375K98888L2829j82016k94091l61511k64141O0669L23643K49950
39132H2183N2690R5635K40215M0330m66327p01300l64802J72471M67582N52610
39122A71287O13938N12205M4353n14005n97929j17484L34881K06623l25716o22726
39112b94573m11597n7286K7197m8966J08921N38687Q27120O67337K37472p7565
39102A516747j27317k4646Q2802J02257k470j26525o0114K12996L67128R9128
39092B039986m28861p36666o02284k90046j81007l40650n04654l91562R656M23073
39082a003015N71327M82611M15687M72121M83606L61526K82401L26592K22747
$$ y = [-433451, -530592, -144648, 378722, 509189, 260593, 43886, -5699, -83904, -204421, -119412, 217963, 516851, 549680, 367664, 73573, -287938, -552079, -491410, -167767, 82183, 134873, 230508, 470723, 511053, 44726, -656574, -1021376, -848905, -381323, 171287, 785225, 1297430, 1341783, 827778, 229849, 112365, 447246, 653869, 328153, -294573, -706170, -763456, -736259, -785225, -676304, -137617, 689503, 1356840, 1594312, 1516747, 1389430, 1364784, 1447586, 1549843, 1547373, 1420848, 1360734, 1573730, 1940858, 2039986, 1611125, 874459, 272175, -17871, -198878, -539528, -1044182, -1435744, -1426088, -1003015, -431688, 50923, 466610, 938731, 1422337, 1783863, 2066264, 2392856, 2615603]
39073B615603k10559o00989m49046R6005L74288J24816k28625k81379j53345j06553
39063A180216j00531j1629N1554k6434p8728R4167L65412M53928L13708J03116
39053B344779r7724k85521l60389k20182R839O3172j34224l48025k80116R2665
39043G84274L95877J56705n96612j125670p16253L61468J049480P85161J15423
39034A209853k13016k32041l42281m00837M2217P78872R96689M11634k80960l36578
39024A633552J33212M89351M39855K23099J16605J29617J72764K62627M27841
39015D028523N12650K59080l14172p39268n57178M7012L81499J42340j80686m5839
39005C533961L47046M23426J39311j1397J93725M23458L79339K05389J65681K60416
$$ y = [2615603, 2405044, 1804055, 1355009, 1451014, 1825302, 1950118, 1721493, 1440114, 1286769, 1180216, 1079685, 1068056, 1119610, 1093176, 1014448, 1108615, 1474027, 1927955, 2241663, 2344779, 2247055, 1961534, 1601145, 1380963, 1390802, 1453974, 1319750, 971725, 691609, 784274, 1180151, 1336856, 740244, -385426, -1101679, -740211, 309269, 1094430, 1209853, 996837, 764796, 422515, 21678, 63895, 842767, 1839456, 2251090, 1970130, 1633552, 1766764, 2256115, 2695970, 2919069, 3035674, 3165291, 3338055, 3600682, 4028523, 4541173, 4800253, 4486081, 3746813, 3189635, 3236647, 3618146, 3760486, 3579800, 3533961, 3881007, 4304433, 4443744, 4432347, 4626072, 5049530, 5428869, 5634258, 5799939, 6060355]
38995F060355L23715K57229N1089k34579m46944m58436l05384p7544K14423M80908
38985E864832M75301J61878q5113l3445n5563n10624r55905p12313m9626Q6726
38975D186148m34685o79055j40856M57287L40611j81301l80671k11420l2676J79595
38965C102977N56296P24216L13490k17595j02411N45283Q66929N40451J52076
38956F481712K00776M39226M32850K06636K9725m7680j33304k04821j38343P1993
38946G338770K69689K97804J85219J52679L37066N43325M98285L34176M38166
38937A0395179P54794P63079L72941K30960O93348J104890P68704J33866J74794
38928A5392555R09818J471213J515518J586980J999913K307436K184538K047149
$$ y = [6060355, 6384070, 6641299, 6692388, 6457809, 6010865, 5552429, 5247045, 5169501, 5383924, 5864832, 6340133, 6502011, 6416898, 6383453, 6327890, 5817266, 4861361, 4149048, 4099422, 4186148, 3751463, 3072408, 2931552, 3388839, 3729450, 3548149, 3167478, 2956058, 2923382, 3102977, 3659273, 4383489, 4696979, 4479384, 4376973, 4922256, 5789185, 6329636, 6481712, 6682488, 7121714, 7554564, 7761200, 7790925, 7743245, 7609941, 7405120, 7266777, 7338770, 7608459, 7906263, 8091482, 8244161, 8581227, 9124552, 9622837, 9957013, 10395179, 11149973, 11913052, 12285993, 12516953, 13210301, 14315191, 15083895, 15217761, 15392555, 16302373, 17773586, 19289104, 20876084, 22875997, 25183433, 27367971, 29415120]
38920B9415120K370603K997166L553347M082746M840972N810575O797521P773190
38912F7641240Q851589J0124674J1668764J3457384J5145976J6238773J6601721
38905A59730121J6517660J6110659J5029703J2900053R936664P083684N711570
38898B43020114P004781J1209473J7439079K4449624L1382219L7374750M0944182
38891D12824222M0699373L6513018K8902296J7237725R6466k1669659m3185813
38884D71417628n8170770o3350423n9992443n1804565m2228224l3345294k6039519
38877A36486390k0442340j6340731j3394422j1146464r195621p543071o459993
38870E1963748n842969n119453m052909l161811k932562l038420k818045k182370
$$ y = [29415120, 31785723, 34782889, 38336236, 42418982, 47259954, 53070529, 59868050, 67641240, 76492829, 86617503, 98286267, 111743651, 126889627, 143128400, 159730121, 176247781, 192358440, 207388143, 220288196, 230224860, 237308544, 243020114, 250024895, 261234368, 278673447, 303123071, 334505290, 371880040, 412824222, 453523595, 490036613, 518938909, 536176634, 536273100, 514603441, 471417628, 413246858, 349896435, 289903992, 238099427, 195871203, 162525909, 136486390, 116044050, 99703319, 86308897, 75162433, 65966812, 58423741, 51963748, 46120779, 41001326, 36948417, 33786606, 30854044, 27815624, 24997579, 22815209]
38862B2815209j549913j169925j000413j014623j158493j206343j059019r47096
38854A3709384r82460q50809l71822K5177r5155m61828n62782m67008n38212o55755
38844H748730m55710j10109r5457l36186l43578r6535M522j2533K53384O40219
38834H196747M50425l67214r08690n61299J45818L82214J27840o3150N915J6095
38824G424701k69973o62762p93534n36462j79760j42949m39508n85821k53323
38815C560609K23789L34294J30763J6232K2742j06363k76139j59558J05815M7716
38805C899900k95699l71999l2161K62617K72830K89521M36418M08471J54281Q3325
38795E107504K82251K46896k28910n94377m14160o0248n0608k71305l46675k61690
$$ y = [22815209, 21265296, 20095371, 19094958, 18080335, 16921842, 15715499, 14656480, 13709384, 12726924, 11876115, 11504293, 11529470, 11434315, 10972487, 10409705, 9942697, 9404485, 8748730, 8293020, 8182911, 8087454, 7751268, 7407690, 7311155, 7315677, 7303144, 7556528, 8196747, 8647172, 8279958, 7371268, 6809969, 6955787, 7338001, 7465841, 7402691, 7408606, 7424701, 7154728, 6491966, 5698432, 5161970, 4982210, 4839261, 4399753, 3813932, 3560609, 3784398, 4118692, 4249455, 4265687, 4288429, 4182066, 3905927, 3746369, 3852184, 3899900, 3604201, 3232202, 3200041, 3462658, 3735488, 4025009, 4461427, 4869898, 5024179, 5107504, 5389755, 5636651, 5407741, 4813364, 4399204, 4338956, 4288348, 4017043, 3670368, 3408678]
38785C408678j47556M3334K00764o4155p24804j075084o84088p5675J00794K2687
38775A004895J75463M05286K41546k10048m28606k68824K4818L02930M48262K01244
38765A896966l52258n40422j7213N37612L81827j04515r3930K74477K29641j91582
38755B020603k40902J15420J15961l58766n09087o1749J97373j91226n33822j81624
38745C72181L83954M13599O2347j06842j51184m02662n70234j28984O26014Q07685
38735A305874K05313m23753m35059m9738J63978O3347r5165j35060j14821j32186
38725C52730j82230j86769p1489J61885L82942L83063P1586l34680m11823K6028
38715A91243O02053P20719L03988p9376K2886L49679L69697M3733k49949l50476
$$ y = [3408678, 3261122, 3304456, 3505220, 3441065, 2716261, 1641177, 957089, 881414, 982208, 1004895, 1180358, 1585644, 1827190, 1617142, 1188536, 919712, 944530, 1247460, 1695722, 1896966, 1544708, 1004286, 987073, 1524685, 1906512, 1801997, 1708067, 1982544, 2212185, 2020603, 1779701, 1895121, 2011082, 1652316, 1143229, 1081480, 1278853, 1087627, 553805, 372181, 756135, 1169734, 1232081, 1125239, 974055, 571393, 1159, -127825, 498189, 1305874, 1511187, 1087434, 652375, 602637, 766615, 829962, 734797, 599737, 484916, 352730, 170500, -16269, -87758, 74127, 457069, 840132, 911718, 577038, 165215, 191243, 793296, 1514015, 1818003, 1738627, 1761513, 2111192, 2480889, 2524622, 2274673, 1924197]
38705A924197m12800m77085m04605k05542j1278K14822M98006M98480r1810q38934
38695F93451r09141k13192M34813M63602J93589R3778O3615j40211l30318k32119
38685A17867N909Q2688j050j02464k07667k54678q4223J68304J28010q1286K06646
38674b1944J054690J444542O50168n25532p79357j24188L25644J07600j52955
38665A978668l1601P4739j32477k59576L7931M51619N82217N02220L69042N8719
38655C631501l88904n19167j69085O0864l64837r96788r78604l17209J35585n8452
38645C4904l62313j40745M41745P26838M34854j15253m89861n28278k97156N8872
38635b36393L44329L72889J37213j41313k28612j14928L0911R0475P2162R57j09887
$$ y = [1924197, 1511397, 1034312, 629707, 424165, 412887, 627709, 1125715, 1624195, 1532385, 693451, -215690, -428882, 5931, 469533, 663122, 756900, 820515, 680304, 349986, 117867, 123776, 206464, 205414, 102950, -104717, -359395, -443618, -275314, -147304, -228590, -21944, 1032746, 2477288, 3127456, 2601924, 1822567, 1698379, 2024023, 2131623, 1978668, 1947067, 2021806, 1889329, 1629753, 1667684, 2119303, 2701520, 3203740, 3572782, 3631501, 3242597, 2723430, 2554345, 2615209, 2250372, 1253584, 274980, -42229, 93356, 34904, -327409, -468154, -26409, 700429, 1135283, 1020030, 530169, 1891, -295265, -236393, 107936, 480825, 618038, 476725, 248113, 133185, 164096, 254571, 326733, 327690, 217803]
38624B17803j68571o6908J05716J00462j19589k30899L6320M69862N95835K70196
38614A210227j71530l48472k23379k9740L1151m1224j04170o7150l0487j46694
38604G8532l20358k27773K32497O89456P14336L55074J9378o6695j2170M7769
38594A510046R9257Q5678j10586m52618p22535p54163n38686j44906K61782M09492
38584c57239K20997N7201K96353O96715O27151R443m65397k86555J75677K75026
38574A249372O176j62956j19665j94449m62921n11047p3572M83073N87006J66853
38564I67870l08326l92859p1280L45829N45468M14697O9683k40226l27109k18316
38554G85431o8558R0279L78286P58766Q69407M02296m05455r36963q81741n02746
$$ y = [217803, 49232, -17676, 88040, 188502, 68913, -161986, -125666, 344196, 940031, 1210227, 1038697, 690225, 466846, 437106, 468257, 427033, 322863, 255713, 225226, 78532, -241826, -469599, -237102, 452354, 1166690, 1521764, 1541142, 1474447, 1462277, 1510046, 1609303, 1694981, 1584395, 1131777, 409242, -344921, -883607, -1028513, -766731, -357239, -136242, -79041, 217312, 914027, 1541178, 1550621, 1085224, 798669, 974346, 1249372, 1255548, 1092592, 972927, 778478, 315557, -195490, -269062, 214011, 801017, 967870, 659544, 266685, 195405, 541234, 1086702, 1501399, 1571082, 1330856, 1003747, 785431, 716873, 807152, 1185438, 1944204, 2813611, 3215907, 2810452, 1873489, 991748, 489002]
38544D89002j87528n0143o3359j97858k38464J18709O81785P21381k1861p00433
38534E51231l81019N76847R39903L05357m35778m37172Q8358M46472L63844j2207
38524B005836m21008m80014M8616O77792N31543l67219q76058l29362M06993K37811
38514A434930m83701n77861J12165O11788L89039n4591k23156k57559l09410j50723
38504D90921K67071N55284M89591K85842P2803k83477o34944n28413L527L30475
38494A048680K13053J53943L73040K72447m65695j044961o57546J95541M39281
38485E27783L3362j88112j7749r4672o15463r01782n27142K4134K24538K85105
38475a249998N76556Q54527O38136J3626m54267m36613r6248K31553L34070K20815
$$ y = [489002, 301474, 251331, 187972, -9886, -248350, -129641, 552144, 1273525, 1251664, 551231, 170212, 747059, 1686962, 1992319, 1556541, 1119369, 1207727, 1654199, 2018043, 2005836, 1584828, 1104814, 1153430, 1831222, 2362765, 1995546, 1119488, 790126, 1197119, 1434930, 951229, 373368, 485533, 1097321, 1486360, 1431769, 1208613, 951054, 641644, 490921, 757992, 1313276, 1802867, 2088709, 2161512, 1878035, 1243091, 714678, 718205, 1048680, 1261733, 1415676, 1788716, 2061163, 1595468, 550507, -107039, 88502, 527783, 561145, 373033, 355284, 260612, -354851, -1256633, -1783775, -1759641, -1535103, -1249998, -673442, 181085, 819221, 832847, 378580, -58033, -154281, 77272, 411342, 632157]
38465F32157J34978L31483O97555P76884L18923l86855q54141q62441m70386J35740
38455D53897O16382N97537R4547l82896m03186j23843j2297k35237n50263o40027
38445e85386l50742K18693O71207N82202M2540l16317r9587L22682L78559Q0533
38435I44384j72503k97944m81081n86449k43302M58459R14055P67758K94972p3528
38425A524821j95478j03082J26373K69608J21803j44168j82093p5019k23091n50787
38415E68887m69360J25051M93750J35115l90162l15337J40662J71664l23166o31447
38405d94343l44638J29961K79416J43789P7735K41706M96224N63874K56108k52912
38395A096920m61510j21254L55767M19249J44151J7927J14430O7630j66355j83817
$$ y = [632157, 767135, 1098618, 1796173, 2573057, 2891980, 2505125, 1650984, 788543, 318157, 453897, 1070279, 1667816, 1762363, 1379467, 976281, 852438, 840141, 604904, 54641, -585386, -936128, -717435, -46228, 535974, 578514, 262197, 162610, 485292, 863851, 944384, 771881, 473937, -7144, -593593, -836895, -378436, 535619, 1303377, 1598349, 1524821, 1329343, 1226261, 1352634, 1622242, 1744045, 1599877, 1417784, 1342765, 1119674, 568887, 99527, 224578, 718328, 853443, 463281, 147944, 288606, 460270, 137104, -494343, -838981, -709020, -429604, -285815, -208080, 33626, 529850, 1093724, 1349832, 1096920, 635410, 514156, 869923, 1289172, 1433323, 1451250, 1565680, 1633310, 1466955, 1283138]
38385A283138J07174K51911L3329j01973K23098O51952O15094J52035k41797l27891
38375B646070k58099j88445j50248j71134k03318p5130K04651K93029j1556l48119
38365A737701k46215J54966K88777p894l13042l04253j78330k31483l79061l37310
38355A83856p3610J67863K17503J83798K84447N34423O54057L59412k38304o49602
38345A623843n29491q4870J77977L9256k51812l32574j08074K22657M00766L35269
38335A492947J38792m5771j97495l16056k70630K1078L05413K09535k00541m37271
38325G00001k86744q4173r6731r2864J29138K43237n8754l88602j66763M09718
38315C07463N88995J83369k12983j79499M626l6371k11454k60523j73731n1387
$$ y = [1283138, 1390312, 1642223, 1675552, 1573579, 1796677, 2448629, 3063723, 3215758, 2973961, 2646070, 2387971, 2199526, 2049278, 1878144, 1674826, 1599696, 1804347, 2097376, 2085820, 1737701, 1491486, 1646452, 1935229, 1927335, 1614293, 1310040, 1131710, 900227, 521166, 183856, 110246, 278109, 495612, 679410, 963857, 1498280, 2152337, 2511749, 2273445, 1623843, 1094352, 1009482, 1187459, 1226715, 974903, 642329, 534255, 756912, 1157678, 1492947, 1631739, 1585968, 1388473, 1072417, 801787, 822865, 1128278, 1337813, 1137272, 700001, 413257, 329084, 232353, 139489, 268627, 511864, 453110, 64508, -102255, 307463, 896458, 1079827, 866844, 687345, 691971, 655600, 444146, 183623, 9892, -41495]
38305d1495J14390L01149L78252L13209J99449L1895k28586l79555j92405R4569
38295E90872J9604l17274l23926R8408L37411J07783l2777L37047O96817L85958
38285A899923l37789p36946o64089m80562k67682J08990M02093K51654p9133j3280
38275H3179L53987L54649j42217m99337l32184k7534M105o4981M4836J82878Q6649
38264D4030j55157k82883k06778M8758M20609O57235M58535n2627l62584k34444
38254C34694M4096K15102L65408M83903K62750l07839o63744m35740n0835o9733
38244A78062l22713k72171Q3227K84983J87256M7857j9622j04544j06427J34466
38234I0374L68010J90359k31569l01576P4737L28125J53849k8463J67176M48067
$$ y = [-41495, 72895, 374044, 752296, 1065505, 1264954, 1296849, 1068263, 688708, 496303, 590872, 610476, 293202, -30724, 67684, 405095, 512878, 480101, 817148, 1513965, 1899923, 1562134, 825188, 161099, -319463, -587145, -478155, -76062, 175592, 96459, 83179, 437166, 791815, 649598, 150261, -181923, -209457, -205352, -270333, -225497, -42619, 44030, -111127, -394010, -600788, -552030, -131421, 525814, 984349, 931722, 569138, 334694, 378790, 593892, 959300, 1443203, 1705953, 1398114, 734370, 298630, 247795, 178062, -144651, -416822, -333595, -48612, 138644, 186501, 166879, 62335, -44092, 90374, 458384, 648743, 417174, 115598, 190335, 518460, 672309, 643846, 811022, 1259089]
38224A259089L69024N0650j07699j07612k34100m49556m13419o8368K23125J90767
38214G11901j3435r6778j3403M7205o1451k65317l38433j41182J94549L69005
38204C92661K31259p7412l08005l18982j06865J90519K83952j9175m39534l87521
38194e59103K74457Q99355Q05018J42467l72273m27248l29007l07760j85366J09871
38184E0411K25426q5930m87972m89648j03744K84008M94330O01293N48684J83719
38174A220577l34409n89531m59457k56446k16110j96079l0078J66413K61858L63839
38164f9423N33740N29742J78329k22413k68002n9447j5021j67493j46850J22915
38154D16077K38481j7371l12075l19122k03616k23907k42241n4151J19538k3970
$$ y = [1259089, 1628113, 1678763, 1571064, 1463452, 1229352, 779796, 366377, 298009, 521134, 711901, 698466, 601688, 588285, 635490, 574039, 308722, -29711, -170893, 23656, 392661, 623920, 546508, 238503, -80479, -187344, 3175, 287127, 267952, -171582, -559103, -284646, 614709, 1419727, 1562194, 1189921, 762673, 433666, 125906, -59460, 50411, 275837, 189907, -298065, -787713, -891457, -607449, -113119, 488174, 1036858, 1220577, 886168, 296637, -162820, -419266, -635376, -831455, -861533, -695120, -433262, -69423, 464317, 994059, 1172388, 949975, 681973, 622526, 607505, 440012, 293162, 416077, 654558, 637187, 325112, 5990, -197626, -421533, -663774, -717925, -598387, -622357]
38144f22357k63913j57411J85549K46599k104k4960L00985L44734k52621q19620
38134a065119n32059L38921P65697M02350l4574R7857N13245N76614K37013o7802
38124A232143j46971k02924l25628k99036j1108K85631L15251J56768O3925O2366
38114A130417j1002j43288j32804J3553j4087l45644o14205m09970J14526M39577
38104B7073L96587K85948K56776M4611m52658p65944m33778K56220N62781K35437
38094D13053k69946n07382n19305m80995k98595J41380N83255O10987J77794l18715
38084d68469m81136k71232N4371K22386J53283j265j9685J44488L21820L75614
38074C0175L83918M56115M77649K49936j38885l29634j69090L5205q6066m38493
$$ y = [-622357, -886270, -1043681, -858132, -611533, -613637, -638597, -337612, 7122, -245499, -1065119, -1597178, -1258257, -492560, -90210, -124784, -26927, 486318, 1062932, 1299945, 1232143, 1085172, 882248, 556620, 257584, 246476, 532107, 847358, 1004126, 1068051, 1130417, 1119415, 976127, 843323, 856876, 842789, 497145, -117060, -527030, -412504, 27073, 423660, 709608, 966384, 1010995, 558337, -207607, -641385, -385165, 177616, 413053, 143107, -364275, -883580, -1364575, -1663170, -1521790, -938535, -327548, -149754, -468469, -949605, -1220837, -1166466, -944080, -790797, -792062, -811747, -667259, -345439, 30175, 414093, 870208, 1347857, 1597793, 1458908, 1129274, 960184, 995389, 909323, 470830]
38064D70830n64314k43776K24312M03020J94972j70438m66082o00898n19820k04104
38054a476298K07938M86814N60385N55165N36295L66176p1821o28086r81856r14570
38044a359858m40636K03496O34950N75197J66428j30287j08177p5520l13651n26131
38034a374189k39229L86283O65735L59821J2671J15412M02640L36580o5699l41239
38024B58786l11415k27698k51455k37822r4341K9111L9717P9064K31372L13070
38014a71611J64473m6976n7386R0873J34965J2541p2803j0587O1484M1648M9028
38003A95649J62584J91311n2201l90451m77789k83894p2987O2913K73865N04827
37993A13827M18067l1684l57138j98608J38066K12591J69191L61788N27985Q4860
$$ y = [470830, -93484, -337260, -112948, 290072, 485044, 314606, -151476, -752374, -1272194, -1476298, -1268360, -781546, -221161, 334004, 870299, 1236475, 1164654, 536568, -445288, -1359858, -1800494, -1596998, -962048, -386851, -220423, -350710, -458887, -534407, -848058, -1374189, -1613418, -1227135, -561400, -201579, -188908, -73496, 329144, 665724, 600025, 258786, -52629, -280327, -531782, -769604, -863945, -834834, -795117, -716053, -484681, -171611, -7138, -54114, -111500, -20627, 114338, 126879, 54076, 43489, 104973, 146621, 195649, 358233, 549544, 497343, 106892, -370897, -654791, -727778, -664865, -391000, 113827, 531894, 500210, 143072, -55536, 82530, 295121, 464312, 826100, 1354085, 1438945]
37983A438945p83222j123531n16303L15666N42603K56723J3886r4062k88713m14566
37973f52574j20035M04892N31386Q1579m01820l98188k7351K24016J07688k10428
37963d60835m09799l29561p6416J56787L43627N49864O34809L52849j47491l38752
37953B75082p1500J18306j75518n48086m21337L8492K64208K06561J84129J03297
37943b6366l00983o09619j10643Q99531J238707N30076k10469j06808L79207L76829
37933B059462p5853l78522m02298l99322l47776j30109J2835j04424j19125K61251
37923C76119N48662J86482l83166l01464K77756L77099k09453n86054k37755J75530
37913B23756l1916m78483l98179J93369O81043P92509P18009N41050J62682k89127
$$ y = [1438945, 655723, -467808, -984111, -668445, -125842, 130881, 144767, 50705, -238008, -652574, -772609, -367717, 163669, 245248, -156572, -554760, -582111, -358095, -250407, -460835, -870634, -1200195, -1276611, -1119824, -776197, -226333, 408476, 761325, 613834, 275082, 203582, 321888, 146370, -401716, -823053, -784561, -520353, -313792, -129663, -26366, -327349, -936968, -1047611, -148080, 1090627, 1620703, 1410234, 1303426, 1682633, 2059462, 1983609, 1605087, 1202789, 803467, 455691, 325582, 338417, 233993, 114868, 376119, 924781, 1111263, 728097, 426633, 704389, 1081488, 872035, 285981, 48226, 223756, 191840, -286643, -684822, -491453, 189590, 982099, 1700108, 2241158, 2403840, 2114713]
37903B114713m91288m01629l20360m04727m22515j16382L76030O27962M09320
37894A371124m8969l45067m06520n19823p91832q46335l51051L30349M64106n7308
37884a201326m94824k06580N63850J083643J004165N43667M4312k88861l24313
37875G23733m9762K78150K88338r6982n42124o65811m49828k00222j32856j12859
37865i60223R9875M17731M62951J17250k16487j31752J98704K89355P0868o2988
37855B85284O3917J36098q6250l13940j30399L77776O77861M04997k49529p31593
37845D34222o56963k13869J2910k44358n28000k52575L96997O19024Q9014n87468
37835i31066o93014k27869L11864N60937M00222j38662p05666p19087m7749O53743
$$ y = [2114713, 1623425, 1221796, 901436, 496709, 74194, -42188, 333842, 961804, 1371124, 1322155, 977088, 570568, 50745, -741087, -1587422, -1938473, -1608124, -1144018, -1201326, -1696150, -1902730, -1338880, -255237, 748928, 1292595, 1336907, 1048046, 723733, 673971, 952121, 1240459, 1143477, 601353, -64458, -514286, -714508, -847364, -960223, -860348, -442617, 20334, 137584, -78903, -210655, -11951, 277404, 348272, 285284, 349201, 485299, 399049, 85109, -45290, 332486, 1010347, 1415344, 1165815, 434222, -222741, -436610, -423700, -668058, -1196058, -1448633, -1051636, -432612, -343598, -931066, -1624080, -1851949, -1540085, -979148, -578926, -717588, -1423254, -2142341, -2190090, -1536347]
37825a536347O93600J86367k41012l14006k20381r8316N0419R1273n4502n7431
37815a500336M13405R79183Q69325L5830o43731m85382J73830N25249K57940k99518
37805C25795o74574n98230r9902M79185P17551N24910J84758o4162k39578l50801
37795B04952k71587m5633J5678k20555m49449l69882j14822M4500J53485L68106
37785f85207N11264K86506j46307k63536R8666M93749M65007Q6196k70075m44077
37775A32186n21078n09149k87174J09379L88262L23824P3858J2379K51218M75542
37765D49247L31134j29563n13190n50068l53951k09824k27504k62612j14777K42040
37755a339068O01336O94306M47752N3130k39687l31495k48851m2345J89160L06489
$$ y = [-1536347, -842747, -656380, -897392, -1211398, -1431779, -1530095, -1479676, -1388403, -1442905, -1500336, -1086931, -107748, 761577, 797407, 153676, -331706, -157876, 367373, 625313, 325795, -348779, -947009, -1046911, -567726, 149825, 674735, 859493, 795331, 555753, 204952, -66635, -112268, -96590, -317145, -766594, -1136476, -1251298, -1206798, -1053313, -685207, -173943, 112563, -33744, -297280, -198614, 295135, 760142, 846338, 576263, 132186, -388892, -898041, -1185215, -1075836, -687574, -363750, -289892, -277513, -26295, 449247, 780381, 650818, 137628, -412440, -766391, -976215, -1203719, -1466331, -1581108, -1339068, -737732, -43426, 404326, 457456, 217769, -113726, -362577, -404922, -215762, 90727]
37745I0727L04320L40573M32025L20966q8242l76435j16796L92252M32035r3529
37735A637896n07011l97429j94552l74104o61879n43854j35666P3454O5492K20098
37725h17555N22406N14846Q3445l02667k86874o9779J5734o1663k13712m33017
37715a048836n79042l55830K01083N53329L19768j57219k68069N5393L82887M81998
37705d14538N16344N67453M11183p1836n75463o83271l63790J3489R4736j18367
37695f24060l07043j74159K26111N20006M37964J44142J5350J49964K94516K50582
37685I33373J07345p355j47728l43149l96234j68669O9650o7421m51449m84906
37675i56543P2629O63430O18802P0196k25809P8827M94177M30300q829k68228
$$ y = [90727, 395047, 735620, 1167645, 1488611, 1400369, 1023934, 907138, 1299390, 1731425, 1637896, 1130885, 733456, 538904, 164800, -497079, -1040933, -1176599, -1103145, -1037653, -817555, -295149, 219697, 303142, 475, -286399, -356178, -340444, -402107, -615819, -1048836, -1627878, -1983708, -1782625, -1229296, -909528, -1066747, -1334816, -1279423, -896536, -414538, 101806, 669259, 1080442, 1008606, 433143, -250128, -613918, -600429, -505693, -624060, -931103, -1105262, -879151, -359145, 78819, 222961, 238311, 388275, 682791, 933373, 1040718, 1033363, 885635, 542486, 146252, -22417, 47233, -20188, -471637, -956543, -883914, -220484, 398318, 468514, 242705, 321532, 815709, 1246009, 1237180, 968952]
37665I68952j45384L9133K2427l5122J12401L67854M05930R1266l74904o53909
37655G98644n23036l8997M40708N15742J65707j78817j32780J83211L57140K37209
37645A824731R748j89110l90841n02866k89702J86740M49676K03269k05218k35535
37635H60892J13393L67430K59250k1604k16213k56978j16507K26868N67370N58421
37625B342322J85818j32176r4415R9130J05522q5571k77013m23249n67080n98643
37615E54645l97567j06965K4084j3412n5530o2285o5517M6541L46158N70882M11486
37604A252520M3779o5747J10614J11046k46072n52875m82063k78139k57736k49178
37594f13851M3652M38121N05996K10971j30013l66183n41326n25135j30597M00327
$$ y = [968952, 823568, 862701, 885128, 850006, 962407, 1330261, 1736191, 1827457, 1452553, 798644, 275608, 236611, 677319, 1193061, 1358768, 1179951, 1047171, 1230382, 1587522, 1824731, 1834479, 1645369, 1254528, 751662, 461960, 648700, 1098376, 1301645, 1096427, 860892, 974285, 1341715, 1600965, 1579361, 1363148, 1106170, 989663, 1216531, 1783901, 2342322, 2528140, 2395964, 2301549, 2400679, 2506201, 2420630, 2143617, 1720368, 1153288, 554645, 157078, 50113, 74197, 60785, 5255, -57030, -122547, -76006, 270152, 841034, 1252520, 1296299, 1230552, 1341166, 1452212, 1206140, 653265, 171202, -106937, -364673, -613851, -570199, -132078, 373918, 584889, 454876, 88693, -452633, -977768, -1108365, -708038]
37584g08038N28775J52342k13534j44683J67378K85555R6345k04620m14246l84884
37574h39610m8976L64759L84978j22264o21605n14583M6938L51277R5107k71807
37564a175786k71664n1815m1699k52357l06525o6231J62302J24754lQ6472L16879
37553a475673L62411J46882l6427K4441J50527O7701j77238l10217k24750m3733
37543a516076J52008L80694N29318L63962j00830m82983m65649j68751R7940K65410
37533i44957M29825M93482K34711k63502n74987m17392M2621M38861N42933L02414
37523B84009j74052n37075l88246K21262P04964O07605J68880n7536L7620J03994
37513I71425m6495k35705l38914m76197o68797o78209l68423O7372M10350O57461
$$ y = [-708038, -179263, -26921, -240455, -385138, -217760, 67795, 164140, -40480, -454726, -839610, -888586, -523827, -138849, -261113, -882718, -1397301, -1350363, -999086, -903979, -1175786, -1447450, -1499265, -1540964, -1793321, -2099846, -2166077, -2003775, -1879021, -1879024, -1792552, -1475673, -1113262, -966380, -1002807, -978366, -827839, -760138, -937376, -1247593, -1472343, -1516076, -1364068, -983374, -454056, -90094, -190924, -673907, -1139556, -1308307, -1210367, -944957, -515132, -21650, 213061, -50441, -625428, -1042820, -1000199, -561338, -18405, 284009, 109957, -427118, -815364, -594102, 110862, 718467, 887347, 829811, 867431, 971425, 924930, 689225, 350311, -125886, -794683, -1472892, -1841315, -1773943, -1363593, -706132]
37503g06132P85295O00863J00134l00825k26236J52807L80704L19023J72698P8844
37493A357175K4628N4718J89647K23644j5498k75552j68805J78526K31955j46026
37483A654412m75421l82504q3668P0122R8528J38685O2974k57656n60086m70446
37473b05060o1559K17056J17261j65808k94557j24554K18396M35804K96226r4751
37463C38454l68284l44194k34275k46254k18593Q4494M94309N89688K62693j63533
37453A94505l66478l24137j84733o2259L194L1222O1530N5645p0917k23938j16350
37442a002716L21826O79842M87561j74029p33127p56490l17711J93716M30291
37433h70837L29554J79348L28357O73441O55795J5534p21511q87877n55031k79025
$$ y = [-706132, 79163, 680026, 780160, 479335, 253099, 405906, 786610, 1105633, 1278331, 1357175, 1381803, 1436521, 1626168, 1849812, 1834314, 1558762, 1389957, 1568483, 1800438, 1654412, 1178991, 796487, 712819, 782941, 881469, 1020154, 1083128, 825472, 265386, -205060, -266619, -49563, 67698, -98110, -392667, -517221, -298825, 136979, 433205, 338454, -29830, -374024, -608299, -854553, -1073146, -988652, -494343, 95345, 358038, 194505, -171973, -496110, -680843, -743102, -739908, -708686, -647156, -591511, -662428, -886366, -1002716, -680890, -1048, 486513, 312484, -420643, -1177133, -1494844, -1301128, -870837, -541283, -361935, -33578, 639863, 1295658, 1311192, 589681, -298196, -853227, -1132252]
37423a132252j68841J55084P11166R52251N76587l3896m11193n29469n01894k71979
37413f54436O3388R3581l30631p22451n69973k6431L98246N46434N89983N55043
37403e7247L52219J28163J18839K23118J33811j58198l74937m16283m20156l83781
37393h54452j45408K09358L33311J40392n626J92521N27406N64025J79127l37939
37383H02715o03856m63672j12598N3870j49404m25165l33713Q6126L35119J85506
37373f25072K5267K13189M39511J87118l63039m72744N9417N28276L23044j97618
37363A17349k98643J6982J16966j71882l01150L5810L55009J73023j94401j61688
37353c12625J68014J97417j94420n06220m12812j30785P9777K44406L68293K91369
$$ y = [-1132252, -1301093, -1146009, -434843, 517408, 1093995, 1060099, 648906, 119437, -382457, -654436, -591048, -497467, -828098, -1550549, -2120522, -2146953, -1748707, -1202273, -612290, -57247, 294972, 423135, 541974, 765092, 898903, 740705, 365768, -50515, -470671, -854452, -999860, -790502, -457191, -316799, -322425, -129904, 397502, 961527, 1140654, 802715, 198859, -264813, -377411, -323541, -472945, -898110, -1231823, -1145697, -810578, -625072, -599805, -386616, 52895, 240013, -123026, -595770, -536353, -8077, 314967, 117349, -181294, -164312, -47346, -219228, -520378, -484568, -129559, 43464, -150937, -312625, -144611, 52806, -141614, -647834, -1060646, -1191431, -1111654, -867248, -498955, -207586]
37343b07586M8994m3003J25856K68578J90560Q1340R8996O9965j19785k21958
37333B91957m1751J86993J86322P7878R0940J38380O0680j3098M1443k290l01750
37322G15704m67769p6560N33815N97785m412n86129n94943k02180J11429J01538
37312A28278j87978n10943m85785M5410O70184P79282L15785k08594m24203m01698
37302b80262k55312L0057K84183J84401k12777m22926k09366J10902K20194K22972
37292c27934K92041L15240J64872m1427j87045l08290l13061N322M34676L50414
37282C84808l66111r22963o37863O8915L02833j8664j98707R3019M17556L33477
37272e43700l6637l34871m00700k37954Q3069L65946M11712K68386J27362J3517
$$ y = [-207586, -158592, -201595, -75739, 192839, 383399, 464739, 563735, 633700, 513915, 291957, 250206, 437199, 623521, 701399, 792339, 930719, 991399, 978301, 1019744, 1017454, 715704, 247935, 171375, 705190, 1302975, 1298563, 712434, 117491, -84689, 26740, 128278, -59700, -570643, -1056428, -1011018, -340834, 438448, 754233, 545639, 121436, -280262, -535574, -505517, -221334, -36933, -249710, -672636, -882002, -771100, -550906, -327934, -35893, 279347, 444219, 402792, 215747, -92543, -405604, -400282, 34394, 384808, 18697, -904266, -1542129, -1473214, -1170381, -1189045, -1387752, -1294733, -877177, -543700, -580337, -915208, -1315908, -1553862, -1470793, -1104847, -693135, -424749, -297387, -283870]
37262b83870j36258j85148J8135K32718Q0494k87226l07755J10143L84753J58546
37252b15468j69724j63477o5340k75748n34715k95859K90025M86145Q9013k29914
37242a085062P9992O58438P95813L97548l4508j56338q4734k8625j4231k0549
37232E07744q7014j96718k61371k75658k85170j81599J90085O33850O48389J05799
37222G98337m01247k49884L45119N77427J29334m32763m57617j2869L57657L97955
37212A051449L20231L29930L07369M6764l71463n95144l89518N1745K75658R9548
37202A126569j34398J0483M49989O40546K84794k90817n86977n19868l63706k94878
37192C21737k47219j30010M6233K33517L53914K79335j0633k70085j89834J93920
$$ y = [-283870, -420128, -605276, -587141, -354423, -273929, -561155, -868910, -758767, -374014, -215468, -385192, -548669, -614009, -889757, -1424472, -1720331, -1430306, -944161, -855148, -1085062, -1005070, -346632, 449181, 846729, 812221, 655883, 571149, 542524, 528293, 507744, 420730, 224012, -37359, -313017, -598187, -779786, -589701, 44149, 692538, 798337, 397090, 147206, 492325, 1069752, 1199086, 766323, 308706, 295837, 653494, 1051449, 1371680, 1701610, 2008979, 2055743, 1684280, 1089136, 699618, 751363, 1027021, 1126569, 992171, 1002654, 1452643, 2093189, 2377983, 2087166, 1500189, 980321, 616615, 321737, 74518, -55492, -9259, 224258, 578172, 857507, 846874, 576789, 386955, 580875]
37182E80875M58509K56924k67812o21598m85169l5012K77369K22542p043j07873
37172B71712m6254o90l2973m5018k6355o2944o7597J63740M92771M02786k83133
37161G66045r41384q25244n9858M85568L07683j82626l36274j04700N9095q8358
37151i20053k86245j72470K31359N40413M59382J13484j40169j72277j80427k88442
37141h15445k79742O3411N15118O06859K54549j03509p0977K33055L88180J99139
37131I90638j32309k75392r5497K51246M73693M01096J04432k25703m55446n12382
37121E24376l25688P5010M42842M96352K65242R0260J94943L88629L11427j09792
37111B353601n83668q03514p34357n12700k03023J80361M59764L68248k7927k22850
$$ y = [580875, 1039384, 1296308, 1028496, 406898, -78271, -113283, 164086, 386628, 379585, 271712, 225458, 224768, 191795, 146777, 120422, 57478, -10119, 153621, 646392, 1049178, 766045, -175339, -1000583, -1060441, -574873, -267190, -449816, -786090, -890790, -831695, -920053, -1206298, -1378768, -1147409, -606996, -147614, -34130, -174299, -346576, -527003, -815445, -1095187, -1031776, -516658, 90201, 344750, 241241, 170264, 403319, 791499, 990638, 858329, 582937, 487440, 738686, 1212379, 1613475, 1717907, 1492204, 1036758, 524376, 198688, 273698, 716540, 1212892, 1478134, 1568394, 1763337, 2151966, 2463393, 2353601, 1769933, 966419, 232062, -280638, -483661, -303300, 156464, 524712, 496785, 273935]
37101B73935J20593O11526N86780P4863k14983J5189J67021k73295q07559o09508
37091e5438J82895O04574K23047l68022n29467l62540k19128k3715M29306Q71526
37081G53038P89795J43440n44030p79645n21951o7070K37022J98297p3266k25641
37071i0011k9276L36670M94369L17307K5071j30020j09815l0850m930o3909j37040
37060E77566q4549J52755M17709M46028J62222k00028l42424k34128j15282j62591
37050F17278k59813j91397J5377J06458m3048k64911l36987k12002N4291L86115
37040a28639N84497L98056r2757m02013k27494J06791J35328m6404k2356J67149
37030D72158Q2001k90455m10503p2795J85076r7181n72411o16106k10086J85018
$$ y = [273935, 394528, 1006054, 1592834, 1667697, 1452714, 1467903, 1634924, 1361629, 554070, -55438, 127457, 732031, 955078, 587056, 57589, -304951, -524079, -547794, -118488, 753038, 1542833, 1686273, 1142243, 362598, -159353, -226423, 10599, 208896, 135630, -90011, -119287, 217383, 711752, 1029059, 1054130, 924110, 814295, 783445, 778515, 714606, 577566, 493017, 645772, 1063481, 1509509, 1671731, 1471703, 1129279, 895151, 779869, 617278, 357465, 166068, 181445, 287903, 244855, -20056, -357043, -569045, -514754, -128639, 455858, 853914, 761157, 359144, 131650, 238441, 373769, 327365, 305009, 472158, 554159, 263704, -146799, -219594, -34518, -131699, -704110, -1320216, -1530302, -1345284]
37020a345284L63015M58450M64998K11523j87898l38044j20536J15627N3283j91638
37010e16504l16354k48788j40874q6204k0665J30672L12588L67504K06968l8545
37000c50202j11819N3024J86537J2463l13586l09873K01701P60968P69603K48843
36990A147659j64784m5726K67238J76856l06660n92184l69900J0410J75383K79091
36980E77383N73337Q10101N72200k0369m59090n78519o15102o22612m17366j12731
36970b92768q8537l12649k95536R3689L61411J95141m7002J7848K11246K36212
36960G9055J83924J71174j2357l98964m86682J7505N34060L61173k54538n06526
36950c12176k25481N8409Q2978J06425K20603J52139j46473l20666j64042J40852
$$ y = [-1345284, -982269, -523819, -58821, 152702, -35196, -373240, -493776, -378149, -324866, -516504, -832858, -1081646, -1222520, -1308724, -1329389, -1198717, -886129, -518625, -311657, -350202, -462021, -408997, -222460, -209997, -523583, -833456, -631755, 129213, 898816, 1147659, 982875, 937149, 1204387, 1381243, 1074583, 482399, 112499, 122909, 298292, 577383, 1150720, 1960821, 2533021, 2512652, 2053562, 1475043, 859941, 237329, -180037, -292768, -381305, -693954, -989490, -895801, -534390, -339249, -386251, -368403, -157157, 79055, 262979, 434153, 421796, 22832, -463850, -446345, 87715, 448888, 194350, -312176, -537657, -479248, -396270, -289845, -69242, 82897, -63576, -384242, -548284, -407432]
36940d07432L92787N24299L98598l3396l93503k52171J63138K33963p4896j89914
36930C61473N8980J71553p0497j72908J73592M82998K64350j78026k99263j72402
36920F19850j85836k80703j38198J36211J50932r2939k31841j64072j13579j12413
36910d12588N1382L21083L05742j03757m42930k44469L29602O59251L72350k79206
36900E56460p15128o02845j34720K21514J97642q3405l34893m00311k98135r8318
36890a692139J55023M28503O45018O64193M00881M866k19510j82128j22738k01958
36880a19989k20963k4429R2821j73477n01290l26387K32536M93316K84486J79486
36870h3890M74475O71628L49921j15539k03588o0079r3614k18202j20504P2495
$$ y = [-407432, -14645, 509654, 908252, 874856, 481353, 229182, 392320, 626283, 551387, 361473, 420453, 592006, 521509, 348601, 522193, 1005191, 1269541, 1091515, 792252, 619850, 434014, 153311, 15113, 151324, 302256, 209317, -22524, -186596, -300175, -412588, -361206, -40123, 265619, 161862, -281068, -525537, -195935, 463316, 835666, 556460, -158668, -761513, -896233, -674719, -477077, -560482, -895375, -1295686, -1593821, -1692139, -1537116, -1108613, -463595, 200598, 601479, 606345, 386835, 204707, 81969, -119989, -340952, -365381, -272560, -446037, -947327, -1273714, -1041178, -547862, -263376, -83890, 390585, 1062213, 1412134, 1296595, 1093007, 1032928, 939314, 721112, 600608, 673103]
36860F73103M1177o6414J22395M54916L91599j43481o26686o79659m58417k50898
36850e42365j27833p2255q4161p0753P9443K73903L08518J59361m6668k62946
36840c85756m64174m83281k19742J03890K16420K02942K96123M20477L52685J98193
36830B37777K37389L76508K52342j23208l16245j25188J65687K68695K20615J37224
36820A331596J3374j32399k21614k68667k96620j69541J42848K66222j24562o40763
36810a00126n57511J31043O47872N10808N1349k77495m42407m44661q3397N11074
36800e3451P12237K34770l53760m21249j17951M6463L3211J18345K53151J83822
36790F35588m632j5706J32221J86501J25606R3553K1790k14674l90306j67194
$$ y = [673103, 714280, 647866, 770261, 1225177, 1616776, 1473295, 846609, 166950, -291467, -542365, -670198, -742453, -826614, -897367, -817924, -544021, -235503, -76142, -122810, -385756, -849930, -1333211, -1552953, -1449063, -1232643, -1029701, -733578, -313101, 39584, 237777, 475166, 851674, 1104016, 980808, 664563, 539375, 705062, 973757, 1194372, 1331596, 1344970, 1212571, 990957, 722290, 425670, 256129, 398977, 665199, 540637, -100126, -657637, -526594, 121278, 632086, 683435, 405940, -36467, -481128, -564525, -53451, 658786, 893556, 539796, 118547, 596, 47059, 80270, 198615, 451766, 635588, 630956, 615250, 747471, 933972, 1059578, 1153131, 1174921, 960247, 569941, 402747]
36780D02747L19092N64021L62211k4406l24485m90412n09989l78116k49128k68215
36770e96680k85508p8283K22858L17792K54460L07633M06074K12879k02014l37925
36760B21286m1657K36680J76918N8122J97196L84479K59530j13492m33342o13987
36750C31733o54233l58055L24105Q73930O77186j08706o47621m54426Q6964L50721
36740D21598K18933o273j17799j24963l2402J89349M31634M70246K16407j60448
36730A506282l94069l54696j24449J13191K50824L17225L31690J64507k92699
36721A517806q07330r04208m47222Q6389J74814n9515p8901K31538M06257J62729
36711B82357j46957j11722R8139N1134k46220m03211k59123k7582J09019J66048
$$ y = [402747, 721839, 1285860, 1648071, 1623665, 1299180, 808768, 298779, -79337, -328465, -596680, -882188, -960471, -737613, -419821, -165361, 142272, 548346, 761225, 559211, 221286, 179629, 416309, 593227, 651349, 848545, 1233024, 1492554, 1379062, 945720, 331733, -322500, -680555, -356450, 517480, 1194666, 1085960, 438339, -16087, 70877, 421598, 640531, 634258, 516459, 391496, 359094, 548443, 980077, 1450323, 1666730, 1506282, 1112213, 757517, 633068, 746259, 997083, 1314308, 1645998, 1810505, 1517806, 710476, -193732, -640954, -554565, -379751, -439266, -518167, -286629, 119628, 282357, 135400, 23678, 121817, 172951, -73269, -476480, -735603, -763185, -654166, -488118]
36701d88118J48890L8627l7436L4356P9120r7649k59449o3337K21695j3445o25280
36690a062026o65755K14420J033684P59287k24094o67833j50812N64125P33266
36681E34262M29638P5819j59616k90654l17524l19431m06546m46759j67928L56079
36671g12660O58751M63605K0526k69193k77752p8266K30842M27326J78872n44534
36661I7517j210391j160796l26194O36650R51095M34884l69464p54214n22323
36652b223236o1236K07657K50096K37500K34856K79740N09240Q96699J065527
36643A396843P17207Q2736m02233o70351q52835p82997k60331L38249M07960O1480
36633C5728p309L21641L86738p7773m14584j52586J46878j81922p66881p85256
$$ y = [-488118, -339228, -300601, -338037, -303681, -224561, -322210, -581659, -644996, -423301, -436746, -1062026, -1727781, -1513361, -479677, 279610, 55516, -612317, -763129, -199004, 534262, 963900, 1039719, 880103, 589449, 271925, -47506, -454052, -900811, -1068739, -712660, -53909, 409696, 430222, 161029, -116723, -194989, 35853, 463179, 642051, 97517, -1112874, -2273670, -2599864, -1963214, -1012119, -577235, -946699, -1700913, -2223236, -2284472, -2076815, -1826719, -1589219, -1354363, -1074623, -565383, 331316, 1396843, 2114050, 2196786, 1794553, 1124202, 271367, -511630, -771961, -433712, -25752, 35728, 28419, 350060, 736798, 659025, 244441, 91855, 238733, 56811, -710070, -1495326]
36623a495326k65217N2925o5490j11577K08338N26643M68377J69322n3296j18077
36613f83378q9966K087J10869J58346J43814R5414l6315k29792k54870L2252L64747
36602c86792L57406M0018k18704k23023n2797K19999N22281N92748K47665k24314
36592H74487l81751k88029l51989n46206l75672K73543Q31653Q07358L78753M666
36582A226813j26925o3208P3053J3772m33696q96659o87095J74102P40637L78349
36572C99143k96236k93056L26421N95089M2683p23621q88197l53170L43799O72907
36562a74238N13043J26551j33222j49396p9415p3884j18888j92415l16319l60406
36552i58589j30797J89803J06499m10631o63998j54552O48371R74354P98232N98840
$$ y = [-1495326, -1760543, -1707618, -1773108, -1884685, -1676347, -1149704, -681327, -512005, -565301, -683378, -773344, -771257, -660388, -502042, -358228, -262814, -299129, -528921, -783791, -751539, -386792, -29386, 10632, -208072, -431095, -483892, -263893, 258388, 851136, 1098801, 874487, 492736, 204707, -147282, -693488, -1069160, -795617, 36036, 843394, 1222147, 1226813, 1099888, 1036680, 1109733, 1123505, 689809, -206850, -893945, -719843, 20794, 399143, 102907, -190149, 136272, 731361, 774044, 50423, -837774, -1190944, -847145, -174238, 338805, 465356, 332134, 182738, 103323, 29439, -89449, -281864, -598183, -958589, -1089386, -899583, -793084, -1203715, -1867713, -2022265, -1373894, -399540, 398692, 997532]
36542I97532M29708K2270l89903k55156K64092L25324l15525q47177n59993K03250
36532a25578O37877M64914m7274n46835p07481l34692K69590M80220K02433M6338
36522C39512L09020M14690r8666o59127m72921K14141N15544K53527J7792M7131
36512H80643j6887k63146l11117j19913j36512l91174k85181L37615P04165K45672
36502F44165m53578n08822j8698K46736P9618n2289L4695j7969l36624m92340
36492h75106k00708J91596K42879N6374K5826J76649J34688k90679p68473p83866
36482b090820k25459M45332O52236L19150p6988j16238P4615J12853l3658n1549
36472i90526J58597L00535J47431j40934l20313l80401l50729q1977M54389Q50390
$$ y = [997532, 1427240, 1449510, 1059607, 804451, 1068543, 1393867, 1078342, 231165, -328828, -125578, 512299, 977213, 929939, 383104, -324377, -659069, -389479, 90741, 293174, 339512, 648532, 1063222, 964556, 305429, -167492, 46649, 562193, 815720, 833512, 880643, 863756, 600610, 289493, 169580, 33068, -358106, -643287, -305672, 398493, 644165, 190587, -318235, -336933, -90197, -10579, -62868, -28173, -46142, -382766, -875106, -1075814, -884218, -641339, -584965, -559139, -382490, -247802, -538481, -1306954, -2090820, -2316279, -1870947, -1218711, -899561, -976549, -1092787, -1018172, -905319, -938977, -990526, -831929, -531394, -383963, -524897, -845210, -1225611, -1576340, -1658317, -1203928, -353538]
36462c53538O47106j1511m74439l73553o843J46209k770k05139k49869q6933K42475
36451g28805N85593P05189N26846K77918J99632K04269K7101l36165n86436n31343
36441C43799l09753j31866O017K10994M26513M45086J75718k03219l97771k94980
36431B70538q1620j9455j10492j09777P6083J95965L7419j86040j38251P6098
36421A0468P2012j11495J1972N26575P73292K47253n73202q14127l69026J03400
36411a22878K28847L23878O50603Q59427N11021k14161p08097o69100l39084q6818
36401D33638j5858r830Q789k1533j48113k32406p3456K52008L64963P5947k73760
36390C60389k48184K7779K8502l71725o78867m79786J1538L16762L11564K38453
$$ y = [-353538, 293568, 282057, -192382, -565935, -572778, -426569, -429339, -634478, -884347, -971280, -728805, -143212, 561977, 1088823, 1366741, 1566373, 1770642, 1797743, 1461578, 875142, 343799, 34046, -97820, -91803, 119191, 545704, 990790, 1166508, 963289, 565518, 270538, 188918, 169463, 58971, -50806, 25277, 221242, 258661, 72621, -65630, 10468, 82480, -29015, -17043, 509532, 1282824, 1530077, 956875, 142748, -226278, -122878, 105969, 429847, 1080450, 1939877, 2450898, 2236737, 1528640, 859540, 520456, 433638, 417780, 407950, 416739, 395206, 247093, 14687, -58769, 193239, 558202, 634149, 360389, 112205, 139984, 168486, -203239, -882106, -1361892, -1350354, -1033592, -722028, -483575]
36380d83575K96928M40717M75766K49429j35034k89062L0992M68636M22908o9182
36370A408523k98170M6694L15901j45956r38451j119600n25880R0942J78850l744
36360i90891P784K14730L19687J95641m0000k07088j84362j2367Q4822m2652k14729
36349h69425j50902Q8301J75717J6568j41795j18666m14J14462K58394M14883
36339b12877M86102M95036N23464M18452p3611p92803j173736r32864m04536j7823
36329a685196K11134M45983O33865O37591N10533L58644J35824j71287l57053
36320G20038k52245R07J46950J18833l6272k94734n01780l47664K05530O94452
36310D54015O63504K18152k13960m44918n14178l65167J9047L20848K10488j15732
$$ y = [-483575, -186647, 254070, 729836, 979265, 844231, 555169, 586161, 1054797, 1477705, 1408523, 1110353, 1157047, 1472948, 1326992, 388541, -731059, -1256939, -1165997, -987147, -990891, -983107, -768377, -448690, -253049, -293049, -500137, -684499, -696866, -612044, -654696, -869425, -1020327, -932026, -756309, -739741, -881536, -1000202, -1000616, -886154, -627760, -212877, 273225, 768261, 1291725, 1710177, 1636566, 843763, -329973, -1262837, -1667373, -1685196, -1474062, -1028079, -394214, 243377, 753910, 1112554, 1248378, 1077091, 720038, 467793, 468700, 615650, 734483, 698211, 403477, -98303, -445967, -240437, 454015, 1117519, 1335671, 1121711, 676793, 162615, -202552, -183505, 137343, 347831, 232099]
36300B32099j86520P603L2484k20740l30024n3789K55745K19172J1378M0253L07494
36289C15155M31224J83766k54767n31461m51862j19709J73055K46347K15410K67773
36279D74931L41094K60131J19512J60644K57920k082n72831p88021k92035L15495
36269B74758K61448k96720n45600k22890J10620K2184k21966k44001j47223j62905
36259a172295j29537K20670O96584Q20051M74217J2329k40940k68223j53228O3448
36249C23076K44500J61224k08133n59021n66395k06320K72014N57404M41827j7898
36239D42278m27340l59817J28861M72399K35626l74162p93110p31191l36878Q6537
36229a656797K84744J23387k47229l84081r077N71363P94729N39151J67021p3673
$$ y = [232099, 45579, 53182, 85666, -135074, -465098, -518887, -263142, -43970, -32592, 7661, 315155, 746379, 930145, 675378, 143917, -307945, -427654, -254599, -8252, 207158, 474931, 816025, 1076156, 1195668, 1356312, 1614232, 1612150, 1039319, 251298, -40737, 274758, 536206, 239486, -306114, -529004, -418384, -396200, -618166, -862167, -1009390, -1172295, -1301832, -1081162, -384578, 435473, 909690, 922019, 681079, 412856, 259628, 323076, 567576, 728800, 520667, -38354, -604749, -811069, -539055, 18349, 460176, 442278, 14938, -344879, -216018, 256381, 492007, 117845, -675265, -1406456, -1743334, -1656797, -1372053, -1248666, -1495895, -1879976, -1889053, -1317690, -522961, 16190, 183211, 109538]
36219A09538k63693l88292j98982K80138N49920K83170j63509k73840j24526j39410
36209c29486k82955q4838N04368Q47783M58308l02809o99665n44603k79081k49857
36199i62835l00403j49646J44721L05934K44536J14514L8700L902J5370J24928
36189d20279K62740K69530J76221K03265L52854K86532j68784o75174q50279q00499
36179a363873p80589n98555N1202Q11481R34631L85873l9985R4882K73530l7503
36169b68906n17413n71571k47443J7073J47693L27513M65032L93821L49797O12907
36159G08503Q64957N66473j33270n26012l64921j18957j54076k69032j94750l0482
36149C48433K7529L080R468P9066J89713K22835k5803m86715o50862k12562L18156
$$ y = [109538, -154155, -542447, -741429, -461291, 88629, 371799, 208290, -65550, -190076, -329486, -612441, -697279, -192911, 654872, 1113180, 810371, 110706, -433897, -712978, -962835, -1263238, -1412884, -1268163, -962229, -717693, -603179, -564479, -560577, -545207, -420279, -157539, 111991, 288212, 491477, 844331, 1130863, 962079, 286905, -563374, -1363873, -2144462, -2743017, -2691815, -1880334, -945703, -559830, -599815, -504933, -231403, -268906, -786319, -1357890, -1605333, -1588260, -1440567, -1113054, -648022, -254201, 95596, 708503, 1573460, 2139933, 2006663, 1480651, 1115730, 996773, 842697, 573665, 378915, 348433, 375962, 379042, 388510, 467576, 657289, 880124, 854321, 367606, -283256, -495818, -177662]
36138a77662K38961k57672l46149J28248M39871K02628o4404R3411L32695K11966
36128H01893n2574o4027P4769R1479Q1313J93940K14282k6575k20918q4102R5088
36117A104568o0194l37691l12110q1786l8393j64346j58282m8808r1180k22996
36107d11218j93396p4107p6176l6359K91312N91142L48292k02463k62968K93368
36097B67427O31716J74212n53289p10562k87232L6657j04727l75452k94140J63579
36087a051811N89835O18933K87406p7590k60567l11860k95311j27741J84172L87017
36077e7517K89987L8245j40574k29681k20662O9872O13400Q94219M93260k64579
36067A485970p23570p47159o36671m36845J5678M81355M90210J38488R764K27786
$$ y = [-177662, 61299, -196373, -542522, -414274, 25597, 228225, 163821, 257232, 589927, 801893, 749319, 685292, 760061, 851540, 932853, 1126793, 1341075, 1314500, 1093582, 1009480, 1104568, 1044374, 706683, 394573, 312787, 274394, 110048, -48234, -97042, -188222, -411218, -604614, -678721, -754897, -791256, -499944, 91198, 439490, 237027, -25941, 267427, 899143, 1073355, 520066, -190496, -477728, -441071, -545798, -921250, -1215390, -1051811, -461976, 156957, 444363, 366773, 106206, -205654, -500965, -628706, -444534, -57517, 232470, 270715, 130141, -99540, -320202, -250330, 363070, 1257289, 1750549, 1485970, 762400, 15241, -621430, -1058275, -1042597, -561242, -71032, 67456, 77220, 305006]
36057C05006K92584j1219k73491k40882k02615k80105p0025N43039Q89706M32941
36047A384939l34240n52514j74531J66163J72527R0652N2082j09998l55964l31520
36037G596O1231L90500K18535l23136o73353m80274Q656K24367n2499l91630k38516
36026a248523L38262P17852N61064K08160J02943J86195J30426r7093k25879r0111
36016E83296K04559M18930L28100j12453o00204o74273k45679K29562K68590j04742
36006B95686m72493m97453j75644K12255L29878J40884J5322K25769M43958J76182
35996F94344l78871n19664j25767J73494Q6911R7861M55802N92701J28888l34919
35986H70780j79022J83851Q0841k25764j06691K02508O1613k77220p0733M40561
$$ y = [305006, 597590, 586371, 312880, 71998, -130617, -410722, -480747, 62292, 951998, 1384939, 1050699, 498185, 323654, 489817, 662344, 752996, 805078, 695080, 339116, 7596, 68827, 459327, 677862, 354726, -318627, -798901, -790245, -565878, -618377, -1010007, -1248523, -910261, -192409, 368655, 576815, 679758, 865953, 996379, 899286, 673407, 583296, 787855, 1206785, 1534885, 1422432, 822228, 147955, -97724, 131838, 400428, 295686, -176807, -674260, -849904, -637649, -307771, -166887, -151565, 74204, 518162, 694344, 315473, -204191, -329958, -156464, -69553, 28308, 484110, 1076811, 1205699, 870780, 691758, 875609, 956450, 730686, 623995, 826503, 888116, 610896, 540163, 980724]
35976I80724K85002n26837r03348m89578k21376o20830q50201j84192P06064Q48914
35966i75658M61053L54358N29458L86082j08615m36912m45990l83073k21084K26308
35956f14073O44667M79092j48588m90215k00288K87091M74638L50996J50303N7203
35946I90826K24860O33554Q74125N18387k34049p15095o49184m03590l12701k54294
$$ y = [980724, 1265726, 738889, -164459, -654037, -875413, -1496243, -2346444, -2530636, -1824572, -975658, -514605, -160247, 369211, 755293, 646678, 209766, -236224, -619297, -840381, -614073, 30594, 509686, 361098, -129117, -329405, -42314, 432324, 783320, 933623, 990826, 1215686, 1849240, 2723365, 3241752, 3007703, 2292608, 1643424, 1239834, 927133, 672839]
$$ [...]
##END NTUPLES=NMR SPECTRUM
##END=
