##TITLE=31Pdec_DE-126_H2
 D2O, 24 sc
 13.2.2026
##JCAMPDX= 6.0         $$ Bruker NMR JCAMP-DX V2.0
##DATA TYPE= NMR SPECTRUM
##DATA CLASS= NTUPLES
##ORIGIN= UXNMR, Bruker Analytische Messtechnik GmbH
##OWNER= root
$$ XWIN-NMR		Version 3.5
$$ Fri Feb 13 15:21:14 2026 Russian Standard Time (UT+4h)  she@DPX200
##.OBSERVE FREQUENCY= 81.013821
##.OBSERVE NUCLEUS= ^31P
##.ACQUISITION MODE= SIMULTANEOUS
##.ACQUISITION SCHEME= undefined
##.AVERAGES= 24
##.DIGITISER RES= 17
##SPECTROMETER/DATA SYSTEM= spect
##.PULSE SEQUENCE= zgpg30
##.SOLVENT NAME= DMSO
##.SHIFT REFERENCE= (INTERNAL, DMSO, 0, 198.062)
##AUDIT TRAIL= $$ (NUMBER, WHEN, WHO, WHERE, WHAT)
$$ ##TITLE= Audit trail, XWIN-NMR		Version 3.5
$$ ##JCAMPDX= 5.01
$$ ##ORIGIN= Bruker BioSpin GmbH
$$ ##OWNER= she
$$ F:/spectra/data/she/nmr/P31/2/pdata/1/auditp.txt
$$ ##AUDIT TRAIL=  $$ (NUMBER, WHEN, WHO, WHERE, WHAT)
(   1,<2026-02-13 15:19:44.73 +0400>,<she>,<DPX200>,
      <created by zg, POWCHK disabled, PULCHK disabled
       configuration hash MD5:
       00 E9 B6 7A A2 85 ED C7 34 08 36 98 17 FE 4E 26
       data hash MD5: 32K
       37 96 4F 67 A1 2D F0 F4 0F 6D 7D AB C2 FD 99 C1>)
(   2,<2026-02-13 15:19:46.92 +0400>,<she>,<DPX200>,
      <Start of raw data processing
       efp BC_mod = 2 LB = 1.5 FT_mod = 6 PKNL = 1 PHC0 = 1335.949 PHC1 = 233.9007 SI = 64K 
       data hash MD5: 64K
       48 9B 48 00 B6 79 CE 7D 73 AF C9 2B A3 9C 6E 6C>)
(   3,<2026-02-13 15:20:13.76 +0400>,<she>,<DPX200>,
      <pk PHC0 = 31.88576 PHC1 = -123.4 
       data hash MD5: 64K
       E2 9A 2C E9 84 8B 07 B6 96 90 6E 61 7A F0 05 B8>)
(   4,<2026-02-13 15:20:17.51 +0400>,<she>,<DPX200>,
      <abs ABSG = 5 
       data hash MD5: 64K
       04 B3 50 31 5B 21 20 DC 92 44 B5 D3 4F 00 3C 0E>)
$$ ##END=
$$ 
$$ hash MD5
$$ 8A AA 1B AF F5 BE 53 98 4F D6 6D 06 12 1D 8D EE
##$RELAX= 
##$RELAX= 
##$RELAX= 
##$RELAX= 
##$RELAX= 
##$RELAX= 
##$RELAX= 
##$RELAX= 
$$ Bruker specific parameters
$$ --------------------------
##$DU= <F:/spectra>
##$EXPNO= 2
##$NAME= <P31>
##$PROCNO= 1
##$TYPE= <nmr>
##$USER= <she>
##$AMP= (0..31)
100 100 100 100 100 100 100 100 100 100 100 100 100 100 100 100 100 100 
100 100 100 100 100 100 100 100 100 100 100 100 100 100 
##$AQSEQ= 0
##$AQ_mod= 1
##$AUNM= <au_zg>
##$AUTOPOS= <>
##$BF1= 81.014009
##$BF2= 200.13
##$BF3= 200.13
##$BF4= 200.13
##$BF5= 200.13
##$BF6= 200.13
##$BF7= 200.13
##$BF8= 200.13
##$BYTORDA= 1
##$CFDGTYP= 0
##$CFRGTYP= 5
##$CHEMSTR= <none>
##$CNST= (0..31)
1 1 145 1 1 1 1 1 1 1 1 1 1 1 1 1 1 1 1 1 1 1 1 1 1 1 1 1 1 1 1 1 
##$CPDPRG= <waltz16>
##$CPDPRG1= <>
##$CPDPRG2= <waltz16>
##$CPDPRG3= <>
##$CPDPRG4= <mlev>
##$CPDPRG5= <mlev>
##$CPDPRG6= <mlev>
##$CPDPRG7= <mlev>
##$CPDPRG8= <mlev>
##$CPDPRGB= <>
##$CPDPRGT= <>
##$D= (0..31)
0 1 0 0 0 0 0 0 0 0.06 0 0.03 2e-05 3e-06 0 0 0.0002 0 0 0 0 0 0 0 0 0 
0 0 0 0 0 0 
##$DATE= 1770981584
##$DBL= (0..7)
120 120 120 11 120 120 24 19 
##$DBP= (0..7)
150 150 150 150 150 150 150 150 
##$DBP07= 0
##$DBPNAM0= <>
##$DBPNAM1= <>
$$ [...]
##$SUBNAM3= <"">
##$SUBNAM4= <"">
##$SUBNAM5= <"">
##$SUBNAM6= <"">
##$SUBNAM7= <"">
##$SUBNAM8= <"">
##$SUBNAM9= <"">
##$SW= 400.765351723535
##$SWIBOX= (0..15)
0 1 3 0 0 0 0 0 0 0 0 0 0 0 0 0 
##$SW_h= 32467.5324675325
##$TD= 32768
##$TD0= 1
##$TE= 0
##$TE2= 300
##$TE3= 300
##$TEG= 300
##$TL= (0..7)
0 120 53 12 22 120 120 120 
##$TP= (0..7)
150 150 150 150 150 150 150 150 
##$TP07= 0
##$TPNAME0= <>
##$TPNAME1= <>
##$TPNAME2= <>
##$TPNAME3= <>
##$TPNAME4= <>
##$TPNAME5= <>
##$TPNAME6= <>
##$TPNAME7= <>
##$TPOAL= (0..7)
0.5 0.5 0.5 0.5 0.5 0.5 0.5 0.5 
##$TPOFFS= (0..7)
0 0 0 0 0 0 0 0 
##$TUNHIN= 0
##$TUNHOUT= 0
##$TUNXOUT= 0
##$USERA1= <user>
##$USERA2= <user>
##$USERA3= <user>
##$USERA4= <user>
##$USERA5= <user>
##$V9= 5
##$VALIST= <valist>
##$VCLIST= <CCCCCCCCCCCCCCC>
##$VD= 0
##$VDLIST= <DDDDDDDDDDDDDDD>
##$VPLIST= <PPPPPPPPPPPPPPP>
##$VTLIST= <TTTTTTTTTTTTTTT>
##$WBST= 1024
##$WBSW= 4
##$XGAIN= (0..3)
0 0 0 0 
##$XL= 0
##$YL= 0
##$YMAX_a= 10504
##$YMIN_a= -11547
##$ZGOPTNS= <>
##$ZL1= 120
##$ZL2= 120
##$ZL3= 120
##$ZL4= 120
##$ABSF1= 198.0616
##$ABSF2= -202.7028
##$ABSG= 5
##$ABSL= 3
##$ALPHA= 0
##$AQORDER= 0
##$ASSFAC= 0
##$ASSFACI= 0
##$ASSFACX= 0
##$ASSWID= 0
##$AUNMP= <proc_1d>
##$AZFE= 0.1
##$AZFW= 0.5
##$BCFW= 0
##$BC_mod= 2
##$BYTORDP= 0
##$COROFFS= 0
##$CY= -3
##$DATMOD= 1
##$DC= 0
##$DFILT= <>
##$DTYPP= 0
##$F1P= 0
##$F2P= 0
##$FCOR= 1
##$FTSIZE= 65536
##$FT_mod= 6
##$GAMMA= 0
##$GB= 0
##$INTBC= 1
##$INTSCL= 9.790993e-09
##$ISEN= 30
##$LB= 1.5
##$LEV0= 0
##$LPBIN= 0
##$MAXI= 10000
##$MC2= 0
##$MEAN= 0
##$ME_mod= 0
##$MI= 50
##$NCOEF= 0
##$NC_proc= -7
##$NLEV= 6
##$NOISF1= 182.463
##$NOISF2= 159.3651
##$NSP= 0
##$NTH_PI= 0
##$NZP= 0
##$OFFSET= 198.0616
##$PC= 4
##$PHC0= 1367.835
##$PHC1= 110.5007
##$PH_mod= 1
##$PKNL= yes
##$PPARMOD= 0
##$PSCAL= 0
##$PSIGN= 0
##$REVERSE= no
##$SF= 81.0140089999434
##$SI= 65536
##$SIGF1= 159.3651
##$SIGF2= -187.1042
##$SINO= 113.3802
##$SIOLD= 16384
##$SREGLST= <1H.CDCl3>
##$SSB= 0
##$STSI= 65536
##$STSR= 0
##$SW_p= 32467.5324675325
##$SYMM= 0
##$S_DEV= 0
##$TDeff= 32768
##$TDoff= 0
##$TI= <>
##$TILT= no
##$TM1= 0
##$TM2= 0
##$TOPLEV= 0
##$USERP1= <user>
##$USERP2= <user>
##$USERP3= <user>
##$USERP4= <user>
##$USERP5= <user>
##$WDW= 1
##$XDIM= 65536
##$YMAX_p= 567168326
##$YMIN_p= -94881633
$$ End of Bruker specific parameters
$$ ---------------------------------
##NTUPLES= NMR SPECTRUM
##VAR_NAME=  FREQUENCY,     SPECTRUM/REAL,   SPECTRUM/IMAG
##SYMBOL=    X,             R,               I
##VAR_TYPE=  INDEPENDENT,   DEPENDENT,       DEPENDENT
##VAR_FORM=  AFFN,          ASDF,            ASDF
##VAR_DIM=   65536,         65536,           65536
##UNITS=     HZ,            ARBITRARY UNITS, ARBITRARY UNITS
##FACTOR=    0.49542278885378, 1,            1
##FIRST=     16045.7642231865, 0,            0
##LAST=      -16421.768244346, 0,            0
##MIN=       -16421.768244346, -94881633,    0
##MAX=       16045.7642231865, 567168326,    0
$$ Real data points
##PAGE= N=1
##DATA TABLE= (X++(R..R)), XYDATA
$$ [...]
41718A78741M90551M16226m84127j089017l59793Q87663P88303q24983j874706
$$ 178741 669292 1085518 601391 -487626 -847419 40244 828547 3564 -1871142
41709a871142r20084P77690J221895N27369K16977N07706K30821p98433j286630
$$ -1871142 -2791226 -2013536 -791641 -264272 -47295 460411 691232 -107201 -1393831
41700a393831o15095K00652K52756R196J44283L32656N7178l31464k38333J73711
$$ -1393831 -2008926 -1808274 -1555518 -1546322 -1402039 -1069383 -1012205 -1343669 -1582002 -1408291
41690a408291L81876L83035M97073O84395O32347K67257j85808m32992k84219
$$ -1408291 -1026415 -643380 -146307 538088 1170435 1437692 1251884 818892 534673
41681E34673N7604o6343r73355j862781j627370m34664M43359M62957L62795O32976
$$ 534673 592277 525934 -447421 -2310202 -3937572 -4372236 -3928877 -3465920 -3103125 -2470149
41671b470149O86569J45098k26784K73376J071858J205638O77377R0922l59988
$$ -2470149 -1783580 -1638482 -1865266 -1591890 -520032 685606 1362983 1453905 1093917
41662A093917p01245o50445j43223K25421J14320J30494P24362J121630M73527
$$ 1093917 392672 -257773 -400996 -175575 -61255 69239 793601 1915231 2388758
41653B388758n32946n18427M72381J034791N23812j54954q1535M15046M33817
$$ 2388758 1855812 1337385 1809766 2844557 3368369 3213415 3131880 3546926 3980743
41644C980743k90348j251743j796458j619527r20853j89853K76150N23159N66775
$$ 3980743 3690395 2438652 642194 -977333 -1898186 -2088039 -1811889 -1288730 -721955
41635g21955K87739j20824j78175J05891J52847j09037L3829P01391Q10612k00417
$$ -721955 -434216 -555040 -733215 -627324 -474477 -583514 -549685 151706 962318 761901
41625G61901j062584m20325R31713J154170J75876l64019J90182O80881K17757
$$ 761901 -300683 -721008 210705 1364875 1540751 1176732 1366914 2047795 2265552
41616B265552n49544p27760m06919n5038K02641K46938q5543l83190j8194O36924
$$ 2265552 1716008 988248 581329 526291 728932 975870 890327 507137 488943 1125867
41606A125867N32013k44028l45739O18586J208888L36895r77193j151007l31297
$$ 1125867 1657880 1413852 1068113 1686699 2895587 3232482 2255289 1104282 772985
41597G72985Q6650m54173j232101j473124j033948j52189O93921R31738N04193
$$ 772985 859635 405462 -826639 -2299763 -3333711 -3485900 -2791979 -1860241 -1356048
41588a356048L1999m0688O2345J89343O74615J399495J370921J84781r02294n41416
$$ -1356048 -1324049 -1364737 -1302392 -1113049 -438434 961061 2331982 2516763 1614469 1073053
41578A073053O72066J027755J59871p27921r28770r97248j214208p78234P04947
$$ 1073053 1745119 2772874 2932745 2204824 1276054 278806 -935402 -1713636 -1008689
41569a008689K007553J625956j34975j413355j086115j4362L00408k73819n13833
$$ -1008689 998864 2624820 2489845 1076490 -9625 -23987 276421 2602 -511231
41560e11231K22473R21531L48035j026607j536494o40079M13086N14543J47727
$$ -511231 -288758 632773 980808 -45799 -1582293 -2222372 -1809286 -1294743 -1147016
41551a147016K35530N51483L12957l13212m69647o5270J29038k11025n13712k80441
$$ -1147016 -911486 -360003 -47046 -360258 -829905 -895175 -766137 -977162 -1490874 -1771315
41541a771315K51275N78263N14775K04669m0704N3877L41146K71814l01071o91097
$$ -1771315 -1520040 -941777 -427002 -222333 -263037 -209160 131986 403800 102729 -588368
41531e88368l19511K96050K54441l18479m69422R4117O54904O90578N36818O11794
$$ -588368 -907879 -611829 -357388 -675867 -1145289 -1051172 -396268 294310 831128 1442922
41521A442922P28147N23603O1117k96175k98986p010J80011j75957q84264j069222
$$ 1442922 2171069 2694672 2755789 2459614 2160628 2153618 2333629 2157672 1273408 204186
41511B04186k86195O84794Q33153K88959j53752m33854r86427j420501q72584
$$ 204186 -82009 602785 1435938 1724897 1571145 1137291 150864 -1269637 -2142221
41502b142221K95036O56724r9951o43772j84458L05717j01264o67790l63810K87664
$$ -2142221 -1847185 -1190461 -1290412 -1934184 -2118642 -1812925 -1914189 -2581979 -2945789 -2658125
41492b658125J73098l97032j93533P96814J269296O49508r4218j0153N21370N74096
$$ -2658125 -2485027 -2882059 -3075592 -2278778 -1009482 -359974 -454192 -464345 57025 631121
41482F31121R2775j09281M54786J227897J236783L24041n40936m41541K73288
$$ 631121 723896 614615 1069401 2297298 3534081 3858122 3317186 2875645 3148933
41473C148933N41444J72639m5326R9057k06348j150672j461080k55526J273330
$$ 3148933 3690377 3863016 3817690 3916747 3710399 2559727 1098647 843121 2116451
41464B116451J386670L29348j91703L09435N76169j90153j179814j431473j113245
$$ 2116451 3503121 3832469 3640766 3950201 4526370 4336217 3156403 1724930 611685
41455F11685p62718l51466J92723M01713n3504p08096r32280o99835k66554L28917
$$ 611685 -151033 -502499 -309776 91937 38433 -669663 -1601943 -2301778 -2568332 -2239415
41445b239415R41993J091263O26235J17801J8607n3703n62481j071506p99359
$$ -2239415 -1297422 -206159 420076 537877 556484 502781 -59700 -1131206 -1930565
41436a930565J43390Q59668Q87535O08876M63644M12291K83555J29965O3019P5531
$$ -1930565 -1787175 -927507 -39972 568904 1032548 1444839 1728394 1858359 1921378 1996909
41426A996909J29147J70442P3160j69812k77585m7082J75736j90070j117292j818583
$$ 1996909 2126056 2296498 2369658 2199846 1922261 1875179 2050915 1860845 743553 -1075030
41416a075030j591135n74350M47169Q16346N20119J06660J33550N67376P52921
$$ -1075030 -2666165 -3240515 -2793346 -1977000 -1456881 -1350221 -1216671 -649295 103626
41407A03626J40190r95077j741094j443362k70204J019252J668175J381207M74788
$$ 103626 243816 -751261 -2492355 -3935717 -4205921 -3186669 -1518494 -137287 337501
41398C37501l98136q10409p97161m93463J24594Q54197J034923L18289n46031
$$ 337501 -60635 -871044 -1668205 -2161668 -2037074 -1182877 -147954 170335 -375696
41389c75696m65549M22148P49818k08817j419494j396262j12404J059533J062873
$$ -375696 -841245 -419097 330721 121904 -1297590 -2693852 -2806256 -1746723 -683850
41380f83850J93999n18554m71121P7724M52464L26917L9318L4742J19735k66571
$$ -683850 -489851 -1008405 -1479526 -1401802 -949338 -622421 -583103 -548361 -428626 -695197
41370f95197r93358j124582k16508R31977J389877J332827J407061J426449P63294
$$ -695197 -1688555 -2813137 -3029645 -2097668 -707791 625036 2032097 3458546 4221840
41361D221840k65919o03856o2456L93552J53754l26446n98307q73670j138003
$$ 4221840 3955921 3352065 3289609 3683161 3836915 3510469 2912162 2038492 900489
41352I00489p52710L24250R47195L43247o03890o87049k22031k89550p07801k99727
$$ 900489 147779 472029 1419224 1762471 1158581 471532 249501 -40049 -747850 -1047577
41342a047577R31316J428679K55775j558920k397135j871939p29953K92043Q59140
$$ -1047577 -116261 1312418 1568193 9273 -2387862 -4259801 -4989754 -4697711 -3838571
41333c838571Q25004L15291j72096j87480K47931Q11681J238214J369332J144416
$$ -3838571 -3013567 -2698276 -2870372 -3057852 -2809921 -1998240 -760026 609306 1753722
41324A753722P17170L42934L9340l95406r60663j312237j110988l46949N96434
$$ 1753722 2470892 2813826 2853166 2457760 1497097 184860 -926128 -1273077 -676643
41315f76643J043963N33823m15480n11614O98302J893158J563191J20196p59244
$$ -676643 367320 901143 485663 -25951 672351 2565509 4128700 4248896 3489652
41306C489652o14829n14107q66983p24943J81951M97139n88058j711972j278153
$$ 3489652 2874823 2360716 1493733 768790 950741 1447880 859822 -852150 -2130303
41297b130303J58335R32659P35536M28206J78670m22934q71183k56994Q57383
$$ -2130303 -1971968 -1039309 -303773 124433 303103 -119831 -991014 -1248008 -390625
41288c90625R05973k06820q57831k80648L28113p9554p68013o43104j6240J93797
$$ -390625 515348 308528 -549303 -829951 -501838 -581392 -1349405 -1992509 -2008749 -1814952
41278a814952P6750L52313R54099J091713M62303m37125j030924j070575n40216
$$ -1814952 -1738202 -1385889 -431790 659923 1122226 685101 -345823 -1416398 -1956614
41269a956614K65382P49715O02176K27460J94798M62052N38690K26094j98957
$$ -1956614 -1691232 -941517 -339341 -111881 82917 544969 1083659 1309753 1110796
41260A110796m13389l37051q5433J34614J74357J19603J72491K91744J82067k70336
$$ 1110796 697407 360356 274923 409537 583894 703497 875988 1167732 1349799 1079463
41250A079463p78042r40093n85088R6952N58963K88424m22619m62686P03628J975014
$$ 1079463 301421 -638672 -1223760 -1126808 -567845 -279421 -702040 -1164726 -461098 1513916
41240A513916J843312M45368p05680r14027q77712r53089m43009P60915J352406
$$ 1513916 3357228 3802596 3096916 2182889 1305177 352088 -90921 669994 2022400
41231B022400M80324p64077r29901l01695j38515o22269r26766p51272m36023
$$ 2022400 2502724 1738647 808746 507051 368536 -253733 -1180499 -1931771 -2367794
41222b367794K3633P65659J206466P09500j45886k71477J68872R6835m98870m64569
$$ -2367794 -2344161 -1578502 -372036 337464 191578 -79899 88973 185808 -313062 -777631
41212g77631M54128R84369K82988p87100j039778n74566k23746j93114o1616L59626
$$ -777631 -323503 660866 943854 156754 -883024 -1457590 -1681336 -1874450 -1936066 -1576440
41202a576440Q36950J105079J032218O28418J09178k85827n59384p31845n28917
$$ -1576440 -739490 365589 1397807 2026225 2135403 1849576 1290192 558347 29430
41193B9430J70635P81081O23040m9758m26415l81556m15103n05483j67780L45662
$$ 29430 200065 981146 1604186 1554428 1128013 746457 331354 -174129 -341909 3753
41183C753J83848n60744p56156m2290N60325L30012j77565l98633o23158q54194
$$ 3753 187601 -373143 -1129299 -1171589 -611264 -281252 -458817 -857450 -1480608 -2334802
41173b334802k75287J116232J760971P39419n23020k73884R04948J162992K74534
$$ -2334802 -2610089 -1493857 267114 1006533 483513 209629 1114577 2277569 2552103
41164B552103m16248m31780n82687j077315j069014k96036M18510O02674O69349
$$ 2552103 2135855 1704075 1121388 44073 -1024941 -1320977 -902467 -299793 369556
41155C69556P42380L39079m12928n97167l1284L02550p7401k76416M63482J458553
$$ 369556 1111936 1451015 1038087 440920 409636 712186 634785 358369 821851 2280404
41145B280404J642722J061486M40626l1967o06989j151402j255485r11005m98525
$$ 2280404 3923126 4984612 5425238 5393271 4786282 3634880 2379395 1468390 969865
41136I69865k95319l39525m87927l91590J71022P94544Q29908L54048J5184j71022
$$ 969865 674546 335021 -152906 -544496 -373474 421070 1250978 1605026 1620210 1449188
41126A449188q17293j660072j372503L52536J784487J380518J0370m44520Q6799
$$ 1449188 631895 -1028177 -2400680 -2048144 -263657 1116861 1127231 682711 769510
41117G69510J24502p04335j130673m96296J90673K4885m06653k39820J85958P8192
$$ 769510 894012 189677 -940996 -1437292 -1246619 -1221734 -1628387 -1868207 -1682249 -1604057
41107a604057l50091k67058L22841N39145j1589o69992o96107k15822R4399p7023
$$ -1604057 -1954148 -2221206 -1898365 -1359220 -1370809 -2040801 -2736908 -2952730 -2858331 -2935354
41097b935354m00618m44600k22478p8118j18165r218N03957J077871J109011N62538
$$ -2935354 -3335972 -3780572 -4003050 -4081168 -4199333 -4208551 -3704594 -2626723 -1517712 -955174
41087i55174Q2674J56574N12703N86794L14743J21563K42668M17076L07891l8687
$$ -955174 -872500 -715926 -203223 383571 698314 819877 1062545 1479621 1787512 1748825
41077A748825k95319k66418n4372J03538K6043l13130o92086o95134j45787M68968
$$ 1748825 1453506 1187088 1132716 1236254 1262297 949167 257081 -438053 -583840 -114872
41067a14872L96465l33572p04009m3560Q27414N89458n91503j116755k36811Q12294
$$ -114872 281593 -51979 -755988 -799548 27866 617324 25821 -1090934 -1327745 -515451
41057e15451O39663k69422m16010M18230J019003P08473J71700Q6187P7448l88580
$$ -515451 124212 -145210 -561220 -142990 876013 1584486 1756186 1842373 1919821 1531241
41047A531241r17548p36118J20863Q29681Q02810K48863j99898j56577J49849
$$ 1531241 613693 -122425 -1562 828119 1630929 1879792 1679894 1523317 1673166
41038A673166J07936m95172j008317o44242L66722R49604O22335P0809J344J48946
$$ 1673166 1781102 1285930 277613 -366629 93 949697 1572032 1642841 1644185 1793131
41028A793131m7906m21204m40554j80542j48469l70481l88231r8415O1283j86972
$$ 1793131 1745225 1324021 883467 702925 554456 183975 -204256 -302671 -241388 -428360
41018d28360n86669p36627m76986Q8369O02555N97226K5638m82060l59724M1575
$$ -428360 -1015029 -1751656 -2228642 -2140273 -1537718 -940492 -914854 -1396914 -1756638 -1715063
41008a715063r2192p93050j158027n46020O28646J473114J527972R45356J93324
$$ -1715063 -1807255 -2600305 -3758332 -4304352 -3675706 -2202592 -674620 270736 464060
40999D64060k23170r8490K54014L86031L23478M21737O55004N77129N7866m92046
$$ 464060 240890 142400 396414 782445 1105923 1527660 2182664 2759793 2817659 2325613
40989B325613p60284q42826p69318l46234K83619N78150M38337M58622Q92116
$$ 2325613 1565329 722503 -46815 -393049 -109430 468720 907057 1365679 2257795
40980B257795J048938L66152n25224o43626j77846k15261j040647j613671r71439
$$ 2257795 3306733 3672885 3147661 2504035 2326189 2110928 1070281 -543390 -1514829
40971a514829M82904J432385J070807j50901j055097r22149j76471J92901j42176
$$ -1514829 -1031925 400460 1471267 1320366 265269 -656880 -833351 -640450 -782626
40962g82626n47541m14506R2158N44009Q88947J098078P84236j39149r23218q78103
$$ -782626 -1330167 -1744673 -1652515 -1108506 -219559 878519 1662755 1523606 600388 -277715
40952b77715l46845K3753M14907J148105J414463K12907j607380j948124l98737
$$ -277715 -624560 -600807 -185900 962205 2376668 2589575 982195 -965929 -1364666
40943a364666J064517R15710L8606p9692L44293K21360l56090m31726M2992K06199
$$ -1364666 -300149 615561 654167 574475 918768 1140128 784038 352312 395304 601503
40933F01503k09486n93468n43926k26516J91327N64256M94353m1080j52719P81884
$$ 601503 392017 -201451 -745377 -971893 -780566 -216310 278043 236963 84244 866128
40923H66128J764002J317720k09793r90263m16593J45120k96107q77432n79066
$$ 866128 2630130 3947850 3738057 2747794 2331201 2476321 2180214 1302782 723716
40914G23716J2947j74318q29803q27556p4546M73928L74435J43944J77314J59767
$$ 723716 736663 562345 -267458 -1095014 -1169560 -695632 -321197 -177253 61 159828
40904A59828k63176q69686j123082p25149J03819O91945M73581k65136n46817
$$ 159828 -103348 -973034 -2096116 -2821265 -2717446 -2025501 -1551920 -1817056 -2363873
40895b363873M1624P10460O12024J38730K84854J024190J296437O23021j92399
$$ -2363873 -2322249 -1611789 -999765 -861035 -576181 448009 1744446 2367467 2175068
40886B175068k61076K29813M73938J56157l31875m88943j72606L45983N69388
$$ 2175068 1913992 2143805 2617743 2773900 2442025 1953082 1780476 2126459 2695847
40877B695847J72154o37484j282179j381237r79354k77335N12663J022902Q87660
$$ 2695847 2868001 2230517 948338 -432899 -1412253 -1689588 -1176925 -154023 733637
40868G33637K45706k68380k77964j11679k39005n55449n94755k70132O937o9026
$$ 733637 979343 710963 432999 321320 82315 -473134 -1067889 -1338021 -1331084 -1400110
40858a400110l09303l28607j4595L97884O02042M99335K59451J17220R7692L1318
$$ -1400110 -1709413 -2038020 -2052615 -1654731 -1052689 -553354 -293903 -176683 -78991 -47673
40848d7673r7312j694M66145Q53355M95239n36206j287658j036308k30374J39343
$$ -47673 -144985 -146679 319466 1172821 1668060 1131854 -155804 -1192112 -1422486 -1283143
40838a283143q7780j24839M52561R65554N97328l92341r72856o20588K18403Q00200
$$ -1283143 -1370923 -1495762 -1043201 -77647 519681 127340 -845516 -1466104 -1247701 -447501
40828d47501P48901J61796m83874o03628j23260K87982O2919l94630l35717K7056
$$ -447501 301400 463196 -20678 -624306 -747566 -459584 -396665 -791295 -1127012 -1099956
40818a099956k50581j250932j844778j290984k41698L98865P41258J276149J709407
$$ -1099956 -1350537 -2601469 -4446247 -5737231 -5978929 -5580064 -4838806 -3562657 -1853250
40809a853250J402027N56010J7673P8662K65585K09678J3383j96813m57809p01696
$$ -1853250 -451223 104787 122460 201122 466707 676385 689768 492955 35146 -666550
40799f66550p49043n07857R9475J074161J856393J480765j32246j585806j560528
$$ -666550 -1415593 -1923450 -1823975 -749814 1106579 2587344 2455098 869292 -691236
40790f91236n24272M8101k42006n16362k15987L38083Q74714J382030J353824
$$ -691236 -1215508 -1167407 -1409413 -1925775 -2141762 -1803679 -928965 453065 1806889
40781A806889J79304j468053j958354q55824M64328Q04395N04224K53107j11483
$$ 1806889 1986193 518140 -1440214 -2296038 -1831710 -1027315 -523091 -269984 -381467
40772c81467p34955q79101n9209Q45367P67612O1838j55952K82938O08946L97166
$$ -381467 -1116422 -1995523 -2054732 -1209365 -441753 -379915 -535867 -252929 356017 753183
40762G53183j16643o13453p62919k28832N74177M20223r94588j999927r92586
$$ 753183 636540 23087 -739832 -968664 -394487 25736 -968852 -2968779 -3961365
40753c961365J042656J667505L76228q93180p16929J04470K79322j24872l76321
$$ -3961365 -2918709 -1251204 -874976 -1768156 -2485085 -2380615 -2101293 -2226165 -2602486
40744b602486l54451k11555K36147Q72861R24046J80378k33378N87393J658944
$$ -2602486 -2956937 -3168492 -2932345 -2059484 -1135438 -955060 -1188438 -601045 1057899
40735A057899J285327m26255j583014j102665k9707J68651m25759o57529p4956
$$ 1057899 2343226 1916971 333957 -768708 -798415 -629764 -1055523 -1713052 -1788008
40726a788008O46604Q14529M75523L6851k54550k99558j04436L9673k26338o82785
$$ -1788008 -1141404 -326875 148648 185499 -69051 -368609 -473045 -433372 -659710 -1342495
40716a342495n80898K68354R52777O26949j88439l19530K87360N44787m274n48797
$$ -1342495 -1923393 -1655039 -702262 -75313 -263752 -583282 -295922 248865 244591 -304206
40706c04206m61868k04754j55504K92762J452316K144671J150376p17004j448350
$$ -304206 -766074 -970828 -1126332 -833570 618746 2763417 3913793 3196789 1748439
40697A748439n56901M40817L30367l56643n72523k70637o8114j84978l57801l52108
$$ 1748439 1191538 1632355 1962722 1606079 1033556 762919 694805 509827 152026 -200082
40687b00082j17961K48858M80290L91643K12051K54254L21333j9n30143o69161
$$ -200082 -318043 -69185 411105 802748 1014799 1269053 1590386 1590367 1060224 391063
40677C91063l56121q9307K3556L47289P32207M50687n13686j053100l78654Q44917
$$ 391063 34942 -54365 -30809 316480 1048687 1499374 985688 -67412 -446066 398851
40667C98851J376362Q43392j62979r02720r62842m18260J13389M1723l55532k43068
$$ 398851 1775213 2618605 2455626 1552906 590064 171804 285193 326916 -28616 -271684
40657b71684M90321J049122J007361P87811N64714j39923j200426j477186n48291
$$ -271684 218637 1267759 2275120 3062931 3627645 3487722 2287296 810110 261819
40648B61819L01213p4230q99241q51622k54777k86727p08718k65197R15222J273946
$$ 261819 563032 488802 -410439 -1262061 -1516838 -1803565 -2512283 -2777480 -1862258 -588312
40638e88312L95789j98503N15120J382358Q25384p97944j710805j013538N06247
$$ -588312 -192523 -391026 124094 1506452 2331836 1533892 -176913 -1190451 -684204
40629f84204J578206J654480R50341p6533j013109j469535j109094k396J056653
$$ -684204 894002 2548482 3498823 3422290 2409181 939646 -169448 -171844 884809
40620H84809J077515M4948q83883q36596l85332n28023r98019o88994M06086R58424
$$ 884809 1962324 2007272 1123389 286793 -98539 -626562 -1624581 -2313575 -1907489 -949065
40610i49065K70120o78742p03293P549M93895M69867L40769K54845m970l63118
$$ -949065 -678945 -1357687 -2060980 -2053431 -1559536 -1089669 -748900 -494055 -499025 -862143
40600h62143m17043r0075K01770J43721m6953R5323P18069J418658J555381Q72632
$$ -862143 -1279186 -1369261 -1167491 -1023770 -1070723 -975400 -257331 1161327 2716708 3589340
40590C589340j57906p57112o38913k46076j66955n01487q63604q57446m79197
$$ 3589340 3431434 2674322 2035409 1789333 1622378 1120891 257287 -600159 -1079356
40581a079356j07347p1425k18290r6296L55189O33486M09279L9902k7664M4981
$$ -1079356 -1186703 -1258128 -1476418 -1572714 -1217525 -584039 -174760 -134858 -162522 -117541
40571a17541q3051j95493Q7789M80943M21005R4106J40599M07812O3993q89696
$$ -117541 -200592 -396085 -308296 172647 593652 687758 828357 1236169 1300162 410466
40561D10466j336950p08678R6641J19296j91495K19526J296013J874160J221720
$$ 410466 -926484 -1635162 -1538521 -1419225 -1610720 -1391194 -95181 1778979 3000699
40552C000699j17798r96556p73262J68059P68887L34680o69513j195443j011113
$$ 3000699 2882901 1886345 1113083 1281142 2050029 2384709 1715196 519753 -491360
40543d91360q89009j198297j168242j63634J042982J179366K45841n40209l94581
$$ -491360 -1380369 -2578666 -3746908 -3910542 -2867560 -1688194 -1442353 -1982562 -2377143
40534b377143K93553Q31584J004612Q32998K61409n68752j177364j202899p74203
$$ -2377143 -2083590 -1252006 -247394 585604 847013 278261 -899103 -2102002 -2876205
40525b876205k43537K41607P18098J086103J020071L25716n92273q32909P2654
$$ -2876205 -3119742 -2878135 -2160037 -1073934 -53863 271853 -320420 -1153329 -1080675
40516a080675J347559J576276L63500j052399j228662k10366O83868N21128l56551
$$ -1080675 266884 1843160 2206660 1154261 -74401 -284767 399101 920229 563678
40507E63678j024649j007085m87333J10226M94829O02244N04866L04712J29806
$$ 563678 -460971 -1468056 -1955389 -1845163 -1350334 -748090 -243224 61488 191294
40498A91294J14195J95672M1933m90871q99279n36008L68094Q05975L67641j45817
$$ 191294 305489 501161 543094 52223 -847056 -1383064 -1014970 -208995 158646 12829
40488A2829O9620O39504P22311L91455M04806Q23168Q26538J2135r46301j230193
$$ 12829 82449 721953 1444264 1835719 2240525 3063693 3890231 3902366 2956065 1725872
40478A725872q45335l17374P0833L12436L11834j6490m25941n51679m45888n21201
$$ 1725872 880537 563163 633996 946432 1258266 1241776 815835 264156 -181732 -702933
40468g02933q46791q59304r6475R85630J395480Q32546N0213j95826n8274q6942
$$ -702933 -1549724 -2409028 -2505503 -1519873 -124393 708153 758366 562540 504266 417324
40458D17324l00789l51434k32692j43862L3346L42363J76301q80628j851111j273063
$$ 417324 116535 -234899 -467591 -611453 -578107 -235744 -59443 -940071 -2791182 -4064245
40448d064245O19276J953328J731622Q93328M14843q1596r70629j420212q24683
$$ -4064245 -3444969 -1491641 239981 1133309 1548152 1466556 495927 -924285 -1748968
40439a748968j55112l79097o16647M04213J893860J963237O12177k35480L42088
$$ -1748968 -1904080 -2283177 -2899824 -2495611 -601751 1361486 1973663 1738183 2080271
40430B080271J154154R57926k3805j034353j750295j860390j050638O1306K34944
$$ 2080271 3234425 4192351 4168546 3134193 1383898 -476492 -1527130 -1465824 -1230880
40421a230880o02081j076719m52652K55181q603o91009o52279R6527P03707Q41864
$$ -1230880 -1832961 -2909680 -3362332 -3107151 -3115754 -3806763 -4459042 -4362515 -3658808 -2816944
40411b816944P80748N88238J66477k23330k18946P5519L21988M68922N72894M43178
$$ -2816944 -2036196 -1447958 -1281481 -1504811 -1723757 -1648238 -1326250 -857328 -284434 158744
40401A58744l6697n10795n24394r1007M20773P21929P09911M52538K33850K72530
$$ 158744 122047 -388748 -913142 -1004149 -583376 138553 848464 1301002 1534852 1807382
40391A807382L20835j0356n23238o43362l77870k86564l94903p1214P25710J068630
$$ 1807382 2128217 2117861 1594623 951261 573391 286827 -108076 -179290 546420 1615050
40381A615050M29571m76309p89903n92297k69146L03447J127415J447443P21908
$$ 1615050 2044621 1568312 778409 186112 -83034 220413 1347828 2795271 3517179
40372C517179l46346o85953l09569j4404n4926l6026J51562J72783r3967m32370
$$ 3517179 3170833 2484880 2175311 2160907 2105981 2069955 2221517 2394300 2300333 1867963
40362A867963o98924q17233n87565j9661M09691L17873n6514k96063l69910l55076
$$ 1867963 1169039 351806 -235759 -255420 154271 472144 415630 119567 -250343 -605419
40352f05419j17646K57804K94730j16189m11948l04470k47405l83968l0242R41816
$$ -605419 -723065 -465261 -170531 -286720 -698668 -1003138 -1250543 -1634511 -1664753 -722937
40342g22937J290449J90560j117614r55978K51873P43447K20847M9154P96048
$$ -722937 567512 758072 -359542 -1315520 -1063647 -320200 -99353 -50199 745849
40333G45849J431419J214793O93494L53270k24823j209062j774887j277811k43174
$$ 745849 2177268 3392061 4085555 4438825 4214002 3004940 1230053 -47758 -290932
40324b90932M56903O42074N18716Q7355n77217j008929q08952j18599N38580O02306
$$ -290932 165971 808045 1326761 1414116 836899 -172030 -980982 -1099581 -561001 41305
40314D1305j77231j254998j484861n04986M87343K79117n25095m67381L85370
$$ 41305 -135926 -1390924 -2875785 -3380771 -2893428 -2614311 -3139406 -3606787 -3221417
40305c221417O35052k2493l79714P5018L85963O6692q396N96094R26114M64797
$$ -3221417 -2586365 -2608858 -2988572 -2913554 -2527591 -2460899 -2469295 -1873201 -947087 -482290
40295d82290K62544J031902J600877P02463q86195j479264q28168O0617O31226
$$ -482290 -219746 812156 2413033 3115496 2229301 750037 -78131 -17514 613712
40286F13712R40814Q37800L00088j8309K41213L10773m13737j082129o92716J69075
$$ 613712 1554526 2392326 2692414 2674105 2915318 3226091 2812354 1730225 1037509 1206584
40276A206584L68651J71618M82774Q72621K67281q97206j223508p50899p07017
$$ 1206584 1575235 1746853 2229627 3102248 3369529 2472323 1248815 497916 -209101
40267b09101j003627k77484J349741J934376Q06632k50674N4572N07662k80017
$$ -209101 -1212728 -1490212 -140471 1793905 2600537 2349863 2404435 2912097 2632080
40258B632080j369148j113314P8026N25939m0059m58782k75106j22425j80605
$$ 2632080 1262932 149618 227644 753583 713524 254742 -20364 -142789 -323394
40249c23394Q8092N92014M83012l25958p84805l12963K54245q7009j076345j614489
$$ -323394 -235302 356712 839724 513766 -271039 -584002 -329757 -416766 -1493111 -3107600
40239c107600j132180l1295Q95575J081779M97276k96486n66874j30043M83285
$$ -3107600 -4239780 -4271075 -3375500 -2293721 -1796445 -2092931 -2659805 -2789848 -2306563
40230b306563O99278N03472K34345P4115l206j4932l481j13454l14097k00726
$$ -2306563 -1607285 -1103813 -869468 -795353 -798559 -813491 -816972 -930426 -1244523 -1445249
40220a445249N05058J313080J345814N08188k48483j78579K28807N9595n47305
$$ -1445249 -940191 372889 1718703 2226891 1978408 1799829 2028636 2088231 1540926
40211A540926n97983R9695M50289l41543j499420j687928p67652K53366O99199
$$ 1540926 942943 1042638 1492927 1151384 -348036 -2035964 -2803616 -2550250 -1851051
40202a851051P92091Q26979O60336K41971k7843J47069M49622L25274l42724j109890
$$ -1851051 -1058960 -231981 428355 670326 642483 789552 1239174 1564448 1221724 111834
40192A11834j365901q21774J95001R49013R98703N88983J62636j93933m33195
$$ 111834 -1254067 -2075841 -1880840 -931827 66876 655859 818495 624562 191367
40183A91367j35968Q18873J483023P80170p64953j347981k55649J124493J200650
$$ 191367 55399 874272 2357295 3137465 2372512 1024531 768882 1893375 3094025
40174C094025J43141p55037q62463m81791K1505L92466K16644n53719j064987
$$ 3094025 3237166 2482129 1619666 1137875 1159380 1551846 1768490 1214771 149784
40165A49784m72877P73912J428402J090815M70442J04343j70116l77885j14876
$$ 149784 -323093 450819 1879221 2970036 3440478 3544821 3374705 2996820 2881944
40156B881944N23990O49053k14919j302004j577879j006753k69364L00691Q03820
$$ 2881944 3405934 4054987 3840068 2538064 960185 -46568 -315932 -15241 788579
40147G88579J095513P81729p2529p77558p43895j13778M30940L64564j86008n79122
$$ 788579 1884092 2665821 2593292 1815734 1071839 958061 1389001 1753565 1567557 988435
40137I88435l56498K06007M29315P9161m49739q02910j014128j031201n32801
$$ 988435 631937 837944 1267259 1346420 896681 93771 -920357 -1951558 -2484359
40128b484359L51890P40416R2979q17575q34412l6466M78762L08699J94408N95843
$$ -2484359 -2132469 -1392053 -1299074 -2116649 -2951061 -2987527 -2508765 -2200066 -2005658 -1409815
40118a409815Q94045N23140j2696K832L03892J85174j98283l8049P47606J238625
$$ -1409815 -515770 7370 -5326 -2494 301398 486572 288289 250240 997846 2236471
40108B236471P67666k22757q17803o54286q5422L25814K68393j41216n02499n38176
$$ 2236471 3004137 2781380 1963577 1309291 1223869 1549683 1818076 1676860 1174361 636185
40098F36185l19806j8602L03857M43818J6730q42958j146494j74445J275382J649327
$$ 636185 316379 297777 601634 1045452 1062182 219224 -927270 -1101715 173667 1822994
40088A822994O45390m48456n67955p6880J80278J00712K7009k6419j99395l72923
$$ 1822994 2468384 2019928 1451973 1375093 1555371 1656083 1683092 1656673 1457278 1084355
40078A084355m51100n25893l74860M40040J462571J311459l63171j827321j381997
$$ 1084355 633255 107362 -267498 172542 1635113 2946572 2583401 756080 -625917
40069f25917K01187Q11637N2027n39723j73482J46792l46563q19952l46662N54254
$$ -625917 -424730 386907 438934 -100789 -274271 -127479 -474042 -1293994 -1640656 -1086402
40059a086402Q96495P33680O47861N29246l5138o98467p51249k70717O0296N2689
$$ -1086402 -189907 543773 1191634 1720880 1685742 987275 236026 -34691 25605 78294
40049G8294N3699O7540k51415p19345n98822L18752J245878J300135M56683n84205
$$ 78294 131993 199533 -51882 -771227 -1370049 -1051297 194581 1494716 1951399 1367194
40039A367194j110985q30382L0829P91759P37993k09006j275943j494432o63243
$$ 1367194 256209 -574173 -543344 248415 986408 777402 -498541 -1992973 -2656216
40030b656216M06896P34949K73188m4062M81971J343684J510441Q77360L39933
$$ -2656216 -2249320 -1514371 -1241183 -1285245 -803274 540410 2050851 2928211 3268144
40021C268144L67305L04110n06052j584603j932329j337162m23859K87686P11045
$$ 3268144 3635449 3939559 3433507 1848904 -83425 -1420587 -1844446 -1556760 -845715
40012h45715P87363M48252l7406k61841k52275l47351m99950k69493L55293O73704
$$ -845715 -58352 389900 352494 90653 -161622 -508973 -1008923 -1278416 -923123 -249419
40002b49419J58370p07938r04942j30159P74064Q38567K08509o5941M23970P10541
$$ -249419 -91049 -798987 -1703929 -1834088 -1060024 -221457 -12948 -78889 345081 1055622
39992A055622j42636j374248j343356L8006R96412M61572m01256j60556N97589
$$ 1055622 912986 -461262 -1804618 -1766612 -770200 -308628 -709884 -870440 -272851
39983b72851M07131m99336n71684L76527P84303o8015q60411l80900O08719P35144
$$ -272851 134280 -365056 -936740 -560213 224090 156075 -704336 -1085236 -476517 258627
39973B58627J23040j42223M8752j91026j047072j520278q38791N03226J423745
$$ 258627 381667 239444 288196 97170 -949902 -2470180 -3308971 -2805745 -1382000
39964a382000J408178P17348j16814o51354o12354K124P96863J121665N89333
$$ -1382000 26178 743526 626712 -24642 -636996 -634872 161991 1283656 1872989
39955A872989m32838j028491o65002J83507O04888L18491j60666k97569j8547
$$ 1872989 1440151 411660 -253342 -69835 535053 853544 692878 395309 376762
39946C76762N19992J097575J311479Q33701r4547r00088j423141j827921j818367
$$ 376762 896754 1994329 3305808 4139509 4044962 3144874 1721733 -106188 -1924555
39937a924555q70918N26520R42252p6937j103050p13722N09097R39942K85251
$$ -1924555 -2795473 -2268953 -1326701 -1403638 -2506688 -3220410 -2711313 -1771371 -1486120
39928a486120k63313Q38M75638N01249K66670J00466j87432p21146j012347n92522
$$ -1486120 -1749433 -1748595 -1272957 -771708 -505038 -404572 -592004 -1313150 -2325497 -2918019
39918b918019K13628O31927L31362l25056p16481m66685K57696Q13347O77503
$$ -2918019 -2704391 -2072464 -1741102 -2066158 -2782639 -3249324 -2991628 -2178281 -1500778
39909a500778O5436k88611Q347O40715J043566Q95303K36975m64283m73250M24642
$$ -1500778 -1435342 -1723953 -1715606 -1074891 -31325 863978 1100953 636670 163420 588062
39899E88062J362517J318888N83612M00389J003869J128676L827j273932j293780
$$ 588062 1950579 3269467 3853079 4253468 5257337 6386013 6389840 5115908 3822128
39890C822128l83247O3555l00355o56439o77947q61295j186871q80142J27676
$$ 3822128 3438881 3502436 3202081 2545642 1867695 1006400 -180471 -1060613 -932937
39881i32937P63570L99442k16513k63385m5018q2466k182O05393J014675L27141
$$ -932937 -169367 230075 13562 -249823 -294841 -377307 -379489 225904 1240579 1567720
39871A567720q85302j224410n19555Q0572L1755O1797O83085J307446J316434
$$ 1567720 682418 -541992 -1061547 -980975 -949220 -887423 -204338 1103108 2419542
39862B419542R31013M74937k15896j020501j158401l92147K54590j09755q71116
$$ 2419542 3350555 3825492 3609596 2589095 1430694 1038547 1293137 1183382 312266
39853C12266r05094k70912J96196M04778Q25445J164339O61412l48790o32346
$$ 312266 -592828 -863740 -667544 -262766 562679 1727018 2388430 2039640 1407294
39844A407294l7451J38118p11320j315681m06483J196629J535619J06108j558789
$$ 1407294 1369843 1507961 796641 -519040 -925523 271106 1806725 1912833 354044
39835C54044j852712q41292J59510K46890k11194l16332J14359M44648L29315
$$ 354044 -1498668 -2339960 -2180450 -1933560 -2144754 -2461086 -2346727 -1902079 -1572764
39826a572764K53927N58032O33581q5894r36887r53156n27779p26423j201326
$$ -1572764 -1318837 -760805 -127224 -213118 -1150005 -2103161 -2630940 -3357363 -4558689
39817d558689n67136R99978J537835L49090o96961n9396J111095J057955K39686
$$ -4558689 -5125825 -4125847 -2588012 -2238922 -2935883 -2995279 -1884184 -826229 -586543
39808e86543J18238M33102l3625q13598l22485J247745J971621J167914J26099
$$ -586543 -468305 -35203 -68828 -882426 -1204911 42834 2014455 3182369 3308468
39799C308468l59436r60802j819489j767557m40586P41495P52779M09840N43501
$$ 3308468 2949032 1988230 168741 -1598816 -2039402 -1297907 -545128 -135288 408213
39790D08213M40905m93399j088081j62132J226521J164915k08034j009337m52521
$$ 408213 849118 355719 -732362 -894494 332027 1496942 1288908 279571 -172950
39781a72950L42330L35232j46513l39005j15596J71343J68701k63600p53316n16170
$$ -172950 169380 504612 358099 19094 -96502 74841 243542 -20058 -773374 -1289544
39771a289544N97442J485199J044353k54215r68942o50302k06532l89338r10051
$$ -1289544 -692102 793097 1837450 1583235 614293 -36009 -242541 -631879 -1541930
39762a541930j153152r14807k95724M44865Q67834P92796O77752R49639J208240
$$ -1541930 -2695082 -3609889 -3905613 -3460748 -2592914 -1800118 -1122366 -172727 1035513
39753A035513Q73291L07483K78650N28745J03436q97572j231492m68198K33253
$$ 1035513 1908804 2216287 2494937 3023682 3127118 2229546 998054 529856 763109
39744G63109j32717r60455j022800j20584R43888J447687J222036N37040j0740
$$ 763109 630392 -330063 -1352863 -1473447 -529559 918128 2140164 2677204 2666464
39735B666464R6106O72554R99470P49542K39853k54401p36041j013515q40675
$$ 2666464 2762570 3435124 4434594 5184136 5423989 5169588 4433547 3420032 2579357
39726B579357n76076p20513p66382K16315J637904J591256l63377k146776j874989
$$ 2579357 2003281 1282768 516386 732701 2370605 3961861 3598484 1451708 -423281
39717d23281k67148P80328P17227J27372p38530j625320j550468k01384Q29338
$$ -423281 -690429 89899 807126 934498 195968 -1429352 -2979820 -3181204 -2351866
39708b351866J13536j089974n56978J222638J611028L545j227335n16516P19435
$$ -2351866 -2238330 -3328304 -3885282 -2662644 -1051616 -1048071 -2275406 -2791922 -2072487
39699b072487P85201L12244O00007J163220P95337j44896l74405J32020L04111
$$ -2072487 -1287286 -975042 -375035 788185 1583522 1438626 1064221 1196241 1500352
39690A500352j02801k68900J75378O60828O70298K35262m73767j216808j497617
$$ 1500352 1397551 1128651 1304029 1964857 2635155 2870417 2396650 1179842 -317775
39681c17775j075354m62149k20591j16796K63083N34957J73589k51710K46562
$$ -317775 -1393129 -1855278 -2075869 -2192665 -1929582 -1394625 -1221036 -1472746 -1226184
39672a226184J289319J362005L8545j267967j251984l55379K01166J79743K65724
$$ -1226184 63135 1425140 1463685 195718 -1056266 -1411645 -1210479 -1030736 -765012
39663g65012P29952J030244P04639N2774k51635L0218M40340L47558l32102j047876
$$ -765012 -35060 995184 1699823 1752597 1500962 1531180 1971520 2319078 1986976 939100
39653I39100j272069j040946p07228m09711n6454L53905O85142Q21910P05138
$$ 939100 -332969 -1373915 -2081143 -2490854 -2547308 -2193403 -1508261 -686351 18787
39644A8787M13538K90713N69359P51029N3447j187589j466124j84024J115821
$$ 18787 432325 723038 1292397 2043426 2096873 909284 -556840 -740864 374957
39635C74957P16658p80226j341107m28440N78330P58625O81173P83787M78872
$$ 374957 1091615 311389 -1029718 -1458158 -879828 -121203 559970 1343757 1822629
39626A822629m15443q70438k32663O06010O33549K57499L49599O70121M23552
$$ 1822629 1407186 536748 304085 910095 1543644 1801143 2150742 2820863 3244415
39617C244415k80256o50045m33589K0604M44368N73156n26j022872j328043m01003
$$ 3244415 2964159 2314114 1880525 1901129 2345497 2918653 2918127 1895255 567212 166209
39607A66209N36140J82533q02517q24250J63711Q14517O67993N12072N41031K80
$$ 166209 702349 884882 82365 -741885 -578174 236343 904336 1416408 1957439 1957719
39597A957719j037589j303144l42370O28794O07228J65038J24920J79497j80111
$$ 1957719 920130 -383014 -725384 -96590 510638 675676 800596 980093 799982
39588G99982m78248j03422N22454O81960N38892N76753N53059M3497n82366p56130
$$ 799982 321734 218312 740766 1422726 1961618 2538371 3091430 3134927 2552561 1796431
39578A796431o99618p72311m60745P18190J800393J334321m05419j615760j445097
$$ 1796431 1096813 324502 -136243 581947 2382340 3716661 3311242 1695482 250385
39569B50385q62241p74440p04029N647Q52722R68553M75139J53773K53032M24858
$$ 250385 -611856 -1386296 -2090325 -2084678 -1231956 -263403 211736 365509 618541 1043399
39559A043399N08130O39869P68886O78748M05090J49057j13687m89409p50816
$$ 1043399 1551529 2191398 2960284 3639032 4044122 4193179 4079492 3590083 2839267
39550B839267n56339o7431J14769k83312q66365j102327q77757l84370K36765
$$ 2839267 2282928 2215497 2330266 2046954 1180589 78262 -799495 -1183865 -947100
39541i47100Q64178J177992Q25173j01006r39666j019292l41978M14344O29534
$$ -947100 -82922 1095070 1920243 1819237 879571 -139721 -481699 -67355 562179
39532E62179L68739J78002L57683O32153N42318j2786o84251r97476p40920j80157
$$ 562179 930918 1108920 1466603 2098756 2641074 2628288 1944037 946561 205641 25484
39522B5484R8002k25418o95346m56724O51097J660464J522445M14033m99428n61608
$$ 25484 123486 -101932 -797278 -1254002 -602905 1057559 2580004 2994037 2494609 1933001
39512A933001k60647k00872j69346K14050N06716J3883q76055r53188P8061J101954
$$ 1933001 1672354 1471482 1302136 1516186 2022902 2036785 1160730 207542 285603 1387557
39502A387557J213360Q86360Q70497Q23183Q1316q20658p08467L20649Q24020
$$ 1387557 2600917 3487277 4357774 5180957 5262273 4441615 3733148 4053797 4877817
39493D877817L6268j142712j530152j049254k95114L64538O75622K99155n82654
$$ 4877817 4914085 3771373 2241221 1191967 896853 1261391 1937013 2236168 1653514
39484A653514j099622p83117k31153q0230j4510M32612Q00328M38113k09206j96105
$$ 1653514 553892 -229225 -460378 -540608 -555118 -122506 677822 1115935 906729 710624
39474G10624L56946M59842j19733n93160n44555m42580n63667m85119n969L75793
$$ 710624 1067570 1527412 1407679 814519 269964 -172616 -736283 -1221402 -1227371 -851578
39464h51578L27960J96241K37255J46570j83488k28202K70187O67176L38318l25190
$$ -851578 -523618 -327377 -90122 56448 -127040 -355242 -85055 582121 920439 595249
39454E95249n16705j73249J16342L8061j95906k74556L679O76790J351257J310033
$$ 595249 78544 -94705 21637 59698 -136208 -410764 -407085 269705 1620962 2930995
39444B930995L43029q07487j230719p87375M3546Q05862J144188P62968j11686
$$ 2930995 3274024 2466537 1235818 448443 491989 1297851 2442039 3205007 3093321
39435C093321o50334l95734O7146r657m52874o33557n14348m08965j68657M09702
$$ 3093321 2442987 2047253 2114399 2104742 1651868 1018311 503963 94998 -73659 336043
39425C36043P60680K75522m30919k81851L51502P478j395083k045879q40896R70677
$$ 336043 1096723 1372245 941326 659475 1010977 1018455 -376628 -2422507 -3263403 -2292726
39415b292726J681715J382562J116819Q93483R6440q22938p94801p3320p7621
$$ -2292726 -611011 771551 1888370 2781853 2878293 2055355 1260554 1187234 1109613
39406A109613j115784j772618j041149K48734Q19976O46522M01559J48594l48815
$$ 1109613 -6171 -1778789 -2819938 -2571204 -1751228 -1104706 -703147 -554553 -903368
39397i03368o60916k08719N77675P40386L06871K23491P40256R97082N08046m9389
$$ -903368 -1564284 -1773003 -1195328 -454942 -148071 75420 815676 1812758 2320804 2271415
39387B271415q2045r9970o52883j092363n23304N14100N85921n18022j426626
$$ 2271415 2189370 2089400 1436517 344154 -179150 334950 920871 402849 -1023777
39378a023777j136738k15005L43245M42451M61064L65176N7860k6726M17835P49999
$$ -1023777 -2160515 -2375520 -2032275 -1589824 -1128760 -763584 -705724 -732450 -314615 435384
39368D35384J70698r00434j214981m44691L99415M79683J86029K63347N98036
$$ 435384 606082 -294352 -1509333 -1954024 -1554609 -1074926 -888897 -625550 -27514
39359b7514N09807j11156n91080l73886K68453N67618J89226k97136m2871R25400
$$ -27514 482293 371137 -219943 -593829 -325376 242242 431468 134332 91461 1016861
39349A016861J500873Q14986n00357r97461l20307L35878n1552q72805p66858
$$ 1016861 2517734 3332720 2832363 1834902 1514595 1850473 1798921 926116 159258
39340A59258M58436J528474J289358K4158r74211q08992K21248J061834R88431
$$ 159258 617694 2146168 3435526 3459684 2485473 1676481 1897729 2959563 3947994
39331C947994K65882k46616r2204L18113K80154l33996r52636j007733o03573
$$ 3947994 4213876 3967260 3875056 4193169 4473323 4139327 3186691 2178958 1575385
39322A575385l80053p07782j170337j079144m47974j0571r3834m6528O93930J497012
$$ 1575385 1195332 487550 -682787 -1761931 -2209905 -2220476 -2314310 -2360838 -1666908 -169896
39312a69896J364585N49616K44455O59438O66692k65627j043814o24098L58155
$$ -169896 1194689 1744305 1988760 2648198 3314890 3049263 2005449 1381351 1739506
39303A739506O68502L23547J49458J57607k23598o70076k61287P52361J001567
$$ 1739506 2408008 2731555 2881013 3038620 2815022 2144946 1883659 2636020 3637587
39294C637587J14175o57979m83884k60426r73321j875014j507109J11336J503671
$$ 3637587 3751762 3093783 2609899 2349473 1376152 -498862 -2005971 -1894635 -390964
39285c90964J639127Q09537k10334r11398r60769k47914P42682J189304P84362
$$ -390964 1248163 2057700 1847366 935968 -24801 -272715 469967 1659271 2443633
39276B443633k2077o45651q45482o22344j03109M31295P59503R15933Q56111K08921
$$ 2443633 2421556 1775905 930423 308079 204970 636265 1395768 2311701 3167812 3376733
39266C376733j028121j808767j015287P93531J649532O45939p84785p88303M80480
$$ 3376733 2348612 539845 -475442 318089 1967621 2613560 1828775 1040472 1520952
39257A520952J322402Q97988R035m12305m30444m47722m06424j82704n5142j77108
$$ 1520952 2843354 3741342 3750377 3338072 2907628 2459906 2053482 1870778 1815636 1638528
39247A638528j45981K50255L53014m75686j580285j594932l27571Q61030Q47317
$$ 1638528 1492547 1742802 2095816 1620130 39845 -1555087 -1882658 -1021628 -174311
39238a74311R2151k98058j48587j05231l86706n32287l01832j1284J70262N44676
$$ -174311 -82160 -380218 -528805 -634036 -1020742 -1553029 -1854861 -1866145 -1695883 -1151207
39228a151207J174175J415094O73314o60851j519896j319354m51498L43301P50631
$$ -1151207 22968 1438062 2111376 1450525 -69371 -1388725 -1840223 -1496922 -746291
39219g46291R25116J002804Q17401J63790p48278j298902j059456k83438M01039
$$ -746291 178825 1181629 1999030 2162820 1414542 115640 -943816 -1227254 -826215
39210h26215O90049P14830N66858J93956j73208p7521L87254M18791l62917j090824
$$ -826215 -136166 578664 1145522 1339478 1166270 1088749 1476003 1894794 1531877 441053
39200D41053o68964O39271J438797R83689n2459o93182p39857m36969J49131Q41473
$$ 441053 -227911 411360 1850157 2833846 2781387 2088205 1348348 911379 1060510 1901983
39190A901983J027127L35584o55607j012913n44246K13365Q16049J079027O85705
$$ 1901983 2929110 3264694 2609087 1596174 1051928 1265293 2081342 3160369 3846074
39181C846074n00249j732264j884652r09022j407L4646j96586J61961Q15118Q99880
$$ 3846074 3345825 1613561 -271091 -1180113 -1181520 -1146874 -1343460 -1181499 -366381 533499
39171E33499M46461K42055M49503M11209r2809m01395j38114O8486l67963q99600
$$ 533499 979960 1222015 1671518 2082727 1989918 1588523 1450409 1518895 1150932 251332
39161B51332n86322M35440J047190O55287j04098l22298O3132M09374L00563l0476
$$ 251332 -334990 100450 1147640 1802927 1698829 1376531 1439663 1849037 2149600 2119124
39151B119124j56066m3732k0559k14310k99443M904M13732M62744K82921L73195
$$ 2119124 1963058 1919326 1898767 1684457 1385014 1389918 1803650 2266394 2549315 2922510
39141B922510N69654Q6259j038279j461820l37758J153180J232709K1474p76784
$$ 2922510 3492164 3578423 2540144 1078324 740566 1893746 3126455 3147929 2371145
39132B371145n15319l14850q41107j059862r9489J064833J079002L31492J30551
$$ 2371145 1855826 1540976 699869 -359993 -459482 605351 1684353 2015845 2146396
39123B146396M60884K01492p18590j076970m07508K68617K25555J59008P78806
$$ 2146396 2607280 2808772 2090182 1013212 605704 874321 1099876 1258884 2037690
39114B037690J420937J064798l0997p55288p62187o66194p96006o67004J58487
$$ 2037690 3458627 4523425 4492428 3737140 2974953 2308759 1512753 845749 1004236
39105A004236J287742J823435J244397p9119j121766j096470k81242K58644m6705
$$ 1004236 2291978 4115413 5359810 5280691 4158925 3062455 2781213 3039857 2993152
39096B993152o00573n52753O244K92741L0223k52900j42041N4104j33963n68748
$$ 2993152 2392579 1839826 1846070 2138811 2169034 1916134 1774093 1828197 1694234 1125486
39086A125486o66648j89155M47814P30668P06675Q26197J140616J067688K85671
$$ 1125486 458838 269683 717497 1448165 2154840 2981037 4121653 5189341 5475012
39077E475012m97428l30172N30646P89214n7885r18841o53042L33980Q05716M51473
$$ 5475012 4977584 4647412 5178058 5967272 5909387 4990546 4337504 4671484 5477200 5928673
39067E928673K5964N4879L36720O26415R32688J096577Q61687M63042M27675O79761
$$ 5928673 5954637 6009516 6346236 6972651 7905339 9001916 9863603 10326645 10754320 11434081
39057A1434081N53434j66666r34102j332384j512480j499468r06385K02626R29677
$$ 11434081 11987515 11820849 10886747 9554363 8041883 6542415 5636030 5838656 6768333
39048F768333O65746L2969L3695O73209J095155P93224N3481o04517q38306m94560
$$ 6768333 7434079 7467048 7500743 8173952 9269107 10062331 10115812 9511295 8672989 8178429
39038H178429K08954N99500J96837n74003q17262l24627K04355J97116l4241J47442
$$ 8178429 8387383 8986883 9183720 8609717 7792455 7467828 7672183 7869299 7835058 7982500
39028G982500P14558R47607L81032n21667q57548l88467J54671O9228l20043j46099
$$ 7982500 8697058 9644665 10025697 9504030 8646482 8258015 8412686 8481914 8161871 8015772
39018H015772O35906J053045M86618m10564o27213j39780K35161M0114l74968
$$ 8015772 8651678 9704723 10191341 9780777 9153564 9013784 9248945 9289059 8914091
39009H914091m92615k02088K52283N15056L41507j25963l99015k33317J3952m7095
$$ 8914091 8421476 8219388 8471671 8986727 9328234 9202271 8803256 8569939 8583891 8536796
38999H536796j68511J39438P12515Q48925L59237o6639K44827J077105J602431
$$ 8536796 8368285 8507723 9220238 10069163 10428400 10361761 10606588 11683693 13286124
38990A3286124J333964O07017J70516L73462Q01201Q36589N29033N62448J262923
$$ 13286124 14620088 15227105 15397621 15771083 16572284 17408873 17937906 18500354 19763277
38981A9763277K087111K365917K104438J673340J197750P77518Q38541J568574
$$ 19763277 21850388 24216305 26320743 27994083 29191833 29969351 30807892 32376466
38973C2376466K364490K607038K694825L461696M784792N732189O037246O440208
$$ 32376466 34740956 37347994 40042819 43504515 48289307 54021496 60058742 66498950
38965F6498950P477276Q908273J0578224J2925792J6270252K0347302K4869395
$$ 66498950 73976226 82884499 93462723 106388515 122658767 143006069 167875464
38958A67875464K9843742L5103813M0297558M5498096N0744206N4459823N3403576
$$ 167875464 197719206 232823019 273120577 318618673 369362879 423822702 477226278
38951D77226278M5225731L0828011J3888306j349457j1746007j6226676j6349686
$$ 477226278 522452009 553280020 567168326 565818869 554072862 537846186 521496500
38944E21496500j5334024j5425581j6361236j6831428j6626690j6442847j6323835
$$ 521496500 506162476 490736895 474375659 457544231 440917541 424474694 408150859
38937D08150859j5591640j4091651j2456026j1230759j0538269j0341107j0210998
$$ 408150859 392559219 378467568 366011542 354780783 344242514 333901407 323690409
38930C23690409r190595o869141m325947k972536k677639k136195r28007j4568
$$ 323690409 314499814 307630673 303304726 300332190 297654551 295518356 294590349 294575781
38922B94575781k74375j873777n179303j0767986j7903424k4168240k7422545
$$ 294575781 294301406 292427629 287248326 276480340 258576916 234408676 206986131
38915B06986131k7487688k5547671k2790589k0053954j7743915j5369733j1996506
$$ 206986131 179498443 153950772 131160183 111106229 93362314 77992581 65996075
38908F5996075p878727m823721m108255m773819m915392m029463l058703k619414
$$ 65996075 58117348 53293627 49185372 44411553 39496161 35466698 32407995 29788581
38900B9788581k382370k034406j711572j372352o85920K21940O77369M02835o3364
$$ 29788581 27406211 25371805 23660233 22287881 21601961 21823901 22501270 22904105 22840741
38891B2840741j98836k17548n74125j138612j334676r70395n37858n98942j079642
$$ 22840741 22641905 22424357 21850232 20711620 19376944 18406549 17868691 17269749 16190107
38882A6190107j361044j065066n53849m68361q87142j244073j092706o27449l30071
$$ 16190107 14829063 13763997 13210148 12741787 11854645 10610572 9517866 8890417 8560346
38873H560346l75965n41396m91585p5097M55146N28236j03125q40478q41958j68352
$$ 8560346 8184381 7642985 7151400 7076303 7531449 8059685 7956560 7116082 6274124 6105772
38863F105772K93996J75382J03210M94819P36953K54439l39574j07694O71217
$$ 6105772 6399768 6575150 6678360 7173179 7910132 8164571 7824997 7717303 8388520
38854H388520Q73520K32337l75604l52067r7844j20336l18988n02178q20711j197518
$$ 8388520 9262040 9494377 9118773 8766706 8668862 8548526 8229538 7727360 6906649 5709131
38844E709131r83587J68990J482961J767879Q31324l52971q82459q61026r36851
$$ 5709131 4725544 4894534 6377495 8145374 8976698 8623727 7741268 6880242 5943391
38835E943391j272929j373553q99156k43626p558j24811J5867N90250J021419
$$ 5943391 4670462 3296909 2397753 2154127 2146569 2021758 2037625 2627875 3649294
38826C649294Q41147L37671k7332l57276r29137j436966j304628n84573J03550
$$ 3649294 4490441 4828112 4800780 4443504 3514367 2077401 772773 188200 291750
38817B91750M64667P45301J068769J164842Q61278L34917k21597p21666r15224
$$ 291750 756417 1501718 2570487 3735329 4596607 4931524 4709927 3988261 3073037
38808C073037m94038M00737J175731J378337R69720R7742r22324j494241j229447
$$ 3073037 2578999 2979736 4155467 5533804 6503524 6601266 5678942 4184701 2955254
38799B955254n75980l56704o55332q08356n11811j51108O6020M11088Q28009P67112
$$ 2955254 2379274 2022570 1367238 558882 47071 -104037 -38017 373071 1201080 1968192
38789A968192K24325l640L57213M44850l09122j088770r72554m26501l50030l86420
$$ 1968192 2192517 2188877 2546090 2990940 2681818 1593048 620494 193993 -156037 -542457
38779e42457L49586J326358J081916l37607j120390l17315P95221P60601L5619
$$ -542457 -192871 1133487 2215403 1877796 757406 440091 1235312 1995913 2031532
38770B031532o2865M76283N82742j8646m92167l46028k5220R1994K60643N96320
$$ 2031532 1968667 2444950 3027692 3009046 2516879 2170851 2145631 2237625 2498268 3094588
38760C094588O16226N8406n30657o10794m80146o17200o87704j04026O89286N66399
$$ 3094588 3710814 3769220 3238563 2627769 2147623 1530423 842719 738693 1427979 1994378
38750A994378n20039j186180n09129O22711Q01848O2457m04366q5849L70573M15651
$$ 1994378 1474339 288159 -220970 401741 1203589 1266046 861680 775831 1146404 1562055
38740A562055K94161L04570K62818K4121j99895l64502p29089j138592r11845
$$ 1562055 1856216 2160786 2423604 2447725 2247830 1883328 1154239 15647 -896198
38731h96198R6211J015690J082540O13357L16143K82580K97046M71300P93719
$$ -896198 -799987 215703 1298243 1911600 2227743 2510323 2807369 3278669 4072388
38722D072388O81571j08005o97649k66801M97212L49575m75423n91089K87592
$$ 4072388 4753959 4645954 3948305 3681504 4178716 4528291 4052868 3461779 3749371
38713C749371R30518O28482J35050R7068K803n23176o99123N9962Q24495M59985
$$ 3749371 4679889 5308371 5443421 5540489 5543292 5020116 4320993 4380955 5205450 5665435
38703E665435m86732n82537K16372M74599n49368j851226k075012j060105L33262
$$ 5665435 5178703 4596166 4812538 5287137 4737769 2886543 811531 -248574 84688
38694H4688J246639J313773O59688j82208o04525m32714k66K90649L14410K03884
$$ 84688 1331327 2645100 3304788 3122580 2518055 2085341 2085075 2375724 2690134 2894018
38684B894018K08593M68050P21329M56347l72151j068311j044484o26954m65242
$$ 2894018 3102611 3570661 4291990 4748337 4376186 3307875 2263391 1636437 1171195
38675A171195m48564K2165Q18533J031214K74274p40645j184757r73478l93051
$$ 1171195 722631 744796 1563329 2594543 2868817 2128172 943415 -30063 -423114
38666d23114L75966R54812P36994k16423q42581l54891N88306P68138J37087k10496
$$ -423114 -47148 907664 1644658 1428235 585654 230763 819069 1587207 1724294 1513798
38656A513798K91505R24279P88099m0049p87410r54267o81362m49629o28594j089375
$$ 1513798 1805303 2729582 3517681 3477632 2690222 1735955 1054593 604964 -23630 -1113005
38646a113005j199011n31091L95361N89397n9243n16875n5274O62684N87279j10839
$$ -1113005 -2312016 -2843107 -2447746 -1858349 -1917592 -2434467 -2489741 -1827057 -1239778 -1350617
38636a350617l33388K14008N80508Q0286o39307n68671K37958Q46980O92878L1862
$$ -1350617 -1684005 -1469997 -889489 -809203 -1448510 -2017181 -1779223 -932243 -239365 -207503
38626b07503o09060q34401l96065N48601J229856R51280N0319m29930j32040K21757
$$ -207503 -816563 -1650964 -2047029 -1498428 -268572 682708 733027 303097 171057 392814
38616C92814M1996k81099k19393r6860m87270j081320j033304k64730M10626M60875
$$ 392814 434810 153711 -65682 -162542 -649812 -1731132 -2764436 -3029166 -2618540 -2157665
38606b157665J76781l8019j68532j94162Q3334N19373O00225K96126K78571Q29035
$$ -2157665 -1980884 -2018903 -2187435 -2381597 -2298263 -1778890 -1178665 -882539 -603968 225067
38596B25067J204493P27422r1780l28450o8834r7722m43215l41941L15094O14463
$$ 225067 1429560 2156982 2065202 1736752 1667918 1570196 1126981 785040 1100134 1714597
38586A714597N6620n75778l61131M19673P10239K7806j120709j842184j509336
$$ 1714597 1771217 1195439 834308 1253981 1964220 1992026 871317 -970867 -2480203
38577b480203k08769J103036J340765N57606m7230K27495O42630L14691l71283
$$ -2480203 -2688972 -1585936 -245171 312435 265205 492700 1135330 1450021 1078738
38568A078738n91625n65376r03231j039083L4142J633620J845651M21819o41318
$$ 1078738 487113 -78263 -981494 -2020577 -1986435 -352815 1492836 1914655 1273337
38559A273337j29088O20435J31084p63121n83422Q1719l08156j276687q95659
$$ 1273337 1144249 1764684 1895768 1132647 549225 630944 322788 -953899 -1849558
38550a849558R00329J971377J269875K18219M7095r0904j082498j777301p26081
$$ -1849558 -949229 1022148 2292023 2510242 2557337 2466433 1383935 -393366 -1119447
38541a119447J210088J874694Q19048m14608o90802l71449p0750K07598M60545
$$ -1119447 90641 1965335 2784383 2369775 1678973 1307524 1236774 1444372 1904917
38532A904917M03791J26377J14236L94290M81952L03465K69816K96175k28802
$$ 1904917 2308708 2435085 2549321 2943611 3425563 3729028 3998844 4295019 4066217
38523D066217j197101j574272r75181m49914r13656j611055j159204L59734J434711
$$ 4066217 2869116 1294844 319663 -130251 -1043907 -2654962 -3814166 -3454432 -2019721
38514b019721J173886L74772L12106J114659J764275J425370L83988l95308m66389
$$ -2019721 -845835 -471063 -158957 955702 2719977 4145347 4529335 4134027 3667638
38505C667638l77299p84475j365083j141272Q1128J210938J160664J91160n20239
$$ 3667638 3290339 2505864 1140781 -491 80637 1291575 2452239 2643399 2123160
38496B123160l87589O4113J46407n0918Q5434P33089J259282R25223j71407j133967
$$ 2123160 1735571 1799684 1946091 1895173 1980607 2713696 3972978 4898201 4726794 3592827
38486C592827j306834r32132n43733j60646L81607O93599K78187m30410m63022
$$ 3592827 2285993 1353861 810128 649482 1031089 1724688 2002875 1572465 1109443
38477A109443J53915L26555l25813p54638j91755N05068K03364o52494p46638
$$ 1109443 1263358 1589913 1264100 509462 317707 822775 1026139 373645 -372993
38468c72993P3101P12030N43732M7955k01833j47981J47376N33659M12342o43053
$$ -372993 -299892 412138 955870 1003825 801992 654011 801387 1335046 1747388 1104335
38458A104335j843202j814185m74694P33758P75667J67066j90712k79229m44532
$$ 1104335 -738867 -2553052 -3027746 -2293988 -1518321 -1351255 -1541967 -1821196 -2265728
38449b265728n01015j45049L26254M31602K37380J16163J48946K18787L11664
$$ -2265728 -2766743 -2911792 -2585538 -2153936 -1916556 -1800393 -1651447 -1432660 -1120996
38440a120996L52151J68638q0477K5871M14566N01752K30690K77177P80235Q66667
$$ -1120996 -768845 -600207 -680684 -654813 -240247 261505 492195 769372 1549607 2416274
38430B416274J29293m72825j66344K04803l96420j207294p39166O64708J175226
$$ 2416274 2545567 2072742 1906398 2111201 1714781 507487 -231679 433029 1608255
38421A608255L14095l78149J53104R90298R40874K86134o7943n7461r9603j37482
$$ 1608255 1922350 1544201 1697305 2687603 3628477 3914611 3846668 3789207 3689604 3552122
38411C552122j9223j44171p77949j273115r20502j52281N7711k99947l40419K36593
$$ 3552122 3532899 3388728 2610779 1337664 417162 264881 322592 22645 -317774 -81181
38401h1181O75408L17064n17303j052312r38183l55508L41376P97018P43557K34694
$$ -81181 594227 911291 393988 -658324 -1596507 -1952015 -1610639 -813621 -70064 164630
38391A64630k63428k34568L30087P97912N03427m07512r62778m72410N42704R71892
$$ 164630 -98798 -333366 -3279 794633 1298060 890548 -72230 -544640 -1936 969956
38381I69956N39113J3659K453K55669L66495L93564L91069N4773n92746q18967
$$ 969956 1509069 1522728 1525181 1780850 2147345 2540909 2931978 2986751 2394005 1575038
38371A575038j89765N88307O29888J99477J54183M32110K22223m52970n51689
$$ 1575038 1385273 1973580 2603468 2802945 2957128 3389238 3611461 3158491 2606802
38362B606802K75907Q74096J51627j261750j750053p75692N66030J054766P41674
$$ 2606802 2882709 3756805 3908432 2646682 896629 120937 686967 1741733 2483407
38353B483407N03921O23390M73042k84334q90134n31655K51715K31097n18750
$$ 2483407 2987328 3610718 4083760 3799426 2909292 2377637 2629352 2860449 2341699
38344B341699n83969M34590R60873j76838j701304j724697o37419k46998o39610
$$ 2341699 1757730 2192320 3153193 2976355 1275051 -449646 -1087065 -1334063 -1973673
38335a973673k02392J219306J662600K89617r91701m74426P07017O13589l68830
$$ -1973673 -2176065 -956759 705841 995458 3757 -470669 236348 849937 481107
38326D81107n12179K12149L84280q5756J69955J228147J303617l32073j784279
$$ 481107 -31072 181077 565357 479601 649556 1877703 3181320 2849247 1064968
38317A064968j098332R43022J933719R64537o28515j225206n35825O05015J174020
$$ 1064968 -33364 909658 2843377 3807914 3179399 1954193 1418368 2023383 3197403
38308C197403O69139m56367j030562l55528Q44246J194348M02432m11318l29924
$$ 3197403 3866542 3410175 2379613 2024085 2868331 4062679 4465111 4053793 3723869
38299C723869O9471l61381j494443j868317o61926J015487J412869L19177q19085
$$ 3723869 3793340 3431959 1937516 69199 -592727 422760 1835629 2154806 1335721
38290A335721q88412l65091k87097p23114r00018m35087K55191O51274O74754
$$ 1335721 447309 82218 -204879 -927993 -1828011 -2263098 -2007907 -1356633 -681879
38281f81879N32401M13803L73419K94774O0087j28021Q2815M93478L29502o32790
$$ -681879 -149478 264325 637744 932518 992605 864584 947399 1440877 1770379 1137589
38271A137589j433886j093613R533P11461O81357N51250O43058O03257K98186
$$ 1137589 -296297 -1389910 -1380377 -668916 12441 563691 1206749 1810006 2108192
38262B108192N0082j37383n98475j084267q56631L1834O13880N14815M48589P21774
$$ 2108192 2158274 2020891 1422416 338149 -518482 -486648 127232 642047 1090636 1812410
38252A812410N04754n90399j410895q87026K13796M76965K8633M7792N93637N86870
$$ 1812410 2317164 1726765 315870 -571156 -357360 119605 148238 196030 789667 1376537
38242A376537j11250k57074P31254J651497J149348m51545j674648j661491q21950
$$ 1376537 1265287 1008213 1739467 3390964 4540312 4088767 2414119 752628 -69322
38233f9322r9429n0228m48255n78112q1701N43209O17272K50097N3980O9233j94947
$$ -69322 -168751 -218979 -667234 -1245346 -1327047 -783838 -166566 83531 137511 206744 11797
38222A1797o49581n27315L37776J050956R14718L22724j03554m38178q49161q63742
$$ 11797 -637784 -1165099 -827323 223633 1138351 1461075 1357521 919343 70182 -793560
38212g93560j22467P09803P57020K74169J90401N61761N48644p5252m60713j0461
$$ -793560 -916027 -206224 550796 824965 1015366 1577127 2125771 2050519 1589806 1579345
38202A579345P14473Q51989L35972l15122p49016q29271m12087L30387O56652
$$ 1579345 2293818 3145807 3481779 3166657 2417641 1588370 1176283 1506670 2163322
38193B163322m3392j342439k057921j497782j16714J050989J306765O84895j76310
$$ 2163322 2119930 777491 -1280430 -2778212 -2894926 -1843937 -537172 147723 -28587
38184b8587m96657l4642N88347N55521p7762l99471R3995P51162P03815J16649
$$ -28587 -525244 -559886 28461 583982 506220 106749 200744 951906 1655721 1772370
38174A772370j40316J82880M83868L68097J37221N4469p3286k39711K7451P21419
$$ 1772370 1632054 1814934 2298802 2666899 2804120 2858589 2785303 2545592 2573043 3294462
38164C294462Q97017n2762j255651j445520p61934l86666o37151o59003n9115
$$ 3294462 4191479 4138717 2883066 1437546 675612 288946 -348205 -1007208 -1066323
38155a066323M33846K98247L0074M9288j21292p87258j141220m25870O50327Q25228
$$ -1066323 -632477 -334230 -304156 -254868 -376160 -1163418 -2304638 -2730508 -2080181 -1254953
38145a254953K05892O7940Q42174J482855J064520L1817n63619l73562J47443
$$ -1254953 -1049061 -981121 -138947 1343908 2408428 2440245 1876626 1503064 1650507
38136A650507M63500L64968k4796l32002k38638J14129K53412r322l87196o05140
$$ 1650507 2114007 2478975 2454179 2122177 1883539 1997668 2251080 2241758 1854562 1249422
38126A249422o81768n94505j39933N56819Q05514J17948r72784j363004o68220
$$ 1249422 567654 -26851 -166784 390035 1195549 1313497 340713 -1022291 -1690511
38117a690511L48931P74527O09557N28112P80758Q49880L50410k00495l4616O34752
$$ -1690511 -1341580 -567053 42504 570616 1351374 2201254 2551664 2351169 2316553 2951305
38107B951305P24020k03559j186724j107723k07810L02714q6044o44909n77645
$$ 2951305 3675325 3471766 2285042 1177319 969509 1272223 1186179 541270 -36375
38098c6375n5726K11161j3596l10257k64225J0416P7696j83698l19268J11955
$$ -36375 -92101 119060 105464 -204793 -469018 -458602 -380906 -564604 -883872 -771917
38088g71917P54221P26472j24669p85182l73983N72376Q01859K8465q72169j160162
$$ -771917 -17696 708776 584107 -201075 -575058 -2682 799177 827642 -44527 -1204689
38078a204689q57091j56347Q06668J480341J213413L62746J10596P36150J065426
$$ -1204689 -2061780 -2218127 -1411459 68882 1282295 1645041 1755637 2491787 3557213
38069C557213K88272o55780m58228N41659Q65434J9146j016485j288125q50960
$$ 3557213 3845485 3189705 2731477 3273136 4138570 4157716 3141231 1853106 1002146
38060A002146k00502L95380P87355Q17126N36980J76723j45656l64259l00974
$$ 1002146 801644 1197024 1984379 2801505 3338485 3515208 3369552 3005293 2704319
38051B704319o61M0111m35886q15826m20693L08413L51233k66703m43110K75364
$$ 2704319 2703658 2743769 2307883 1492057 1071364 1379777 1731010 1464307 1021197 1296561
38041A296561R91028Q27359N4412o12546r67070j035771o86244j51682j78938
$$ 1296561 2287589 3114948 3169360 2556814 1589744 553973 -132271 -283953 -462891
38032d62891r08258j287823m45010R39251J539867J184560P39504N77329L05277
$$ -462891 -1371149 -2658972 -3103982 -2164731 -624864 559696 1299200 1876529 2181806
38023B181806j08240j18295L13884M53499n1725n91996n57776j51578J78332M50187
$$ 2181806 2073566 1955271 2269155 2722654 2670929 2078933 1521157 1369579 1547911 1998098
38013A998098P91450R00604M25623m20802j036778j009332l26011O33247J163351
$$ 1998098 2789548 3690152 4115775 3694973 2658195 1648863 1322852 1956099 3119450
38004C119450P94426o471k83515K0287q6438r65662j480664o60444O24400Q71150
$$ 3119450 3913876 3907405 3623890 3644177 3557739 2592077 1111413 450969 1075369 1946519
37994A946519K24485N2795N27918L74591p21263j235297j79099J131267R30925
$$ 1946519 2171004 2223799 2751717 3126308 2405045 1169748 990649 2121916 3052841
37985C052841m14532j101491n17968K67884L57813k8138m57868q90715j156906
$$ 3052841 2638309 1536818 1018850 1286734 1644547 1616409 1158541 267826 -889080
37976h89080q81965k19923K12770L41376O62843J078847P72492l32361j069874
$$ -889080 -1771045 -1990968 -1778198 -1436822 -773979 304868 1077360 744999 -324875
37967c24875o48259J86735L83007R6063M4071J41102j02003l98360j30683L96867
$$ -324875 -973134 -786399 -403392 -307329 -263258 -122156 -224159 -622519 -753202 -356335
37957c56335L92248K5531J46636O36752M46648n21625r71104j54576R68352J206476
$$ -356335 35913 61444 208080 844832 1291480 769855 -201249 -355825 612527 1819003
37947A819003P12871K96152Q8015j78413k98963N954L45792K22427r2908r6440
$$ 1819003 2531874 2828026 2916041 2737628 2438665 2444619 2790411 3012838 2919930 2823490
37937B823490k2806l75058q94185r79647p93378q87294j020393n42691K03553
$$ 2823490 2800684 2425626 1531441 551794 -241584 -1128878 -2149271 -2691962 -2488409
37928b488409K10363m09384m04501M93161R01858k4797j070333o78114Q10337
$$ -2488409 -2278046 -2687430 -3091931 -2598770 -1696912 -1721709 -2792042 -3470156 -2659819
37919b659819J837799J791523J200230L44120q65239j802948j408920J89120J509403
$$ -2659819 -822020 969503 2169733 2513853 1648614 -154334 -1563254 -1374134 135269
37910A35269J565974R08178M11917L4202n76505j072958r07745l60772j95050
$$ 135269 1701243 2609421 3021338 3055540 2479035 1406077 498332 137560 -57490
37901e7490n02840o64846l87621o8543l1638n836L79663R70253J224532P86903
$$ -57490 -560330 -1225176 -1612797 -1681340 -1712978 -1718814 -1339151 -368898 855634 1642537
37891A642537j99011j151115j368106n85568O16036J206836P51240r4571l49890
$$ 1642537 1443526 292411 -1075695 -1661263 -1045227 161609 912849 818278 468388
37882D68388J68631P65849Q01655L30513k23196o08819p40645n02533L8730M28612
$$ 468388 637019 1402868 2204523 2535036 2311840 1703021 962376 459843 498573 927185
37872I27185L01414k3041N7957M22368K70405n83546j163245o26814M45709Q36032
$$ 927185 1228599 1205558 1263515 1685883 1956288 1372742 209497 -417317 28392 864424
37862H64424M01459O3062J88531O3641p37859j441562j146132j14665P01084R21078
$$ 864424 1265883 1328945 1517476 1581117 843258 -598304 -1744436 -1859101 -1158017 -236939
37852b36939Q08364M95001m0323m38979k58098K00190J23459o12937j160933q42956
$$ -236939 571425 1066426 1026103 587124 329026 529216 652675 39738 -1121195 -1964151
37842a964151J520O01142O82249M66887J57034j57553l15497j88393J13637L54870
$$ -1964151 -1962631 -1361489 -679240 -212353 -55319 -212872 -528369 -716762 -603125 -248255
37832b48255M08548K88339J14511J06224L61379N82450L46887k41916n64527l34283
$$ -248255 160293 448632 563143 669367 1030746 1613196 1960083 1718167 1153640 819357
37822H19357l913k7022j70554l3921J38591j78262q05574r74348m76101k120p3395
$$ 819357 815444 788422 617868 583947 722538 544276 -261298 -1235646 -1711747 -1713867 -1787262
37811a787262k45056J36399P96209Q13447k8735q11227o52857J35434N43607L04541
$$ -1787262 -2032318 -1895919 -1099710 -286263 -314998 -1126225 -1779082 -1643648 -1100041 -795500
37801g95500K07072P93094J352337Q20250o01740j513350j117997k07562Q3960
$$ -795500 -588428 204666 1557003 2377253 1775513 262163 -855834 -1063396 -979436
37792i79436j23862J33143R74088J340401N35159o89480j112604o60062l70733
$$ -979436 -1103298 -970155 3933 1344334 1879493 1190013 77409 -582653 -953386
37783i53386q37758j339442q32316N67223J596149J340241K84834l87978k79315
$$ -953386 -1791144 -3130586 -3962902 -3395679 -1799530 -459289 -174455 -562433 -841748
37774h41748j08286n72502j341282j490233p05206L37020Q01241O03597L28264
$$ -841748 -950034 -1522536 -2863818 -4354051 -5059257 -4722237 -3920996 -3317399 -2989135
37765b989135L97185N85841M51395O0457K943O05566J373554J449888N49150p43880
$$ -2989135 -2591950 -2006109 -1554714 -1494257 -1491314 -885748 487806 1937694 2486844 1742964
37755A742964j536147j363575n37263O7218j99650r30842r44633K11825J441649
$$ 1742964 206817 -1156758 -1694021 -1626803 -1826453 -2757295 -3701928 -3490103 -2048454
37746b048454J426016M14723k28403o4510L4123l41569l42189N52842J377654
$$ -2048454 -622438 -207715 -436118 -500628 -466505 -808074 -1150263 -597421 780233
37737G80233J074065J22228k96764n7346J21085Q1615K27161M76592M04443J97695
$$ 780233 1854298 1976526 1679762 1622416 1743501 1825116 2052277 2528869 2933312 3131007
37727C131007L58628O41519L90769k41266n61536o32805j028555j426264r09494
$$ 3131007 3489635 4131154 4521923 4280657 3719121 3086316 2057761 631497 -277997
37718b77997K57566P17590J78527r5145N52505J116093P85498K83904L44755L25731
$$ -277997 -20431 697159 875686 780541 1333046 2449139 3234637 3518541 3863296 4189027
37708D189027m01442r97413n65102J10783j18126o43326j64837P81727M58088
$$ 4189027 3787585 2790172 2225070 2335853 2217727 1574401 1409564 2191291 2649379
37699B649379j107358j903221r82955K27895L45121k604L39502J011856R46108
$$ 2649379 1542021 -361200 -1344155 -1116260 -771139 -773743 -434241 577615 1523723
37690A523723K97431J26896N69414O72404O0244m12876l2705O23917N11839m07821
$$ 1523723 1821154 1948050 2517464 3189868 3250112 2837236 2804531 3428448 3940287 3532466
37680C532466j205394j321477j149841j127694r35364j52091P49825Q84287L09823
$$ 3532466 2327072 1005595 -144246 -1271940 -2207304 -2359395 -1609570 -725283 -415460
37671d15460L1811M96185R64488P74372L52428L25786L87924o3287o90895o24312
$$ -415460 -383649 112536 1077024 1851396 2203824 2529610 2917534 2854247 2163352 1539040
37661A539040J69256Q69514J029383R10508O51207N4793o60213q10337k92197
$$ 1539040 1708296 2577810 3607193 4517701 5168908 5223701 4563488 3753151 3460954
37652C460954N0951m40696j259648j355391m64934N88171Q68576L66411n2902
$$ 3460954 3511905 3071209 1811561 456170 -8764 579407 1447983 1814394 1761492
37643A761492K30773P10152L99855o61180j272920p63719j8498j37838p83168
$$ 1761492 1992265 2702417 3102272 2441092 1168172 404453 385955 248117 -535051
37634e35051q36419k07386J75005n0027k75977j20331Q8687J56405L29115N30643
$$ -535051 -1371470 -1578856 -1403851 -1453878 -1729855 -1850186 -1761499 -1605094 -1275979 -745336
37624g45336K53933m63300q17652l76574K95284N18548L80568L83100O97868J020605
$$ -745336 -491403 -954703 -1772355 -2148929 -1853645 -1335097 -954529 -571429 126439 1147044
37614A147044Q24822j89122j466082j737822n33879Q19343P51045l03374n31745
$$ 1147044 1971866 1782744 316662 -1421160 -1955039 -1135696 -384651 -688025 -1219770
37605a219770M86475J216473O24108m03982o82631l18991Q2240M96018Q80705
$$ -1219770 -733295 483178 1107286 703304 20673 -298318 -216078 279940 1160645
37596A160645O63468k40800q87407o46335j42716o9426j09543J03941P6207m91207
$$ 1160645 1824113 1583313 695906 49571 -93145 -162571 -272114 -168173 -91966 -583173
37586e83173q19548l60825M3612m59101j167169r68274j73507J92935J46131L26792
$$ -583173 -1402721 -1763546 -1719934 -2179035 -3346204 -4314478 -4487985 -4295050 -4148919 -3822127
37576c822127N57104L30315J00204N05729Q96878L03182o44130n54829L55905
$$ -3822127 -3265023 -2934708 -2834504 -2328775 -1431897 -1128715 -1772845 -2327674 -1971769
37567a971769O77725L35863N88558J420364J180882n87781k004171j498734L2070
$$ -1971769 -1294044 -958181 -369623 1050741 2231623 1643842 -360329 -1859063 -1826993
37558a826993Q01367N12701L2918k16214l33889j57988M61859J021737Q73468
$$ -1826993 -1025626 -512925 -480007 -696221 -1030110 -1188098 -726239 295498 1168966
37549A168966J34540n02852o19143l03400J58887M71398M38000J28672k22911
$$ 1168966 1303506 800654 181511 -121889 36998 508396 946396 1075068 852157
37540H52157m77053n15625j46181N04962Q31329N42062K00381K53664J05912p79538
$$ 852157 375104 -140521 -286702 218260 1049589 1591651 1792032 2045696 2151608 1372070
37530A372070j423189m79742J378021J906572L20567j669092k220405j349090
$$ 1372070 -51119 -530861 847160 2753732 3074299 1405207 -815198 -2164288
37522b164288j34967O60324O57777j38841q48200m40839O00896P03451l16090
$$ -2164288 -2299255 -1638931 -981154 -1119995 -1968195 -2409034 -1808138 -1104687 -1420777
37513a420777q21110m2528O09331n6639j045176r70115k79757j04676j80377L47995
$$ -1420777 -2241887 -2284415 -1675084 -1731723 -2776899 -3747014 -4026771 -4131447 -4311824 -3963829
37503c963829J066322J006988M67783M29050P68348O73341K84074L02145M34509
$$ -3963829 -2897507 -1890519 -1422736 -993686 -225338 448003 732077 1034222 1468731
37494A468731j12782r24073q19295J62876Q00851O19384K87566J64135l8029j25169
$$ 1468731 1355949 431876 -387419 -224543 576308 1195692 1483258 1647393 1609364 1484195
37484A484195N00286J464035J570682O08758l07227m70989l88719n54554o83656
$$ 1484195 1984481 3448516 5019198 5627956 5320729 4849740 4461021 3906467 3222811
37475C222811n62238n16705o29602n16084j85383r1884j28589K63101P90505M90457
$$ 3222811 2660573 2143868 1514266 998182 812799 720915 592326 855427 1645932 2136389
37465B136389m51017o00140L94027R78850J65932p37617k25447R07224Q83842
$$ 2136389 1685372 1085232 1479259 2458109 2624041 1886424 1660977 2568201 3452043
37456C452043j48120m87221K29535M96365m98984j556895j386618m74026q7347
$$ 3452043 3303923 2816702 3046237 3542602 3043618 1486723 100105 -373921 -461268
37447d61268l55098l82963K28342R59892J243047R20990j5017j283198j907633
$$ -461268 -816366 -1199329 -970987 -11095 1231952 2152942 2137925 854727 -1052906
37438a052906r68843Q77196J607724L16259j298864j010832Q76420J910653Q47489
$$ -1052906 -2021749 -1144553 463171 779430 -519434 -1530266 -653846 1256807 2104296
37429B104296q67542j358882o31006J84932O45911Q93102O41026l73432j418107
$$ 2104296 1236754 -122128 -753134 -568202 77709 970811 1611837 1238405 -179702
37420a79702j495442p69066j71936R0344M73877Q04999L98479n28568q63204k35818
$$ -179702 -1675144 -2444210 -2616146 -2525802 -2051925 -1246926 -848447 -1377015 -2240219 -2476037
37410b476037M93336O46205N20708M43869J38846m48900o57296p1366P41579J020419
$$ -2476037 -1982701 -1336496 -815788 -371919 -233073 -681973 -1339269 -1410635 -669056 351363
37400C51363P36495K85688j38915m19115l24489Q0838L01411O6484k85865l69968
$$ 351363 1087858 1373546 1234631 815516 491027 571865 873276 939760 653895 283927
37390B83927k64783j99511j45415K6200L04198N79203O43267K48436m41428p30885
$$ 283927 19144 -180367 -325782 -299582 4616 583819 1227086 1475522 1034094 303209
37380C03209l12264P4445k74381p28201k71290O16563N50788l84317o21477K65042
$$ 303209 -9055 65390 -208991 -937192 -1208482 -591919 -41131 -425448 -1046925 -781883
37370g81883Q09071J93535l48623K31145R06828M13684m72701k78690N83737N03089
$$ -781883 27188 220723 -127900 103245 1010073 1423757 951056 672366 1256103 1759192
37360A759192o27676j252775n49538O10136J143945Q78235R6469q40739j267713
$$ 1759192 1131516 -121259 -670797 -60661 1083284 1961519 2057988 1217249 -50464
37351e0464o56653M74834R31219L01289o26451r85311p10607k31647J21286K99025
$$ -50464 -707117 -232283 698936 1000225 373774 -611537 -1322144 -1553791 -1432505 -1133480
37341a133480N08550R57758J384440J193113L94926j61821l8091j826p79852j662009
$$ -1133480 -624930 332828 1717268 2910381 3305307 3143486 3105395 3103569 2323717 661708
37331F61708j422809k12190O33386M78039j3391j09183J65298M84326O35249M15566
$$ 661708 -761101 -973291 -339905 138134 124743 15560 180858 665184 1300433 1715999
37321A715999j74046o81065p63018p47959r56764r17303j75695N83482L98780
$$ 1715999 1541953 860888 97870 -650089 -1606853 -2524156 -2699851 -2116369 -1717589
37312a717589l41699m49978J25876L66172P6682J10440N57347M23897m17537o42904
$$ -1717589 -2059288 -2509266 -2383390 -2017218 -1940536 -1830096 -1272749 -848852 -1266389 -1909293
37302a909293L67864J306571R12875j16320m19366j22771k98024r53871j036045
$$ -1909293 -1541429 -234858 678017 561697 142331 19560 -278464 -1232335 -2268380
37293b268380j97034P00021R02523O04451K72211q6595o23412j064144q40119
$$ -2268380 -2465414 -1765393 -862870 -258419 13792 -72803 -696215 -1760359 -2600478
37284b600478J89456J300583J446273M59771n18679l04183P69459J210886L28525
$$ -2600478 -2411022 -1110439 335834 795605 276926 -27257 742202 1953088 2281613
37275B281613r30151j320556p40135M6815M58240L98771M8426j96065m19L48663
$$ 2281613 1351462 30906 -709229 -662414 -204174 194597 243023 46958 46539 395202
37265C95202J59780n83894r83561m81537K88762M58103J23121o5889m20l5832
$$ 395202 554982 -28912 -1012473 -1494010 -1205248 -747145 -624024 -689913 -690333 -726165
37255g26165j71767q5123J87183K61533J6235l36743o54647q41091n95559K31152
$$ -726165 -897932 -983055 -795872 -534339 -518104 -854847 -1509494 -2350585 -2946144 -2714992
37245b714992J084167J076562L9462j165155j508894p86906K75401P73120N02169
$$ -2714992 -1630825 -554263 -514801 -1679956 -3188850 -3975756 -3700355 -2927235 -2425066
37236b425066J13584K60717O89030N78238j99820p71544m79967J91426M11350
$$ -2425066 -2311482 -2050765 -1361735 -783497 -983317 -1754861 -2234828 -2043402 -1632052
37227a632052K31470L53823R18927J235631P64106j50645p02071n11258L8706
$$ -1632052 -1400582 -1046759 -127832 1107799 1871905 1721260 1019189 507931 546637
37218E46637K60035q8572n39791n09859n3561K60704J69476k5074n3406k0064
$$ 546637 806672 718100 178309 -331550 -385111 -124407 45069 19995 -33411 -53475
37208e3475K2213K95926P77062R24127L54301n28482r73881p35505j82463K34136
$$ -53475 -31262 264664 1041726 1965853 2320154 1791672 817791 82286 -100177 133959
37198A33959L73570M14711O04681Q61317P07726q1778r41656j152526q62559p56265
$$ 133959 507529 922240 1526921 2388238 3095964 3014186 2072530 920004 57445 -698820
37188f98820q27505m46509K97847M70703j55609n77704j57716L61559J86275k17358
$$ -698820 -1526325 -1972834 -1674987 -1204284 -1359893 -1937597 -2095313 -1733754 -1547479 -1764837
37178a764837o5870L76114L95400P6193n9251k3006j4575K47734Q57602J059598
$$ -1764837 -1830707 -1454593 -1059193 -983000 -1042251 -1065257 -1079832 -832098 25504 1085102
37168A085102L42466m57748l16328L46069M55084R8064J12955L67834M9635o29589
$$ 1085102 1427568 969820 653492 999561 1454645 1552709 1665664 2033498 2083133 1453544
37158A453544o76210j58150j38222p09229p62748N0696P56572Q13793Q37211J056085
$$ 1453544 777334 619184 480962 -228267 -991015 -940319 -183747 630046 1467257 2523342
37148B523342O43639o56320j658077j410877n73287j93501j50762K36161R01498
$$ 2523342 3166981 2510661 852584 -558293 -1131580 -1325081 -1475843 -1239682 -338184
37139c38184J266229J155829P70294L12165J19539M52110P85782K62907p77954
$$ -338184 928045 2083874 2854168 3166333 3285872 3737982 4523764 4786671 4008717
37130D008717r20836J14155P51595o5456j183891j141361m62350n08752j083429
$$ 4008717 3087881 3202036 3953631 3888175 2704284 1562923 1100573 591821 -491608
37121d91608r70934j89228J52293j00876m2287M55004N17261l018k21759O8026
$$ -491608 -1462542 -1651770 -1499477 -1600353 -1642640 -1187636 -670375 -673393 -895152 -827126
37111h27126m5509q33630j193661m09433N91091O17751j00314n11858k86542J10155
$$ -827126 -872635 -1706265 -2899926 -3309359 -2718268 -2100517 -2200831 -2712689 -2999231 -2889076
37101b889076L43367M15450L36664K44041M77477R58205R26520l2585j094506
$$ -2889076 -2545709 -2130259 -1793595 -1549554 -1072077 -113872 812648 780063 -314443
37092c14443j117234k33337L24965j5418m18159P9389J187449J757735J222845
$$ -314443 -1431677 -1665014 -1340049 -1355467 -1773626 -1694237 -506788 1250947 2473792
37083B473792J50237n60481o21660l93419k75404l40227m92839o80740q07296
$$ 2473792 2624029 2063548 1441888 1048469 773065 432838 -60001 -740741 -1548037
37074a548037o48037r8127N76957R76883J035476J029980J109092J047551N57194
$$ -1548037 -2196074 -2294201 -1717244 -740361 295115 1325095 2434187 3481738 4038932
37065D038932l22028j213751j669888j454733p57848j27182M8331J3492L09678
$$ 4038932 3716904 2503153 833265 -621468 -1379316 -1506498 -1458167 -1444675 -1134997
37056a134997R07957J100348N06564k31776k52887K76743L47619m47402j289645
$$ -1134997 -227040 873308 1379872 1148096 895209 1171952 1519571 1072169 -217476
37047b17476j229456m02362K89458L93125K76594L89065O57179P20164M26692
$$ -217476 -1446932 -1849294 -1559836 -1166711 -890117 -501052 156127 876291 1302983
37038A302983l5987l07642j16641M07645O98438L07452m94890r77061q07769l10091
$$ 1302983 1266996 959354 842713 1250358 1948796 2256248 1761358 784297 -23472 -333563
37028c33563J34217M57248N97371L76946o8034k47800j0813K14310J72470J95224
$$ -333563 -199346 257902 855273 1232219 1164185 916385 905572 1119882 1292352 1487576
37018A487576M48288M22878k04263q01607o31052M2682M99049O87070Q41502N20570
$$ 1487576 1935864 2358742 2154479 1352872 721820 764502 1263551 1950621 2792123 3312693
37008C312693o96520j874781j572770n3587Q30192K29901o66204o56375j34096
$$ 3312693 2616173 741392 -831378 -884965 -54773 175128 -491076 -1147451 -1281547
36999a281547O7191J01336L77403M89652k080n59579n23239k70397m50971p33815
$$ -1281547 -1214356 -1113020 -735617 -245965 -248045 -807624 -1330863 -1601260 -2052231 -2786046
36989b786046m48124J06328J98812N1253L97070R65685P67217j68474o58116j53352
$$ -2786046 -3234170 -3127842 -2929030 -2877777 -2480707 -1515022 -747805 -916279 -1574395 -1727747
36979a727747N15109N32806K23118K61038N38299M27366k30254q99401j010823
$$ -1727747 -1212638 -679832 -456714 -195676 342623 769989 539735 -359666 -1370489
36970a370489o24336l78179o46750q17960M3970J636995K351345J362315n3839
$$ -1370489 -1994825 -2373004 -3019754 -3837714 -3793744 -2156749 194596 1556911 1503072
36961A503072k70277L63636K72609p42543j258825n83458K34499J62582l83543
$$ 1503072 1232795 1596431 1869040 1126497 -132328 -715786 -481287 -318705 -702248
36952g02248n02527j53199J58537K59097K38836P4687k04512m35377o40604r03079
$$ -702248 -1204775 -1357974 -1199437 -940340 -701504 -626817 -831329 -1266706 -1907310 -2810389
36942b810389q65924j18754Q39073R62500J95159l73418j92385J6755l03094n24731
$$ -2810389 -3676313 -3795067 -2955994 -1993494 -1798335 -2171753 -2364138 -2347383 -2650477 -3175208
36932c175208r505O91952P11211J68247k52034l61527k99200M0773N75350O49157
$$ -3175208 -3184713 -2492761 -1781550 -1613303 -1865337 -2226864 -2526064 -2485291 -1909941 -1260784
36922a260784m1227o91409m31833L76891P56866N37539K83097K44831K85932M44958
$$ -1260784 -1302011 -1993420 -2425253 -2048362 -1291496 -753957 -470860 -226029 59903 504861
36912E04861O79700M46208n48980j542788j576174q05953p9932L36830O34884
$$ 504861 1184561 1630769 1081789 -460999 -2037173 -2843126 -2923058 -2586228 -1951344
36903a951344O03345R5405j29959N89304J348866P77760o03817q95829K35217
$$ -1951344 -1347999 -1252594 -1382553 -793249 555617 1333377 729560 -166269 68948
36894F8948J010554L80475m82887l62151J22287K4675p2907P14230J628397J287239
$$ 68948 1079502 1459977 977090 614939 737226 761901 688994 1403224 3031621 4318860
36884D318860l2054q29723p47099q18599j397000j466810m44994O72680O83067
$$ 4318860 4286806 3457083 2709984 1891385 494385 -972425 -1417419 -744739 -61672
36875f1672j89356p54902m12331L83276Q81584P63718K67224q4309K8551L41056
$$ -61672 -251028 -1005930 -1418261 -1034985 -153401 610317 877541 793232 821783 1162839
36865A162839K67933l49965r77111r99134m18926K09290M06424K10708P7828L86750
$$ 1162839 1430772 1080807 103696 -895438 -1314364 -1105074 -698650 -487942 -410114 -23364
36855b3364R75660J229064P81606L8917k81246q9890l5134n60226j219250j206389
$$ -23364 952296 2181360 2962966 3001883 2720637 2630747 2595613 2035387 816137 -390252
36845c90252l51051P05463J217865R71524K88927l30633n68557m91633m33290
$$ -390252 -741303 -35840 1182025 2153549 2442476 2111843 1543286 1051653 618363
36836F18363n35204m68582J42465J039538J425174Q84423j02618p85286r49308
$$ 618363 83159 -385423 -242958 796580 2221754 3106177 3003559 2218273 1268965
36827A268965p72094k50566O09380J221920Q57918k00056p32718k03758M30300
$$ 1268965 496871 246305 855685 2077605 2935523 2735467 2002749 1798991 2229291
36818B229291J41151n98583n61416L25578Q97335N17519j43778l28414k05899
$$ 2229291 2370442 1771859 1210443 1536021 2433356 2950875 2807097 2478683 2272784
36809B272784k10790k02517O0862K27627j33777p15726q67709n67211l47849m13216
$$ 2272784 2061994 1859477 1920339 2147966 2014189 1298463 430754 -136457 -484306 -897522
36799h97522m33720j59942L06296Q19534J266495J362358Q90228J82598j32193
$$ -897522 -1331242 -1491184 -1184888 -365354 901141 2263499 3153727 3336325 3204132
36790C204132L8110J22874k76652q53422j082326q70211m86050j33940J43471
$$ 3204132 3242242 3365116 3088464 2235042 1152716 282505 -203545 -337485 -194014
36781a94014L07225K88621O7047k78331n37410m72493j23635J14957j647j31678
$$ -194014 113211 401832 468879 190548 -346862 -819355 -942990 -828033 -829680 -961358
36771i61358J84402P23750P97365K91956j29210n5982Q5411j41100l64507j503
$$ -961358 -776956 -53206 744159 1036115 906905 850923 936334 795234 430727 429224
36761D29224P24899J008459N16321l37170j039054j359135j180706n34558J62194
$$ 429224 1154123 2162582 2678903 2341733 1302679 -56456 -1237162 -1771720 -1609526
36752a609526M12874K68063J98354K97282J39441m18293q45814o66696j39217
$$ -1609526 -1196652 -928589 -730235 -432953 -293512 -711805 -1557619 -2224315 -2363532
36743b363532J71970J62528R6863J2351k66885n99815n20168J11397P82224Q40020
$$ -2363532 -2191562 -2029034 -1932171 -1919820 -2186705 -2786520 -3306688 -3195291 -2413067 -1573047
36733a573047J69147p27615j158385p11323M41437J519835J625962N86665p11955
$$ -1573047 -1403900 -2131515 -3289900 -4001223 -3559786 -2039951 -413989 172676 -539279
36724e39279j126990m72384L32861M44469P4006k3557K82731M40902K48414K12599
$$ -539279 -1666269 -2138653 -1805792 -1361323 -1287317 -1310874 -1028143 -587241 -338827 -126228
36714a26228O15839Q84467M31920l32955n22367n1610K99241L9155m82427p24634
$$ -126228 489611 1374078 1805998 1473043 950676 899066 1198307 1237462 755035 30401
36704C0401n50579q3647M39323N42629j39519j162567j508885q09294K22541Q38653
$$ 30401 -520178 -603825 -164502 378127 238608 -923959 -2432844 -3242138 -3019597 -2180944
36694b180944J076794J145046P60633j70804q13165k97503Q84352J315168M93490
$$ -2180944 -1104150 40896 801529 630725 -182440 -479943 404409 1719577 2213067
36685B213067n65045p38794j46565K28204j77602r37591j187003n65787L73022
$$ 2213067 1648022 909228 762663 990867 813265 -124326 -1311329 -1877116 -1504094
36676a504094P55386L95323o6200j22840p499j5925J70922Q39787J402398J060780
$$ -1504094 -748708 -353385 -419585 -542425 -549924 -565849 -394927 444860 1847258 2908038
36666B908038N0982o68807q10401q89454j051296q38710k60340o615k79059m17384
$$ 2908038 2959020 2290213 1479812 590358 -460938 -1299648 -1559988 -1566603 -1845662 -2263046
36656b263046j05801O5961k04829k07617N35273J201847Q22842j85840o77026
$$ -2263046 -2368847 -2302886 -2507715 -2715332 -2180059 -978212 -155370 -341210 -1018236
36647a018236m37918j27634N6676M64698Q85222N62113m92863j220636r15579
$$ -1018236 -1456154 -1583788 -1527112 -1062414 -177192 384921 -107942 -1328578 -2244157
36638b244157j13302L33954M04389O17225J061714J284634R73286L19826k79343
$$ -2244157 -2357459 -2023505 -1619116 -1001891 59823 1344457 2317743 2637569 2358226
36629B358226o17540p20637o51347m13989r5313L8675j76198m48584k95522K46360
$$ 2358226 1740686 1020049 368702 -45287 -140600 -101925 -278123 -726707 -1022229 -775869
36619g75869N59269K97216j11478j40518N1034l4807m08910o39261n52683l98829
$$ -775869 -216600 80616 -30862 -171380 -120346 -155153 -564063 -1203324 -1756007 -2154836
36609b154836l79172l97122k33714K53541R22230J172793M17216r51319j594701
$$ -2154836 -2534008 -2931130 -3164844 -2911303 -1989073 -816280 -399064 -1350383 -2945084
36600b945084p77692O22491J306668J215221J134263J141891O30737k94590p01849
$$ -2945084 -3722776 -3100285 -1793617 -578396 555867 1697758 2328495 2033905 1332056
36591A332056k79084J93599J06105k22730l81612n30464q01247q68005n76513
$$ 1332056 1052972 1246571 1352676 1129946 748334 217870 -583377 -1451382 -2027895
36582b027895k71453r2118L00429Q82664R78263L30354l23787l30342o385J60084
$$ -2027895 -2299348 -2391466 -2091037 -1208373 -230110 100244 -223543 -553885 -560270 -400186
36572d00186L70852Q14564R10815K10464o13116p01465l61670l66836m49065J57596
$$ -400186 -29334 785230 1696045 1906509 1293393 591928 230258 -136578 -585643 -428047
36562d28047R88482P15423o63871j516830r10970R6926K37206q4744K76658J208551
$$ -428047 560435 1275858 611987 -904843 -1815813 -1718887 -1481681 -1566425 -1289767 -81216
36552h1216J522207Q16906J1153o6159K77840K53667l15311r05277r54037l41275
$$ -81216 1440991 2257897 2269050 2202891 2480731 2734398 2419087 1513810 559773 218498
36542B18498N53412J065489P25545k62570j144684j349970r66071m20074J1954
$$ 218498 771910 1837399 2562944 2300374 1155690 -194280 -1160351 -1580425 -1568471
36533a568471J65362j67752q63418j162279m19316Q21492J237480M62359l34999
$$ -1568471 -1403109 -1570861 -2434279 -3596558 -4015874 -3194382 -1956902 -1494543 -1829542
36524a829542q9286O72069P55793J35973j95735O5599J66347l02216p59173p26545
$$ -1829542 -1918828 -1246759 -490966 -354993 -550728 -485129 -318782 -620998 -1380171 -2106716
36514b106716n70626o65173o78048k65532K73129O29679J049477J604131J638166
$$ -2106716 -2677342 -3342515 -4020563 -4286095 -4012966 -3383287 -2333810 -729679 908487
36505I08487P63502k33801m23482j39386l06402p80712o08276J91687M29972l90754
$$ 908487 1671989 1438188 1014706 875320 568918 -211794 -820070 -628383 -198411 -589165
36495e89165j165373p03629O60537J607268J429533N06446m32605r24162q22785
$$ -589165 -1754538 -2458167 -1797630 -190362 1239171 1745617 1313012 388850 -433935
36486d33935k68220L06921M09159r8264q03376j053766n92802J14280L85011J42290
$$ -433935 -702155 -395234 13925 -84339 -887715 -1941481 -2534283 -2420003 -2034992 -1892702
36476a892702j00266q3610o4804m9620M66621J466932J899189J052140j87182
$$ -1892702 -1992968 -2076578 -2141382 -2191002 -1724381 -257449 1641740 2693880 2506698
36467B506698n22881j88963l75318j020896q09173M70226J244538N19743n48720
$$ 2506698 1983817 1794854 1419536 398640 -410533 59693 1304231 1823974 1275254
36458A275254m64783M09042P11046K87930J34727N51985P32400J61419o88042
$$ 1275254 810471 1219513 1930559 2218489 2353216 2905201 3637601 3799020 3110978
36449C110978j204811j297054j032077m05778K78917M62651O8932k99854j70984
$$ 3110978 1906167 609113 -422964 -828742 -549825 -87174 -18242 -318096 -489080
36440d89080K24269M39870M60637N06128M88286J03670n84214j004102o65522
$$ -489080 -264811 175059 635696 1141824 1630110 1733780 1149566 145464 -520058
36431e20058K32267R28977Q63126K07958m02269n34839k02374L43314P04206L77674
$$ -520058 -287791 641186 1504312 1712270 1310001 775162 572788 916102 1620308 1997982
36421A997982p07010j632391j192931M68774J597820Q71486p74754j239187L9968
$$ 1997982 1290972 -341419 -1534350 -1065576 532244 1403730 628976 -610211 -570243
36412e70243J440968J334137k6552j211136j448892j062344n31323J8141M13447
$$ -570243 870725 2204862 2178310 967174 -481718 -1544062 -2075385 -2057244 -1643797
36403a643797K76197l92643q89018n23220M36741R20697K70775r20059j380340
$$ -1643797 -1367600 -1760243 -2649261 -3172481 -2735740 -1815043 -1544268 -2464327 -3844667
36394c844667n18875R32935J651938J026230k66529r37658l77422P14205J100010
$$ -3844667 -4363542 -3430607 -1778669 -752439 -1018968 -1956626 -2334048 -1619843 -519833
36385e19833M43244k95933j36273N57055N39776n10833j355517p39331Q86948
$$ -519833 -76589 -372522 -508795 48260 588036 77203 -1278314 -2017645 -1130697
36376a130697J787027R71592p09143j619816j126087q5433K85838k54170q70552
$$ -1130697 656330 1627922 918779 -701037 -1827124 -1912557 -1626719 -1880889 -2751441
36367b751441p17225J67646J093933J545964J488636J053065L71381k66141n17400
$$ -2751441 -3468666 -3301020 -2207087 -661123 827513 1880578 2251959 1985818 1468418
36358A468418l82553j69900N527L02659O35033N65562r200n23780m84925j83205
$$ 1468418 1085865 915965 921492 1224151 1859184 2424746 2415546 1891766 1406841 1223636
36348A223636j98566m66826l91203J88417O47982L38750n77917j206284p95336
$$ 1223636 1025070 558244 167041 355458 1003440 1342190 764273 -442011 -1237347
36339a237347M29917J350320J063821q8089r06286p59390j79582O4222r3792k90390
$$ -1237347 -807430 542890 1606711 1518622 612336 -147054 -326636 -262414 -356206 -646596
36329f46596l47179j62709M39606J182564J197927J47603r63250r29458L1745
$$ -646596 -993775 -1156484 -716878 465686 1663613 1811216 847966 -81492 -49747
36320d9747O92616N68471K34546M5643k78101o69836n17413J59506M10591j93995
$$ -49747 642869 1211340 1445886 1491529 1213428 543592 26179 185685 596276 402281
36310D02281p57426m06285L65326N28568M9921l21370l26990k99906k69669M4980
$$ 402281 -355145 -761430 -396104 132464 182385 -138985 -465975 -765881 -1035550 -990570
36300i90570L94099Q7418q59414j417270p55247P01313J743274J605277N10602
$$ -990570 -596471 -509053 -1368467 -2785737 -3540984 -2839671 -1096397 508880 1019482
36291A019482p06441j263550r09507q721Q36428J275309J285116R07619K17911
$$ 1019482 313041 -950509 -1860016 -1868737 -1032309 243000 1528116 2435735 2653646
36282B653646m27921m96559J01642O97207N06952m18120j194011j165069o85940
$$ 2653646 2225725 1729166 1830808 2528015 3034967 2616847 1422836 257767 -428173
36273d28173n61577q87391r22784k06413P04221R74629O25381M16613P77641J383738
$$ -428173 -989750 -1877141 -2799925 -3006338 -2302117 -1327488 -702107 -285494 492147 1875885
36263A875885J720483J510773O10196q47781k065182k059004q93295J72568K21718
$$ 1875885 3596368 5107141 5717337 4869556 2804374 745370 -147925 24643 246361
36254B46361j81919M7284R11042J421175J038452K63036j71217o6583L04309N09514
$$ 246361 64442 111726 1022768 2443943 3482395 3745431 3574214 3507631 3811940 4321454
36244D321454J61934p24419j543848j670421j197912o90935l05149K57221R21618
$$ 4321454 4483388 3758969 2215121 544700 -653212 -1344147 -1649296 -1392075 -470457
36235d70457J069200M18228m92207r76741q81707l66393M12469J041679Q75353
$$ -470457 598743 1016971 524764 -451977 -1333684 -1700077 -1287608 -245929 629424
36226F29424j18608r83530q85575k60623j34569n55276o05005J2013L92086j38783
$$ 629424 510816 -472714 -1358289 -1618912 -1753481 -2308757 -2913762 -2901749 -2509663 -2648446
36216b648446q54943o29011M27741J204384J229292J098801J200216J032680K85434
$$ -2648446 -3503389 -4132400 -3704659 -2500275 -1270983 -172182 1028034 2060714 2346148
36207B346148k96312J9994O06979K82324p71749j092127j01023R68418Q26967
$$ 2346148 2049836 2069830 2676809 2959133 2187384 1095257 994234 1962652 2789619
36198B789619j78662q66474q86790o65596l23580K50386O08838J51227p93034
$$ 2789619 2610957 1744483 857693 192097 -131483 118903 727741 878968 85934
36189H5934j273754j025468n17558J10888R90112J491817P20312p30977j059208
$$ 85934 -1187820 -2213288 -2730846 -2619958 -1629846 -138029 582283 -148694 -1207902
36180a207902J35930J055583M00784o57913m99194L45373L45631k93348j33262
$$ -1207902 -1071972 -16389 384395 -273518 -772712 -427339 -81708 -375056 -508318
36171e08318P57052P78763l81817j007215k0189J366239J561716P41650N7402
$$ -508318 248734 1027497 645680 -361535 -381724 984515 2546231 3287881 3345283
$$ [...]
##END NTUPLES=NMR SPECTRUM
##END=
