##TITLE=31Pdec_DE-126_3
 , 24 sc
 6.2.2026
##JCAMPDX= 6.0         $$ Bruker NMR JCAMP-DX V2.0
##DATA TYPE= NMR SPECTRUM
##DATA CLASS= NTUPLES
##ORIGIN= UXNMR, Bruker Analytische Messtechnik GmbH
##OWNER= root
$$ XWIN-NMR		Version 3.5
$$ Fri Feb  6 16:07:16 2026 Russian Standard Time (UT+4h)  she@DPX200
##.OBSERVE FREQUENCY= 81.013821
##.OBSERVE NUCLEUS= ^31P
##.ACQUISITION MODE= SIMULTANEOUS
##.ACQUISITION SCHEME= undefined
##.AVERAGES= 24
##.DIGITISER RES= 17
##SPECTROMETER/DATA SYSTEM= spect
##.PULSE SEQUENCE= zgpg30
##.SOLVENT NAME= DMSO
##.SHIFT REFERENCE= (INTERNAL, DMSO, 0, 198.062)
##AUDIT TRAIL= $$ (NUMBER, WHEN, WHO, WHERE, WHAT)
$$ ##TITLE= Audit trail, XWIN-NMR		Version 3.5
$$ ##JCAMPDX= 5.01
$$ ##ORIGIN= Bruker BioSpin GmbH
$$ ##OWNER= she
$$ F:/spectra/data/she/nmr/P31/2/pdata/1/auditp.txt
$$ ##AUDIT TRAIL=  $$ (NUMBER, WHEN, WHO, WHERE, WHAT)
(   1,<2026-02-06 16:06:12.98 +0400>,<she>,<DPX200>,
      <created by zg, POWCHK disabled, PULCHK disabled
       configuration hash MD5:
       00 E9 B6 7A A2 85 ED C7 34 08 36 98 17 FE 4E 26
       data hash MD5: 32K
       8B 44 B3 1F 5E F4 72 D8 97 55 8A 69 A7 B0 02 30>)
(   2,<2026-02-06 16:06:15.59 +0400>,<she>,<DPX200>,
      <Start of raw data processing
       efp BC_mod = 2 LB = 1.5 FT_mod = 6 PKNL = 1 PHC0 = 1405.686 PHC1 = 67.30091 SI = 64K 
       data hash MD5: 64K
       E8 1E 76 33 C8 1D 4D F9 F5 C8 83 21 78 8D BD DF>)
(   3,<2026-02-06 16:06:35.92 +0400>,<she>,<DPX200>,
      <pk PHC0 = -2.135334 PHC1 = 0 
       data hash MD5: 64K
       86 41 2D F3 A9 64 36 1B B1 E8 DB 59 E3 D6 08 99>)
(   4,<2026-02-06 16:06:44.62 +0400>,<she>,<DPX200>,
      <abs ABSG = 5 
       data hash MD5: 64K
       D6 41 D1 5D 56 6D 0D F6 EF 61 F9 E0 F4 F7 78 3E>)
$$ ##END=
$$ 
$$ hash MD5
$$ 38 17 2D 15 65 32 B5 75 8F A8 15 7A 67 03 6F 07
##$RELAX= 
##$RELAX= 
##$RELAX= 
##$RELAX= 
##$RELAX= 
##$RELAX= 
##$RELAX= 
##$RELAX= 
$$ Bruker specific parameters
$$ --------------------------
##$DU= <F:/spectra>
##$EXPNO= 2
##$NAME= <P31>
##$PROCNO= 1
##$TYPE= <nmr>
##$USER= <she>
##$AMP= (0..31)
100 100 100 100 100 100 100 100 100 100 100 100 100 100 100 100 100 100 
100 100 100 100 100 100 100 100 100 100 100 100 100 100 
##$AQSEQ= 0
##$AQ_mod= 1
##$AUNM= <au_zg>
##$AUTOPOS= <>
##$BF1= 81.014009
##$BF2= 200.13
##$BF3= 200.13
##$BF4= 200.13
##$BF5= 200.13
##$BF6= 200.13
##$BF7= 200.13
##$BF8= 200.13
##$BYTORDA= 1
##$CFDGTYP= 0
##$CFRGTYP= 5
##$CHEMSTR= <none>
##$CNST= (0..31)
1 1 145 1 1 1 1 1 1 1 1 1 1 1 1 1 1 1 1 1 1 1 1 1 1 1 1 1 1 1 1 1 
##$CPDPRG= <waltz16>
##$CPDPRG1= <>
##$CPDPRG2= <waltz16>
##$CPDPRG3= <>
##$CPDPRG4= <mlev>
##$CPDPRG5= <mlev>
##$CPDPRG6= <mlev>
##$CPDPRG7= <mlev>
##$CPDPRG8= <mlev>
##$CPDPRGB= <>
##$CPDPRGT= <>
##$D= (0..31)
0 1 0 0 0 0 0 0 0 0.06 0 0.03 2e-05 3e-06 0 0 0.0002 0 0 0 0 0 0 0 0 0 
0 0 0 0 0 0 
##$DATE= 1770379572
##$DBL= (0..7)
120 120 120 11 120 120 24 19 
##$DBP= (0..7)
150 150 150 150 150 150 150 150 
##$DBP07= 0
##$DBPNAM0= <>
##$DBPNAM1= <>
##$DBPNAM2= <>
$$ [...]
##$SUBNAM3= <"">
##$SUBNAM4= <"">
##$SUBNAM5= <"">
##$SUBNAM6= <"">
##$SUBNAM7= <"">
##$SUBNAM8= <"">
##$SUBNAM9= <"">
##$SW= 400.765351723535
##$SWIBOX= (0..15)
0 1 3 0 0 0 0 0 0 0 0 0 0 0 0 0 
##$SW_h= 32467.5324675325
##$TD= 32768
##$TD0= 1
##$TE= 0
##$TE2= 300
##$TE3= 300
##$TEG= 300
##$TL= (0..7)
0 120 53 12 22 120 120 120 
##$TP= (0..7)
150 150 150 150 150 150 150 150 
##$TP07= 0
##$TPNAME0= <>
##$TPNAME1= <>
##$TPNAME2= <>
##$TPNAME3= <>
##$TPNAME4= <>
##$TPNAME5= <>
##$TPNAME6= <>
##$TPNAME7= <>
##$TPOAL= (0..7)
0.5 0.5 0.5 0.5 0.5 0.5 0.5 0.5 
##$TPOFFS= (0..7)
0 0 0 0 0 0 0 0 
##$TUNHIN= 0
##$TUNHOUT= 0
##$TUNXOUT= 0
##$USERA1= <user>
##$USERA2= <user>
##$USERA3= <user>
##$USERA4= <user>
##$USERA5= <user>
##$V9= 5
##$VALIST= <valist>
##$VCLIST= <CCCCCCCCCCCCCCC>
##$VD= 0
##$VDLIST= <DDDDDDDDDDDDDDD>
##$VPLIST= <PPPPPPPPPPPPPPP>
##$VTLIST= <TTTTTTTTTTTTTTT>
##$WBST= 1024
##$WBSW= 4
##$XGAIN= (0..3)
0 0 0 0 
##$XL= 0
##$YL= 0
##$YMAX_a= 120510
##$YMIN_a= -132899
##$ZGOPTNS= <>
##$ZL1= 120
##$ZL2= 120
##$ZL3= 120
##$ZL4= 120
##$ABSF1= 198.0616
##$ABSF2= -202.7028
##$ABSG= 5
##$ABSL= 3
##$ALPHA= 0
##$AQORDER= 0
##$ASSFAC= 0
##$ASSFACI= 0
##$ASSFACX= 0
##$ASSWID= 0
##$AUNMP= <proc_1d>
##$AZFE= 0.1
##$AZFW= 0.5
##$BCFW= 0
##$BC_mod= 2
##$BYTORDP= 0
##$COROFFS= 0
##$CY= -3
##$DATMOD= 1
##$DC= 0
##$DFILT= <>
##$DTYPP= 0
##$F1P= 0
##$F2P= 0
##$FCOR= 1
##$FTSIZE= 65536
##$FT_mod= 6
##$GAMMA= 0
##$GB= 0
##$INTBC= 1
##$INTSCL= 9.790993e-09
##$ISEN= 30
##$LB= 1.5
##$LEV0= 0
##$LPBIN= 0
##$MAXI= 10000
##$MC2= 0
##$MEAN= 0
##$ME_mod= 0
##$MI= 50
##$NCOEF= 0
##$NC_proc= -3
##$NLEV= 6
##$NOISF1= 182.463
##$NOISF2= 159.3651
##$NSP= 0
##$NTH_PI= 0
##$NZP= 0
##$OFFSET= 198.0616
##$PC= 4
##$PHC0= 1403.551
##$PHC1= 67.30091
##$PH_mod= 1
##$PKNL= yes
##$PPARMOD= 0
##$PSCAL= 0
##$PSIGN= 0
##$REVERSE= no
##$SF= 81.0140089999434
##$SI= 65536
##$SIGF1= 159.3651
##$SIGF2= -187.1042
##$SINO= 113.3802
##$SIOLD= 16384
##$SREGLST= <1H.CDCl3>
##$SSB= 0
##$STSI= 65536
##$STSR= 0
##$SW_p= 32467.5324675325
##$SYMM= 0
##$S_DEV= 0
##$TDeff= 32768
##$TDoff= 0
##$TI= <>
##$TILT= no
##$TM1= 0
##$TM2= 0
##$TOPLEV= 0
##$USERP1= <user>
##$USERP2= <user>
##$USERP3= <user>
##$USERP4= <user>
##$USERP5= <user>
##$WDW= 1
##$XDIM= 65536
##$YMAX_p= 298246212
##$YMIN_p= -1165129
$$ End of Bruker specific parameters
$$ ---------------------------------
##NTUPLES= NMR SPECTRUM
##VAR_NAME=  FREQUENCY,     SPECTRUM/REAL,   SPECTRUM/IMAG
##SYMBOL=    X,             R,               I
##VAR_TYPE=  INDEPENDENT,   DEPENDENT,       DEPENDENT
##VAR_FORM=  AFFN,          ASDF,            ASDF
##VAR_DIM=   65536,         65536,           65536
##UNITS=     HZ,            ARBITRARY UNITS, ARBITRARY UNITS
##FACTOR=    0.49542278885378, 1,            1
##FIRST=     16045.7642231865, 0,            0
##LAST=      -16421.768244346, 0,            0
##MIN=       -16421.768244346, -1165129,     0
##MAX=       16045.7642231865, 298246212,    0
$$ Real data points
##PAGE= N=1
##DATA TABLE= (X++(R..R)), XYDATA
$$ [...]
41523A7047180j824747j590620j349443j131229r52981p97223o79700o39628o36237
41514G445372n60362l92869k50862k18987k29136j78569q1956j9766l163J4556
41504E524258L5797J9317m0712j12718j86612k67764l29639l37528l08864k92278
41494C703257k95662k87412k59375k36913k31240k26628k10393j78845j25613
41485A651176o0815k3872l6541o4221o8932p3539j13869j51084j11533j2271L7985
41474I72484j2222q1604p3317q943J4444l3318q2563o9315j5848J4962O543o786
41462F24517o215j4966m6903o7791m2466L438J6170j716L569M1143M8503r353
41450E47930p1309n9719J1744O3748N7089J9434j3420k9014k2398J365J5327L922
$$ plain form
41523 17047180 15222433 13631813 12282370 11151141 10198160 9400937 8721237 8081609 7445372
41514 7445372 6885010 6492141 6241279 6022292 5793156 5614587 5532631 5512865 5509702 5524258
41504 5524258 5560055 5579372 5538660 5425942 5239330 4971566 4641927 4304399 3995535 3703257
41494 3703257 3407595 3120183 2860808 2623895 2392655 2166027 1955634 1776789 1651176
41485 1651176 1590361 1566489 1529948 1465727 1396795 1323256 1209387 1058303 946770 934499 972484
41474 972484 960262 878658 805341 796398 810842 777524 694961 625646 609798 624760 631303 624517
41462 624517 618302 603336 556433 488642 446176 449614 465784 464068 467637 508780 557283 547930
41450 547930 476621 416902 428646 492394 549483 568917 555497 526483 504085 505450 520777 524699
41438E24699k883K6562O1047L9367l6910r7528r3656m5915O28K1144O721l3660
41426C69616n7027k2094M3832O0926m11p6034r1010m7846m483M747m734l380J5904
41413A88006L2653K2961p627k5326j6444j3846m5600q0324o9092k3820K862M833
41401c0764K2415N5886N4540Q279k4258q249J5639Q497m406N244P590k7332o0644
41388B2437l8625J9180M7639K7603m823j9802j4021J0725L9912L4710k3414r0141
41376A1380j04829o6090j9806R906L0887M0275K4852n36l237J7191K9343K0630
41364a0034J0319J0605Q909o166k6333l3781j5825K1449M4058J8956l1949m2162
41352e1954Q732N6919M4705K092j4464j5894l9921n7219j2003O2635P1936N952
$$ plain form
41438 524699 521816 548378 609425 648792 611882 514354 420698 374783 375411 396555 403276 369616
41426 369616 312589 290495 334327 395253 394842 318808 227798 179952 175469 180216 175482 172102 188006
41413 188006 220659 243620 235993 210667 194223 180377 134777 54453 -14639 -38459 -35597 -30764
41401 -30764 -8349 47537 102077 110356 86098 77849 93488 101985 97579 102823 110413 83081 22437
41388 22437 -16188 2992 50631 78234 73411 53609 39588 50313 90225 124935 101521 11380
41376 11380 -93449 -159539 -179345 -169439 -138552 -98277 -73425 -73961 -77198 -60007 -30664 -10034
41364 -10034 285 10890 19799 13633 -12700 -46481 -62306 -40857 3201 22157 -9792 -51954
41352 -51954 -43222 13697 58402 60494 46030 30136 -9785 -67004 -79007 -16372 55564 61516
41340F1516m1608k2892n085m4930q3379l7271O3267J09124N7894k3353n5427l3280
41328e5424n938o779k3773k8168j5148m228k730P050L1982M8018M1120L7504N5614
41315G9100O0409J8394l0440k4093J6215J1340m9279r0124o8379k6789p656L117
41303a08185J5525O0m4808o2855k5837J6157J7619O336J7908K7027M876j4134
41291a50311R268M3379L6031p21k1259k1939k2815j4266J2530K2430p041k6149
41279a40863J3883O5994N1468r105k2398L1502O9943L0334n3328j05997q4928
41268a53495K592J00340J30128P1347k492k0059j1523m0672p9441n1377K5267
41257b9385N5589K4934J4040M3446L2731m4786r2228m0400L8567M9518J6030J3139
$$ plain form
41340 61516 19908 -2984 -8069 -52999 -136378 -173649 -110382 -1258 56636 33283 -22144 -55424
41328 -55424 -61362 -68141 -91914 -120082 -135230 -139458 -142188 -135138 -103156 -55138 -14018 23486 79100
41315 79100 139509 157903 127463 103370 119585 130925 81646 -8478 -76857 -103646 -111302 -108185
41303 -108185 -92660 -92600 -137408 -200263 -226100 -209943 -192324 -185988 -168080 -141053 -136177 -150311
41291 -150311 -141043 -97664 -61633 -62354 -83613 -105552 -128367 -142633 -130103 -107673 -114714 -140863
41279 -140863 -126980 -60986 -9518 -18623 -41021 -9519 60424 90758 37430 -68567 -153495
41268 -153495 -150903 -50563 79565 150912 148420 128361 116838 76166 -3275 -54652 -29385
41257 -29385 26204 51138 65178 108624 141355 96569 4341 -36059 2508 52026 68056 81195
41245H1195L0961P074n0334p0645l3554Q140J2352r674l2351m5601m4415k5494
41233a72346M087L3348N2251M3360j883m9689m9862j0001Q670r931q226L9189
41221a21033O5528J7860m4556l7622J4010K2026k1611m3370j6810L992j3222k8588
41209b03396m182L9225O5070O7850N5018K6914n037j7046n388J0460K2572L8557
41197I0617M9507L4227Q57j6195q352k891j3844k3918k4874l2850m8599m4616
41185d0931j3325R796k384k4961j7460J8755M7335M6244K6081P850J68n935k7287
41172B3946o4915q8285o1625O506O0967O2390L4684L0108N7772P2824M0290j3639
41160A61023l3437q012J5577J575k0193q2M9453O2738J1955n7941r7206j05480
$$ plain form
41245 81195 112156 119230 68896 -1749 -35303 -27163 -14811 -24485 -56836 -102437 -146852 -172346
41233 -172346 -168259 -134911 -82660 -39300 -41183 -90872 -140734 -150735 -142065 -151996 -160222 -121033
41221 -121033 -55505 -37645 -82201 -119823 -105813 -83787 -105398 -148768 -165578 -161586 -174808 -203396
41209 -203396 -207578 -168353 -103283 -35433 19585 46499 41462 24416 19028 29488 52060 90617
41197 90617 140124 174351 175208 159013 150661 147770 133926 110008 85134 52284 3685 -40931
41185 -40931 -54256 -44460 -46844 -71805 -89265 -70510 -23175 23069 49150 57000 57168 51233 23946
41172 23946 -40969 -129254 -190879 -184373 -123406 -61016 -26332 3776 61548 134372 174662 161023
41160 161023 127586 119574 135151 136726 116533 116451 165904 228642 240597 182656 85450 -20030
41148b0030r4642m9209L2664R7342Q7830J8517m5403o4915m5212j501M5480N9141
41136B0062K3484k1328k5521J142J2230o87q838o662j3053k1583r679P601o309
41123d9141m1919n3241l2463j0937J1039O0578J13634J02940K4910m0374m4811
41112D0215l1787m5279n6530l0216M418O177q725n335R565J8192L5530O6796O6104
41099F9125k23q3817j09272p2133k6239J38J7518K6358J4547o840j5099j4715
41087b00652k3498l3215k3435J00J7914L0106M2136M0159J7938K443J2087J8612
41075i9305l339k0341R569N7185N7589J0518k0320m544J8996Q506k8606n7424
41063g1516n2463j3902K3654J3896l6793n5815n26O6881O3614J3657Q939N9733
$$ plain form
41148 -20030 -114672 -163881 -131217 -33875 53955 72472 27069 -37846 -83058 -84559 -39079 20062
41136 20062 43546 22218 -3303 -2161 10069 9382 544 -6118 -19171 -40754 -50433 -42832 -49141
41123 -49141 -91060 -144301 -176764 -187701 -176662 -116084 -2450 100490 125400 85026 40215
41112 40215 8428 -36851 -93381 -123597 -119179 -113002 -121727 -127062 -117497 -99305 -63775 3021 69125
41099 69125 68902 -14915 -124187 -196320 -222559 -222421 -204903 -178545 -163998 -170838 -185937 -200652
41087 -200652 -224150 -257365 -280800 -280700 -262786 -232680 -190544 -150385 -132447 -130004 -117917 -99305
41075 -99305 -102644 -122985 -113416 -56231 1358 11876 -8444 -12988 6008 14514 -14092 -71516
41063 -71516 -123979 -137881 -114227 -100331 -137124 -192939 -193465 -126584 -62970 -49313 -40374 19359
41051A9359P7378J4097o8049r3245o2983k0032J5481L9631M3620K9163Q605k2179
41039a9154o8609r4850n6444J8198M7767J4803j0271J6181N0702N1629M7843O7010
41027F4805O8077J1710n7714o9822k8202Q546J0554j3534n2916q4627o5637M377
41015b04383M9478J3185m6694l4145M0394P5788L0565k8431l6502j1647P45N67
41003a51080J4115M2358O0458M9240J1483k9660m8208m6118n2932p3626o4553
40992b88523j52O7582P5266M9087O2242J02251P6373l1834j09556o9706K2971
40981d3999N2400J4810n515J5768J9413j8407l9164j238M8066M4132j921l1016
40969E3329k3564q234k447L664Q195p382l5947m4284l2166m4750r3595j09812
$$ plain form
41051 19359 96737 110834 42785 -50460 -113443 -133475 -117994 -78363 -34743 -5580 3025 -19154
41039 -19154 -87763 -182613 -239057 -220859 -173092 -158289 -168560 -152379 -101677 -50048 -2205 64805
41027 64805 132882 144592 86878 17056 -11146 -2600 7954 -5580 -58496 -143123 -208760 -204383
41015 -204383 -154905 -141720 -188414 -222559 -182165 -106377 -75812 -104243 -140745 -152392 -151647 -151080
41003 -151080 -136965 -94607 -34149 15091 26574 -3086 -51294 -97412 -150344 -223970 -288523
40992 -288523 -288675 -221093 -145827 -96740 -34498 67753 144126 112292 2736 -66970 -43999
40981 -43999 8401 23211 17696 33464 52877 34470 -4694 -5932 42134 86266 84345 53329
40969 53329 29765 21531 19084 22748 30943 23561 -12386 -56670 -88836 -133586 -227181 -336993
40957c36993l0122R7446J59299J20397N4814K5026N556m0824q1086o4835j1967
40946a03289J8141J5334J2172J1258j0113l2447o070O1152R7020O5841J5464j754
40934A42709K275m778j5488j0397m952j9717l2468r678L2149M3874J4237j8639
40922A19127k4244j2522p109j4138k3161k1272o210L694j6228n7852p3506l2673
40910a66094L1605O2577N0258K6382L853l0900o7348o5382j5852L7113N6098N5281
40898b2409N9832N5675J6154m3338p5680n8871j3730K8752N2539N4137L8917J9118
40886A11096Rk5545n5164o5565m5816k5094l4767n4982l9015J3361N1024M4188
40874a26270J6055r016l7911o5615n2429J3008P0189O0951J8421K0888P3502J02408
$$ plain form
40957 -336993 -367115 -269669 -110370 10027 64841 89867 95423 54599 -26487 -91322 -103289
40946 -103289 -85148 -69814 -57642 -46384 -56497 -88944 -95014 -33862 63158 128999 144463 142709
40934 142709 144984 140206 124718 114321 109369 89652 57184 47506 79655 123529 137766 119127
40922 119127 94883 82361 75252 61114 37953 16681 10471 14165 -2063 -59915 -133421 -166094
40910 -166094 -134489 -71912 -21654 4728 8581 -22319 -89667 -155049 -170901 -133788 -77690 -22409
40898 -22409 37423 93098 109252 65914 -9766 -68637 -82367 -53615 -1076 53061 91978 111096
40886 111096 111105 85560 30396 -35169 -80985 -106079 -140846 -195828 -234843 -221482 -170458 -126270
40874 -126270 -110215 -119231 -157142 -222757 -275186 -262178 -191989 -131038 -112617 -91729 -18227 84181
40862H4181O5438K081l9079n8053o3684l8663J3527L8070K52m7495k9412M2592
40850c0245Q1991M5519j9844n3334m9345l1849p998K0445L1027L457m2923o2439
40838a15538l2565K4022O2661N3557M186m5506n8180l6211j4107j0032l529K6012
40826a45230N8595N5649J3533l0347m3962l1170j3832n143p441j6862j9107K520
40814a82797M0592N9421L5777o953k7117k0580k0853m1942n2274k1858K8957N3284
40802a56343L6943P620q175r341j194J8253M1685M5287J6788k1084l2351q755
40790g0667K2521K9508N440k9441m8270l8726q008K8487N7315O5109L9861j2273
40778D0856n8311o4152k9732J2657L2015J9445j5049m7549n0169j9615J0321R237
$$ plain form
40862 84181 149619 151700 112621 54568 -9116 -47779 -34252 3818 4070 -43425 -72837 -30245
40850 -30245 51746 97265 77421 24087 -25258 -57107 -65105 -44660 -13633 -10176 -53099 -115538
40838 -115538 -148103 -124081 -61420 -7863 -3677 -49183 -107363 -143574 -157681 -167713 -171242 -145230
40826 -145230 -86635 -30986 -17453 -47800 -91762 -122932 -136764 -141907 -149348 -166210 -185317 -182797
40814 -182797 -142205 -82784 -47007 -53960 -81077 -101657 -122510 -164452 -216726 -238584 -209627 -156343
40802 -156343 -119400 -111780 -119955 -129296 -130490 -112237 -70552 -25265 -8477 -29561 -61912 -70667
40790 -70667 -48146 -18638 -13198 -42639 -90909 -129635 -137643 -109156 -51841 13268 53129 40856
40778 40856 -17455 -81607 -111339 -98682 -66667 -47222 -62271 -109820 -159989 -179604 -169283 -160046
40766a60046o838m634P532l216k5441j3053K7753L0621k3508n9237j4554O2551
40754a82070Q4475M3925j197k2118k5991j271O0815J07321P1041k4112q3238o9980
40742d2400l9604l5234l3381j4394o181k0516j5645L2876Q2517R0734P9278Q3692
40730A61742Q5787N0103q618m7346n7938o1560o2368n0622l4242k8469k8223k1439
40718a03193j3186j1301r540o769j4231k1879M148O0971Q8491M8729j4550l9408
40706c1718k8877k0791j4855R959L7596L8736K7556L2048L1972o784n7919o6552
40694d9629l8350k2339j9802P968N0089N4731K9717L9196Q2772P4634k0815j19819
40682F8353j33830q0226k8714k896J1544J8047K2500M6118P7461O3259n055n2530
$$ plain form
40766 -160046 -166884 -171518 -163986 -167202 -192643 -205696 -177943 -147322 -170830 -230067 -244621 -182070
40754 -182070 -97595 -53670 -54867 -76985 -102976 -104247 -43432 63889 134930 110818 27580 -42400
40742 -42400 -82004 -117238 -150619 -165013 -171194 -191710 -207355 -174479 -91962 -1228 78050 161742
40730 161742 247529 297632 289014 241668 183730 122170 59802 9180 -25062 -53531 -81754 -103193
40718 -103193 -116379 -127680 -137220 -143989 -158220 -180099 -175951 -114980 -26489 22240 7690 -31718
40706 -31718 -60595 -81386 -96241 -86282 -48686 -9950 17606 49654 81626 74842 16923 -49629
40694 -49629 -87979 -110318 -130120 -122152 -72063 -17332 12385 51581 134353 208987 188172 68353
40682 68353 -65477 -145703 -174417 -177313 -165769 -147722 -125222 -79104 -1643 61616 56561 4031
40670D031k4823K5405K2726j3501j4610J6767K0675j0215k3419n53K3003L0648
40658E6134L9843M1510P30o7782r4658m9321J8116M8808L8327J0961j7694l2419
40646g445j9255O519J5148J5101M0600P6928O1741j5482p9808p2858k9101p505
40634a5417n124O654J2211j4543m3756k7892J7194L6830K5086J8924J7787j5068
40622A2886o9189q0886k8903K9792M4809L2833K3069J555m4977p7530n3847j292
40610b11680J4225j9811m9055k7847L1176Q4977J05268R1031O1437M2007M0791
40599A62519L7868J2785k4239m6634m7530l8326k1253O281K6314J6355p706n406
40587G1028K1545K0400l0801p5111n1845R357K3232l1281q0402n5807K0740P7981
$$ plain form
40670 4031 -20792 4613 27339 13838 -772 15995 36670 26455 3036 2483 25486 56134
40658 56134 95977 137487 138217 70435 -24223 -73544 -55428 -6620 31707 42668 24974 -7445
40646 -7445 -26700 -20181 -5033 10068 50668 127596 189337 173855 94047 21189 -7912 -15417
40634 -15417 -20541 -13887 -1676 -16219 -59975 -87867 -70673 -33843 -8757 10167 27954 12886
40622 12886 -56303 -137189 -166092 -136300 -91491 -58658 -35589 -34034 -79011 -156541 -210388 -211680
40610 -211680 -197455 -217266 -266321 -294168 -262992 -178015 -72747 18284 79721 121728 162519
40599 162519 200387 213172 188933 142299 94769 56443 35190 41471 67785 84140 76434 71028
40587 71028 92573 112973 82172 7061 -44784 -35427 -12195 -43476 -123878 -179685 -158945 -80964
40575h0964Q5289O6928M6878K1878r980l0265k6732j7274k6585m8835n3921k8960
40563a02543M766K0051J2507o485k8578m4368l4433Q977N3258M8619p664n4897
40551a30790l8750J9830N2822L1839p096k5535l0340m1477m5852j8925K4041L9513
40539a70720J9660O229K5787M5223K1037l0040m9966k3330N04j8202n1094m6492
40527b71404o833J8813J0789L963K6796N3157M1090l112l1151j5375K2454M5116
40515a05697L9120J5378q360j6514m030J2908Q474j8057l3474j4230J4301R069
40503a01112k4881l3672J0044O3247O8341K8726m791p590L26N681K2984M9553
40491G6856M5984n517n7256n2384m319K3784O935j9953k4583j4387m142R497K5385
$$ plain form
40575 -80964 4325 71253 118131 140009 130029 99764 73032 55758 29173 -19662 -73583 -102543
40563 -102543 -97777 -77726 -65219 -71704 -100282 -144650 -179083 -170106 -116848 -68229 -75893 -130790
40551 -130790 -169540 -149710 -96888 -65049 -72145 -97680 -128020 -169497 -215349 -234274 -210233 -170720
40539 -170720 -151060 -144831 -119044 -73821 -52784 -82824 -132790 -156120 -155616 -173818 -224912 -271404
40527 -271404 -278237 -259424 -248635 -244672 -217876 -164719 -123629 -126741 -157892 -173267 -150813 -105697
40515 -105697 -66577 -51199 -59559 -76073 -80103 -67195 -58721 -76778 -110252 -124482 -110181 -101112
40503 -101112 -125993 -159665 -149621 -86374 -18033 10693 5902 -1688 -1362 4319 27303 76856
40491 76856 122840 117323 60067 7683 3364 27148 34083 14130 -10453 -24840 -28982 -19485 5900
40478E900K6281P455j3555k9025m8591o1613l5535K3889N6161K7442j3042p158
40466f1391J7078j1281q6501j21239o6067K8722Q7858R4115P2453L9035K037j8391
40454b3572q608J5127K7418K4109J2408j0058m0918n3796k5262K3577M2391J4067
40442c117k1184j5844K5367N1431K7104k4530m7590j5553M0823O7416M0637j4595
40430A10365n2846m9923k2297o931j7120k4931j577L4579M0160J4468K523J9394
40418D5864K2249j2400l6749q634K5235m855p1103p8717j0542M7068L7165N271
40406d0148O742J9879L009k4991k3896p342j3881l0613r116N2704R7789Q1028
40394A11164J7902l9421n2811k8939j0663k4543l6509M786P4766Q1496k063p6702
$$ plain form
40478 5900 32181 39636 26081 -2944 -51535 -113148 -148683 -124794 -68633 -41191 -54233 -61391
40466 -61391 -44313 -55594 -142095 -263334 -329401 -300679 -212821 -118706 -46253 -7218 -5181 -23572
40454 -23572 -32180 -17053 10365 34474 46882 36824 -4094 -57890 -83152 -59575 -17184 -3117
40442 -3117 -24301 -40145 -14778 36653 63757 39227 -8363 -23916 16907 84323 124960 110365
40430 110365 57519 7596 -14701 -21632 -38752 -63683 -65260 -30681 9479 23947 26470 45864
40418 45864 68113 55713 18964 10330 35565 30710 -40393 -119110 -129652 -82584 -45419 -40148
40406 -40148 -33406 -13527 -10518 -35509 -59405 -66747 -80628 -111241 -120357 -67653 30136 111164
40394 111164 129066 89645 36834 7895 -2768 -27311 -63820 -59034 15732 97228 95165 18463
40382A8463m4507N3004R6980N6078O007N15J0412j450k2681l1869l4305l1557
40370G5090p720K8230L4636N66k6831j1940J0874r362n3616m8017L5084J27820
40358A54814J36790N1187l8891m3775J7473M1201k1793r5288q1404K048M8577
40347A70939J1892m2453m3669o709J5723J9595L8822P4335Q3629M3123j0368j6297
40335C38562L7201R0275P4135m636o6411n5027r00L4232L7642L0369Q848l6302
40323D87988o5678k8420M9506Q5150N2201N850j4436l1278n8238o0666k4330P192
40311D04841Q585K1659P5518J16923Q3988M909m2212l5608j3787k25J1418J1838
40299F47847k1272p3318r3301n4323J1721M1943m646j06046j80234j57333o0933
$$ plain form
40382 18463 -26044 26960 123940 180018 186025 186540 196952 195502 172821 140952 106647 75090
40370 75090 67370 95600 130236 130802 103971 92031 102905 93543 39927 -8090 26994 154814
40358 154814 291604 342791 303900 260125 277598 318799 297006 201718 120314 122362 170939
40347 170939 182831 140378 96709 90000 105723 125318 164140 238475 322104 365227 354859 338562
40335 338562 375763 466038 540173 535537 469126 414099 413199 447431 485073 515442 524290 487988
40323 487988 422310 393890 443396 528546 580747 586597 572161 540883 482645 421979 397649 404841
40311 404841 413426 435085 510603 627526 711514 716423 674211 638603 624816 624591 636009 647847
40299 647847 626575 553257 459956 405633 417354 459297 454651 348605 168371 11038 -49895
40288d9895J6925L0708K1380K7969K8507L839j2802k369n143l5728k7706N3191
40276D8876J13033N5828n0561o2454J9390N6926m765o7633n4571j8399k6992n3596
40264d4918m6699k0091q853p275o006k3258m8106k2839O2533J25495J00375K9635
40252H9993j3996l1002n1358n1788k530N1357M6369N843O06K8813K6537j3394
40240H5450k7113P771L1221j941n1848n4792p567M0093M5621M969n1305p9545
40228e8986o0345j9512M884Q370R185P237q770k4554j5460N655K473k1415k1391
40215a92629J8280O0543P3402O4743M4254J814m9198n6457J324O4565N9981m498
40203H6124n7067n8115l0525j259L2564O6780O8774K4861k2446k2609J4317L5708
$$ plain form
40288 -49895 -32970 -2262 19118 47087 75594 79433 66631 64262 59119 23391 -4315 48876
40276 48876 161909 217737 167176 104722 124112 181038 176273 108640 54069 35670 8678 -44918
40264 -44918 -91617 -111708 -120561 -127836 -133842 -157100 -205206 -228045 -165512 -40017 60358 89993
40252 89993 75997 44995 -6363 -58151 -60681 -9324 37045 42888 43494 72307 98844 85450
40240 85450 58337 66108 97329 95388 43540 -11252 -18819 21274 66895 71864 20559 -58986
40228 -58986 -119331 -138843 -133959 -125589 -116404 -109167 -117937 -142491 -157951 -152296 -149823 -171238 -192629
40215 -192629 -174349 -113806 -40404 24339 68593 70407 21209 -35248 -33924 30641 90622 86124
40203 86124 29057 -29058 -59583 -60842 -28278 38502 107276 132137 109691 87082 101399 137107
40191A37107K4088J2244J7707J4387o565m4N9001J04566N4552n8697j14748p1416
40179A72182j9843l8505p5548m3102L6231O7944L6538J9899N4859P9987L8499
40168C29141l3383o1744l2278P275J3654j4307m6860n1267k2247N667o019m6526
40156D1106o1910k1539M4673Q2751O7372J4697l5041m6303k2034n263k2319l7526
40144a336k799O0451Q1739M0764j1894l6761m3728l8485m326L9498L8907K14K682
40131A24926O5422Q9429R167q1029n9011K9445L7347n2346j04434m5975L5571
40120D8512M7530K0768J8770K3346m081k7851j428K9387j1995r6540j13102k5743
40108i2427P6746J01086M9852j7722o3942p9971o0038q666M4455O4454M1889l655
$$ plain form
40191 137107 161195 173439 191146 205533 198968 198924 257925 362491 417043 358346 243598 172182
40179 172182 152339 113834 38286 -4816 31415 99359 135897 155796 210655 290642 329141
40168 329141 295758 234014 201736 209011 222665 208358 161498 110231 87984 93651 87632 41106
40156 41106 -20804 -42343 2330 85081 152453 167150 132109 85806 63772 58509 36190 -1336
40144 -1336 -4135 56316 138055 178819 166925 130164 86436 47951 43625 83123 122030 122244 124926
40131 124926 190348 279777 288944 207915 148904 178349 215696 163350 58916 12941 48512
40120 48512 96042 116810 135580 158926 154845 126994 125566 154953 142958 46418 -66684 -92427
40108 -92427 -15681 85405 135257 117535 53593 -26378 -86416 -95082 -50627 13827 55716 52061
40096E2061m0150m3224j6007J1008J5552J2750K6647M3138K7148j4946l3171n620
40084C5186K8343K6558j363k3912l7545n1956n3214k3344J8987L7691L0650K4850
40072A0931K6524J4641j6624m6025n9303o1139n0096j7683K1842L8578L2439L1561
40060g4354L5596J0285l9616m8210J7200Q7350P6954P516k5519O630L4494P180
40048I5506l2647k3479K0272L4761r22m1659l6546J5594O8531P2979K3218l6845
40036A58763o2749n8053n3848n1486k5064K0717M5378L8391L7858N8849N7327
40025A66083N618m6404m0693j992M998j9127j9585J0154J6510j7440l9584j6908
40013A630J0881K603j4822M433M4972N0977Q486l7523m2167n040M0505N8341L3470
$$ plain form
40096 52061 11911 -31313 -47320 -36312 -20760 -8010 18637 61775 88923 73977 40806 35186
40084 35186 63529 90087 88724 64812 27267 -24689 -77903 -101247 -82260 -44569 -13919 10931
40072 10931 37455 52096 35472 -10553 -69856 -130995 -181091 -198774 -176932 -138354 -105915 -74354
40060 -74354 -38758 -28473 -68089 -116299 -99099 -11749 65205 72721 47202 53832 88326 95506
40048 95506 62859 39380 59652 94413 93491 51832 15286 30880 99411 172390 195608 158763
40036 158763 96014 37961 -15887 -67373 -92437 -71720 -26342 12049 49907 108756 166083
40025 166083 171701 125297 84604 82612 87610 68483 48898 59052 75562 58122 18538 1630
40013 1630 12511 15114 292 4725 49697 100674 109160 71637 29470 24430 64935 123276 156746
40000A56746j5934n2245n4463l3521p292K0133M2338L7824j834m5990n3802k3462
39988c1502Q680J3921k415j6800j2181J2289M1614N4056L9392Q490j8817l0301
39976F6426k4246p747K557p772k9376l2406k331L8547N4669L2265j3434n0401
39964B6751m5760O650O5329P4158L1112l924J1364M5844M5521P944l1921o2074
39952A70994q9898r4715m2390M7503R9484O7267r809n3054k8687K3400L2830k7787
39940I5138j01157r3737J0563J08364R0710j7084q4430m0942M9079R0604P2763
39929A79871M5600L2881J8273o318k4165k1792q281o811l2742o9705p1866j5946
39917A8999N2992O6045K1540j6566j7779k1453n2728p1337m8204k8334n4393q0887
$$ plain form
40000 156746 140812 88567 34104 583 -6709 13424 55762 93586 91752 45762 -8040 -31502
39988 -31502 -22822 -8901 -11316 -28116 -40297 -28008 13606 67662 107054 115544 96727 66426
39976 66426 42180 34433 36990 29218 -158 -32564 -34895 3652 58321 90586 77152 26751
39964 26751 -19009 -12359 52970 127128 158240 154316 165680 211524 257045 264989 233068 170994
39952 170994 81096 -13619 -56009 -8506 90978 158245 148436 95382 66695 90095 122925 95138
39940 95138 -6019 -99756 -89193 19171 109881 92797 8367 -32575 16504 107108 179871
39929 179871 225471 258352 276625 270307 246142 224350 216069 209258 176516 106811 34945 18999
39917 18999 71991 138036 159576 143010 125231 103778 51050 -20287 -68491 -96825 -151218 -232105
39905b32105m1249L8138P5589O0909N3128O1471K8565n2030r8311o1821p879j6744
39893a92339o4035o5428l126N8608O8241M0393J6367J5448L0626M1311K4609k3386
39881e2711p3539q7570n7285p371L6926O8458Q5394P7711L6007l0220q8106j00031
39869a92337n4729J7903P0005P6833N0051J3937j6935l4003k7326L847M0653N7919
39857E818M8110K5613O393j1565m0375p2446p2396k0012M4273N2774R67l6217
39845f9063p760L4727J1746o0929r0518l8301L6979P1024O0924K6791k2037n4941
39833a01358k3857N8236J02394N5778k4701o1086n9820o5103o2483j4870M1581
39822a55289L4432k3863m4910J045M7510M5111K7913L5400M5018K6719J054p793
$$ plain form
39905 -232105 -273354 -235216 -159627 -98718 -45590 15881 44446 -7584 -105895 -167716 -175595 -192339
39893 -192339 -256374 -321802 -324928 -266320 -198079 -157686 -141319 -125871 -95245 -53934 -29325 -52711
39881 -52711 -126250 -213820 -271105 -278476 -241550 -173092 -87698 -9987 26020 -4200 -92306 -192337
39869 -192337 -247066 -229163 -159158 -82325 -32274 -18337 -35272 -69275 -96601 -92754 -52101 5818
39857 5818 53928 79541 85934 74369 33994 -38452 -110848 -130860 -86587 -33813 -32846 -69063
39845 -69063 -76823 -42096 -30350 -91279 -181797 -220098 -183119 -112095 -51171 -24380 -46417 -101358
39833 -101358 -125215 -66979 35415 91193 66492 5406 -54414 -119517 -182000 -196870 -155289
39822 -155289 -120857 -144720 -189630 -188585 -141075 -95964 -68051 -32651 12367 39086 40140 32347
39810C2347k3799o7160r2605m3667N4498J17264J06976O4383L4607J2096k6463
39799A68477p2198r2411p3814l8129j5200r129K245L1407N5264M3003N199j2952
39787h238O008K7638K1302R323K9635P0478Q0452L7690k4571o2781o5744m8189
39775G3003k6920j3174j0901j1766j976J9616L8211M0360K5847J638k4236l9778
39763F9924l2729n640K0592K7189J7182O314j887j8270m1457m5221j1092L2978
39751A7883L4143j5417n6362l2868L3959P4362N9412K3021l309l1520p5524j08257
39739h0477r2524l3934K5635N5459N4798L6327J3105m878j7675l1542l8776j9241
39727a33723K2843M6414K3641j5718k2097L614J3773j4814n0143n3872l0071q297
$$ plain form
39810 32347 8548 -58612 -151217 -194884 -140386 -23122 83854 148237 182844 194940 168477
39799 168477 96279 3868 -69946 -108075 -123275 -132404 -130159 -98752 -43488 -485 4714 -8238
39787 -8238 -2230 25408 46710 56033 85668 156146 236598 274288 249717 186936 121192 73003
39775 73003 46083 32909 22008 10242 8266 27882 66093 106453 132300 133938 109702 69924
39763 69924 37195 31555 52147 79336 96518 102832 100945 82675 41218 -4003 -15095 17883
39751 17883 52026 36609 -19753 -52621 -18662 55700 115112 138133 134824 103304 27780 -80477
39739 -80477 -173001 -206935 -181300 -125841 -71043 -34716 -21611 -26489 -44164 -75706 -114482 -133723
39727 -133723 -110880 -64466 -40825 -56543 -78640 -75026 -61253 -76067 -126210 -180082 -210153 -218450
39715b18450J501J5542M4061P1410P6200O3659O1508P6904P7233L7504r862j4679
39703B82531P004j4338r0179j38830r9623k2909R300m37P33J0689q152l2155k336
39690i8702N9711O9932K7316K7084R3404J15873K1128r4733r9969j6395L2578
39679A37227J0542j0335R715L0665K7719L0487M7171L7041j0964m4200k5253J4213
39667B54028L1435L0733K8361Q810l9169p8083o0091N377N6557M5869j6436p6634
39655A90757q5732m3395M756K4247L1736N3127O6077L4097j8236l1263r161j4434
39643B02576n0879m2143L4979Q6574L6361n2007o9557j8633J7490J4853J4972
39632A74586J8479j6417p1950p2614n149N5346O0920M6233M3450K9744l326j3578
$$ plain form
39715 -218450 -216949 -201407 -157346 -85936 -9736 53923 115431 192335 269568 307072 297210 282531
39703 282531 289535 275197 185018 46188 -53435 -76344 -67044 -67481 -66748 -56059 -64211 -96366 -98702
39690 -98702 -38991 30941 58257 85341 178745 294618 315746 221013 121044 104649 137227
39679 137227 147769 137434 147149 177814 205533 236020 283191 320232 309268 265068 239815 254028
39667 254028 285463 316196 344557 353367 314198 236115 176024 181401 237958 283827 267391 190757
39655 190757 105025 61630 66386 90633 122369 175496 241573 275670 257434 226171 217010 202576
39643 202576 151697 109554 144533 231107 267468 215461 145904 127271 144761 159614 174586
39632 174586 193065 176648 104698 32084 26935 82281 143201 189434 232884 262628 259302 245724
39620B45724R391M879n5680r8821n5273K4741M5265P696q789K0011M1501K5411
39608B06056k004k4407n6274q6999p7923l2880l755m271J3503O6492R3659M9920
39596A41117j1608j4510K4603K7002k0542m5262l267N1610M5205j5306n8029m2840
39584G8173j370J5686j408k2445j7003J7951N6449O1047J7224l9295m8501J750
39572A18258M8558K7833l9892p6813n2464j0374J3474L8358Q0511J05618Q2974
39561C36041L9741J1338j8628o9497r6763n1823J9809K9979j3925k0213L0360
39550A96419M5352k5357r6398p3198P010M0971J1777j0937P976L1927K6908J778
39538A64228k7267n4044o0013k5915K6256M6179J9300j6463k2822K507M3208Q3199
$$ plain form
39620 245724 255115 259994 204314 105493 50220 74961 120226 127922 119133 139144 180645 206056
39608 206056 204052 179645 123371 36372 -41551 -74431 -78186 -82457 -68954 -2462 91197 141117
39596 141117 129509 114999 139602 166604 146062 100800 97533 149143 194348 179042 121013 78173
39584 78173 76803 92489 91081 68636 51633 69584 126033 187080 204304 165009 116508 118258
39572 118258 166816 194649 154757 77944 25480 15106 28580 66938 147449 253067 336041
39561 336041 375782 387120 368492 298995 202232 150409 170218 200197 186272 166059 196419
39550 196419 241771 216414 120016 46818 53828 94799 106576 95639 103615 135542 162450 164228
39538 164228 136961 82917 22904 -3011 23245 69424 88724 72261 49439 51946 95154 178353
39526A78353J01991Q2824L6154n503j9808o878K1487M2730K8541j8535m5971q485
39514C86900O3160R5071O9156L9098M2121N1150L6947K4656M7309P9008O3719
39503I98295l350o6526q1503o1660m3345l1820l217M8749R2002R2752N9171K8362
39491A027910J5114J443j8545j9285R645L1258J1378k3569k2378J2619L0505R291
39479A065386j9067k3046n701K1922N7131Q3481P3613L0316j0344l0165m6727
39468A196799o6496o0890j3518M1549N5809J9407l9039q3205q7685n3001j4445
39457H95285q855k5131k1516L016K559l4918n5034j7926L6155M4095M663l7082
39445G85311n6508n5329l0932J0003K8558n219n9476p2797l2658J3326J5827l4369
$$ plain form
39526 178353 280344 363168 399322 393819 374011 367133 388620 431350 459891 441356 395385 386900
39514 386900 450060 545131 614287 653385 695506 746656 783603 808259 855568 934576 998295
39503 998295 994945 928419 846916 785256 741911 710091 706874 755623 847625 940377 999548 1027910
39491 1027910 1043024 1044467 1025922 1006637 1016282 1047540 1058918 1035349 1012971 1025590 1056095 1065386
39479 1065386 1046319 1023273 1017572 1039494 1096625 1180106 1253719 1284035 1273691 1243526 1196799
39468 1196799 1130303 1069413 1055895 1097444 1153253 1172660 1133621 1050416 962731 909730 895285
39457 895285 886430 861299 839783 842799 845358 810440 755406 737480 773635 817730 822393 785311
39445 785311 728803 673474 642542 652545 681103 675884 616408 543611 510953 524279 540106 505737
39433E05737j06125j41179r2310J5842Q8889O5492p515m5467l8545l5951m6485
39422A62383l1831Q529K4685Q03j6969R77K0486K701l7710o0458m6090N666Q1600
39409A14772J37279J18626L1603m7087n9144k9856j4017j4959k19K9820L9397
39398C06215J5019j6233k7169j7948q96J5433K1301O854k1781m0837l2957n927
39386B01074J9663L5414M7166N3082L5892j0309n7862p3373o2587n7254n7136
39375G3770k7114L3344O6674L7937m515J642L8480M3768J4489J959J5184Q478
39363C04096k6848l6289N888M4588K2129l9577p2695m5229J8474O9048O6236J4697
39351C24518k3880M921O4963O4514j3286p9914o7071j4132R635L414K091M329
$$ plain form
39433 505737 399612 258433 166123 181965 270854 336346 328831 283364 244819 208868 162383
39422 162383 130552 139081 163766 164569 147600 148577 169063 171764 134054 73596 27506 33172 114772
39409 114772 252051 370677 402280 355193 296049 266193 252176 237217 236998 266818 306215
39398 306215 321234 305001 277832 259884 258988 274421 295722 302576 280795 239958 207001 201074
39386 201074 220737 256151 303317 356399 392291 381982 324120 250747 188160 130906 73770
39375 73770 46656 80000 146674 184611 180096 181738 220218 263986 278475 280434 295618 304096
39363 304096 277248 240959 246847 291435 313564 273987 201292 156063 174537 243585 309821 324518
39351 324518 300638 305559 370522 435036 421750 341836 274765 260633 270268 273682 275773 280102
39339B80102l659l21L0790N3872L8094K0399M0622N4059n876j03109j28928n2224
39327B23821M3712P9246N6479R974m3673q3626p7669k8931J6256K8877K4699J9793
39315B68958O844j0006o949J3664J6742o089j7636K120K3073K2092K4082M9486
39303C86381O4907L2383k3392m5852k6169p084j5796l3044l0119o879J2672N723
39291C13731k8869o2956n6612J915P4477J02714O2517j3591o6905o5363k8782
39280B32276k28N839J2750L4931M7946K6948q306k1184j5604k4681m9056n1313
39268A90318j5883K6470M3375L5566J8745L394j124N743J971k7414m9304j8352
39256B13505M3396N9113M694n3515n3994j8180J379m4K384N469j0688l6329l9809
$$ plain form
39339 280102 276443 276122 306912 360784 398878 419277 459899 513958 508082 404973 276045 223821
39327 223821 267533 346779 403258 413232 369559 285933 208264 179333 195589 224466 249165 268958
39315 268958 275802 265796 258847 272511 289253 283164 265528 267648 290721 312813 336895 386381
39303 386381 451288 483671 460279 414427 388258 381174 365378 332334 302215 295336 308008 313731
39291 313731 284862 221906 165294 167209 241686 344400 406917 393326 326421 261058 232276
39280 232276 232048 237887 250637 285568 333514 360462 352156 330972 315368 290687 241631 190318
39268 190318 174435 200905 244280 279846 298591 301985 300861 306604 308575 281161 231857 213505
39256 213505 256901 316014 320708 267193 213199 195019 196398 196354 198738 204207 193519 157190 117381
39243A17381j0142L3962O2093M5597j7900q0091q0667k6416J3706Q625R17J8226
39231H5291K3871J325Q141P4471J19571O1221m7109r0477o1230m2315n2010k9982
39219E0768K7937M8656J4287k371L1650N3401K3214m321J3105K3413k3491p8277
39207A77971p0819k0618J1792K6785N4680P0647L1909l0810m7493j5869P529P905
39195B03609J9715M0534K4976k5857m9994k1018J2406J0549J070J8509M2683M1028
39183C18210K8075L5810N5636N5163L3104J6488J5047J3990N482l716j3375l1025
39171E28889n0159m9752k1655J6286M0076M2922L4464K3562P965j8113m8140o1536
39159D44809m4638r460J8890L0959L4952L1054M549m5547q8472q9722n0347m932
$$ plain form
39243 117381 107239 141201 203294 248891 230991 150900 70233 43817 57523 66148 67065 85291
39231 85291 109162 110487 118628 193099 312670 373891 326782 236305 175075 132760 80750 50768
39219 50768 78705 127361 141648 139277 170927 224328 247542 243221 256326 279739 256248 177971
39207 177971 107152 86534 98326 125111 179791 250438 282347 251537 204044 188175 195704 203609
39195 203609 223324 263858 288834 262977 212983 191965 204371 214920 215990 234499 277182 318210
39183 318210 346285 382095 437731 492894 525998 542486 557533 571523 577005 573289 559914 528889
39171 528889 478730 428978 407323 423609 463685 506607 541071 564633 572598 554485 506345 444809
39159 444809 400171 390711 409601 440560 475512 506566 511115 465568 377096 287374 237027 232095
39147B32095J4728L141k5115m9705n2927k8013J4259N2344P0390O5971M4638J5216
39135C57022q986j5033m655J104j8079n5327p7888o0138j1141L5622N5523M8866
39123B46890K8965P936l109O498L6003O5451O7086K7759l6144q1805o7620L286
39111C01196O8657O1431j2581p6252p4342l5879j8675k3503r117K6073L6916J0429
39099B54353o364J9227N2057M4818Q511j5136k2809m1037o3808n2551j624M1613
39087B17250L5838q157n2385p2022n7983j1696M0128N2066J1053l4358k5714L0790
39075A24810O9813M8270m509k8935r403J2872j376l5820l8588O711N0579L5390
39063B29814k7682o7256l9971J8817M6537K9071P65j0945q800l443q26j0112l3525
$$ plain form
39147 232095 246823 249964 224849 175144 122217 94204 108463 160807 231197 297168 341806 357022
39135 357022 348036 333003 328348 329452 311373 256046 178158 118020 106879 142501 198024 246890
39123 246890 275855 283791 280682 287180 323183 388634 455720 483479 447335 365530 297910 301196
39111 301196 369853 431284 418703 342451 268109 232230 213555 190052 180935 207008 243924 254353
39099 254353 247989 267216 319273 364091 372602 357466 334657 293620 229812 177261 175637 217250
39087 217250 253088 244931 192546 120524 62541 50845 90973 143039 154092 119734 94020 124810
39075 124810 194623 242893 238384 209449 200046 212918 211542 175722 137134 143845 194424 229814
39063 229814 202132 134876 94905 113722 160259 189330 190095 179150 170350 166907 166081 155969 122444
39050A22444m6924k2753K0837K7565k3571q0579p6644o799P3419J08905Q6445
39039A82345L4335J733K0460O5661P4164K5475k2421j3207K1060P861m9362p3704
39027B74400l7004k824j9187m1410j3377L4308L7074N682J615K4131J0161m8691
39015B24878p5370k2726N2632P5642N3677L8981L6583J3893k4861m0427k6381
39004C06521j4897j2920R875N5440P1661K1183n8380r2457m8891L7972J02440
38993C77547R4178J6404o5540p9729l0108N626j9253n6443l9948J1474K7673m55
38981B41426j4165Q365J7209j5308l6488L148O1087N8174q741p0419q2583n8398
38969A03307j3267N4442J17784J21919O1606R302K6996Q3877J00259M8112l0799
$$ plain form
39050 122444 75520 52767 73604 101169 77598 -2981 -79625 -86424 -13005 95900 182345
39039 182345 216680 218413 238873 304534 378698 404173 381752 368545 389605 397466 348104 274400
39027 274400 237396 234572 215385 173975 160598 194906 231980 237662 239277 263408 273569 224878
39015 224878 149508 126782 179414 255056 308733 347714 384297 398190 373329 332902 306521
39004 306521 291624 278704 288579 344019 415680 436863 378483 286026 237135 275107 377547
38993 377547 471725 488129 422589 342860 312752 318378 299125 242682 202734 214208 241881 241426
38981 241426 227261 235626 252835 237527 201039 204187 265274 323448 314707 244288 161705 103307
38969 103307 90040 144482 262266 384185 445791 455093 482089 565966 666225 714337 683538
38958F83538q6448r7914o2384N939O3637O5951J9572k2008k6939k0617l7574o4440
38946D20313n6421Q03O7917Q9988M7776k5294p1558o0814j8245O557j563j0949
38934C88510O751L6445M4092K2003j1406m1711o2347n8813k1152K7809M7259K8944
38922D06384O566N551J1334L793m680P658L0379L5172K1530J4545J9472J3764
38910E71468q788j9571J933L3290L9580K0219K153K5O847J4125J6433K788l0870
38897F49632o3734o9971n4348m1148l0259J34M2016N1504J5367j5969L901M8262
38885E35387N9345L5660K2733K6708J911o1159r6609n0607L3537O5851K2972l5268
38873E60461n0914k2976K0929N9851P2938M0401k1299n4445k3421L3493M7196
$$ plain form
38958 683538 597090 499176 436792 442731 506368 572319 591891 569883 542944 522327 484753 420313
38946 420313 363892 364695 432612 522600 570376 545082 473524 412710 394465 401022 399459 388510
38934 388510 395261 431706 475798 497801 486395 444684 382337 323524 302372 330181 377440 406384
38922 406384 412950 418501 429835 433628 428948 436606 466985 502157 523687 538232 557704 571468
38910 571468 562680 543109 545042 578332 617912 638131 640284 640309 647156 661281 677714 680502 649632
38897 649632 585898 515927 461579 420431 390172 390306 432322 483826 499193 483224 487125 535387
38885 535387 594732 630392 653125 679833 681744 620585 523976 473369 506906 572757 595729 560461
38873 560461 509547 486571 507500 567351 640289 680690 659391 604946 581525 615018 662214
38862F62214K782n0179o6649m9331j9576J5377M8091N7941M1144K8240L8556M0054
38850G48664k087n3461m5677J4992M0711j0052o1858l0652M7873P0870K2346r259
38838G32410K9358P9859O6391L632l5370k0198J4171K3516m346n0575p9258o3524
38826F96066j8171J1155P222K082J9421L3631J9017J526J5648M2378M3669L0573
38814I04217L4748L5292j1492p9496r1600l6412J5128K5053L5032O8280P3974
38803I72724K2103k5554r141K8603J4058l5532m7573j5242N722j387m373j135
38791I03273j9057l8856j0976M3147M0022l1060p2474j9109O4453Q1320L2517
38780I73200q526k376L2053O1579N7933P322n6999o9686k1025J4991j5560o6656
$$ plain form
38862 662214 664996 614817 548168 498837 479261 494638 542729 600670 641814 670054 708610 748664
38850 748664 746577 693116 647439 662431 703142 693090 631232 600580 648453 719323 741669 732410
38838 732410 761768 841627 908018 911650 876280 856082 870253 893769 889423 838848 759590 696066
38826 696066 677895 689050 696272 698354 717775 751406 770423 771949 787597 829975 873644 904217
38814 904217 938965 974257 962765 883269 791669 755257 770385 795438 830470 898750 972724
38803 972724 994827 969273 960132 988735 1002793 967261 919688 904446 910168 908781 904408 903273
38791 903273 884216 845360 834384 877531 917553 886493 814019 794910 859363 940683 973200
38780 973200 964674 962298 994351 1055930 1113863 1121185 1064186 994500 973475 988466 972906 906250
38768I06250p1343m5705m2477n0631k7466P676Q104O13M5544J09801R5463K196
38756I38025n6096k3008K5850K1359J478J3098J9831j1818k7842J5929N0879n99
38744I67086p9364o7909K3690P3565L3950j9174k5414j4653k0896k3816j1117
38733H35948j4297m5056o6986o1168n1761m1830M92O2839P7698L1035k54K9555
38721G56215N6767J6781m4661m7942n513J4260O40r078j3842l5391n0599k4545
38709F13092J2231N010k7630k4679Q922J7838M201J7736M5129J9973m8864p1315
38697E71644k0217K8405K8605K5580M4373L5994p774n130P1298J14050M4196m7957
38685H83067m3962J0936l055o7634o1879K3878P2391L7295K981K2118L4974j878
$$ plain form
38768 906250 834907 789202 746725 696094 668628 676304 684408 685021 730565 840366 935829 938025
38756 938025 881929 858921 884771 906130 907608 920706 940537 928719 900877 916806 967685 967086
38744 967086 887722 819813 843503 917068 951018 931844 906430 891777 870881 847065 835948
38733 835948 821651 776595 709609 648441 596680 554850 555342 618181 695879 726914 726660 756215
38721 756215 812982 829763 785102 737160 731647 745907 746547 737469 723627 688236 637637 613092
38709 613092 625323 630333 602703 578024 586946 604784 608985 626721 671850 691823 642959 571644
38697 571644 551427 579832 608437 634017 678390 714384 706610 701480 772778 886828 931024 883067
38685 883067 839105 850041 846986 779352 717473 741351 813742 851037 854018 876136 911110 909232
38673I09232k9919N267O1516P8127O3559M5449J1039l9965n5490j2069K7399O617
38661A070762l0333j1932M3316O2305L4533J3364K1382K9331J9841P263j475j1230
38649A247127j0030J4165L6507K3756q824j7396Q03N871k0853n5234o8219m6293
38637A101380J3738Q6416J09861N0676l3047n2337p192J6696k4507p4365o4714
38626A122605n007M5259N0217J8144j7111j6827K8158P3002O4470J4853j6050
38615A361713j5705l1828p3275p2997M597Q4289P3216j0099o8676o0261k6605
38604A164369m564J7330M5477M8961P739m7492p0637n1874j6191J0056J5498K192
38592A120864j6546k3628j3240M099J3682R426n281k3616m0009n0012m6745k4391
$$ plain form
38673 909232 879313 884580 946096 1024223 1087782 1133231 1144270 1104305 1048815 1036746 1064145 1070762
38661 1070762 1040429 1028497 1071813 1134118 1168651 1182015 1203397 1232728 1252569 1259832 1258357 1247127
38649 1247127 1237097 1251262 1287769 1311525 1302701 1285305 1286108 1291979 1271126 1215892 1147673 1101380
38637 1101380 1115118 1201534 1311395 1362071 1329024 1276687 1269495 1286191 1261684 1187319 1122605
38626 1122605 1117598 1162857 1213074 1231218 1214107 1197280 1225438 1298440 1362910 1377763 1361713
38615 1361713 1346008 1314180 1240905 1167908 1172505 1256794 1330010 1319911 1251235 1190974 1164369
38604 1164369 1159805 1177135 1222612 1271573 1279312 1231820 1161183 1109309 1093118 1103174 1118672 1120864
38592 1120864 1104318 1080690 1067450 1071549 1085231 1094657 1089376 1065760 1025751 975739 928994 904603
38580I04603Q151K7258K4575K6316N5095Q0068M7781l0608p2381k8637M7578P4424
38568A164223M2318l497m3742q5725j05772o4829J5919O1437M1320N874L393J6144
38556A047063J0412Q57J8952M9296M7635R537k1553j3516J8343L5997J8367k2862
38544A198528n0815l2650K2374O2176M7566j142l4911m1213m6297n7701m6791
38533A019124k334L6333K9001o239j8284L916K0715N742j5627p823K2351M0500
38521A127375L6211K9325K7172O632m6921j02298j06968m7420L0741O9072N4380
38510A077301K2746J0683J7261K1646K2865L8527O5237O8986L0258k3339n1432
38499A300739n0143m0130k2247J5668N3694M9035K670k6399J221M8384N5850K7857
$$ plain form
38580 904603 912754 940012 964587 990903 1045998 1126066 1173847 1143239 1070858 1042221 1089799 1164223
38568 1164223 1206541 1203044 1159302 1073577 967805 902976 918895 980332 1021652 1027526 1030919 1047063
38556 1047063 1057475 1058332 1077284 1126580 1174215 1183752 1162199 1148683 1167026 1203023 1221390 1198528
38544 1198528 1147713 1115063 1137437 1199613 1247179 1246037 1211126 1169913 1123616 1065915 1019124
38533 1019124 1016790 1053123 1082124 1075885 1057601 1061517 1082232 1087974 1072347 1064524 1086875 1127375
38521 1127375 1163586 1192911 1220083 1226715 1179794 1077496 970528 923108 953849 1022921 1077301
38510 1077301 1100047 1110730 1127991 1149637 1172502 1211029 1276266 1345252 1375510 1352171 1300739
38499 1300739 1250596 1210466 1188219 1203887 1257581 1306616 1309286 1282887 1284108 1332492 1388342 1416199
38487A416199K0952N6946Q9539O7135K53n1380m7722r752J0627l678j3340K0479
38475A556258P1081P2078J2020l9170k4256J7776O993n9807j01967o7551j311
38464A442144K2316l333k0884P458N5364P3405M8929J1486p628k333J9071M8967
38452A694962P3311O8969L1181p027r897J1862J6897l974j6258K102L1394M8628
38440A942150N6740N8612M1242Q833o241P786J8895M158j4212j6733k5240n2361
38428B023629n8616j2790M5002N9576M4381M6207O0557N2169K9178K0673R058
38417B319024l0334m9646R965R3115Q3047j5297o7482j2012N3138L7888l755J6523
38405B434174P3313Q5958N5721M5059O3662O5936L6396K276j8380j9931J2812
$$ plain form
38487 1416199 1437151 1494097 1583636 1650771 1651024 1599644 1551922 1542170 1552797 1549119 1535779 1556258
38475 1556258 1627339 1699417 1711437 1672267 1648011 1665787 1672780 1612973 1511006 1443455 1442144
38464 1442144 1464460 1461127 1440243 1447701 1503065 1576470 1625399 1636885 1629257 1626924 1645995 1694962
38452 1694962 1768273 1837242 1868423 1861396 1851499 1863361 1880258 1876284 1860026 1862128 1893522 1942150
38440 1942150 1998890 2057502 2098744 2107577 2101336 2109122 2128017 2132175 2117963 2101230 2075990 2023629
38428 2023629 1965013 1952223 1997225 2056801 2101182 2147389 2207946 2260115 2289293 2309966 2319024
38417 2319024 2288690 2239044 2249009 2342124 2425171 2409874 2342392 2330380 2383518 2421406 2417651 2434174
38405 2434174 2507487 2593445 2649166 2694225 2757887 2823823 2860219 2862495 2844115 2824184 2836996
38394B836996P0467R4202M9572l353J6787R0954J23377P5331N935j8254Q659N7746
38382C408419J02282J18214R2027M1360J486r994K595K8225M7025L8361J7507
38371C887507L1261Q5015J16495Q5881M4722N5183Q6285O7592J1775n315L1430
38360D497831O4026O8610Q2812J15062J14431N8759J565j053M4098R8536J38518
38349E283195J51614J35794J18013J28368J47391J29327Q1923O3118Q9700J15831
38339F444274J18693J34788J81780K11892J85914J40174J34218J71224K10434
38330G933391K27424K28369K28791K41620K65611K77856K65588K60052K93946
38321A0222648L32917L13477K50755K31598K83206L29324L09139K60923K43859
$$ plain form
38394 2836996 2907463 3001665 3051237 3047884 3064671 3155625 3279002 3354333 3360268 3342014 3350673 3408419
38382 3408419 3510701 3628915 3720942 3762302 3763788 3753794 3756389 3784614 3831639 3870000 3887507
38371 3887507 3918768 4003783 4120278 4206159 4250881 4306064 4392349 4459941 4471716 4466401 4497831
38360 4497831 4561857 4630467 4713279 4828341 4942772 5001531 5003096 5002043 5046141 5144677 5283195
38349 5283195 5434809 5570603 5688616 5816984 5964375 6093702 6175625 6238743 6328443 6444274
38339 6444274 6562967 6697755 6879535 7091427 7277341 7417515 7551733 7722957 7933391
38330 7933391 8160815 8389184 8617975 8859595 9125206 9403062 9668650 9928702 10222648
38321 10222648 10555565 10869042 11119797 11351395 11634601 11963925 12273064 12533987 12777846
38312A2777846K51594K57678K78232L25578L56794L35434K98196K96833L16789
38303A5494974L16719L06221L14427L15910K62879J73076J18874J36242J94639
38294A7633961K46211K63435K46171K30417K67295L56205M26900M24720L80576
38285B0475891L60984L90922M64369N75517O86672P25016O80735O54235P28029
38276B5742370Q44508Q99997R08410R62097J066916J140641J164049J209324J307739
38267C5246051J403841J465503J536634J650007J780501J915200K079493K261328
38259D9338558K402370K506355K665920K928915L220549L458446L669384L923415
38251G4113912M219008M513392M818381N183089N606958O042340O471797O924877
$$ plain form
38312 12777846 13029440 13287118 13565350 13890928 14247722 14583156 14881352 15178185 15494974
38303 15494974 15811693 16117914 16432341 16748251 17011130 17184206 17303080 17439322 17633961
38294 17633961 17880172 18143607 18389778 18620195 18887490 19243695 19670595 20095315 20475891
38285 20475891 20836875 21227797 21692166 22267683 22954355 23679371 24360106 25014341 25742370
38276 25742370 26586878 27486875 28395285 29357382 30424298 31564939 32728988 33938312 35246051
38267 35246051 36649892 38115395 39652029 41302036 43082537 44997737 47077230 49338558
38259 49338558 51740928 54247283 56913203 59842118 63062667 66521113 70190497 74113912
38251 74113912 78332920 82846312 87664693 92847782 98454740 104497080 110968877 117893754
38243A17893754P423929P958623Q509950R064720R610212J0137200J0639289J1095359
38235A92333036J1469575J1736397J1876237J1837160J1539949J0938522J0037857
38228B71768733Q839844P324126N509108L480148J324253r10032l147648n240474
38220B88948058p049758q542939r756415j0697346j1340928j1696312j1811256
38213B18053104j1724635j1466303j1088509j0646129j0158354r633724r109643
38206A44225807q613090q106117p538645o945699o422235n999455n614689n216460
38198H9769417m833026m510072m235640l963337l673608l381471l111127k886362
38190E9174774k719363k587015k442918k272953k113211j991028j876729j727547
$$ plain form
38243 117893754 125317683 133276306 141786256 150850976 160461188 170598388 181237677 192333036
38235 192333036 203802611 215539008 227415245 239252405 250792354 261730876 271768733
38228 271768733 280608577 287932703 293441811 296921959 298246212 297336180 294188532 288948058
38220 288948058 281898300 273355361 263598946 252901600 241560672 229864360 218053104
38213 218053104 206328469 194862166 183773657 173127528 162969174 153335450 144225807
38206 144225807 135612717 127506600 119967955 113022256 106600021 100600566 94985877 89769417
38198 89769417 84936391 80426319 76190679 72227342 68553734 65172263 62061136 59174774
38190 59174774 56455411 53868396 51425478 49152525 47039314 45048286 43171557 41444010
38182D1444010j561301j444490j404685j388925j326468j212478j104875j044251
38174C0956537j006213r46813q70947q24063q23878q37314q30922q06898p73780
38165B3235709p21038o52273o08698o16726o35344o04057n31154m82869m85643
38156A7897907m92133m58728m09103l91099m02974l99533l59167l12608l00891
38147A4371671l23042l36886l09975k60583k36350k52151k68529k44818j94591
38138A1944746j63901j67383j77721j74763j69297j69843j59709j28180j01205
38129A0532744j12971j55729j84592j75585j57436j71344k11231k28134j98817
38120H936905j64996j79956k29804k43598j85483j01450n8788p0746j05886j44057
$$ plain form
38182 41444010 39882709 38438219 37033534 35644609 34318141 33105663 32000788 30956537
38174 30956537 29950324 29003511 28132564 27308501 26484623 25647309 24816387 24009489 23235709
38165 23235709 22514671 21862398 21253700 20636974 20001630 19397573 18866419 18383550 17897907
38156 17897907 17405774 16947046 16537943 16146844 15743870 15344337 14985170 14672562 14371671
38147 14371671 14048629 13711743 13401768 13141185 12904835 12652684 12384155 12139337 11944746
38138 11944746 11780845 11613462 11435741 11260978 11091681 10921838 10762129 10633949 10532744
38129 10532744 10419773 10264044 10079452 9903867 9746431 9575087 9363856 9135722 8936905
38120 8936905 8771909 8591953 8362149 8118551 7933068 7831618 7772830 7702084 7596198 7452141
38110G452141j86172k21692k24827j86988j29724q2393o1625o9116r3222j14053
38100F082329j18352j06479q1767m8037k3209l1057o5591r0115r0298r7739j34646
38089E195039j68249j57552j17139r0988q6986q4454q3842r4228q9787m0745K1622
38078D202691L4851l830m1515o1232r3500j30113j13393l9043J4621L234j7486
38067C755285K357J4143l7489r7146p4943j155O870p5988j44853j24462o7835
38056C154784n4055p0375n7582j5220P446o070k7673l7499l5155j3516K3740L0017
38044B898842l3714j13371r9737J9617J14206O9795n7073j13901n1885L0099L6661
38033B699539j2511m6204m5069l6277l4326l7431n2684q1217r9523q9141o1800
$$ plain form
38110 7452141 7265969 7044277 6819450 6632462 6502738 6420345 6358720 6289604 6196382 6082329
38100 6082329 5963977 5857498 5775731 5727694 5704485 5673428 5607837 5517722 5427424 5329685 5195039
38089 5195039 5026790 4869238 4752099 4661111 4574125 4489671 4405829 4311601 4221814 4181069 4202691
38078 4202691 4237542 4233712 4192197 4130965 4037465 3907352 3793959 3754916 3769537 3772771 3755285
38067 3755285 3757642 3771785 3734296 3637150 3562207 3561052 3567922 3491934 3347081 3222619 3154784
38056 3154784 3100729 3030354 2972772 2957552 2964998 2958928 2931255 2893756 2858601 2845085 2868825 2898842
38044 2898842 2865128 2751757 2652020 2671637 2785843 2855638 2798565 2684664 2632779 2662878 2699539
38033 2699539 2687028 2640824 2595755 2559478 2525152 2487721 2435037 2353820 2254297 2165156 2103356
38022B103356k8367K1422P4529P6071Q293n3623l3258L0765L8653k1837p0057
38011B145947o8986o6946q6181p1922J354N9793L2215m0136o5331k7400J7370
38000A829777L7996N0792N7762L1153l1878q6487q8339m0490J4726L6005J5578
37989A826595j7788l0666k0450p505J142J2516J6013q054m2346m1529j790K7499
37977A713637K0842J0944J9098J3066k3084l9917m083K7076j0168o8859m9350
37966A609202M5245J04582O4413k0250p0903p7104o3680l4265R005L6095K4860
37955A627200L58L543L7392O8851O9633L6083j7009o4225q1518o6539m3118l6950
37943A533701m8965n5303l1765J9087O3164O4895K5409j9269l8847l1089n679
$$ plain form
38022 2103356 2074989 2096411 2170940 2247011 2255304 2201681 2168423 2199188 2237841 2216004 2145947
38011 2145947 2076961 2010015 1923834 1851912 1853266 1913059 1945274 1905138 1839807 1812407 1829777
38000 1829777 1867773 1918565 1976327 2007480 1975602 1889115 1800776 1760286 1775012 1811017 1826595
37989 1826595 1808807 1778141 1757691 1750186 1751328 1763844 1779857 1771803 1729457 1687928 1686138 1713637
37977 1713637 1734479 1745423 1764521 1777587 1754503 1714586 1710503 1737579 1727411 1658552 1609202
37966 1609202 1654447 1759029 1823442 1803192 1732289 1655185 1591505 1557240 1566245 1602340 1627200
37955 1627200 1627558 1631101 1668493 1737344 1806977 1843060 1826051 1761826 1680308 1613769 1570651 1533701
37943 1533701 1484736 1429433 1397668 1416755 1479919 1544814 1570223 1550954 1512107 1481018 1475339
37932A475339K4604L2301m980n7354n9338j174M1041M366p3251j08672p7711j4494
37920A180677N0757R1884O5668l0937j08589p5666L0279Q3582L9089k4253l2487
37909A270004l158J4774Q444j6551n2765o7590k8319L2331M4084N461j6416o250
37897A184049k3153p1774o2124L8006J14475O3472m4350o4803J0670O2444L1125
37886A238037j5402m805M5937P9258O8743K1218m0665q2011q0516n4401l5409
37875A139984k2825N89K4609K9335K9847M9122N9888J6528n7774q2272k8889L8515
37863A196657N4168K5818m397k3716l7048l0113J0286N5331N3962k830o0882n7264
37851A179972J0248P8303Q8328N2275K8510L6993L5300p764n6807o1327k7935
$$ plain form
37932 1475339 1499943 1532244 1527264 1469910 1410572 1409398 1450439 1454805 1381554 1272882 1195171 1180677
37920 1180677 1231434 1323318 1388986 1358049 1249460 1173794 1204073 1287655 1326744 1302491 1270004
37909 1270004 1266846 1281620 1290064 1273513 1220748 1153158 1124839 1157170 1201254 1206715 1190299 1184049
37897 1184049 1160896 1089122 1026998 1065004 1179479 1242951 1198601 1133798 1144468 1206912 1238037
37886 1238037 1222635 1217830 1263767 1343025 1411768 1432986 1392321 1310310 1229794 1175393 1139984
37875 1139984 1117159 1117748 1142357 1171692 1201539 1250661 1310549 1327077 1269303 1187031 1158142 1196657
37863 1196657 1250825 1276643 1272246 1248530 1211482 1181369 1191655 1246986 1300948 1298118 1237236 1179972
37851 1179972 1190220 1268523 1356851 1409126 1437636 1474629 1509929 1502165 1445358 1384031 1356096
37840A356096K797K4205N4719P7739N1341j9244p1485o0810p544M0031N4950L7575
37828A540370N595j5364j8254k9399o6533r2499n5077L0810R0650Q4080M1228
37817A515607p53l9600o7679m8899K4933R4750R3046K1628n6627q4298m9687J3987
37805A416408N0627K7909k0601k6156K7622P9965P3626K4386j5056k5728k4804
37794A588198k5444k7589k8667j8162J4230M3088J6267o6210j20210p5357K1269
37783A321413N7528K0p4200q9906n7675k8928j9801j3914q020j5201l2803l8183
37771A000330k0020M575J2911P575J1061K8372L2243K669l2070k5963J3652K5749
37759A061084j8024o7642o6785l4452k8079m9835m8182p929K0962j67m2671n7875
$$ plain form
37840 1356096 1358893 1383098 1437817 1515556 1566897 1547653 1476168 1415358 1407814 1447845 1502795 1540370
37828 1540370 1545965 1530601 1512347 1482948 1416415 1323916 1268839 1299649 1390299 1474379 1515607
37817 1515607 1514854 1475254 1407575 1358676 1383609 1478359 1571405 1593033 1536406 1452108 1402421 1416408
37805 1416408 1467035 1494944 1474343 1448187 1475809 1555774 1629400 1653786 1638730 1613002 1588198
37794 1588198 1562754 1535165 1506498 1488336 1502566 1545654 1561921 1495711 1375501 1300144 1321413
37783 1321413 1378941 1378961 1304761 1214855 1157180 1128252 1108451 1094537 1086517 1071316 1038513 1000330
37771 1000330 980310 984885 997796 1005371 1016432 1044804 1077047 1079716 1047646 1021683 1035335 1061084
37759 1061084 1043060 975418 908633 874181 846102 796267 748085 740156 761118 760951 718280 660405
37747F60405m3679l1593l1897k7324j1317n80o541j5777p717J7344L5488K4839
37735E61651o911k4744k542M4495P2897N7712J7227j1552j2806k777p537l4053
37723F51060n9315m9550R10N1492N1606R32m1948k4184L8763Q1778O5582J3739
37711G80865k6075l4459k1825J494K9722M2515J3318n0278r6341p9563j3163M6318
37699E92528N7746K3690k7831o5325o3573k1323K5737L5076Q164j2107k687R477
37687E59572m284k3350n081N0559R4673Q7609M1414l63j1837p793k0064n1437
37675G09618o1797j7651M9139O6111J6166k9351n365N1874N5029m693m0686M066
37663G92460P2096P0258l61m3990K960Q6817J00578J4208q8253j07228l9672L0622
$$ plain form
37747 660405 616726 585133 553236 525912 514595 514015 507474 491697 483980 501324 536812 561651
37735 561651 554740 529996 527454 571949 644846 702558 719785 708233 695427 692650 685113 651060
37723 651060 591745 542195 543105 594597 646203 647135 605187 581003 619766 701544 767126 780865
37711 780865 754790 720331 698506 700000 729722 772237 785555 735277 638936 559373 546210 592528
37699 592528 650274 673964 646133 580808 517235 495912 521649 556725 564889 552782 550095 559572
37687 559572 555288 531938 526857 577416 672089 759698 801112 800749 788912 781119 761055 709618
37675 709618 647821 630170 679309 745420 761586 732235 726870 778744 833773 829080 788394 792460
37663 792460 864556 934814 934453 890463 893423 980240 1080818 1095026 1006773 899545 859873 890495
37651H90495M2883K1338J7641L2519L0464O932p238l144q580l6715o0253n3627
37639H72715k7867m647J3567K5079J1844k7397n1470k3612K9701M7731J7982j2959
37627H70667j4259j0056k4761l2728j155M3976M4402k998l3445l767M3640L5368
37615I14884l6534j05796j13044o6199j6276K981j691p757r267k0542m9555p5471
37603D15733o7242k7007N486M710o609K007J7998J2564n87J3494L5931N965p3431
37590C39012j08928m1032N8101P4137N492m2760r871M8200N2458O184k8252k0093
37578C32648K789M459j3655k2625p225J2591O440k2648l5179o332L7099N1377
37566C39739L3999J9748K5145K7924O454k6214l9611k3891j950o555m2525p0914
$$ plain form
37651 890495 933378 954716 972357 1004876 1035340 1042272 1035034 1031890 1023310 986595 926342 872715
37639 872715 844848 840201 853768 878847 890691 863294 811824 788212 817913 865644 883626 870667
37627 870667 856408 846352 821591 788863 787708 831684 876086 873088 839643 835876 879516 914884
37615 914884 878350 772554 659510 593311 577035 580016 578325 570568 561301 540759 491204 415733
37603 415733 348491 321484 326970 331680 325071 327078 345076 357640 357053 370547 406478 412443 339012
37590 339012 230084 189052 247153 321290 326782 284022 274151 322351 374809 380993 352741 332648
37578 332648 335437 339896 326241 303616 296391 308982 315422 292774 257595 251263 288362 339739
37566 339739 373738 393486 418631 446555 453009 426795 387184 363293 361343 354788 312263 241349
37554B41349m6966J8564O0531L9422p366k2301o606j115j1798q119J3392J9794
37542B88781M67j3980k321J8624K6278J8223P74j4110k159M3045P8225N7477O909
37529E06233o326K0441K1129k5816n7402k9232J5789K5348J6896K5907L4994J6852
37517E64813k55K4048O8123P9468N3024K4328J1544J4657M1384Q1078Q4894K8244
37505A075350l8479n9315n7362q3635j17628j00772m5207j9917l6679l8225l856
37494D74275J8808L444j1502N824L0284K6603m896m6238p7778p0193j4623L7771
37482C71779K8896j2976o578N1063P4446L0329o854J7825M7794J2130o0097r3991
37470D53766p9534n6440l5024m353J6210L931j3286O356M5635M8908K985m9553
$$ plain form
37554 241349 194383 212947 273478 312900 305534 283233 276627 275512 263714 255595 268987 288781
37542 288781 289248 275268 272947 291571 317849 336072 336846 322736 320577 363622 441847 499324 506233
37529 506233 499907 520348 541477 515661 458259 429027 444816 470164 487060 512967 547961 564813
37517 564813 564558 588606 656729 736197 789221 813549 825093 839750 881134 962212 1047106 1075350
37505 1075350 1036871 977556 920194 836559 718931 618159 572952 553035 516356 478131 474275
37494 474275 493083 496527 485025 490849 521133 547736 542840 496602 418824 348631 334008 371779
37482 371779 400675 387699 381121 432184 506630 536959 530105 547930 595724 607854 547757 453766
37470 453766 374232 317792 282768 278415 294625 298556 285270 291626 337261 386169 389154 339601
37458C39601o5142l1628L1696P2657L8098n2746j04814o4341K701P213l1388k6272
37446A15635L4617P4852M9236n250m3078o0963o2425l7023N895L4678M1255M4719
37434A92148M3817J6023k9550n0802l4856j2407r94J4376L2809K4475j4755m4603
37422A35681l7777j2646J0030L8464P6151R7622Q2097M0700m187l6290l9349j3837
37410C36659Q23k8799o4809m1780K1562L6016j4077l3894L0232R4440O3878k1152
37398C79099n4209k1794K986r800k1969j6790k0202l0167p266M9289Q2907N6318
37386C88402k425m2772l9760J824M8419M7476j6048p9367p0832j1206J5556j2214
37374B27053l1713p503J5173j074j7103J5239P0939Q8628N3716J025l8196n5689
$$ plain form
37458 339601 274459 242831 274527 347184 385282 332536 227722 163381 166082 173295 141907 115635
37446 115635 150252 225104 274340 269090 226012 165049 102624 65601 71496 106174 147429 192148
37434 192148 235965 251988 222438 171636 136780 124373 123379 137755 170564 195039 180284 135681
37422 135681 97904 85258 95288 133752 209903 307525 389622 430322 426135 389845 350496 336659
37410 336659 337482 308683 243874 202094 223656 259672 245595 211701 241933 336373 400251 379099
37398 379099 324890 303096 306082 296282 274313 257523 237321 207154 199888 249177 332084 388402
37386 388402 385977 343205 303445 305269 353688 401164 385116 305749 234917 223711 239267 227053
37374 227053 195340 187837 203010 201936 184833 200072 271011 359639 413355 414380 376184 320495
37362C20495n5598n2418n7918n5085j8002L0805L2730j4699l6538R787O2628N0296
37350B16483M286N417N3322P2143L0485k4722n3525o6851p4116n5783j1008K3726
37338A19857K9412L0896M3682L9371m960n9554p7603n2438j0867K7735N8123P3621
37326B17275P0827N8361M1022Q484m0029p2647n2357J2182O2405M7027j9039o2297
37314B71214k8957M6696P5856K6085l5025l3929Q181J8393j3475l3049k1865j8327
37302B61798l0087j2063L8677N1885j617m3031k148O4953N8871j1278n2537l4563
37290B88860j3704k0855k0230J0754M3398N7299O7109P1965M4818q131m0427l7739
37278D43117l5283m4314k9773J1846K3335k4130p5485p1029k7330M902J1076k480
$$ plain form
37362 320495 264897 212479 154561 99476 81474 112279 145009 130310 93772 103559 166187 216483
37350 216483 220769 226186 279508 351651 382136 357414 303889 237038 162922 107139 96131 119857
37338 119857 149269 180165 223847 263218 258258 198704 121101 68663 57796 85531 143654 217275
37326 217275 288102 346463 387485 395969 355940 283293 230936 243118 305523 352550 333511 271214
37314 271214 242257 288953 364809 390894 355869 321940 330121 348514 335039 301990 280125 261798
37302 261798 231711 219648 258325 310210 308593 265562 263414 328367 387238 375960 323423 288860
37290 288860 275156 254301 234071 244825 288223 345522 412631 484596 529414 521283 480856 443117
37278 443117 407834 363520 333747 345593 368928 344798 269313 198284 170954 175856 186932 184452
37266A84452l8054p2588n2027K4170P0226K8964l8501n0243k8451l4486l7627
37255d4165K9537J17335R9730k5722j11666o8191K2325M8109J8663M211J3771
37244A03937J4873R396R542j1526o8040j02731n8110K4101N2315J4078j8402j63
37232c0730L9935O1096N3495J7985l5097o1957k1383N3623P8149K6731l1778l2480
37220A17589N491K7861K5301K1986K0235N976r880l247J5192O022l8210p1388
37208A22928m9559J0093M4511J5705m5267o9933k5150N2410R7335Q2057L1502
37197B66632j9481n8377p9476o4778o968N9141P8740L8069j6830l4536j6165j458
37185A44513q003j1923O699K7162J7366j7670m2919m0918k4142k682K7941N9895
$$ plain form
37266 184452 146398 73810 21783 45953 116179 145143 106642 56399 27948 -6538 -44165
37255 -44165 -14628 102707 202437 176715 65049 -3142 19183 67292 85955 90166 103937
37244 103937 118810 128206 137748 126222 58182 -44549 -102659 -78558 -26243 -12165 -30567 -30730
37232 -30730 9205 70301 123796 141781 106684 44727 23344 76967 155116 181847 150069 117589
37220 117589 123080 150941 176242 198228 218463 224439 214559 211312 226504 232526 194316 122928
37208 122928 73369 83462 127973 143678 98411 28478 3328 55738 153073 235130 266632
37197 266632 247151 188774 109298 44520 37552 96693 175433 213502 196672 162136 145971 144513
37185 144513 136510 124587 131286 158448 175814 158144 115225 74307 50165 47483 75424 135319
37173A35319O7407M5439K6494L6173N4410M6366J3209j5737k6310k5477j6814
37162C40479k762k923l4172p3443p4327k5511L5822P1456P3196M5104p253n6889
37150B88777o1558j4313L6953M4217J3608j7113l3847m8410n8598m2113N000M9640
37138A62243N3673J3339m0037p0059o0806k1190K4952N2051M5208J0640k3983
37127A46031k9123k097K7591K9364M954j6328j1977J1757K9703K3951L220l802
37115B13244J5621L2382R874l3198l4075J8911M9356j912p4577o3893K1574O5321
37103B18628J5188m1291j4884N1986N8631j111m1530j8523J7729R227l0916m7212
37091A75922j4625L6464N3873J7391l4154m0539O073M8976M5808K4582K6558K9933
$$ plain form
37173 135319 202726 248165 274659 310832 365242 411608 424817 409080 382770 357293 340479
37162 340479 337717 334794 300622 227179 152852 127341 163163 234619 307815 352919 345666 288777
37150 288777 227219 212906 249859 294076 307684 290571 256724 208314 149716 107603 112603 162243
37138 162243 215916 229255 189218 119159 58353 37163 62115 114166 159374 170014 146031
37127 146031 116908 114811 142402 171766 176720 160392 148415 160172 189875 213826 217046 213244
37115 213244 228865 261247 271121 237923 203848 222759 272115 270203 195626 131733 153307 218628
37103 218628 233816 192525 177641 229627 288258 287147 245617 227094 244823 254050 223134 175922
37091 175922 161297 197761 251634 269025 234871 194332 200405 249381 295189 319771 346329 376262
37079C76262j2425q0720j02383n8003o995N782O121K7429M9584M1556K0846K1896
37067B88950L3466J6896k7518n7602m9014k0379J771R939M479j2273k1684R52
37055A67983M5350O1383K0738l3906l3859K5360P2686N0028j8184o3977n8384
37044B35218k4265J4027N0665P1810N5784J2445j7484k0171k7069n3106n9593
37033B38261j6477L5787L7184l139k3417r46K7992L5116L1172K4823L219l1880
37021C57695n1980m1109j1790K4935O4837Q1903M6949j1451k2139K6605N7721
37010E22176J6394m4485m3796P006K9362r67k8056p634L7296O3450O1222M4850
36998F56818K5011J0321J2035L1016N3636O7320O8746N7632L7852K2757K3166
$$ plain form
37079 376262 363837 283117 180734 122731 115736 121518 127639 155068 204652 246208 267054 288950
37067 288950 322416 339312 311794 254192 205178 184799 186570 196509 200988 188715 167031 167983
37055 167983 213333 274716 295454 261548 227689 253049 325735 375763 357579 293602 235218
37044 235218 210953 224980 275645 347455 403239 415684 398200 378029 350960 297854 238261
37033 238261 221784 257571 294755 291616 268199 267253 295245 330361 361533 386356 389575 357695
37021 357695 305715 264606 252816 277751 342588 424491 471440 459989 437850 464455 522176
37010 522176 538570 494085 450289 457295 486657 485690 457634 450000 487296 550746 611968 656818
36998 656818 681829 692150 704185 735201 788837 856157 924903 982535 1020387 1043144 1066310
36987A066310L2141L5769L2443K5661R370j6958l0365j1217J9348K2619r4j0884
36975A174143J521O366p115o43M5427P5078K2501q0314j23401n9093L0145L8044
36963A122659k9052p2083l8396J8989L1119M578j2837j4967l1761o0852o2757
36952H54640k5826J3096K2355Q292j4490m2534o0995m7634j7621j7468n0288n7133
36940E64394o921M5564L8472m707j9054K13N051j8334l6573l4268k9995k9169
36928D74673j7984o092k1794n9377p9079o3914l3656m348K0362K4286j856k2578
36916B08643J497M0808L2695j4074l0844q590j1026m7988m1297L5936Q9872M8985
36904C04617j4785j955N1517L8407m2211r1330p1870m6310n0667m1011J0052N7181
$$ plain form
36987 1066310 1098451 1134220 1166663 1192324 1201694 1184736 1154371 1143154 1162502 1185121 1185027 1174143
36975 1174143 1175664 1182030 1174915 1174272 1219699 1294777 1317278 1236964 1113563 1054470 1084615 1122659
36963 1122659 1093607 1021524 983128 1002117 1033236 1037814 1024977 1010010 978249 917397 854640
36952 854640 828814 841910 864265 872557 858067 815533 754538 706904 689283 671815 621527 564394
36940 564394 557473 603037 641509 636802 617748 617961 623012 604678 568105 533837 503842 474673
36928 474673 456689 450597 428803 369426 290347 226433 192777 188429 208791 233077 231221 208643
36916 208643 210140 250948 283643 269569 238725 230135 219109 171121 129824 165760 255632 304617
36904 304617 289832 287877 339394 377801 335590 244260 172390 126080 75413 34402 44454 101635
36892A01635N9298L8923K8152J9935R649K2835N6168M6186m5410j52467j71502
36881A3402r1204n04K8447J5518J9483N0596O7299M4539J0018J027J0687O844
36869A76152p160N248M2005M2789k4796j00320j01469l2813L1075N1923N4301
36858A36935N4373L2522j0513l2575j0124K7345M4321L9181K0818r668l5176k6448
36846B30991P526J6801j8360n7226o3028n1013m4769l2880k632K8326M7581O9417
36834A30734Q8754O9051J6141R67N3018R4176N0614k7838m7178j7120j5197l9332
36822C56790j7265M6648N9643o366o5650n8254l2901m2223n2999k4121R521L336
36810A76159j5174n168O262j9730m5958j3578M8886N7218l103o0570o1501k3488
$$ plain form
36892 101635 160933 199856 228008 247943 257592 280427 336595 382781 337371 184904 13402
36881 13402 -77802 -78306 -49859 -34341 -14858 35738 103037 147576 157594 158621 169308 176152
36869 176152 168992 174240 216245 259034 234238 133918 32449 -364 30711 82634 136935
36858 136935 191308 223830 213317 180742 170618 197963 242284 281465 302283 292615 257439 230991
36846 230991 238517 255318 236958 179732 116704 65691 20922 -11958 -14590 13736 61317 130734
36834 130734 219488 288539 304680 305647 358665 452841 503455 475617 428439 411319 396122 356790
36822 356790 339525 386173 445816 439450 373800 315546 282645 240422 187423 163302 172823 176159
36810 176159 160985 155817 162079 142349 96391 82813 131699 188917 185814 125244 63743 40255
36798D0255J3672L1630K6697Q422L306J9948K5201q70j2578L7573J05884J05066
36786D04206L5583j2776N906M2801N1577N0552N7219M2117o185l9052k2966Q91
36774F09873j4924m7873n2038l2893j7731L647M4237O4744K4986l7080n1064k0868
36762D73016j1565l9084n0402j9527R959m73k6783k7651l665J5297J1178j2101
36750C18199l5511l4473n990J5587R4k9501k9587p555q819l6606m6596k6586j4094
36737E8562j9830o584K8405K7003k9068o5014k3271L7472L1082j9554k5943J9137
36725A2397L7865J112l3282k8471k1928l8567l3515K5311P9810N2688l8247r8619
36713h3446p6215r345L9738N1813L9721R389l7641p4782n6477K8193J19886J35955
$$ plain form
36798 40255 53927 85557 112254 120676 123982 143930 169131 168261 155683 193256 299140 404206
36786 404206 439789 427013 432919 475720 527297 577849 635068 677185 671000 631948 608982 609873
36774 609873 594949 547076 495038 462145 444414 448061 492298 557042 582028 544948 493884 473016
36762 473016 461451 422367 371965 352438 362397 361924 335141 307490 303825 319122 330300 318199
36750 318199 282688 248215 242225 257812 257906 228405 198818 191263 182444 145838 99242 72656 58562
36737 58562 38732 32148 60553 87556 58488 -6526 -29797 7675 38757 19203 -6740 12397
36725 12397 50262 51374 18092 -10379 -32307 -70874 -104389 -79078 732 53420 15173 -83446
36713 -83446 -159661 -169006 -129268 -77455 -37734 -28345 -65986 -140768 -197245 -169052 -49166 86789
36701H6789O3551j7908k8755J6782M0279Q180l3646l5774q360J0662J2126R945
36689A23871L623j9315n0964n9924k5140L6090P5168N1229k5188r1172r2744m4761
36677a19227o750m074q649P18O576n39P512M5036P2209N0484P017n325J1613J4070
36663G0671p355k2043k2050k9328l8211j3469L9665O3797L3497k536L584K9837
36651A06059K9718M677j4167k1611k6453j4433K1831L9748l667p1917q5098l4926
36639g0239M492q427k6679q49M3189N5229L7154J8291l605m0573o5645m7111j1968
36626a16741j3034m2799m2856J535L9914L9674K8422L1859K7638m064l2033j9065
36614a01550J7505L2646J8168K377J937P885P168q579m1516p2553o8384k7188
$$ plain form
36701 86789 150340 132432 103677 120459 160738 168918 135272 99498 91138 101800 113926 123871
36689 123871 127494 108179 57215 -2709 -27849 8241 83409 134638 109450 18278 -74466 -119227
36677 -119227 -125977 -130051 -138700 -137982 -131406 -131945 -124433 -79397 -7188 43296 50313 44988 56601 70671
36663 70671 63316 41273 19223 -10105 -48316 -61785 -22120 41677 75174 72638 76222 106059
36651 106059 135777 140454 126287 104676 78223 63790 85621 125369 121702 49785 -35313 -70239
36639 -70239 -65747 -74174 -100853 -101702 -58513 -3284 33870 52161 48556 7983 -57662 -104773 -116741
36626 -116741 -129775 -172574 -215430 -213895 -173981 -134307 -105885 -74026 -46388 -50452 -82485 -101550
36614 -101550 -84045 -51399 -33231 -30854 -28917 -21032 -13864 -22443 -63959 -136512 -204896 -232084
36602b32084Q004R048M591K6293M7988L0201l187K727L9665M4370N71l6487k8853
36589h7153l626P694J4998K7506K4303N69j0220K967q69m0073o0377j8030L3456
36576a08855J3049n8652p8523l977R3444J25614P9893J409o2744q2381n3475j2482
36564a47680o964l3000l5546J1050N9868N5083O927k9408k6441j401K3639M1845
36552h2028M6595L0460N300j506J8529L9950L2221n404m3239m8144j0052M6368
36540B9050P3279L9354k9543o3533k3966M1283M6263k4476q7116n9380L5210R7776
36528G4201P6762K0596M157L8791P2638N7105n699o9818q8639n9662k7140k7871
36516F5421m2940k8486J5285M5707M6239M2985M4082K1180k5085m3397j5529l99
$$ plain form
36602 -232084 -224080 -215032 -210441 -184148 -136160 -105959 -109146 -106419 -66754 -22384 -21813 -58300 -87153
36589 -87153 -90779 -83085 -68087 -40581 -16278 -15709 -25929 -22962 -23831 -63904 -124281 -142311 -108855
36576 -108855 -95806 -154458 -232981 -236958 -143514 -17900 61993 63402 658 -81723 -135198 -147680
36564 -147680 -154644 -187644 -223190 -212140 -152272 -97189 -90262 -119670 -146111 -147512 -123873 -82028
36552 -82028 -35433 -4973 327 -1179 17350 57300 89521 84117 40878 -7266 -17318 29050
36540 29050 102329 141683 112140 48607 24641 65924 112187 87711 595 -58785 -23575 74201
36528 74201 150963 171559 175716 214507 287145 344250 338551 268733 180094 120432 93292 65421
36516 65421 22481 -6005 9280 54987 101226 144211 188293 209473 184388 140991 125462 125063
36504A25063l7680o4856q368Q5170J02002K5382m9292o0503m3935l5400r719M3904
36492G1768P1793L8347p028o273J6328K891l9300n4921l1102o885n123j2212k0015
36479A8268l4973m3062j4545M2141O8484K1248o6704j10763o1888L5402Q3177
36468f3215L8476l2245l4809K8047O2546J9418l7896l1840J9946M6289L0430J2324
36456E7471Q868n18j7867j9772q729j4359l4510k7739J9308O2588O0716K8418
36444A13875P048R565J8361J9434J6799J9259K4831J9517m068k6322j7907J1973
36432B12365J3636l1372o9326m7055L268R710k7864m1651p833K1348J2217J368
36420D8811K0752L8132J7855j3163j2075Q434P159j8659m1287m9476m2388p052
$$ plain form
36504 125063 87383 22527 14159 99329 201331 226713 177421 116918 72983 37583 27864 71768
36492 71768 143561 181908 174880 168607 184935 187826 148526 93605 62503 55618 50495 38283 18268
36479 18268 -16705 -59767 -74312 -32171 36313 57561 -9143 -119906 -181794 -146392 -63215
36468 -63215 -24739 -56984 -91793 -63746 -1200 18218 -19678 -51518 -31572 14717 45147 57471
36456 57471 66339 65821 47954 28182 19453 5094 -29416 -57155 -37847 24741 85457 113875
36444 113875 120923 130488 148849 168283 185082 204341 229172 248689 244621 218299 200392 212365
36432 212365 226001 194629 125303 78248 81516 91226 63362 21711 13878 35226 47443 48811
36420 48811 69563 107695 125550 112387 100312 108746 115905 97246 55959 6483 -35905 -42957
36408d2957M7655O4640P653o3278n3447L5091J00948P8641J2292k3508j7096m319
36396A42315q390l1247o7681r1323n8784K9822R8690P4343j3543o0138k0486L3139
36384B6717J4575n6152q3858l3468K3896J6526k7391l0284J3877L3580m639m1506
36372a48127j6902L8008N2517K4738J4907M5065P1547O2896M2826L4403J7012
36361B38890k5073n5053l1772J9920L5311l067m6697m9404j8675P952R636m954
36349G7014j1885R230N5432R3832Q9006M1141j6239n6567p8610q2465n6207m708
36337E8974L1912K0170j4962j3538L8761Q3863O2926p231n5289m2309J702K8017
36325A92996K5634J4166M958o128j7126j5578K332K2496K5734M885k5594l2714
$$ plain form
36408 -42957 4698 69338 76991 13713 -39734 -4643 96305 174946 187238 163730 146634 142315
36396 142315 133925 102678 34997 -56326 -115110 -85288 13402 87745 74202 14064 -6422 26717
36384 26717 41292 -14860 -98718 -132186 -108290 -91764 -119155 -149439 -135562 -101982 -106621 -148127
36372 -148127 -165029 -127021 -74504 -49766 -34859 10206 81753 144649 187475 221878 238890
36361 238890 213817 158764 126992 146912 182223 179156 132459 83055 64380 72332 81968 77014
36349 77014 65129 74359 129791 223623 312629 353770 337531 280964 202354 119889 63682 58974
36337 58974 90886 111056 96094 82556 121317 205180 268106 260875 205586 163277 164979 192996
36325 192996 218630 232796 237754 231626 214500 198922 201254 223750 249484 254369 228775 196061
36313A96061O605O7157Q5181L0969m5650p5317n8622n0034o2395n0014K175M0433
36301H6549K7299L707J5346K9502q087p1518q6875m6189j1005r931j1592k211
36289h5005q314k6668j2951L2275M5731P476j3973K6460P0079N2796J3600K0503
36277A22009M5896J7139m4517m5616K8263Q7742P6146L5474J4520J02k4690l2131
36265B80337p002Q830k1728o8952p8712m1857J0978M8219M4384j0852q0976r9280
36253a6611m7536J7715M1841L3754K6531K4707K2526K7444L1562O981l7023m5639
36241H6252m618K5024L072k4942j3930J674j3067r937N2139R9384M2972o1367
36229A82656q4605k6606m873m8361n5680J5042O5020K3074l6310k4216K1149J6428
$$ plain form
36313 196061 202666 269823 355004 385973 340323 265006 206384 156350 93955 43941 46116 86549
36301 86549 113848 117555 132901 162403 154316 82798 -4077 -50266 -61271 -71202 -82794 -85005
36289 -85005 -93319 -119987 -132938 -100663 -54932 -47456 -61429 -34969 35110 87906 101506 122009
36277 122009 167905 185044 140527 94911 123174 210916 287062 322536 337056 337158 312468 280337
36265 280337 273335 282165 260437 191485 112773 70916 81894 130113 174497 163645 82669 -16611
36253 -16611 -64147 -46432 -4591 29163 55694 80401 102927 130371 161933 168914 131891 86252
36241 86252 81634 106658 109730 84788 70858 72532 59465 49528 101667 201051 244023 182656
36229 182656 98051 71445 66572 18211 -37469 -22427 42593 65667 29357 5141 26290 42718
36217D2718k8300m8789l9325l2250j5702L5342Q1810O3286l250m5307m0486l0570
36205f0823m1356n2580m2887j2022L4882Q0490Q7091M0945j0405j0080L4858P3159
36193A21272P9321N8493R937n7729r7052o9060p244K1719P067j1137j6230j9848
36181A9509j0293L0285O6034M3254j3480k1977L0937O6440L8987J643R000L1235
36169B91574J7411j7376k9070k4369m0724p3016p6986l4434K8062P7650R8949
36158B17671Q7939N2785J7430K638N627R550M337r320k2733k0103N379L1613K7343
36145D10156j485j2353J5593N1238N4564K5953l384j0311L802J8025O552l1997
36133E26353o0054m2843k083Q903j6203k8988m213K6272L3517L1095K9269M225
$$ plain form
36217 42718 14418 -34371 -73696 -105946 -121648 -86306 -4496 58790 55540 10233 -30253 -60823
36205 -60823 -102179 -154759 -197646 -209668 -174786 -94296 -7205 33740 23335 13255 48113 121272
36193 121272 200593 259086 269023 211294 114242 45182 37938 59657 66724 55587 39357 19509
36181 19509 9216 39501 105535 148789 135309 113332 144269 210709 249696 251339 260339 291574
36169 291574 308985 291609 262539 238170 197446 124430 47444 13010 41072 118722 217671
36158 217671 305610 358395 375825 378463 384090 393640 397977 388657 365924 345821 351200 382813 410156
36145 410156 408671 396318 411911 463149 517713 543666 540282 529971 533773 551798 558350 526353
36133 526353 466299 423456 421373 430276 414073 385085 380872 407144 440661 471756 501025 505250
36121E05250m9668q4733o1291o763K6992K9843J8733l028k7814k4488J3865M0459
36109C77357K4400Q754L7333O4621J8453p4020j12766p0783k4667k8566m1927
36098A78189j2259L9963N9802L3506j0177l9682l5870J260M1152M5949J6894j1401
36086C07326k4119l2547k7620J5046P0725P0504J936n4646l4567J7606J7448l5738
36074B91354o7652l9894R369L1241K1172L268j805J3236L6062L6343j877n0560
36062B80257o4986l9391j0924q036j8823j5051J0937L8964M0318M897m2758o1135
36050A14269l4612J0617M0679M6684L2820q23m0038m8934j6117J4070o82l1222
36038H6711j9328K2693K3224l1193o3931k4659L0672K7440j5448k7548k770L776
$$ plain form
36121 505250 455582 370849 309558 302795 329787 359630 378363 375335 347521 323033 336898 377357
36109 377357 401757 410511 447844 512465 530918 456898 344132 273349 248682 220116 178189
36098 178189 165930 205893 265695 299201 289024 249342 213472 214732 255884 301833 318727 307326
36086 307326 283207 250660 223040 238086 308811 379315 381251 326605 292038 309644 327092 291354
36074 291354 223702 183808 193177 224418 245590 248858 247053 260289 296351 332694 330817 280257
36062 280257 215271 175880 164956 156920 138097 123046 133983 172947 213265 218162 175404 114269
36050 114269 79657 90274 130953 177637 210457 209634 169596 120662 104545 118615 117933 86711
36038 86711 67383 90076 113300 82107 18176 -6483 24189 51629 36181 8633 5863 9639
36026I639k2462l6371j8480m456j2075q577K0088L2797P377r044K1492N1997K3627
36013E5552k5454j0204N9883Q2488J4682o4281p3254l6192k1996l8666m5587l0238
36001a33267j3339j111J6877L6315M2878L3107L887m9543r5588p1341K6098R9462
35989a05565O8522j2475l4791K653J2959j6139l979O3423Q5223J0674o4005m4552
35977c8052J2842L062n3513n7124k375K1173j2273k8216J2127M9363L4326O835
35965e1825J7632M4663M2002J7540P388J2730J2170N975L146q603l7603n7343
35953G872m2624j4609p342j0004J0202M3372M8258K2601P460J5960J1662k4493
35941F8315n5139m4750j7639j9045m4779n2131k7461p77N338L375J0788K4873
$$ plain form
36026 9639 -12823 -49194 -67674 -72130 -84205 -92782 -72694 -39897 -32520 -41564 -20072 31925 55552
36013 55552 30098 19894 79777 162265 176947 112666 39412 3220 -18776 -57442 -103029 -133267
36001 -133267 -146606 -147717 -130840 -94525 -51647 -18540 -14653 -64196 -159784 -231125 -205027 -105565
35989 -105565 -37043 -49518 -84309 -81656 -68697 -84836 -88815 -25392 59831 70505 6500 -38052
35977 -38052 -25210 -22148 -75661 -132785 -135160 -113987 -126260 -154476 -142349 -92986 -58660 -51825
35965 -51825 -34193 10470 52472 70012 77400 90130 102300 108275 111421 102818 65215 7872
35953 7872 -34752 -49361 -56703 -66707 -56505 -13133 35125 57726 65186 81146 92808 68315
35941 68315 13176 -31574 -49213 -68258 -113037 -165168 -192629 -193406 -188068 -184693 -173905 -149032
35929a49032L9179N6115O7533N0389M230l0914k3945j369r387l8874l5736R298
35917f2513L3020j0719p5484p9919j7598L9937M3472K0258J8138L9823N8209O5303
35905G1927P0115O2907K0420m8095r0225o5568R25M1507K1805k3206l8483j8690
35893E339o769k6817m8444l3413N478K0791k833k8327j6976K4192N6331N4159
35881B711K5894k996j6125j8413k3966l1663k3082O061K8073K0082O858L1580
35869E014Q4264J00438M6018l3817p4447o7898m8285l1483j2644n676l3558p7745
35857a49819q3651l2164K9354M8135L1456K5893M8193O6229M7862N406k0621j2711
35845C562M470J456j2963n701K6488M5423K6631j994k885J2383L834k9382m4451
$$ plain form
35929 -149032 -109853 -53738 13795 64184 68414 37500 13555 12186 2799 -36075 -71811 -62513
35917 -62513 -29493 -40212 -115696 -195615 -213213 -173276 -129804 -109546 -91408 -51585 6624 71927
35905 71927 142042 204949 225369 177274 87049 21481 22406 63913 85718 62512 24029 5339
35893 5339 -1430 -28247 -76691 -110104 -104626 -83835 -86668 -114995 -131971 -107779 -51448 2711
35881 2711 28605 25609 9484 -8929 -32895 -64558 -87640 -81579 -53506 -33424 -26566 5014
35869 5014 89278 189716 235734 201917 127470 59572 11287 -20196 -32840 -38516 -72074 -149819
35857 -149819 -233470 -265634 -236280 -188145 -156689 -130796 -82603 -16374 31488 36894 16273 3562
35845 3562 8032 9488 -3475 -9176 17312 62735 89366 87372 84487 96870 100704 71322 26871
35832B6871j8699K0653L7349K2998j2057m8036m9498O104P8190Q7343J5054o4089
35820A02183p9699m8790k2669j256L8875P0797M9649P72n971L0157L3925k3314
35808A44659p3714o0133k2766k6654n6094m4198K1166P9380P5968J8673m0017
35797A6270n0538q615L2338J4583m1628m8663K6953J03176R3011K9451P404L4455
35785B08197L1423k5759o3203l1434J6529J3574k4166m2379l7649m1219n0061
35774d6147l5276m42K1212J8024N091j2239l8533n7732m3025O48L6290M0810K6320
35761h4999J4110R062J862j7021m1167l9474J4868R1373J11039M1646m6422o6123
35749a1246k8957j3069l4089k7855L0261P3396M7890j277o151J6392R56n4018
$$ plain form
35832 26871 8172 28825 66174 89172 77115 29079 -20419 -14315 63875 151218 166272 102183
35820 102183 22484 -26306 -48975 -50231 -11356 59441 109090 109862 103891 134048 167973 144659
35808 144659 70945 10812 -11954 -38608 -94702 -138900 -117734 -38354 37614 56287 16270
35797 16270 -34268 -42883 -10545 4038 -37590 -86253 -59300 43876 136887 166338 173742 208197
35785 208197 239620 213861 150658 119224 135753 149327 125161 82782 45133 3914 -46147
35774 -46147 -81423 -81865 -60653 -42629 -37538 -49777 -88310 -146042 -189067 -188419 -152129 -111319 -84999
35761 -84999 -70889 -61827 -59965 -76986 -118153 -157627 -142759 -51386 59653 101299 54877 -11246
35749 -11246 -40203 -53272 -87361 -115216 -84955 -11559 36331 35054 28903 45295 46251 -7767
35737g767q2420n0713J031K3573J2943q562k1719r746L1044O6885N2311l363l5428
35724c1931j2058J8245K237l2907k2022L1291N2327M849n2286m3250K8125R1712
35712C4332R7491N5973N940k4750k7778j2572l232j8649m8681o3755n1697k9171
35700h6549j1565Q338L6988N2088K3960l5777p0775l8814L5981Q3843O0849j0459
35688D8108p1693q7061o4327k9393K631L0473N5654P5495Q0871O0823J9944j1516
35676A10009o471J5273N21o1859j07815p4794O519M0883j3521r8173j32233r7058
35664d18719k7771M0170Q6892R6890O6133J4643k6149l4619n584M4744P6101N5549
35652c1720L973j9705K794K2271j037l3097j8900L1766O0264M0873k179m3600
$$ plain form
35737 -7767 -90187 -140900 -139869 -116296 -103353 -111915 -133634 -143380 -112336 -45451 6860 3497 -31931
35724 -31931 -43989 -25744 -23507 -56414 -78436 -47145 5182 10031 -42255 -85505 -57380 34332
35712 34332 131823 187796 193736 168986 141208 128636 125404 106755 58074 -5681 -57378 -86549
35700 -86549 -98114 -89776 -52788 -700 23260 -12517 -83292 -122106 -86125 -2282 58567 48108
35688 48108 -23585 -110646 -174973 -204366 -201735 -171262 -115608 -40113 40758 101581 121525 110009
35676 110009 103538 118811 119332 57473 -50342 -125136 -118617 -77734 -91255 -189428 -321661 -418719
35664 -418719 -446490 -406320 -319428 -222538 -156405 -141762 -167911 -202530 -208114 -163370 -87269 -31720
35652 -31720 -27747 -47452 -44658 -22387 -23424 -56521 -75421 -43655 16609 57482 55303 11703
35640A1703p1360o3588r270M8104M4978j5108o1489n5046l2194l1935l6043j4628
35628b85876J8673L8905N6668Q5039R1767M0542l6363o4300k6837J0307q967n5452
35616a35894n8209p22N9114O3154K1054r261M698L8313N2293M1298K4674J0190
35604A10702o369j8348j6382j3598k9956n2755m7063q745K7387L7961L3357K1765
35592C7956q170n2119p6103o0677k7393j428J8599L3721K6959N20p274K3361N5206
35579c6842M5856P133k2840l3906l1501o657L3775M2192o503n6474m1962O452
35567a01277L098n5292p7988j7716O0604P9207M8505K6415K8239K7193J4634J2004
35555D7626L0789N0576L9586q562n4285m1243L0750Q0228L5190o1365r6039l7320
$$ plain form
35640 11703 -59657 -123245 -132515 -84411 -39433 -54541 -116030 -171076 -203270 -235205 -271248 -285876
35628 -285876 -267203 -228298 -171630 -86591 5176 45718 9355 -54945 -81782 -71475 -80442 -135894
35616 -135894 -194103 -194825 -135711 -72557 -51503 -60764 -56066 -17753 34540 75838 100512 110702
35604 110702 104333 85985 69603 56005 26049 -26706 -73769 -82514 -55127 -17166 16191 37956
35592 37956 29786 -22333 -98436 -159113 -186506 -187934 -169335 -135614 -108655 -108135 -115409 -92048 -36842
35579 -36842 9014 16147 -6693 -40599 -72100 -78757 -44982 -2790 -9293 -65767 -107729 -101277
35567 -101277 -98179 -153471 -231459 -249175 -188571 -109364 -60859 -34444 -6205 20988 35622 47626
35555 47626 78415 128991 168577 160015 105730 64487 95237 175465 210655 149290 53251 15931
35543A5931K5720J7449k4628k8159M07O127j2735p940K8839M6593J1210m6435
35531C2379o9842l5629K9996P2296N1686j2931n6012m1194n466q88j9432j8127
35519g3164L395P175q493L92M7955Q7335P6002K8511j7735m8742o0931m2570k580
35506c450J5359j2614m6900l7197J910J6715L265J3473O6724J10527R2861L1083
35494B51756k0767l8166k6193J2724O4593P9819K0450p0596j00946m0490M3705
35483A75889P8042O0592K6142j6323o7814r6944o7726K319N5686O1862L7693R688
35471B59106j0023j7393j8469l0832n5134n9921k6944R422J0125m187Q682L0629
35459I5061R561m1308n0645l061L5872K8508J5401K4029J2787m1885q0149m8045
$$ plain form
35543 15931 41651 59100 34472 6313 6720 12847 112 -7828 21011 67604 78814 32379
35531 32379 -37463 -73092 -43096 29200 80886 67955 11943 -29251 -34717 -35605 -55037 -73164
35519 -73164 -69769 -62594 -71087 -70695 -22740 64595 140597 169108 151373 102631 41700 -870 -3450
35506 -3450 11909 -705 -47605 -84802 -82892 -66177 -62912 -49439 17285 127812 220673 251756
35494 251756 230989 192823 166630 179354 243947 323766 344216 273620 172674 132184 175889
35483 175889 253931 314523 340665 324342 256528 159584 91858 94177 149863 211725 249418 259106
35471 259106 249083 231690 213221 182389 127255 67334 40390 49812 59937 55750 64432 95061
35459 95061 104622 63314 12669 9608 45480 73988 89389 113418 126205 84320 4171 -43874
35447d3874J0533K3471o8m544J2247J3335J187K965N960j4148k7321O518N0582
35434C6843L6359k0943m3983k0360j0927l2597l5660r236m403k7750j6556M2505
35422a06708P2461L4429j706K1233M9390K0315k1019n118L1108O022n8319o3526
35410b1438O691O1450L8923k2396n9967n7527k5135K0998M1068k181p7333r9411
35398a96258l5619N0116Q0573N1303J1392l221P742K3868K0379r068l5334k3826
35386e7953J2754K2000j8652o9360p5954k6719M3587Q1840N1562k7024p5685l8117
35374a77721M0391O2558J0031l7229k6496m534k4849n0747j7139N4224P6868K2095
35362g2548m6529o2675k8863J0461K7276K7177L1079M8045N8276L4924o001n946
$$ plain form
35447 -43874 -33341 -9870 -9938 -14482 -2235 11100 12287 15252 21212 7064 -20257 -13739 36843
35434 36843 73202 52259 8276 -12084 -23011 -55608 -91268 -100504 -104907 -132657 -149213 -106708
35422 -106708 -34247 182 -1524 19709 69099 89414 68395 63277 94385 100407 42088 -21438
35410 -21438 -14747 46703 85626 63230 3263 -54264 -79399 -58401 -17333 -19514 -96847 -196258
35398 -196258 -231877 -181761 -101188 -49885 -38493 -41714 -33972 -10104 10275 1207 -34127 -57953
35386 -57953 -45199 -23199 -41851 -111211 -187165 -213884 -170297 -88457 -36895 -63919 -139604 -177721
35374 -177721 -137330 -74772 -64741 -101970 -128466 -133000 -157849 -208596 -225735 -171511 -94643 -72548
35362 -72548 -119077 -181752 -210615 -200154 -172878 -145701 -114622 -66577 -8301 26623 20622 14676
35350A4676N6787J17153R8135J5781m3546m0384j7099j3878j4134M439K0148N368
35338B03446k3314l0227j1703Q515J5214P226j4071l7182l9604j8156k056j2280
35326D5808k7660j8927L242P840l499j235K0558L5478K9328J8425J5746R223j3289
35313A21038l9750m7559k7192J2675M8272M9337P293m2309n1143j8368P673k493
35301A7474k0885r573K3591M3523L8020J8508q972l7796m1298j402M9225N6634
35289A27049J8334j6753k5916l8686o6549o2950K782P4504P2624P253l5710j7605
35277C8377R051n847l3886k1625K3585M6023J6120m5209r8568j07790m8824O0400
35265a68193J47116J42811N8510k9327o5914n9594m1281k3713q012M706J8669
$$ plain form
35350 14676 71463 188616 286751 302532 258986 218602 201503 187625 173491 177930 198078 203446
35338 203446 180132 149905 138202 146717 161931 169157 155086 117904 78300 60144 58088 45808
35326 45808 18148 -779 2463 10303 6804 5569 26127 61605 90933 109358 125104 134327 121038
35313 121038 81288 33729 6537 19212 67484 116821 124114 81805 30662 12294 19967 17474
35301 17474 -3411 -12984 10607 54130 92150 110658 101686 63890 22592 21190 70415 127049
35289 127049 145383 128630 102714 64028 -2521 -65471 -62689 11815 84439 91692 55982 38377
35277 38377 47428 41581 7695 -13930 9655 55678 71798 26589 -71979 -179769 -228593 -168193
35265 -168193 -21077 121734 180244 150917 85003 25409 -15872 -39585 -47597 -42891 -24222
35254b4222L3251K7740r476m1603k2562K3576K4123k7737n2021p947L4875P597
35242c4406m4367l6532J8959M3483K2723R834J6342P14l5920m2525j7862j9824
35230a19381n3949n1172Q728M9244K1963j3484K941L0623J2274j7083M239M9237
35218g5820M8741J0295n130O344j244k7799l0293p873K002j283N395o02m9543
35205a26810q8760l9724N9003Q6222K6757l187M8658Q5325L3030k9850r495M4943
35193H6112L3162k6990m5910k2922l2151p5283p4012r033M5049M0709J7652J5581
35181d8036J1271j8958m2070k0689K2986L9543K0552j161k731N076O51j7194k5126
35168g5886p003J3768j895m4487n3342l548M7938M5582K0030K7357M4291J0683
$$ plain form
35254 -24222 9029 36769 27293 -14310 -36872 -13296 10827 -16910 -68931 -76878 -42003 -34406
35242 -34406 -78773 -115305 -96346 -52863 -30140 -20306 -3964 -3250 -39170 -81695 -99557 -119381
35230 -119381 -173330 -224502 -215774 -166530 -144567 -158051 -155110 -124487 -112213 -129296 -125057 -75820
35218 -75820 -27079 -16784 -21914 -15570 -16814 -44613 -74906 -82779 -80777 -82060 -76665 -77267 -126810
35205 -126810 -215570 -255294 -196291 -110069 -83312 -86499 -37841 47484 80514 50664 41169 86112
35193 86112 119274 92284 46374 23452 -8699 -83982 -157994 -167027 -121978 -81269 -63617 -48036
35181 -48036 -36765 -55723 -97793 -118482 -95496 -55953 -35401 -36562 -39293 -34217 -33566 -50760 -75886
35168 -75886 -82889 -69121 -71016 -115503 -168845 -172393 -124455 -78873 -58843 -31486 12805 23488
35156B3488m5937l3096N1594R5070L5217m4683m7142k560m86m0537m7103k259
35144e8434L1192J8720L812K8187O4863O3407K2654j4326j7732k26J552l6578
35132A07091r7938j28147q2447K0383J04315J08305M5450j8569l7746k3257j2254
35121a4814j8154k3190r832J7590M1565M5857K0742k6660o2970n4163j2034J2395
35109h3668J81m233L4553P4069N1753j0109k6904J9682M8574m20p8176j00667
35097g5365o1475j7209M570K3084M4599M3126Q827k5256k2775R850L0848J0007
35085b7169l7771o7179n2875j7031O430K1533N2367Q3046O5752K267l5356O51
35073e335O1853O9920K1262k3489k8676q617J8921M5321M2432j7701j02057j27501
$$ plain form
35156 23488 -22449 -55545 -3951 91119 126336 81653 34511 31951 31465 -9072 -56175 -58434
35144 -58434 -27242 -8522 -4710 23477 88340 151747 174401 160075 142343 142117 143669 107091
35132 107091 9153 -118994 -201441 -181058 -76743 31562 77012 58443 20697 -2560 -14814
35121 -14814 -32968 -56158 -65990 -48400 -6835 39022 59764 33104 -29866 -84029 -96063 -83668
35109 -83668 -83487 -87720 -53167 20902 72655 62546 35642 55324 103898 103478 25302 -75365
35097 -75365 -136840 -154049 -149479 -126395 -81796 -38670 -29843 -55099 -77874 -68024 -37176 -27169
35085 -27169 -64940 -132119 -184994 -202025 -195595 -174062 -121695 -38649 27103 29370 -5986 -5335
35073 -5335 56518 126438 147700 124211 95535 86918 105839 151160 193592 175891 73834 -53667
35061e3667n7639M5481R0568N4292j0797m5551l7938j4797K60J1441L3361N8068
35049G3082N7063J9655l1551p1646r3624q4870k2888P1864J16205N3172n7245
35038B9217r6903l7359L0312K3233l4452o6838n0697k2965j2599j0087j76Q717
35026b40597M6j8344j3008L3547Q5589Q2432J4762n3273o0587k2164N890Q737
35014a76970J5283L5075M5546L8889L1761K6178P211j7760k4575j9607l1534n2152
35002a22655m0984J628K4854O534j7306k2375l2667n8315o0431j8137K6503L5677
34990b77674L4978N6016P0638M0956n832j4822J2535K8383J0381k5522o1555q2154
34978b13672o5560j3911L3781N4290O9297Q6580O6940J446m0900j5133J0903l8772
$$ plain form
35061 -53667 -111306 -65825 24743 79035 68238 22687 -15251 -30048 -29788 -18347 15014 73082
35049 73082 130145 149800 118249 46603 -47021 -131891 -154779 -82915 33290 86462 29217
35038 29217 -67686 -105045 -74733 -51500 -85952 -152790 -203487 -226452 -239051 -249138 -249314 -240597
35026 -240597 -240551 -258895 -271903 -238356 -152767 -70335 -55573 -108846 -169433 -191597 -185707 -176970
35014 -176970 -161687 -126612 -81066 -42177 -10416 15762 22973 5213 -19362 -38969 -70503 -122655
35002 -122655 -163639 -162011 -137157 -130623 -147929 -170304 -202971 -261286 -321717 -339854 -313351 -277674
34990 -277674 -242696 -186680 -116042 -75086 -80918 -95740 -83205 -54822 -44441 -69963 -131518 -213672
34978 -213672 -279232 -293143 -259362 -205072 -135775 -49195 17745 19191 -21709 -36842 -25939 -64711
34966f4711j10475j00784l2214j5494n5345m2309M8350J01193N2507j243L5422
34955a85103J03270R2053R710n4735p4296q7407r8470p2377j2163L6371N1728
34944b91419N0827M6131L6469K7736K3352J1575o971q481P391K581k9974l3442
34932a64225K4881Q4980P8529L3809K0339L1475J1441l0203l0213J1554K3610
34921I5977k1063o6709o8969n0933m4419m2546l2869k0569k270K9831M9891K3125
34909a51523k6000l5490k250J5050j027k194K7497L6246J141k5430j1245k968
34897a78193l3211m9397o332M1126K1014l6017m8081j1391J0684j629j2965j3873
34885c18265k8149m7297l7089p856l939k2364j5417J9542K6544j6761o0851o1970
$$ plain form
34966 -64711 -175186 -275970 -308184 -323678 -379023 -421332 -372982 -271789 -219282 -220525 -185103
34955 -185103 -81833 10220 19930 -34805 -109101 -196508 -294978 -367355 -379518 -343147 -291419
34944 -291419 -240592 -194461 -157992 -130256 -106904 -95329 -102300 -110781 -103390 -100809 -130783 -164225
34932 -164225 -139344 -54364 24165 57974 78313 109788 121229 91026 60813 72367 95977
34921 95977 74914 8205 -60764 -111697 -156116 -198662 -231531 -252100 -254370 -224539 -174648 -151523
34909 -151523 -177523 -213013 -215263 -200213 -201240 -203434 -175937 -139691 -138550 -163980 -175225 -178193
34897 -178193 -211404 -260801 -267133 -226007 -204993 -241010 -289091 -300482 -289798 -291427 -304392 -318265
34885 -318265 -346414 -393711 -430800 -438656 -442595 -464959 -480376 -460834 -434290 -451051 -511902 -573872
$$ [...]
##END NTUPLES=NMR SPECTRUM
##END=
