##TITLE=31Pdec_DE-126_2
 , 24 sc
 6.2.2026
##JCAMPDX= 6.0         $$ Bruker NMR JCAMP-DX V2.0
##DATA TYPE= NMR SPECTRUM
##DATA CLASS= NTUPLES
##ORIGIN= UXNMR, Bruker Analytische Messtechnik GmbH
##OWNER= root
$$ XWIN-NMR		Version 3.5
$$ Fri Feb  6 15:12:33 2026 Russian Standard Time (UT+4h)  she@DPX200
##.OBSERVE FREQUENCY= 81.013821
##.OBSERVE NUCLEUS= ^31P
##.ACQUISITION MODE= SIMULTANEOUS
##.ACQUISITION SCHEME= undefined
##.AVERAGES= 24
##.DIGITISER RES= 17
##SPECTROMETER/DATA SYSTEM= spect
##.PULSE SEQUENCE= zgpg30
##.SOLVENT NAME= CDCl3
##.SHIFT REFERENCE= (INTERNAL, CDCl3, 0, 198.062)
##AUDIT TRAIL= $$ (NUMBER, WHEN, WHO, WHERE, WHAT)
$$ ##TITLE= Audit trail, XWIN-NMR		Version 3.5
$$ ##JCAMPDX= 5.01
$$ ##ORIGIN= Bruker BioSpin GmbH
$$ ##OWNER= she
$$ F:/spectra/data/she/nmr/P31/2/pdata/1/auditp.txt
$$ ##AUDIT TRAIL=  $$ (NUMBER, WHEN, WHO, WHERE, WHAT)
(   1,<2026-02-06 15:10:56.39 +0400>,<she>,<DPX200>,
      <created by zg, POWCHK disabled, PULCHK disabled
       configuration hash MD5:
       00 E9 B6 7A A2 85 ED C7 34 08 36 98 17 FE 4E 26
       data hash MD5: 32K
       29 97 D7 32 75 D2 FB 6C 17 9C 45 96 2D 63 AA 6E>)
(   2,<2026-02-06 15:11:29.35 +0400>,<she>,<DPX200>,
      <Start of raw data processing
       efp BC_mod = 2 LB = 1.5 FT_mod = 6 PKNL = 1 PHC0 = 1395.463 PHC1 = 67.30091 SI = 64K 
       data hash MD5: 64K
       DF C9 A6 2B 6D 4A 2D D7 69 AF 1E 5D 96 87 33 4B>)
(   3,<2026-02-06 15:11:51.96 +0400>,<she>,<DPX200>,
      <pk PHC0 = 10.22327 PHC1 = 0 
       data hash MD5: 64K
       B9 98 5B 8A 35 CF 58 32 52 56 18 87 1C 9B AA 6A>)
$$ ##END=
$$ 
$$ hash MD5
$$ 2D 9B 06 0E 5B 9B 53 CF 70 DE 1A C2 A4 51 1C BE
##$RELAX= 
##$RELAX= 
##$RELAX= 
##$RELAX= 
##$RELAX= 
##$RELAX= 
##$RELAX= 
##$RELAX= 
$$ Bruker specific parameters
$$ --------------------------
##$DU= <F:/spectra>
##$EXPNO= 2
##$NAME= <P31>
##$PROCNO= 1
##$TYPE= <nmr>
##$USER= <she>
##$AMP= (0..31)
100 100 100 100 100 100 100 100 100 100 100 100 100 100 100 100 100 100 
100 100 100 100 100 100 100 100 100 100 100 100 100 100 
##$AQSEQ= 0
##$AQ_mod= 1
##$AUNM= <au_zg>
##$AUTOPOS= <>
##$BF1= 81.014009
##$BF2= 200.13
##$BF3= 200.13
##$BF4= 200.13
##$BF5= 200.13
##$BF6= 200.13
##$BF7= 200.13
##$BF8= 200.13
##$BYTORDA= 1
##$CFDGTYP= 0
##$CFRGTYP= 5
##$CHEMSTR= <none>
##$CNST= (0..31)
1 1 145 1 1 1 1 1 1 1 1 1 1 1 1 1 1 1 1 1 1 1 1 1 1 1 1 1 1 1 1 1 
##$CPDPRG= <waltz16>
##$CPDPRG1= <>
##$CPDPRG2= <waltz16>
##$CPDPRG3= <>
##$CPDPRG4= <mlev>
##$CPDPRG5= <mlev>
##$CPDPRG6= <mlev>
##$CPDPRG7= <mlev>
##$CPDPRG8= <mlev>
##$CPDPRGB= <>
##$CPDPRGT= <>
##$D= (0..31)
0 1 0 0 0 0 0 0 0 0.06 0 0.03 2e-05 3e-06 0 0 0.0002 0 0 0 0 0 0 0 0 0 
0 0 0 0 0 0 
##$DATE= 1770376255
##$DBL= (0..7)
120 120 120 11 120 120 24 19 
##$DBP= (0..7)
150 150 150 150 150 150 150 150 
##$DBP07= 0
##$DBPNAM0= <>
##$DBPNAM1= <>
##$DBPNAM2= <>
##$DBPNAM3= <>
##$DBPNAM4= <>
##$DBPNAM5= <>
##$DBPNAM6= <>
##$DBPNAM7= <>
##$DBPOAL= (0..7)
0.5 0.5 0.5 0.5 0.5 0.5 0.5 0.5 
##$DBPOFFS= (0..7)
0 0 0 0 0 0 0 0 
$$ [...]
##$SUBNAM3= <"">
##$SUBNAM4= <"">
##$SUBNAM5= <"">
##$SUBNAM6= <"">
##$SUBNAM7= <"">
##$SUBNAM8= <"">
##$SUBNAM9= <"">
##$SW= 400.765351723535
##$SWIBOX= (0..15)
0 1 3 0 0 0 0 0 0 0 0 0 0 0 0 0 
##$SW_h= 32467.5324675325
##$TD= 32768
##$TD0= 1
##$TE= 0
##$TE2= 300
##$TE3= 300
##$TEG= 300
##$TL= (0..7)
0 120 53 12 22 120 120 120 
##$TP= (0..7)
150 150 150 150 150 150 150 150 
##$TP07= 0
##$TPNAME0= <>
##$TPNAME1= <>
##$TPNAME2= <>
##$TPNAME3= <>
##$TPNAME4= <>
##$TPNAME5= <>
##$TPNAME6= <>
##$TPNAME7= <>
##$TPOAL= (0..7)
0.5 0.5 0.5 0.5 0.5 0.5 0.5 0.5 
##$TPOFFS= (0..7)
0 0 0 0 0 0 0 0 
##$TUNHIN= 0
##$TUNHOUT= 0
##$TUNXOUT= 0
##$USERA1= <user>
##$USERA2= <user>
##$USERA3= <user>
##$USERA4= <user>
##$USERA5= <user>
##$V9= 5
##$VALIST= <valist>
##$VCLIST= <CCCCCCCCCCCCCCC>
##$VD= 0
##$VDLIST= <DDDDDDDDDDDDDDD>
##$VPLIST= <PPPPPPPPPPPPPPP>
##$VTLIST= <TTTTTTTTTTTTTTT>
##$WBST= 1024
##$WBSW= 4
##$XGAIN= (0..3)
0 0 0 0 
##$XL= 0
##$YL= 0
##$YMAX_a= 133236
##$YMIN_a= -148264
##$ZGOPTNS= <>
##$ZL1= 120
##$ZL2= 120
##$ZL3= 120
##$ZL4= 120
##$ABSF1= 0
##$ABSF2= 0
##$ABSG= 0
##$ABSL= 0
##$ALPHA= 0
##$AQORDER= 0
##$ASSFAC= 0
##$ASSFACI= 0
##$ASSFACX= 0
##$ASSWID= 0
##$AUNMP= <proc_1d>
##$AZFE= 0.1
##$AZFW= 0.5
##$BCFW= 0
##$BC_mod= 2
##$BYTORDP= 0
##$COROFFS= 0
##$CY= -3
##$DATMOD= 1
##$DC= 0
##$DFILT= <>
##$DTYPP= 0
##$F1P= 0
##$F2P= 0
##$FCOR= 1
##$FTSIZE= 65536
##$FT_mod= 6
##$GAMMA= 0
##$GB= 0
##$INTBC= 1
##$INTSCL= 9.790993e-09
##$ISEN= 30
##$LB= 1.5
##$LEV0= 0
##$LPBIN= 0
##$MAXI= 10000
##$MC2= 0
##$MEAN= 0
##$ME_mod= 0
##$MI= 50
##$NCOEF= 0
##$NC_proc= -3
##$NLEV= 6
##$NOISF1= 182.463
##$NOISF2= 159.3651
##$NSP= 0
##$NTH_PI= 0
##$NZP= 0
##$OFFSET= 198.0616
##$PC= 4
##$PHC0= 1405.686
##$PHC1= 67.30091
##$PH_mod= 1
##$PKNL= yes
##$PPARMOD= 0
##$PSCAL= 0
##$PSIGN= 0
##$REVERSE= no
##$SF= 81.0140089999434
##$SI= 65536
##$SIGF1= 159.3651
##$SIGF2= -187.1042
##$SINO= 113.3802
##$SIOLD= 16384
##$SREGLST= <1H.CDCl3>
##$SSB= 0
##$STSI= 65536
##$STSR= 0
##$SW_p= 32467.5324675325
##$SYMM= 0
##$S_DEV= 0
##$TDeff= 32768
##$TDoff= 0
##$TI= <>
##$TILT= no
##$TM1= 0
##$TM2= 0
##$TOPLEV= 0
##$USERP1= <user>
##$USERP2= <user>
##$USERP3= <user>
##$USERP4= <user>
##$USERP5= <user>
##$WDW= 1
##$XDIM= 65536
##$YMAX_p= 369820860
##$YMIN_p= -1799593
$$ End of Bruker specific parameters
$$ ---------------------------------
##NTUPLES= NMR SPECTRUM
##VAR_NAME=  FREQUENCY,     SPECTRUM/REAL,   SPECTRUM/IMAG
##SYMBOL=    X,             R,               I
##VAR_TYPE=  INDEPENDENT,   DEPENDENT,       DEPENDENT
##VAR_FORM=  AFFN,          ASDF,            ASDF
##VAR_DIM=   65536,         65536,           65536
##UNITS=     HZ,            ARBITRARY UNITS, ARBITRARY UNITS
##FACTOR=    0.49542278885378, 1,            1
##FIRST=     16045.7642231865, 0,            0
##LAST=      -16421.768244346, 0,            0
##MIN=       -16421.768244346, -1799593,     0
##MAX=       16045.7642231865, 369820860,    0
$$ Real data points
##PAGE= N=1
##DATA TABLE= (X++(R..R)), XYDATA
$$ [...]
43744 -126672 -105063 -143881 -201084 -241488 -288066 -360370 -404370 -355772 -250324 -189684 -202753
43733 -202753 -223652 -212493 -207753 -233525 -243050 -200800 -147734 -131023 -130247 -111007 -98458 -133715
43721 -133715 -196734 -233723 -231215 -209030 -169848 -110077 -54263 -26746 -14186 -3442 -22755 -88586
43709 -88586 -145406 -127439 -57664 -15122 -20957 -29984 -22199 -20804 -19403 23512 100165 141389 117257
43696 117257 81923 85200 101943 88871 55058 28550 -269 -48806 -89982 -84358 -44556 -19499
43684 -19499 -27838 -51377 -84837 -144284 -220915 -266620 -243862 -169103 -92494 -47543 -32485 -31408
43672 -31408 -36222 -43014 -40127 -19273 434 -16790 -73496 -121398 -119415 -91471 -91147 -121812 -139435
43659 -139435 -134437 -154281 -222285 -283323 -271197 -201634 -156945 -189841 -272771 -334063 -321036 -238433
43647 -238433 -147630 -119168 -166389 -234164 -265370 -258622 -242669 -223376 -193503 -175341 -204812 -272774
43635 -272774 -323830 -322921 -291042 -267260 -268084 -295307 -348432 -406704 -427334 -392234 -340741 -326188
43623 -326188 -347656 -352631 -305499 -225819 -152384 -95193 -41885 2643 9270 -37111 -108062 -153993
43611 -153993 -153915 -133676 -134485 -173079 -236891 -306601 -369238 -412369 -422234 -395264 -343526 -283576 -226939
43598 -226939 -184790 -169769 -182166 -202170 -208963 -203843 -203183 -213446 -227454 -240996 -254106 -256478
43586 -256478 -234598 -199488 -184230 -202031 -228047 -236832 -233992 -230912 -215785 -183597 -172775 -224446
43574 -224446 -310454 -350473 -309875 -239414 -203971 -209705 -219246 -202799 -151947 -75950 -10175 1588
43562 1588 -39701 -80900 -89093 -98033 -145932 -199446 -190186 -109041 -13640 48481 75179 74309 46396
43549 46396 9038 -8915 -11289 -34510 -91537 -151361 -185923 -201730 -211251 -208821 -193613 -184597
43537 -184597 -191673 -198584 -193538 -190725 -202013 -213252 -211279 -211691 -235440 -275597 -309385 -326616 -324617
43524 -324617 -291767 -222325 -139274 -80099 -62369 -75879 -100774 -120444 -125041 -116535 -107188 -106377
43512 -106377 -114465 -130509 -153477 -174666 -185992 -198489 -232241 -282629 -318331 -320381 -301642 -280191
43500 -280191 -256931 -228031 -195092 -154745 -104790 -66595 -66361 -84275 -66660 -10730 10236 -55425
43488 -55425 -154467 -191261 -145780 -78648 -39413 -26318 -29605 -56426 -100228 -127653 -114725 -73707
43476 -73707 -37442 -35997 -84616 -166821 -230185 -229465 -179959 -142683 -150068 -169552 -149395 -81175
43464 -81175 -5639 32454 26745 9343 9243 14309 -11279 -71270 -124660 -139792 -131617 -124389 -108047
43451 -108047 -63241 -4213 39160 60352 60967 22242 -62283 -148504 -191459 -217004 -280428 -360545
43439 -360545 -367683 -270958 -151909 -104510 -134113 -182447 -203507 -182453 -123552 -59315 -41989
43428 -41989 -90723 -166909 -224013 -255882 -275616 -280060 -264730 -246522 -240475 -234959 -216652 -199633
43416 -199633 -205242 -233668 -276663 -332581 -384872 -394990 -348165 -281372 -233957 -195844 -140407 -82425
43404 -82425 -57140 -57657 -42162 253 33740 27065 -15056 -73044 -130719 -169988 -179498 -173294 -173015
43391 -173015 -170421 -138526 -82370 -43291 -42435 -54064 -52679 -56444 -97320 -167899 -228479 -260546
43379 -260546 -285283 -323760 -360769 -365307 -338206 -316567 -323147 -331646 -304505 -252711 -223661 -228643
43367 -228643 -223123 -176559 -121386 -98169 -84819 -30060 57619 107576 76386 -5398 -85119 -145200
43355 -145200 -191323 -219422 -221256 -203645 -182302 -169532 -178103 -218446 -279878 -332428 -358061 -361794
43343 -361794 -345682 -301187 -242811 -215591 -238583 -266714 -247470 -198993 -187473 -231537 -275709
43332 -275709 -269149 -229485 -206420 -213118 -222425 -212068 -184408 -150563 -120755 -107518 -117907 -143648
43320 -143648 -175144 -220593 -291940 -375493 -439064 -467476 -465824 -427083 -331950 -196779 -87644
43309 -87644 -54775 -73270 -83368 -75225 -90652 -141001 -170675 -126342 -32654 32455 26075 -23671
43297 -23671 -67395 -93526 -124472 -167793 -194546 -175942 -128690 -102541 -120738 -154554 -168078 -165857
43285 -165857 -173898 -191093 -191291 -166883 -138463 -121874 -116493 -127741 -166518 -216387 -233800 -197797
43273 -197797 -134591 -78111 -31508 15091 53433 66480 53294 28200 10247 23359 82992
43262 82992 167092 224971 234176 225205 231075 240643 228051 200973 185716 184858 184499 186947 200804
43249 200804 212187 201633 178648 164189 150068 115287 76051 77058 129647 193161 221080 196478
43237 196478 125898 35965 -22212 -6593 63549 117166 103429 32632 -51481 -105908 -96057 -16828
43225 -16828 76795 101872 38392 -40676 -56361 -15322 14545 -508 -24925 -9507 47534 103626
43213 103626 121669 106611 91870 93557 89366 51178 -13635 -71356 -103618 -117020 -116925 -100784
43201 -100784 -80308 -82582 -119210 -171770 -210095 -207396 -145603 -39127 46942 42860 -47953 -149070
43189 -149070 -200505 -213017 -220040 -221106 -207131 -206498 -256412 -337660 -379058 -334299 -232847 -148775
43177 -148775 -129151 -153252 -157390 -103273 -21191 24004 5500 -44724 -83872 -100968 -109461 -125542
43165 -125542 -160271 -206564 -230291 -206043 -164113 -159862 -189225 -188912 -142152 -122203 -184181 -265962
43153 -265962 -262762 -170337 -84853 -72017 -102662 -121564 -118931 -112561 -102760 -74110 -23660 29009
43141 29009 53494 33291 -10103 -30300 -11203 8466 -8899 -41305 -42991 -21212 -26966 -73097
43129 -73097 -114366 -118573 -109469 -120435 -146711 -168380 -187469 -212928 -231412 -222863 -195139 -181017
43117 -181017 -203280 -252873 -296965 -304872 -274053 -231363 -200270 -173823 -136468 -102781 -105662 -147405
43105 -147405 -194492 -226356 -256158 -291476 -309404 -294583 -274980 -288705 -329561 -355432 -345645 -323450
43093 -323450 -318151 -325324 -315057 -270217 -205166 -146372 -103694 -70280 -47055 -49009 -77771 -104704
43081 -104704 -100337 -71316 -47660 -39384 -28338 -1481 30201 49089 49508 36137 17719 1865
43069 1865 -15342 -47162 -89580 -111911 -97472 -76552 -84007 -98331 -70320 -8988 16103 -28891
43057 -28891 -94912 -122062 -112624 -102202 -100405 -99116 -106662 -130433 -147822 -135154 -108414 -97466
43045 -97466 -97557 -88321 -85702 -124610 -192582 -231758 -217881 -193095 -200635 -224491 -221789 -187057 -149559
43032 -149559 -121512 -87192 -46441 -36021 -87752 -181363 -261486 -296826 -300350 -289899 -257682 -196511
43020 -196511 -131854 -96194 -83844 -67114 -51888 -72906 -125643 -151300 -117995 -77930 -101721
43009 -101721 -178678 -228576 -205947 -150709 -130273 -165563 -226347 -273918 -290490 -278662 -248109
42998 -248109 -206043 -161219 -134747 -152294 -213986 -283193 -321028 -324795 -318388 -315769 -314045 -313238 -316877
42985 -316877 -315635 -296375 -268807 -256498 -255505 -229697 -161884 -87230 -55680 -75561 -114577 -145240
42973 -145240 -164197 -169708 -149741 -107180 -78109 -101055 -169789 -234452 -251190 -214020 -137335 -37406
42961 -37406 49237 60314 -32116 -160379 -209125 -142552 -46981 -23487 -72644 -120019 -126724 -124295
42949 -124295 -148242 -189592 -226542 -263391 -309833 -344204 -329066 -260361 -179683 -133823 -134887 -163921
42937 -163921 -199569 -229544 -241974 -229115 -207571 -212617 -252718 -287245 -277721 -247987 -254836 -303733
42925 -303733 -341526 -340655 -336403 -355503 -362318 -321177 -267491 -256516 -270780 -247901 -189047 -166207
42913 -166207 -211304 -263996 -256316 -197568 -142480 -115640 -104456 -98495 -98721 -104225 -119268 -159140
42901 -159140 -221919 -267977 -258276 -208433 -177753 -203281 -265545 -321060 -347467 -349195 -337598 -322678
42889 -322678 -316308 -323153 -324454 -289961 -221796 -172711 -193768 -265778 -313130 -293189 -239977 -204881
42877 -204881 -191990 -182146 -184638 -216684 -252872 -249056 -208898 -174706 -154985 -117680 -62777 -42486
42865 -42486 -85661 -150485 -180678 -169662 -143349 -118678 -107435 -121765 -142906 -122675 -54596 -7182
42853 -7182 -39788 -115021 -146831 -113344 -65929 -42092 -32871 -34304 -63571 -105688 -103661 -36617
42841 -36617 34855 41894 -2353 -27765 -6060 20742 10962 -19964 -32238 -22218 -19552 -34170
42829 -34170 -39064 -14166 17370 15277 -29245 -90154 -141389 -173285 -182199 -171612 -163135 -177103
42817 -177103 -195678 -173865 -100338 -22015 9804 -1439 -10133 15164 64639 104354 105769 66657
42805 66657 11760 -32783 -60528 -64579 -14152 102968 216440 215830 87571 -42746 -48454 57705
42793 57705 165200 205780 193267 156884 108903 70185 60891 61589 38387 8117 22022 80889
42781 80889 127682 137334 150674 193848 224499 198700 143182 111715 103398 77740 32608 12316
42769 12316 36080 63237 46305 -10635 -69226 -114698 -164087 -213999 -217012 -143757 -48742 -22324
42757 -22324 -73823 -120703 -114926 -112877 -172137 -245656 -256592 -225941 -224561 -231356 -161895 -35938
42745 -35938 15409 -56282 -137167 -122046 -54508 -23228 -21406 -4758 -2453 -56026 -109335 -79421
42733 -79421 2120 35261 11139 6070 30970 13081 -63467 -119947 -113643 -96946 -107832 -103609
42721 -103609 -54581 -11465 -17748 -34739 -22346 -24032 -91337 -176183 -184449 -109696 -37700 -30316
42709 -30316 -67679 -100447 -107481 -101128 -110914 -157534 -219439 -244043 -217563 -195366 -228901 -291678
42697 -291678 -318030 -288714 -235911 -190762 -172753 -203376 -274926 -325733 -302571 -232118 -177893
42686 -177893 -149585 -119385 -104155 -145131 -209028 -201748 -102328 -1764 24111 6718 9046 26421
42674 26421 17492 -16759 -42018 -44886 -31960 -4944 25298 34482 31357 66514 150215 204986
42662 204986 156291 34134 -74952 -140891 -185281 -197112 -143787 -58888 -28743 -77347 -142527
42651 -142527 -185512 -244111 -340765 -411527 -384043 -278069 -172227 -105057 -62481 -36742 -38738
42640 -38738 -59090 -68010 -61824 -75370 -136591 -227865 -300329 -318142 -288145 -249945 -233115 -227252
42628 -227252 -207485 -181596 -181013 -203297 -204443 -166176 -131911 -146525 -192689 -221772 -221307 -213404 -207650
42615 -207650 -197048 -186036 -181272 -164602 -116230 -60260 -48891 -100846 -184383 -254366 -276432 -230095
42603 -230095 -132084 -50428 -49609 -120146 -200293 -258726 -305741 -330565 -297618 -221623 -180337 -218159
42591 -218159 -287630 -321150 -313733 -295799 -268269 -213356 -139895 -73833 -27802 -15521 -61830 -151425
42579 -151425 -200325 -139700 -13619 63850 42419 -25879 -75458 -96069 -106403 -113406 -117406 -119024
42567 -119024 -104974 -59000 2467 37922 33049 12890 -4937 -31670 -71459 -103802 -118652 -131084
42555 -131084 -140675 -115105 -43147 28706 46756 14568 -23862 -45334 -60953 -85395 -124370 -181353
42543 -181353 -247600 -293498 -296419 -272001 -256090 -261520 -270967 -263630 -231122 -177565 -121117 -82246
42531 -82246 -55236 -13010 38999 44483 -29961 -126945 -154757 -101605 -42985 -39058 -78409 -126535
42519 -126535 -169378 -189975 -161525 -100257 -78390 -139718 -235385 -287550 -288296 -285436 -290997 -264376
42507 -264376 -188772 -111011 -83511 -97897 -98911 -50798 23415 64342 37321 -25790 -58314 -41118
42495 -41118 -28992 -70745 -131318 -139626 -97684 -81210 -126660 -180449 -185382 -160998 -156754 -169958
42483 -169958 -162877 -133171 -111603 -103210 -84078 -53814 -41484 -53548 -61065 -51530 -53762 -92502
42471 -92502 -150424 -195987 -222839 -240329 -247431 -240019 -229326 -231714 -248823 -272368 -297966 -320735
42459 -320735 -327682 -307692 -262050 -199026 -129790 -72060 -38030 -15215 12439 17574 -54434 -197301
42447 -197301 -315497 -330037 -280396 -262769 -287497 -270998 -173733 -72027 -60465 -137760 -229395
42436 -229395 -280524 -280721 -230197 -137911 -42843 10688 20906 18869 14417 -12617 -66132 -115834
42424 -115834 -137914 -146170 -168019 -208567 -249864 -270094 -255572 -210412 -162491 -143257 -153120 -163220
42412 -163220 -158710 -158877 -180459 -202377 -190386 -146019 -108828 -112747 -152908 -187765 -163545 -55073
42400 -55073 94325 189736 175865 104546 71980 89281 66953 -50693 -187640 -221840 -139264
42389 -139264 -42618 -13119 -25451 -17116 13228 17547 -24493 -88340 -152849 -219655 -278584 -293627
42377 -293627 -247531 -180109 -154515 -186329 -224562 -210085 -142211 -74457 -46751 -41674 -22997 -1767
42365 -1767 -29224 -117663 -204394 -221043 -174213 -123045 -94753 -68267 -37220 -34600 -75357 -120239
42353 -120239 -130785 -127803 -154630 -204054 -228597 -216132 -207423 -229731 -253585 -235045 -171196 -91383
42341 -91383 -17930 36243 48256 510 -82477 -141634 -141079 -103301 -77373 -87365 -125869 -183341
42329 -183341 -256773 -328322 -363048 -345844 -305866 -283410 -280399 -266392 -229202 -189280 -156893 -108355
42317 -108355 -28792 46193 66887 37503 10733 12335 7754 -40902 -115357 -166261 -182057 -202101
42305 -202101 -259712 -333832 -367682 -327639 -236524 -150731 -109816 -112260 -137349 -175116 -220040 -246025
42293 -246025 -217866 -138068 -59782 -34834 -61444 -97982 -113516 -105739 -83710 -60249 -55388 -80581
42281 -80581 -120844 -156310 -196044 -257797 -314623 -304895 -213510 -106155 -55084 -59631 -70939 -67661
42269 -67661 -66132 -74363 -83110 -95221 -116851 -121043 -70851 13192 61514 51073 40621 78483
42257 78483 123671 105233 21688 -73841 -157364 -235878 -281673 -244281 -141849 -71369 -95288
42246 -95288 -168911 -214148 -218388 -217770 -222132 -210671 -180231 -145283 -100668 -34574 24224 22780 -41628
42233 -41628 -105089 -112353 -76819 -48985 -55417 -90844 -144238 -201412 -234380 -220345 -174662 -143428
42221 -143428 -152922 -175530 -155804 -70851 39910 109507 107135 62113 26481 27332 59938 106144
42209 106144 139368 127338 60469 -25213 -80800 -99876 -113876 -133678 -133289 -101462 -69735 -65862
42197 -65862 -73387 -68748 -69675 -105580 -156654 -167767 -122636 -68089 -59968 -111546 -194288 -259647 -261497
42184 -261497 -194466 -117963 -105010 -151997 -174465 -113758 -13331 41016 25423 -18334 -59473
42173 -59473 -104406 -150593 -170827 -162397 -167542 -213605 -262452 -255977 -195972 -141232 -128450 -131234
42161 -131234 -107276 -58493 -23623 -23780 -37833 -35304 -19159 -20546 -49123 -65334 -22386 68511
42149 68511 142816 160344 146039 132423 98985 14639 -85472 -131381 -124554 -142751 -220212 -292185
42137 -292185 -295293 -256765 -229472 -200541 -141215 -97385 -130686 -194002 -176468 -75137 -8862
42126 -8862 -34229 -61840 -12867 47244 20787 -58133 -82062 -44258 -38525 -102767 -171986 -192487
42114 -192487 -185422 -177654 -157262 -128275 -132013 -174279 -197284 -168267 -138739 -165577 -220105 -230872
42102 -230872 -185772 -140497 -144410 -198499 -269898 -314210 -300827 -245415 -198375 -178707 -149783 -87152
42090 -87152 -27922 -9177 -62 40882 70804 5168 -147967 -273833 -289759 -234798 -193512
42079 -193512 -185617 -171582 -129510 -79650 -46058 -28488 -12165 10609 27890 15651 -31850 -82935
42067 -82935 -99139 -81240 -58562 -36880 4090 55300 66099 10802 -69020 -117589 -130630 -138598
42055 -138598 -153003 -165072 -174330 -178203 -150235 -72808 16298 54524 33774 10113 28367 73817
42043 73817 109207 123733 125734 115251 89190 57678 34008 17675 1922 -12002 -20616 -26887
42031 -26887 -30070 -18305 13753 50093 72591 86428 107130 127613 119926 71080 -2189 -77766
42019 -77766 -146292 -195863 -200378 -145360 -56779 17898 57158 75667 86419 76751 35842 -13169
42007 -13169 -33869 -24380 -19794 -42602 -73306 -82883 -75622 -78662 -98740 -114444 -112570 -108439 -119456
41994 -119456 -137180 -143362 -142126 -153117 -174075 -174873 -140871 -105982 -123576 -207087 -310886 -367937
41982 -367937 -340193 -243976 -143717 -111438 -162804 -229315 -223060 -139937 -67386 -70831 -109210 -101946
41970 -101946 -49983 -30958 -81498 -150073 -183127 -195291 -214877 -210405 -132267 -6355 73432
41959 73432 48988 -46667 -140005 -185235 -177920 -141743 -120477 -153804 -236658 -315488 -340360 -312875
41947 -312875 -276639 -272182 -305266 -345572 -352865 -317795 -275237 -258510 -246685 -191555 -100134 -45461
41935 -45461 -72085 -131373 -148794 -123994 -114517 -139407 -159466 -155526 -165684 -218225 -272512 -265640
41923 -265640 -193237 -107511 -50948 -29446 -43996 -106673 -211148 -314371 -367462 -354897 -295252
41912 -295252 -218786 -156280 -133594 -154943 -195531 -228850 -258990 -305797 -356367 -357308 -274109 -145523
41900 -145523 -56844 -57809 -119031 -169924 -168891 -134228 -114462 -132527 -158923 -145411 -88892 -49249
41888 -49249 -88256 -197522 -305533 -352414 -337013 -294296 -258136 -254840 -298869 -369932 -417251
41877 -417251 -414490 -393336 -392782 -391536 -332040 -209083 -91437 -42999 -57636 -90314 -120155 -153814
41865 -153814 -188736 -208316 -207170 -193159 -166096 -118941 -61272 -18689 -3523 -4331 -8291 -13448
41853 -13448 -12139 12370 54367 72003 35177 -21277 -27239 32385 88652 70747 -6915 -71979
41841 -71979 -95345 -121073 -186306 -255427 -268507 -228978 -196624 -199926 -205371 -187011 -178218 -217935
41829 -217935 -277793 -292930 -256427 -233011 -268159 -324370 -330292 -263970 -160796 -61408 14056
41818 14056 50200 33563 -23668 -80357 -101799 -89203 -67314 -53988 -51434 -58284 -74399 -89925
41806 -89925 -80026 -25025 57881 113031 94330 17854 -50171 -66894 -58673 -80333 -144982 -215013
41794 -215013 -250218 -238798 -188830 -120745 -69976 -67570 -110202 -169784 -230400 -286162 -308255 -264566
41782 -264566 -186133 -159187 -215513 -277652 -262812 -203020 -196708 -261214 -307472 -265659 -168514 -89380
41770 -89380 -55021 -51296 -68081 -97103 -114800 -107265 -95573 -104509 -119873 -106792 -61863 -20557
41758 -20557 -16013 -49326 -96386 -128344 -129265 -105958 -78609 -59891 -54077 -73696 -129804 -197660
41746 -197660 -224107 -189567 -135655 -108235 -102284 -94330 -99538 -148442 -219999 -248368 -202017 -119878
41734 -119878 -62715 -57574 -91971 -131137 -135336 -90089 -28293 1161 -9592 -27518 -36622 -60569
41722 -60569 -115359 -172035 -188392 -157646 -107310 -64721 -37552 -15764 15720 52831 59871 6143
41710 6143 -79129 -121272 -88636 -37828 -42593 -98483 -132509 -98898 -31011 7248 -3717 -27391
41698 -27391 -23245 5391 21594 6335 -17355 -21401 -16531 -34895 -79067 -121344 -152108 -189078
41686 -189078 -228434 -229547 -174103 -105713 -76889 -81121 -72057 -30712 21942 63599 83830 69458
41674 69458 17656 -37242 -47104 -6733 39690 52444 32911 7032 -2000 15555 46823 58134
41662 58134 32192 1453 15095 74500 134126 164124 171663 158592 108790 34589 -12796 -7050
41650 -7050 19552 33187 44203 61136 50341 -2872 -36001 13750 99185 113468 46363 3331
41638 3331 52466 137509 179693 185969 197171 196111 148394 94605 114255 209130 297328 321391
41626 321391 295066 245271 184623 153360 206439 323475 402007 388273 355380 396584 494479
41615 494479 563585 579701 585303 589323 549914 460643 375160 326062 284776 229412 195212 219907
41603 219907 280804 325008 334495 329212 327994 334880 347872 360200 366965 380151 413302 443870
41591 443870 427291 365484 320404 330846 355235 336854 292437 285385 330050 374082 369950 319491
41579 319491 248671 178841 126290 94318 59558 -2935 -74661 -101488 -54302 39942 130142
41568 130142 179725 172311 111233 30020 -16948 5551 85630 181057 259264 322139 399811 519613
41556 519613 676295 836963 975788 1089212 1175003 1225700 1260570 1333397 1476445 1660062
41546 1660062 1845298 2054366 2337741 2680973 3004012 3267082 3530024 3884723 4364874
41537 4364874 4945141 5596148 6306916 7069998 7880282 8758549 9767114 10992605 12502198
41528 12502198 14312336 16413792 18833248 21642780 24884025 28499432 32343075 36187298
41520 36187298 39640860 42111529 43010662 42105402 39668805 36275189 32483699 28699603
41512 28699603 25202271 22163521 19620826 17500640 15707220 14188909 12935400 11941575
41504 11941575 11177819 10582726 10086691 9645811 9239802 8835839 8380413 7838843 7221311
41495 7221311 6560929 5892405 5261671 4720203 4283680 3918359 3587348 3287254 3024534
41486 3024534 2788661 2574146 2400877 2283466 2201349 2122804 2035881 1934756 1805337 1653028
41476 1653028 1517412 1426898 1360353 1282577 1194216 1116420 1050010 982695 916416 858208 805358
41465 805358 763708 749013 742394 687661 576219 490340 501535 561217 564770 500493 450951 449750
41453 449750 425798 318120 177269 106587 138209 205014 221234 170626 119605 143245 233145
41442 233145 299173 280436 220743 196127 204823 191909 158510 165830 228739 282235 274115 229053
41430 229053 198442 201251 235175 291983 337714 328835 273804 231711 228135 223395 187328 147534
41418 147534 130199 111176 70586 43948 65268 101237 100750 79941 98534 168291 237511 257303
41406 257303 219510 137726 32860 -63854 -125127 -144538 -123541 -59883 29115 96622 111007
41395 111007 90031 61052 14903 -60532 -127159 -130511 -75738 -19075 11462 35258 57294 42626
41383 42626 -27186 -113992 -166318 -176442 -172028 -172366 -176747 -183676 -198160 -219463 -233281 -219004 -164310
41370 -164310 -77852 8689 55433 40055 -22319 -82538 -92392 -51047 -12028 -25842 -77423 -103231
41358 -103231 -73182 -28435 -26472 -73938 -131110 -161216 -153729 -114849 -59751 -10864 10900 -5802
41346 -5802 -60511 -132159 -175119 -150157 -67183 24915 95217 149536 188094 183715 121966 31780
41334 31780 -45122 -90034 -99306 -74493 -37756 -20700 -17666 11209 68820 97935 58019 -21565
41322 -21565 -98706 -175979 -254904 -286896 -234653 -143817 -86510 -64229 -33959 -166 -2449 -30161
41310 -30161 -32749 -12953 -30928 -104780 -174937 -184287 -139203 -78073 -28311 -4958 -8682 -19930
41298 -19930 -31819 -78385 -183753 -299854 -353477 -341154 -312869 -279373 -216949 -155493 -166891
41287 -166891 -252472 -328182 -338450 -301444 -229947 -108338 22890 65877 -126 -75732 -87045
41276 -87045 -82214 -121604 -169389 -177960 -192776 -271538 -365731 -388979 -353857 -336698 -347024 -337908
41264 -337908 -313902 -317014 -323317 -267945 -174135 -147517 -220918 -298532 -285309 -196763 -111281 -78367
41252 -78367 -101580 -155647 -194545 -188655 -169526 -193798 -258425 -304114 -304505 -290482 -281647 -263703
41240 -263703 -246149 -267288 -318767 -339653 -315406 -305376 -331646 -322656 -230014 -128863 -119881 -183320
41228 -183320 -220937 -209846 -216168 -262700 -281071 -221472 -134143 -99151 -124895 -160680 -178293 -195883
41216 -195883 -233573 -284255 -330498 -362534 -370791 -341975 -279749 -217845 -189293 -181642 -147384 -71349
41204 -71349 -4029 -2917 -58302 -111785 -138724 -168219 -216872 -250395 -234772 -188678 -152797 -131754
41192 -131754 -99570 -46308 12566 63018 99409 111160 89567 45685 -572 -46176 -100119
41181 -100119 -158634 -208197 -249379 -292112 -326036 -321637 -269492 -198512 -145484 -122646 -124433 -148314
41169 -148314 -191430 -235212 -252197 -231517 -189309 -151957 -134165 -133317 -137302 -132648 -110676 -75907
41157 -75907 -49559 -54854 -92839 -139394 -171258 -184880 -181152 -148146 -83127 -23737 -23124 -83883
41145 -83883 -145053 -154037 -130104 -131380 -172833 -208184 -193614 -142280 -103038 -100238 -111534 -104705
41133 -104705 -83996 -87159 -132725 -182419 -173991 -91225 17277 93669 124196 126868 110820 72940
41121 72940 20952 -27898 -66195 -91252 -88004 -46776 2825 9357 -39205 -100262 -134967 -151810
41109 -151810 -172322 -184676 -166348 -133296 -124077 -139675 -140210 -106351 -63980 -34416 -599 50174
41097 50174 84655 64835 9752 -28504 -41020 -67077 -121130 -163984 -164594 -148250 -154222 -177081
41085 -177081 -184373 -171247 -161825 -167651 -177203 -181644 -184163 -186938 -190016 -196595 -200549 -182341 -141466
41072 -141466 -115219 -131018 -155592 -135519 -80000 -52835 -81058 -125897 -155462 -188191 -237735
41061 -237735 -269038 -251402 -215792 -213503 -244581 -268764 -264377 -236287 -188175 -131503 -105152 -140587
41049 -140587 -216518 -284978 -326416 -340420 -309543 -232405 -174268 -208358 -303295 -344377 -284268
41038 -284268 -198708 -163961 -155886 -119657 -68728 -43727 -26362 20625 58567 9639 -115266
41027 -115266 -209388 -206404 -154460 -131527 -148757 -169359 -171447 -154171 -119869 -84835 -75293 -82879
41015 -82879 -60259 5287 53151 29816 -25222 -30421 21027 56206 29051 -26547 -57200 -51270
41003 -51270 -23732 16758 63717 105383 136803 155682 143508 84854 8588 -33780 -41480 -68297
40991 -68297 -134715 -188235 -182526 -147201 -137827 -160522 -194147 -245221 -319921 -373276 -355868 -294382
40979 -294382 -257441 -251910 -225910 -173248 -154087 -192600 -228907 -208194 -156340 -126040 -120709 -118521
40967 -118521 -127028 -159439 -186774 -168201 -113665 -71416 -63966 -74315 -84591 -91624 -91747 -82094 -70214
40954 -70214 -58191 -34729 -12861 -50491 -184644 -356643 -456944 -449777 -406701 -405664 -440942
40943 -440942 -453000 -410813 -337300 -275064 -248588 -244929 -218392 -132945 -13191 67104 63256 7788
40931 7788 -36382 -51616 -72226 -130196 -219588 -308295 -362953 -366743 -334193 -305914 -306627 -308949 -264119
40918 -264119 -174335 -107589 -124633 -212320 -308854 -374009 -404560 -397232 -343394 -267009 -223886 -239784
40906 -239784 -280666 -308356 -331896 -368749 -388604 -350020 -276074 -232576 -233008 -228522 -202600 -206655
40894 -206655 -269998 -336949 -342211 -299126 -255915 -207256 -123858 -46971 -66881 -194397 -323067
40883 -323067 -349279 -281634 -200301 -149327 -112758 -77341 -72029 -132782 -247003 -350606 -387212
40872 -387212 -366590 -350342 -374993 -409635 -404774 -358790 -305770 -256397 -194118 -125852 -90918 -108082
40860 -108082 -149087 -179657 -198773 -223790 -261567 -305702 -338074 -326011 -251140 -156040 -125166
40849 -125166 -189061 -273820 -281639 -206171 -130701 -118270 -145059 -154979 -145135 -162740 -225433 -281275
40837 -281275 -267397 -188928 -110473 -75536 -69814 -69620 -82946 -115928 -137323 -120476 -96408 -115769
40825 -115769 -170887 -205156 -193067 -160849 -131710 -105583 -95106 -121183 -159372 -149450 -79789 -8181
40813 -8181 23534 38072 58330 57253 14593 -33263 -51982 -68149 -113564 -157840 -160908 -150494
40801 -150494 -172467 -197224 -161061 -83671 -54020 -96674 -137630 -119957 -74791 -48747 -31134
40790 -31134 6343 52572 81230 87880 65646 -11823 -138131 -240787 -250543 -183701 -113521 -79822
40778 -79822 -70764 -76573 -107077 -154089 -183714 -181180 -170462 -173901 -179610 -167273 -143367 -126425 -112217
40765 -112217 -83591 -52135 -56484 -103630 -139356 -110965 -50037 -50148 -147550 -260127 -277673 -192481
40753 -192481 -101334 -84879 -127379 -165441 -176685 -189468 -221738 -244699 -217572 -144516 -79417
40742 -79417 -66781 -89422 -96726 -82886 -100303 -174907 -247765 -249001 -206795 -218282 -310387 -396789
40730 -396789 -397859 -341776 -301754 -283499 -241080 -179226 -164566 -226182 -304393 -324365 -280802 -221680
40718 -221680 -180195 -158947 -161730 -197040 -247976 -275531 -268138 -262126 -289197 -320593 -295476 -201895
40706 -201895 -96212 -32898 -8253 3541 -10309 -82198 -194221 -275698 -284439 -255484 -248085
40695 -248085 -271262 -288880 -280726 -266616 -272743 -299518 -327567 -338398 -322858 -282384 -232724 -202354
40683 -202354 -216677 -275959 -347692 -388758 -385490 -369837 -383199 -421942 -433370 -375031 -267146
40672 -267146 -173589 -136451 -141588 -146073 -126305 -95512 -83645 -108189 -161898 -220990 -261886 -274763
40660 -274763 -267866 -259093 -258374 -258629 -249589 -236394 -230592 -223076 -187517 -121135 -61667 -45664 -65859
40647 -65859 -90242 -107088 -124220 -136861 -130236 -109712 -95027 -84664 -58734 -19401 5089 304
40635 304 -26131 -79784 -177197 -293078 -358577 -344485 -306618 -309074 -335341 -323268 -265055 -216566
40623 -216566 -211747 -219855 -198976 -152179 -112158 -96403 -95768 -91990 -73364 -42846 -18406 -17804 -38680
40610 -38680 -59154 -58936 -37370 -17215 -34759 -111882 -224723 -313162 -339754 -329155 -329672 -347330
40598 -347330 -345339 -303860 -248977 -216269 -211485 -218630 -227061 -235736 -242083 -240450 -228722 -209805 -187355
40585 -187355 -161466 -129033 -92194 -65050 -60619 -69666 -70846 -68818 -96679 -162023 -217433 -216763 -181307
40572 -181307 -170313 -197215 -219987 -212176 -195176 -191209 -191522 -189638 -201608 -224850 -215771 -146468 -56672
40559 -56672 -9023 -10919 -21486 -24029 -45899 -103163 -164951 -187408 -158637 -99390 -40589 -9726
40547 -9726 -17780 -45376 -57805 -46108 -37707 -54427 -80509 -93759 -110174 -163662 -246341 -306278
40535 -306278 -313382 -292305 -270529 -228341 -137615 -28795 29699 19174 -6423 2704 32027 40334
40523 40334 22170 -511 -26647 -78362 -160969 -249055 -311779 -333932 -317840 -282181 -251864 -232482
40511 -232482 -204315 -157440 -117142 -112532 -135812 -158489 -171012 -175286 -156429 -103792 -48485 -32748
40499 -32748 -45945 -40071 -9747 -2964 -42436 -91743 -119551 -143812 -183709 -218339 -229927 -242533
40487 -242533 -274967 -296983 -283138 -274105 -322614 -399829 -420845 -358838 -275172 -231757 -226764 -228226
40475 -228226 -222109 -207005 -180243 -152128 -144559 -156208 -156190 -131169 -111086 -123897 -149334 -150015 -134091
40462 -134091 -149175 -211401 -274069 -285557 -258451 -253511 -298562 -353388 -368254 -349309 -334031 -318837
40450 -318837 -260150 -154390 -66897 -52268 -84376 -103730 -103005 -117037 -148947 -164482 -156666 -158629
40438 -158629 -180374 -184607 -149490 -113421 -124933 -175687 -214870 -212715 -182801 -154058 -144548 -153968
40426 -153968 -161542 -138288 -79999 -23709 -15286 -61340 -123100 -155594 -146169 -119422 -112080 -140970
40414 -140970 -191471 -236887 -262688 -263560 -227790 -148234 -49684 18554 26667 -14004 -74467 -130840
40402 -130840 -160955 -149626 -112688 -89017 -89079 -76169 -22091 43486 71607 63696 63234 83966 87331
40389 87331 40463 -35705 -93693 -113390 -108601 -91511 -53624 13366 90774 139944 138266 100729
40377 100729 60250 34410 22334 25547 49450 81505 90144 56709 -4639 -64392 -99770 -98520
40365 -98520 -67173 -44339 -74530 -148727 -199224 -180186 -127590 -105597 -115798 -103747 -46401 13509
40353 13509 27022 -2957 -34277 -29930 19309 93501 154353 174052 160078 139402 120497 89714
40341 89714 43556 1524 -17490 -14139 -1679 5107 -3379 -19991 -21971 -1046 19346 20249 23957
40328 23957 59003 102031 102514 63675 47110 87419 152465 204555 249456 297384 323743 309249
40316 309249 285625 300251 355960 417244 455302 460180 433490 398541 392690 419669 435709 413491
40304 413491 387854 398990 423565 414161 381426 375334 396787 392604 342702 293957 291778 324591
40292 324591 354532 365112 359150 339000 307120 268136 223713 181288 160273 163621 156665 113294
40280 113294 71561 91129 157037 185607 138365 70882 45791 55188 62186 63905 66228 40747
40268 40747 -36175 -127762 -173257 -164675 -141152 -118900 -72675 15042 122371 205262 222704 157829
40256 157829 44310 -43111 -62652 -61502 -118857 -238637 -342034 -368927 -342343 -319172 -316839
40245 -316839 -313367 -293943 -269961 -260641 -270989 -284009 -273238 -234980 -206261 -229273 -292815 -331208
40233 -331208 -292595 -191243 -82943 -8988 21448 15585 -9651 -29079 -31835 -40876 -83574 -139816
40221 -139816 -151186 -100200 -52048 -82019 -175499 -244086 -240838 -207312 -187761 -155348 -73119 16810
40209 16810 37454 -9724 -53241 -69086 -103514 -162437 -172289 -100243 -31056 -51395 -120954 -144820
40197 -144820 -126570 -146950 -211786 -232457 -172225 -113046 -134902 -201863 -220018 -160615 -77782
40186 -77782 -36448 -63254 -143495 -228564 -261606 -226688 -165371 -127870 -120955 -117915 -102339 -83412
40174 -83412 -78788 -96577 -127726 -150540 -150605 -134687 -114094 -84924 -46000 -22022 -34037 -55950
40162 -55950 -44327 -10029 -9823 -57425 -95499 -77864 -31967 -10302 -21035 -40520 -58927 -74997
40150 -74997 -71964 -37634 6401 25369 10245 -21734 -47671 -45118 -1629 64097 113280 131651
40138 131651 135375 126440 86789 32655 19885 62936 101667 91452 74433 106977 164706 187713
40126 187713 182469 201079 242734 258266 244546 251479 287174 294489 245527 191778 184455 197039
40114 197039 169913 100043 45298 50343 94244 113130 71314 11932 22600 133745 268492
40103 268492 320885 267820 171360 90342 35807 1366 -18049 -41603 -87820 -135365 -140039 -98402
40091 -98402 -55176 -41947 -47850 -54082 -54741 -40848 -11619 -6863 -74444 -191704 -271625 -265894 -212047
40078 -212047 -159943 -108832 -48778 -8721 -14164 -32675 -10164 56687 119226 132561 87218 3979
40066 3979 -78453 -125532 -135037 -132886 -139359 -161202 -208618 -276680 -311967 -256867 -140928 -65604
40054 -65604 -73299 -96500 -72507 -38293 -54444 -97195 -102543 -76529 -79704 -122729 -156357 -161770
40042 -161770 -180494 -242566 -316982 -348358 -309164 -211760 -99401 -25701 -15718 -47737 -88815
40031 -88815 -130413 -167760 -173369 -129139 -64893 -27766 -29748 -55689 -96284 -137341 -149606 -134789
40019 -134789 -147343 -216122 -279214 -262729 -193243 -153710 -151597 -123377 -62537 -41737 -90285 -143728
40007 -143728 -148743 -134413 -135657 -121317 -54986 30352 77151 81502 75238 65361 40540 10194
39995 10194 -6690 -8611 6728 56214 127217 153227 86278 -25257 -83599 -59184 -15349 -17959
39983 -17959 -66539 -125408 -182635 -249764 -319189 -350928 -311768 -218468 -127813 -81633 -76824 -95088
39971 -95088 -134496 -187053 -212524 -179062 -117251 -85545 -87604 -76410 -40403 -25450 -58944 -111339
39959 -111339 -153046 -191635 -228603 -240479 -234948 -261559 -321999 -331991 -231755 -83217 7905
39948 7905 24066 21516 22769 3139 -37782 -71414 -99686 -147434 -197937 -204429 -168545 -143092
39936 -143092 -151732 -167802 -178147 -200923 -225828 -204704 -130468 -68547 -75309 -129212 -173562 -186462
39924 -186462 -176278 -145655 -98373 -57691 -44769 -53634 -68440 -88174 -117378 -150182 -176526 -186797
39912 -186797 -165995 -109566 -47989 -20370 -17010 9748 66193 99433 82331 62276 84829 116119
39900 116119 95777 33701 -6912 -5132 -422 -19818 -43179 -48718 -46766 -54179 -69870 -88273
39888 -88273 -109155 -125868 -130874 -137853 -166852 -200030 -189781 -130278 -85654 -113639 -184196 -215487
39876 -215487 -184616 -160053 -210538 -315442 -394885 -411619 -405518 -424053 -454785 -449062 -388795 -299812
39864 -299812 -213840 -152639 -141839 -195513 -277656 -320453 -301121 -267038 -264503 -280361 -283136 -281396
39852 -281396 -295610 -303334 -269208 -211741 -179691 -169492 -131609 -64862 -35569 -77455 -133627 -137617
39840 -137617 -103568 -89431 -108848 -132198 -148634 -170449 -188190 -177133 -149936 -153001 -197402 -232489
39828 -232489 -208030 -137977 -85313 -97533 -165103 -230917 -238504 -184960 -125066 -108634 -122914 -121414
39816 -121414 -99950 -105809 -167702 -254814 -318351 -340405 -327378 -290513 -254222 -249639 -271482 -270446
39804 -270446 -219775 -162107 -153702 -186461 -208511 -203354 -198542 -205245 -203550 -190666 -190947 -206031 -206209
39791 -206209 -192434 -216028 -299896 -381076 -381966 -317007 -275515 -300959 -336179 -305315 -215399 -145909
39779 -145909 -147515 -179831 -162438 -75780 11416 24084 -28656 -68013 -41436 26673 81426 99526
39767 99526 90529 68815 50982 58247 89645 104420 60710 -31588 -118220 -156524 -146553 -115614
39755 -115614 -94086 -100598 -128731 -150709 -151722 -153777 -185920 -239685 -278226 -282978 -265340 -237655
39743 -237655 -201995 -166727 -145793 -140498 -147555 -180351 -247923 -314843 -325600 -279147 -237433 -243587
39731 -243587 -273776 -292650 -310051 -343339 -362002 -324463 -251983 -211881 -229522 -262744 -266732 -240979
39719 -240979 -201615 -148317 -81419 -23702 1058 -2151 -9349 -6931 2176 12173 20874 26773 25989
39706 25989 7306 -47646 -142008 -236753 -268715 -213812 -120127 -60912 -64198 -104532 -149722 -186902
39694 -186902 -206101 -192567 -150879 -114586 -111462 -129600 -134817 -114350 -86573 -70957 -64572 -49418
39682 -49418 -11319 48661 110495 143322 129745 84074 37640 9078 1053 17942 60962 105243
39670 105243 113194 83296 57243 61907 75417 75951 88147 135850 176054 144324 62276 30871
39658 30871 96062 182523 198506 154182 121778 116007 84118 5465 -66447 -76218 -29918 36194
39646 36194 108317 183928 236314 229527 162625 72453 -5883 -62024 -97343 -111852 -111136 -110399 -118763
39633 -118763 -124267 -104775 -55459 776 35011 41395 38228 42734 57625 85537 136549 202857
39621 202857 241629 215407 149132 112742 135794 173322 179083 178560 226684 311922 357485 324910
39609 324910 268215 261958 311356 363143 377927 357089 317168 276725 260104 275500 289910 262316
39597 262316 204693 171392 178502 176288 124420 54802 22675 24680 12481 -27125 -57158 -56528
39585 -56528 -51589 -65019 -75013 -53988 -17379 2626 14622 57731 133669 187370 173111 115757
39573 115757 81969 101814 144345 168827 171632 169267 158775 122916 66132 14280 -25250 -72904
39561 -72904 -132730 -168174 -149835 -108166 -102258 -141187 -173345 -160762 -128526 -120048 -131255 -122298
39549 -122298 -83038 -50217 -53038 -72684 -75742 -65266 -67251 -77837 -67656 -47501 -79891 -187145
39537 -187145 -285730 -273562 -169448 -97173 -123247 -181311 -184748 -142560 -111509 -94483 -60088
39526 -60088 -23784 -27984 -60073 -68698 -53102 -57278 -75515 -47599 37109 112397 137764 148950
39514 148950 169999 156351 83525 23983 61392 172574 265496 300771 305407 294211 257285
39503 257285 218837 233361 307999 380779 392323 343973 278511 237213 241868 289317 355877 423464
39491 423464 495317 570371 622947 636632 638388 664880 713330 760318 804534 846978 856274 813474
39479 813474 773199 810226 908615 975099 970698 957307 992317 1046234 1064146 1055733 1076489 1149314
39467 1149314 1242683 1309780 1327414 1311680 1302453 1311401 1293019 1208132 1108592 1096718 1191136 1299013
39455 1299013 1340158 1325941 1286041 1203687 1083757 1006511 1026725 1074523 1052761 994789 1017485
39444 1017485 1131224 1209643 1165931 1057877 978626 929912 862060 775430 712481 683277 659392
39433 659392 624119 581484 530252 472008 433021 435547 454333 443191 402504 377383 383306 378122
39421 378122 327602 261650 234213 250604 269058 262897 245655 232756 209716 154714 79030 30869
39409 30869 57813 161434 282883 344266 321922 271399 258759 277449 266788 206612 143861
39398 143861 113500 88870 45014 21385 66422 150516 194950 174002 132862 112884 115742 138771
39386 138771 185189 229352 226956 177190 130233 120243 135079 160775 202523 245193 248378 205634
39374 205634 158914 131088 98073 53333 36866 60773 69383 26873 -12376 15508 81951 115484
39362 115484 111281 110885 103892 41756 -57936 -108764 -69745 7523 61223 88213 114127 148785
39350 148785 190176 229351 240633 210585 181188 211494 286300 319812 269943 194567 166877
39339 166877 185591 205525 215568 242076 297835 364075 411269 416737 377540 321680 286726 273465
39327 273465 243820 178887 112504 88365 108165 143371 177266 212154 249055 280296 295240
39316 295240 285106 253534 224884 223405 240634 243975 220219 188794 173705 190335 254855 365142
39304 365142 467911 491265 426475 338391 281074 247134 216400 199955 202258 188641 136250
39293 136250 82523 78465 120368 165962 189079 180153 127961 50314 11894 53192 122699 139759
39281 139759 109615 111199 177656 259411 313211 356004 404024 422838 384021 328228 319080 354947
39269 354947 374375 344017 300188 294524 327960 356401 346127 302142 244956 184100 129336 109136
39257 109136 146007 213263 249229 227968 188288 174898 179950 170256 145730 131453 127096 107767
39245 107767 72249 49626 52198 57876 52204 59204 112486 210608 311483 361328 329988 235678
39233 235678 137893 89949 95320 120104 138615 146258 138770 112060 82152 71506 70253 45559
39221 45559 616 -12208 39833 116986 153438 138774 120201 129436 140076 109443 44694 6161
39209 6161 38797 110802 140332 90160 13146 -19643 -15271 -38321 -95780 -100799 14464 190221
39197 190221 295707 281384 223705 213721 250969 276050 273060 290597 361737 444598 466346 408097
39185 408097 320712 262213 244629 245770 247599 246743 244353 247640 273930 330341 387829 395347 331637
39172 331637 237221 186466 223132 318922 396750 404182 365032 345408 367622 381430 333174 237065
39160 237065 152369 112314 111883 149400 228518 313625 334812 266449 170245 129355 157648 201306
39148 201306 214929 203599 193771 196133 209438 238033 282842 320223 311590 245228 159446 109887
39136 109887 114321 142489 161857 175863 206269 252120 284411 278273 238956 198225 190061 221050
39124 221050 258992 264122 238894 227063 250063 268975 234756 156161 86983 61529 76645 122857
39112 122857 189551 243038 245823 208170 185015 210328 263211 304816 316160 291518 230333 152276
39100 152276 92338 65489 58843 66473 101846 163134 216336 231143 211876 180935 154274 141771
39088 141771 145720 150068 136796 116594 111295 104772 55205 -34373 -104933 -116022 -83443 -26656
39076 -26656 62695 171353 245740 266883 287848 343608 376685 318314 201126 117735 96988
39065 96988 95547 90269 100211 124911 134920 125592 118178 111136 93140 95471 156378 234579 241518
39052 241518 171974 117956 128672 143531 106165 63093 85752 154633 188934 152345 72241
39041 72241 -10095 -54347 -24374 62306 118934 86905 23695 26637 90420 119564 77794 38380
39029 38380 63332 109801 103431 50991 23197 53636 109095 151899 183945 218864 243861 232428
39017 232428 185982 145415 154666 215502 284294 316133 306014 280152 255184 223032 177320 136385
39005 136385 127014 152594 189151 211452 214052 204990 185901 145974 78485 924 -47819 -36880
38993 -36880 27593 103808 146636 142977 121490 128241 183732 255417 278215 216936 112031 49642
38981 49642 74545 141639 170094 141107 118586 166645 271870 366840 410638 416830 413596 412590
38969 412590 417067 424769 416756 379995 349350 381415 465247 508898 454550 363299 331084 355517
38957 355517 354948 299242 241880 222513 220559 225667 272351 360430 410804 365253 284235 274031
38945 274031 340801 388231 356827 299996 302921 372259 436590 435492 383210 346392 370429 435157
38933 435157 487251 505343 509254 506872 471806 394807 321529 302190 325677 342501 338548 344977
38921 344977 380158 419720 426696 384763 306374 234850 226450 292509 365556 364851 295274 238078
38909 238078 241263 268777 270816 251476 238207 229821 215472 213592 247835 302164 339638 354289
38897 354289 367676 382748 380109 358889 343007 339373 324438 286826 253053 248235 253768 233631
38885 233631 192272 174921 208044 266657 311376 334061 347337 348156 323899 291290 295450 356772
38873 356772 440513 493394 492892 448661 379643 312826 283677 304540 341572 354478 353227 381069
38861 381069 442447 487681 481207 449170 436741 444793 437599 400102 360277 354509 386401 424065
38849 424065 435547 427151 439731 496422 564252 590580 571127 548458 541610 521338 475386 456100
38837 456100 522263 654630 767643 794741 732198 614693 488704 405470 396434 442388 493598
38826 493598 528461 567655 625917 682728 718188 750570 809835 885457 928581 909986 858763
38815 858763 832806 855740 893301 896426 858854 817803 801288 800190 802795 827629 892460 969227
38803 969227 1008131 1000616 979364 955736 902372 812002 729352 695001 690420 674615 652108 664372
38791 664372 725169 802998 865124 904725 922936 917531 898549 887776 890491 888500 871374 854621
38779 854621 855938 872851 896603 929121 969784 1001966 1012830 1014877 1026915 1041020 1029635 982674
38767 982674 918270 856862 802846 754919 718804 703714 715289 752389 800017 828295 816270
38756 816270 779111 753081 748226 737311 703582 677266 700654 768472 830270 851608 848284 852291
38744 852291 864480 857983 819709 770550 741506 740853 752455 760957 767033 775550 781138 776184 764245
38731 764245 749505 719269 661157 599611 585460 633237 694062 714516 701710 699700 717997 723493
38719 723493 698919 666318 643306 614805 567402 521340 505180 521400 558918 617477 692219
38708 692219 750079 751952 694563 611540 542133 516503 554288 645722 740296 785498 777870 751629
38696 751629 723096 681305 633833 618127 648351 685907 689285 666702 650167 640842 617842 587395
38684 587395 579054 590867 579888 523504 457841 430396 436380 432296 403780 389889 434522 532626
38672 532626 632893 684206 675924 640979 621346 623875 614727 571088 531958 568952 696878 841698
38660 841698 921468 939512 965732 1036856 1115280 1151717 1148861 1139389 1128103 1091830 1032931 1001857
38648 1001857 1048900 1159376 1251018 1247189 1154026 1054013 1018067 1041866 1083471 1135524 1216803
38637 1216803 1304191 1333447 1284679 1214079 1171448 1137563 1087572 1066773 1132881 1247975 1306035
38626 1306035 1268613 1203423 1176793 1175971 1163610 1145598 1142289 1140596 1123617 1114493 1142504 1188838
38614 1188838 1211765 1208654 1209609 1223855 1237085 1251712 1282175 1313649 1314282 1292782 1294396 1326528
38602 1326528 1338403 1301901 1268562 1303979 1393124 1458065 1457799 1423473 1393953 1366176 1332128 1325084
38590 1325084 1383209 1476270 1513273 1440750 1308720 1216840 1208566 1241858 1256243 1238238 1213028
38579 1213028 1197603 1182712 1151707 1101759 1049608 1023820 1044631 1104092 1172143 1224820 1253888
38568 1253888 1246959 1184152 1073566 969403 925455 938169 960983 967873 973385 991170 1005120
38557 1005120 992301 951702 899481 853439 829663 835519 857141 872495 886109 930381 1019153
38546 1019153 1119548 1187441 1214499 1220313 1213306 1186664 1147418 1121268 1121528 1131055 1122920 1087979
38534 1087979 1038515 998334 995946 1051373 1150672 1237915 1255267 1203131 1147616 1151562 1205404 1247596
38522 1247596 1249194 1243969 1261908 1271713 1228005 1153008 1119926 1155383 1205323 1208925 1164950 1109645
38510 1109645 1071586 1071792 1124479 1200295 1226141 1170658 1105142 1125516 1226733 1310078 1312539 1272874
38498 1272874 1260510 1292343 1340094 1374138 1373553 1331123 1277506 1267763 1313604 1358319 1349302 1304381
38486 1304381 1269506 1243229 1195499 1140996 1131789 1178265 1236347 1284035 1352756 1456724 1542302
38475 1542302 1549900 1494334 1441374 1425112 1428648 1430609 1426554 1409453 1372326 1336432 1341267 1396390
38463 1396390 1471409 1540420 1604822 1661708 1685001 1660142 1610491 1565573 1527267 1493351 1489480
38452 1489480 1540274 1620788 1673292 1669374 1626693 1571202 1517386 1484253 1492692 1536506 1584158 1617893
38440 1617893 1646856 1678523 1707351 1736387 1775355 1808830 1805259 1772148 1760015 1788402 1810383
38429 1810383 1781649 1722465 1670976 1618276 1545968 1493018 1513756 1586094 1636494 1653801 1699856
38418 1699856 1792772 1859736 1844637 1796650 1797948 1850543 1894332 1906359 1918762 1949182 1971849
38407 1971849 1966498 1955247 1975941 2040796 2128927 2205180 2246208 2261749 2287888 2348549 2430562
38396 2430562 2505160 2557536 2581125 2566531 2524489 2500903 2530724 2584014 2597093 2559433 2532136
38385 2532136 2569681 2656402 2737800 2787667 2819880 2849615 2870263 2870753 2860816 2870152 2921025 3003675
38373 3003675 3085696 3148038 3200341 3253591 3294683 3307261 3305969 3324848 3375200 3438030 3496588
38362 3496588 3552291 3606489 3650212 3679187 3701586 3725026 3748454 3766718 3771067 3753776 3732324
38351 3732324 3757200 3863840 4020765 4158919 4251017 4325587 4404519 4474777 4532515 4605098 4705886
38340 4705886 4809659 4897691 4984605 5073624 5134159 5162525 5215236 5327996 5444347 5491743 5497323
38329 5497323 5551841 5675776 5803984 5902366 6013578 6167762 6330300 6477351 6652679 6894177
38319 6894177 7154811 7357277 7496909 7637180 7825745 8063830 8338912 8635464 8922229
38310 8922229 9176969 9422790 9701483 10015466 10334787 10653953 10994129 11349125 11683361
38301 11683361 11997739 12344727 12748272 13153162 13496875 13802950 14153907 14581983 15033475
38292 15033475 15446663 15826301 16223212 16665551 17133124 17587857 18006129 18377013 18682883
38283 18682883 18897535 19011553 19056676 19092526 19159773 19251075 19336643 19411885 19504080 19631947
38273 19631947 19778084 19914048 20041919 20194861 20398543 20646817 20921254 21226482 21596759
38264 21596759 22063720 22616122 23194803 23740462 24258170 24827781 25532289 26373859 27277637
38255 27277637 28182501 29105122 30100500 31185121 32332424 33533151 34818397 36213233
38247 36213233 37702599 39265938 40922822 42716983 44665298 46745994 48934517 51236375
38239 51236375 53691372 56360240 59297191 62515216 65983282 69677171 73629898 77915847
38231 77915847 82594735 87694370 93238127 99254422 105759360 112768879 120340342 128569915
38223 128569915 137534547 147266284 157794066 169166916 181407338 194482283 208360199
38216 208360199 223056576 238556955 254702930 271207279 287769794 304104149 319828404
38209 319828404 334390391 347148206 357507020 364975451 369164343 369820860 366891369 360543811
38201 360543811 351140484 339191494 325282841 309981162 293780403 277128248 260456503
38194 260456503 244135169 228404421 213388368 199169985 185820648 173369706 161795033
38187 161795033 151053982 141094305 131843156 123239026 115287880 108035849 101457475 95414541
38179 95414541 89765761 84485405 79627464 75195169 71103894 67274776 63710136 60447122
38171 60447122 57466172 54681687 52021958 49496069 47171468 45090919 43218549 41466208
38163 41466208 39763737 38099755 36508025 35032902 33702112 32506029 31395026 30318847
38155 30318847 29279436 28322663 27463634 26647587 25814167 24981548 24226870 23584298 22998954
38146 22998954 22393146 21749290 21106443 20491820 19883624 19247408 18593974 17981898 17453375
38137 17453375 16978900 16489028 15964023 15464190 15054140 14723098 14410177 14088279 13779965
38128 13779965 13496703 13213860 12923351 12669235 12496753 12385920 12268177 12104153 11921904
38119 11921904 11776920 11688429 11618231 11507501 11335132 11138825 10971660 10841019 10704739 10525393
38109 10525393 10305482 10065049 9815177 9571566 9363942 9196794 9017487 8767099 8465287
38100 8465287 8203549 8034856 7900157 7695968 7402866 7113988 6930283 6851873 6788727 6663913
38090 6663913 6483975 6310806 6189634 6115488 6049149 5943616 5767654 5535735 5319488 5199091
38080 5199091 5181360 5179273 5094535 4918975 4739231 4639204 4609819 4563981 4438513 4270564
38070 4270564 4160269 4157340 4204386 4207894 4145843 4072368 4024868 3975027 3889187 3793393 3738827
38059 3738827 3725840 3706088 3653834 3595049 3560177 3541321 3510504 3457565 3393063 3326276 3255742
38048 3255742 3178960 3104080 3049838 3029097 3028585 3014471 2968777 2910834 2867917 2835466 2788977 2728291
38036 2728291 2680793 2658454 2640516 2607411 2565941 2530327 2505226 2501731 2539213 2604907 2638172
38025 2638172 2592635 2499315 2426501 2383458 2314810 2203476 2125844 2159567 2263717 2308112 2227867
38014 2227867 2102280 2053998 2100533 2145368 2108032 2020964 1979850 2023230 2089625 2089866 1999925
38003 1999925 1876566 1796115 1789077 1828103 1864943 1872043 1854382 1833328 1825161 1829636 1831695 1816507
37991 1816507 1788330 1768332 1763434 1746258 1688347 1612393 1580334 1613333 1650862 1619926 1530551
37980 1530551 1466438 1481062 1537276 1561079 1526870 1469906 1434380 1434890 1461545 1496978 1521880 1520507
37968 1520507 1493889 1462869 1446876 1438311 1408590 1348352 1294212 1298428 1368949 1455699 1504335 1507423
37956 1507423 1490416 1467218 1435654 1405331 1395898 1404639 1406284 1396009 1405622 1458406 1528452 1569559
37944 1569559 1574128 1577733 1605964 1641150 1652792 1643615 1642414 1650779 1621577 1513489 1360083 1255716
37932 1255716 1262342 1351880 1452512 1523480 1558759 1547194 1479236 1387091 1328519 1321905 1339146
37921 1339146 1370984 1446064 1556551 1615756 1546470 1392955 1292074 1328825 1454179 1549291
37911 1549291 1540803 1444780 1324672 1228675 1163945 1115861 1077116 1049654 1029331 1011556 1010611 1044531
37899 1044531 1094784 1116024 1103265 1112307 1182606 1271865 1307892 1280760 1235873 1192394 1124955
37888 1124955 1027628 944879 924323 972592 1063276 1152093 1181348 1116428 996291 909692 900563
37877 900563 928242 936643 923731 917771 922937 925105 925722 932695 935136 922016 913113 937634 989370
37864 989370 1033650 1054622 1067367 1084123 1094754 1085486 1058459 1027547 1005474 996054 992606 986807
37852 986807 980303 976567 963501 929907 904177 938063 1029426 1100979 1095782 1060950 1083305 1164445
37840 1164445 1224280 1222056 1203947 1218025 1249194 1267878 1284408 1312671 1326872 1305543 1285393
37829 1285393 1316718 1384647 1427517 1423915 1411108 1418673 1431570 1425537 1397334 1350845 1293261 1257308
37817 1257308 1285566 1369895 1441551 1449773 1422337 1418364 1447012 1470107 1466683 1451825 1438615 1425499
37805 1425499 1425200 1463658 1534451 1588802 1592808 1568934 1559292 1572162 1590246 1608530 1629650 1637223
37793 1637223 1613830 1580591 1577615 1600776 1599679 1553081 1505188 1498771 1506769 1472735 1401211 1360483
37781 1360483 1393449 1464369 1505701 1488529 1432101 1369169 1323965 1309824 1325258 1354696 1386887
37770 1386887 1428864 1488049 1543280 1552524 1500002 1425347 1388430 1402325 1417571 1386285 1327541
37759 1327541 1301320 1320812 1330337 1288566 1234176 1227372 1251127 1226174 1120861 990413 895008
37748 895008 832801 781704 758984 792811 860626 901863 884924 832409 790497 796604 858020 932099
37736 932099 945812 870211 761071 691701 665754 640908 616969 633567 679366 675347 578304
37725 578304 449253 381941 398789 452625 503550 555442 625974 706536 752790 715322 596391
37714 596391 470954 418850 436199 453029 437057 423243 430022 417500 365358 326137 346548
37703 346548 389486 395610 376204 378008 397801 407673 429318 496354 565726 559538 487457 437077
37691 437077 443304 459460 463458 492563 551412 585157 579175 589947 633017 637876 574438 530208
37679 530208 582055 671956 701311 680294 681472 699415 670614 602545 568970 585370 592456 565725
37667 565725 546470 555790 567107 575194 603537 627618 585174 492596 457853 529893 618557 626320
37655 626320 590058 617075 728522 845879 909602 938402 972049 1011430 1029018 1009174 966800
37644 966800 933854 924590 917400 890635 869441 897406 959256 983857 941586 884174 858641 836931
37632 836931 772828 677725 589045 510150 440927 424491 490063 579061 606989 582072 582432 624931
37620 624931 645835 620016 607083 646302 686891 672391 628729 609521 605772 578165 544070 556852
37608 556852 608465 622236 553796 446367 367521 332986 316918 304977 306195 329086 374423
37597 374423 445419 541466 641162 709619 727370 701041 644964 568476 488096 433995 424338 438909
37585 438909 438562 413277 393535 407386 441878 458754 437699 391373 345770 321171 329478 372250
37573 372250 431762 471632 460419 402724 342579 323183 339585 345815 317868 288989 299148 328712
37561 328712 323480 281265 263693 306433 364426 378004 357299 360195 408876 469467 502832 499955
37549 499955 475836 461217 492054 573898 662099 708073 718510 737091 776064 804089 799154 774171
37537 774171 746833 720529 699849 689339 671348 621527 553299 508208 491676 459655 386789
37526 386789 307776 266451 259856 262767 275736 311475 355291 378902 384776 402362 440515 470090
37514 470090 459350 411452 360898 336559 329022 301195 241575 194593 210030 268178 295941 263689
37502 263689 218507 200412 177077 104405 11049 -35467 -24952 -5918 2240 36392 117712 207339
37490 207339 260896 288391 327026 378308 405960 388264 346269 318366 322020 343644 357538 350478
37478 350478 329946 312595 310095 326576 359743 395827 410565 387509 334329 273950 224188 193892
37466 193892 190480 215259 252213 275414 271697 250161 230254 225720 235629 243847 232545 203921
37454 203921 181122 177711 175380 146757 94179 48955 34372 44826 60462 67920 67815 76592 119002
37441 119002 200036 282667 314482 285053 239067 220638 221685 204792 164871 138426 146998 160258
37429 160258 138151 93566 79895 115465 155822 158511 143764 159112 207899 257218 303665 374678
37417 374678 457571 485191 420188 307751 210751 134985 62192 17319 40199 108614 153824
37406 153824 151578 139618 138640 116317 53460 -5517 -6134 43844 91570 107420 102575 92992 80749
37393 80749 69315 69240 82442 98116 109895 124159 144537 157818 146365 113176 84174 79149
37381 79149 86634 77540 40085 -11282 -58018 -89213 -92023 -58563 -12430 1024 -29933 -64369
37369 -64369 -67469 -59070 -72533 -95364 -95077 -81962 -93048 -124160 -132559 -105324 -71471 -43668 -4385
37356 -4385 40651 54098 31350 16939 30346 30291 -11726 -53101 -40423 12157 52001 62323
37344 62323 59661 45659 13134 -18883 -25631 -19860 -31853 -60620 -87322 -119068 -168389 -202949
37332 -202949 -175221 -100994 -49058 -44184 -38256 4046 48033 50771 33426 46116 88121 110721
37320 110721 90362 57014 43783 39609 10258 -46619 -87253 -68012 3870 78456 118980 130372
37308 130372 127859 106398 65011 36513 52347 86714 80115 23336 -24240 -14919 26749 46897
37296 46897 34585 22047 34712 71042 117722 156244 163396 131241 81703 41111 10045 -18374
37284 -18374 -24425 16328 79203 102158 66965 30044 43725 78391 65953 3823 -37766 -17365
37272 -17365 21216 19992 -9231 -15101 8376 22955 22371 46241 104874 145583 125254 75869
37260 75869 60750 95263 147584 190439 209020 180484 97642 3808 -44879 -46891 -37423 -12614
37248 -12614 62824 164755 201173 131049 30742 -7679 5266 228 -28393 -20604 41724 103756
37236 103756 125859 135148 160518 171944 128614 52833 8046 17565 45464 53703 43072 33914
37224 33914 35678 46444 62197 73668 66405 35170 -9533 -56800 -108659 -169248 -227663 -262591
37212 -262591 -262577 -235857 -204135 -191806 -211414 -245462 -248377 -187265 -84741 -2506 26623 32431
37200 32431 59199 102368 119205 94484 62876 56926 59026 26397 -47276 -115348 -123051 -58110
37188 -58110 40914 115764 129262 88602 35543 10078 20812 50843 85476 122042 153694 162098
37176 162098 138554 100745 71258 45158 -786 -66349 -117759 -127238 -102450 -66539 -32107 -11029
37164 -11029 -21267 -52036 -46112 36471 147407 196113 169702 149861 193456 257440 279579 277459
37152 277459 307099 359199 366839 305559 223277 169239 147414 146154 161841 178620 169401 136134
37140 136134 115348 130188 167542 207629 237609 231707 168638 84271 52540 85360 102773 41192
37128 41192 -55131 -98265 -72944 -33663 -15135 -7225 -3713 -14880 -33270 -39341 -43098 -72336
37116 -72336 -116869 -133330 -113264 -97607 -108127 -110791 -71552 -10888 24612 15782 -28601 -95250
37104 -95250 -159462 -178013 -125918 -33084 43104 77002 84143 78949 53599 7578 -24765 1129
37092 1129 87616 182938 235688 255682 296650 369252 402973 330414 191500 101480 109941 144445
37080 144445 117584 41000 -8375 1289 33180 47997 36497 -8167 -91588 -179279 -208517 -164753
37068 -164753 -108621 -100483 -131120 -155915 -162797 -163329 -141449 -67832 36204 101868 96158 62359
37056 62359 56627 78969 95740 101290 116185 136744 129725 83489 31971 14367 33203 65163
37044 65163 93653 114322 124449 128350 145557 191212 246855 268934 234119 164420 98681 49235
37032 49235 1082 -50811 -85058 -83888 -59660 -28472 28623 138283 263991 311854 243217
37021 243217 146177 140371 225988 290258 266908 218983 233029 295223 330219 321518 321362 352887
37009 352887 370508 330442 251769 189216 179062 223190 292042 330206 293810 201681 122614
36998 122614 97940 107124 122239 152136 202158 234283 220424 209625 279642 424588 548599
36987 548599 582649 557045 538845 546618 560863 577947 605637 627100 618735 596347 598457 623957
36975 623957 631107 606171 587977 606055 637014 651686 668499 720323 795837 859634 911545 974373
36963 974373 1032488 1041571 1005665 985644 1009835 1031522 1011648 995692 1053862 1170614 1250796
36952 1250796 1231581 1142420 1050260 984959 932752 877208 828716 818348 862049 927454 954192
36941 954192 925268 898464 936074 1016971 1056315 1008535 913053 836784 809825 824486 857556
36930 857556 876371 855950 811571 790089 811425 842177 843772 821039 801910 793127 782740 767808
36918 767808 749119 708360 621246 495264 373800 298202 276315 287172 304289 311120 301059
36907 301059 270954 224036 182407 179777 220792 257697 238552 178056 143905 163091 181745 142825
36895 142825 68779 28470 41884 59886 34759 -24932 -75399 -86732 -60635 -16037 30511
36884 30511 72535 104557 109159 65710 -21599 -116058 -178139 -194966 -177151 -142947 -113376 -103302
36872 -103302 -102717 -82750 -34094 17109 45120 55901 65067 67109 51909 34232 37837 60616
36860 60616 80826 88706 88855 81705 66575 54335 55563 65596 77621 91649 90522 36522 -72342
36847 -72342 -168979 -188310 -156422 -157594 -220626 -292049 -321241 -313472 -286175 -229219 -137484 -43940
36835 -43940 9252 11051 -20207 -54685 -62732 -40459 -26539 -56288 -99222 -91569 -34435 3394
36823 3394 -4028 -877 42709 62604 6221 -59081 -33294 58596 95603 37872 -22238 -1501
36811 -1501 69655 120488 144435 174611 203646 192759 143239 104659 109590 136146 142881 117577
36799 117577 83844 75148 110033 181324 256836 291846 256071 166232 92267 108046 216788
36788 216788 337112 383730 353289 308137 288445 279579 266494 270619 306126 337693 324539 288546
36776 288546 293826 360151 437274 474919 481992 495282 518495 525448 510585 500348 511034 524290
36764 524290 516052 487616 452382 409688 352443 289379 237975 202129 178574 178986 218327 281628
36752 281628 332861 363691 402101 458834 497979 485432 438533 394815 353682 290012 212027
36741 212027 157116 129000 88307 22062 -21507 1866 63658 96143 77906 48170 41005 41639
36729 41639 17558 -32069 -73901 -77524 -46450 -17266 -29349 -88126 -158829 -205120 -229904 -263355
36717 -263355 -313313 -350289 -349033 -322107 -295466 -268971 -224994 -165704 -115218 -87843 -80171 -94612
36705 -94612 -140557 -203278 -242041 -238874 -225941 -240361 -269861 -271410 -232010 -180919 -146682 -130912
36693 -130912 -123223 -114267 -94273 -68219 -72825 -141222 -240914 -287740 -246109 -180167 -169463 -200646
36681 -200646 -191095 -111434 -32882 -37706 -120437 -204533 -235062 -224450 -213406 -216913 -220127 -210370
36669 -210370 -194665 -188000 -198298 -225049 -259797 -282648 -272570 -232382 -190508 -162628 -125453 -52654
36657 -52654 32330 71612 43494 -12055 -46639 -53989 -55264 -61471 -69709 -76725 -77670 -66380 -50087
36644 -50087 -46492 -55038 -53040 -33500 -21039 -32504 -48577 -46890 -37261 -38924 -49385 -64324 -100131
36631 -100131 -161341 -211630 -217266 -196421 -182879 -165966 -119422 -69564 -70745 -118956 -153041 -144146
36619 -144146 -122188 -107578 -83729 -54635 -62329 -116243 -164796 -173493 -175488 -202382 -220367 -191821
36607 -191821 -155023 -174212 -237550 -274636 -263009 -248182 -256263 -255145 -224427 -207132 -251791 -334895
36595 -334895 -382275 -357361 -296719 -258557 -262033 -287104 -314299 -341094 -361951 -359652 -332215 -308622
36583 -308622 -312198 -320119 -290311 -223632 -164269 -137101 -123622 -109301 -112562 -144883 -178534 -182673
36571 -182673 -163545 -141326 -113877 -74272 -41683 -42613 -77077 -127864 -183043 -226063 -231913 -204880
36559 -204880 -192265 -222838 -257933 -246695 -204483 -184534 -191208 -181862 -148348 -134788 -166492 -214265
36547 -214265 -242382 -247173 -236181 -212316 -192818 -203803 -239901 -263350 -254227 -227366 -194141 -151281
36535 -151281 -117155 -126973 -168165 -169531 -90439 15563 61783 24198 -54723 -127008 -166867 -162817
36523 -162817 -124631 -88056 -81361 -94643 -101225 -90300 -56347 16573 124218 215201 234765 186823
36511 186823 118595 54075 -18294 -96004 -143458 -135392 -92549 -61321 -71291 -114316 -151559 -145162
36499 -145162 -99485 -64154 -77317 -116572 -132370 -120022 -122787 -164143 -216075 -245211 -254121 -256366
36487 -256366 -241067 -193461 -135499 -114077 -147676 -204383 -237080 -228510 -198320 -175928 -174664 -189411
36475 -189411 -208589 -218965 -202561 -146907 -69749 -20436 -35528 -93557 -131810 -112544 -59183
36464 -59183 -23150 -29435 -61868 -87537 -82595 -43098 13291 56300 65662 49294 34006 37203
36452 37203 53719 71232 87597 103271 104218 70512 5878 -58012 -97172 -119992 -140783 -145750
36440 -145750 -114345 -65600 -43470 -49066 -29703 39332 97261 62895 -59650 -182085 -233697
36429 -233697 -221551 -185609 -137265 -67192 11460 58857 44961 -22946 -104656 -151977 -140403
36418 -140403 -88907 -42884 -27152 -20678 12655 73766 121221 113682 50407 -28240 -69142 -37941
36406 -37941 56194 154656 185024 127354 42141 8151 29389 31375 -37955 -135218 -178753 -155468
36394 -155468 -127675 -140710 -170938 -175515 -151850 -125612 -110171 -101045 -87004 -48070 30117 117174
36382 117174 143123 76071 -27166 -83790 -81087 -71173 -83082 -86814 -48750 16932 67777 81367
36370 81367 72234 72067 95446 118333 100615 40734 -11660 -17164 3381 9994 8259 28621 60336
36357 60336 61073 25669 -11528 -43825 -100757 -177435 -216746 -188805 -136459 -110598 -105788 -93086
36345 -93086 -72817 -55784 -31292 1874 5559 -47565 -116536 -133235 -87338 -26909 14462 47093
36333 47093 85707 120618 132422 107565 39841 -58506 -149697 -197581 -199637 -176308 -142168 -109324
36321 -109324 -100989 -128464 -164303 -169937 -142417 -104492 -60512 -181 59788 80637 55791 27456
36309 27456 39011 93246 160720 207429 214730 194363 180641 186696 180208 131520 69879 50071
36297 50071 74450 99666 116882 162947 239299 284795 262679 221158 222852 253651 251012 196963
36285 196963 133726 99658 92643 92300 83457 58522 23020 -3347 -10268 -11491 -15737 394 60339
36272 60339 140429 189065 187142 156293 113324 57406 4865 -9644 14137 26453 -7144 -53874
36260 -53874 -60300 -28927 -7792 -14191 -15585 5714 13427 -29816 -100518 -141272 -133920 -107375 -78479
36247 -78479 -29335 45539 110794 135365 136269 145525 155438 133788 80137 27563 -6193 -28920
36235 -28920 -34301 3688 80712 141900 135680 66101 -26244 -112970 -185032 -227244 -213111 -130552
36223 -130552 -9144 79565 66415 -44393 -156634 -171323 -97660 -36927 -52158 -104817 -137587
36212 -137587 -157935 -194339 -220096 -185929 -103532 -34584 -8565 -8035 -26243 -77448 -146169 -185060
36200 -185060 -178621 -160564 -152845 -136274 -103180 -91352 -131301 -193844 -225316 -211525 -176542 -139340
36188 -139340 -103966 -79040 -76450 -94821 -123360 -154903 -180372 -182222 -150742 -98043 -43458 2175
36176 2175 27353 16915 -21764 -49868 -40972 -18642 -21876 -46922 -58284 -49717 -52269 -75161 -79155
36163 -79155 -31372 40240 75267 51043 -836 -43025 -70935 -94903 -105824 -83345 -36606 -9334
36151 -9334 -23844 -36204 17755 129524 210444 198885 139481 115958 130617 108454 18725 -71209
36139 -71209 -87904 -44649 -987 29806 76593 135781 166699 166305 189234 268088 357253 390383
36127 390383 365976 341694 361660 420666 485252 516699 484781 399222 328895 351590 470507
36116 470507 604613 671176 656467 601965 553705 539748 564644 598335 590881 525281 441899
36105 441899 388507 364092 340705 324619 355993 447068 553404 615146 606471 542716 461411
36094 461411 399189 364587 328995 265064 195315 174958 217368 263866 246099 161683 71241
36083 71241 32095 49020 81816 88644 63703 35424 26336 26354 21718 34964 99423 194339 248502
36070 248502 224382 160481 108536 69116 23756 -7380 7159 45064 49669 12696 -13322 7441
36058 7441 50843 80959 96402 102976 78365 2761 -93821 -150336 -136864 -77329 -19335 -1145
36046 -1145 -34599 -90653 -107581 -47556 49760 101365 79282 41751 45348 62135 28620 -44408
36034 -44408 -75423 -36022 -6976 -67650 -175525 -219172 -169572 -106039 -87908 -76566 -20491
36023 -20491 44359 39582 -41496 -124524 -147185 -109786 -39485 39883 92673 77205 -7076 -108812
36011 -108812 -180880 -220384 -237261 -218817 -157448 -88533 -60220 -72532 -81200 -63763 -51486 -83752
35999 -83752 -150874 -199862 -192567 -146792 -115815 -130123 -168028 -191313 -199616 -225275 -272085 -292798
35987 -292798 -251651 -184204 -158028 -186120 -221023 -231964 -238942 -257616 -261692 -233242 -208394 -225695
35975 -225695 -258728 -257076 -236680 -261530 -333533 -372495 -330104 -258126 -222566 -209673 -175851 -142821
35963 -142821 -166019 -232367 -269372 -250877 -217995 -191508 -144710 -83712 -71875 -130374 -184976
35952 -184976 -170898 -134992 -164293 -251577 -306157 -277994 -200488 -118908 -45319 10596 28088
35941 28088 9840 -15668 -39970 -82717 -143182 -184110 -179154 -142408 -98093 -54515 -21734 -21876
35929 -21876 -62828 -124395 -181667 -220746 -229629 -204907 -172112 -164056 -171598 -154708 -112577 -96857
35917 -96857 -132866 -171276 -152678 -88478 -41314 -47479 -93203 -151704 -208856 -255373 -277676 -262081
35905 -262081 -206909 -137543 -99594 -111903 -134671 -122125 -99996 -135167 -223160 -275572 -247570
35894 -247570 -208174 -235799 -306390 -348451 -356459 -371817 -386697 -352322 -269742 -193940 -148188 -103200
35882 -103200 -45798 -5284 -2131 -23092 -51782 -74156 -57852 13582 86887 87961 32258 13491
35870 13491 64227 104765 66392 -5683 -24155 20801 70255 83952 62382 10290 -66304 -140123
35858 -140123 -182679 -195752 -194141 -174436 -130790 -83444 -60518 -65483 -86571 -118798 -152682 -165797
35846 -165797 -154484 -149737 -170026 -182661 -148151 -82112 -35389 -29927 -50854 -83318 -114938 -115334
35834 -115334 -59193 31324 101816 121192 96923 49710 6100 -26 39291 78867 64986 1486
35822 1486 -62024 -94064 -94896 -65709 -16344 8718 -28181 -92990 -115773 -91770 -82736 -113371
35810 -113371 -141025 -146795 -175500 -243516 -280951 -227098 -127829 -69233 -55248 -25308 31757 59877
35798 59877 28749 -24222 -57439 -76716 -105071 -141601 -170641 -184317 -181421 -165647 -154208 -166641
35786 -166641 -195508 -206321 -175494 -114900 -53387 -6490 30089 64663 90847 86864 44545 -1086
35774 -1086 3768 64810 124147 131611 100412 61882 2520 -100368 -205067 -236379 -189374 -138947
35762 -138947 -137095 -161967 -183701 -213644 -255526 -269716 -234932 -197765 -205673 -227486 -201820 -141308
35750 -141308 -123382 -181314 -261045 -293861 -267291 -213549 -165517 -139533 -135930 -142797 -151591 -167694
35738 -167694 -190677 -195779 -161672 -108578 -78825 -84489 -103787 -121496 -137124 -138515 -109375 -64983
35726 -64983 -39797 -36769 -32360 -34317 -79456 -159012 -205627 -187279 -162075 -195875 -267952 -309417
35714 -309417 -303004 -288108 -285166 -271295 -227763 -166756 -109955 -73993 -71860 -96229 -110716 -93105
35702 -93105 -76402 -106630 -169390 -204778 -190940 -162188 -141830 -112475 -68492 -45315 -67214 -104506
35690 -104506 -113532 -91916 -69018 -65384 -82575 -109399 -119848 -91038 -42012 -26070 -62736 -107685
35678 -107685 -117366 -113281 -145945 -216854 -275655 -284342 -251486 -210230 -189501 -198686 -217233 -210515
35666 -210515 -176525 -156623 -173523 -186935 -154988 -117384 -155962 -272700 -368310 -361743 -281618
35655 -281618 -211755 -187424 -181251 -162373 -128646 -92749 -69723 -72451 -93189 -96105 -57138 -10496
35643 -10496 -23963 -114600 -211724 -225974 -147519 -55914 -32558 -81528 -143132 -166678 -150922 -122334
35631 -122334 -99123 -82015 -62496 -32191 4016 22179 3309 -35669 -59358 -67699 -100299 -171040
35619 -171040 -233633 -242496 -218121 -212466 -232713 -246765 -248747 -262661 -281280 -258687 -179943 -92192
35607 -92192 -46256 -46397 -76820 -134681 -206733 -251382 -245161 -224067 -238574 -280814 -294241 -251474
35595 -251474 -189780 -164634 -189115 -224064 -217016 -152125 -69334 -28550 -50122 -102472 -150300 -189136
35583 -189136 -219691 -222234 -190595 -168336 -204503 -277266 -306850 -256191 -181927 -163525 -207984 -253355
35571 -253355 -253354 -226502 -217839 -238751 -263147 -269021 -257324 -230022 -180603 -123753 -106310 -153015 -214633
35558 -214633 -213154 -140637 -71042 -62746 -91569 -101758 -82938 -63459 -58921 -66182 -87452 -122835
35546 -122835 -153690 -166330 -177032 -202323 -224402 -222930 -219319 -242743 -270140 -256794 -218145 -217080
35534 -217080 -263455 -290361 -250819 -179359 -127113 -89870 -43801 -9901 -29102 -94342 -154295
35523 -154295 -175295 -164457 -142384 -127459 -138166 -174689 -200225 -174789 -113375 -82671 -128303
35512 -128303 -222168 -292631 -298781 -268391 -263626 -309125 -358916 -348049 -275356 -209443 -202005 -224905
35500 -224905 -218705 -178613 -153600 -171019 -203712 -215545 -203758 -184515 -165058 -146444 -133521 -126125
35488 -126125 -114699 -97461 -87917 -91289 -86226 -48830 9383 44226 22543 -45294 -116917 -153287
35476 -153287 -141409 -94005 -38417 -2593 2414 -7076 -3775 15383 20913 -9260 -53932 -76320
35464 -76320 -79845 -102505 -152957 -191723 -191710 -176732 -171342 -152785 -98017 -45685 -49523 -85716 -76770
35451 -76770 -11531 30367 -2295 -55712 -56700 -19965 -11188 -39374 -52188 -23946 14166 31864
35439 31864 32097 16253 -31773 -105370 -159644 -164924 -149888 -164348 -215509 -263974 -272541 -241717
35427 -241717 -204977 -200135 -234467 -267698 -242314 -143372 -18877 67255 90161 67295 28922
35416 28922 -341 -10853 -17874 -45911 -86511 -93985 -47077 8700 13495 -32287 -85215 -130246
35404 -130246 -179714 -210411 -172472 -78295 -15232 -31636 -66822 -45332 7173 9255 -46477 -87685
35392 -87685 -79035 -64418 -76929 -82581 -54289 -41500 -104952 -213994 -273042 -244026 -186976 -168965
35380 -168965 -180032 -166536 -117348 -78210 -84536 -112038 -109382 -65680 -26509 -42948 -118472 -209947
35368 -209947 -268059 -269714 -225621 -172095 -147067 -156853 -169887 -155680 -120760 -90444 -71182 -59837
35356 -59837 -76108 -140649 -219733 -242242 -191025 -133441 -134117 -179012 -221644 -262245 -325424 -385172
35344 -385172 -379058 -298400 -209025 -169744 -173303 -182365 -184518 -189969 -202105 -210962 -201316 -161966 -106213
35331 -106213 -79426 -113391 -173389 -192764 -166505 -159143 -200963 -235002 -207574 -158054 -157932 -199024
35319 -199024 -217161 -208435 -236916 -315494 -357028 -281539 -118267 38387 129979 147264 84710
35308 84710 -51314 -198553 -265369 -220491 -123138 -50394 -22035 -10407 3285 8494 -9796
35297 -9796 -47764 -85829 -105663 -104077 -94092 -90324 -92480 -88735 -75883 -66753 -72739 -86234 -86985 -63438
35283 -63438 -26388 -5096 -26653 -89390 -158943 -203680 -230451 -264519 -296700 -286324 -230590 -189561
35271 -189561 -205207 -227567 -176306 -61752 19563 17522 -9128 6272 32269 -11753 -133636
35260 -133636 -255063 -310068 -305388 -282043 -264351 -260514 -276823 -308741 -335253 -335833 -304472 -248493
35248 -248493 -190038 -163079 -182259 -214475 -210851 -171260 -144563 -154606 -162892 -129749 -82968 -87393
35236 -87393 -154922 -219020 -208242 -129349 -65857 -92823 -195368 -280553 -276884 -208096 -150881 -139156
35224 -139156 -148856 -166233 -210466 -271333 -286356 -225919 -157239 -164390 -228394 -249329 -182368 -92748
35212 -92748 -64776 -105011 -156211 -170915 -146165 -107466 -81683 -79390 -95031 -125964 -180390 -251570
35200 -251570 -301651 -302888 -284274 -297648 -341391 -363494 -343653 -319051 -311502 -285199 -213803 -142925
35188 -142925 -134073 -174934 -200595 -191424 -195838 -252009 -331211 -372709 -345584 -265366 -174761 -119784
35176 -119784 -123766 -168563 -209181 -213817 -185002 -146062 -121251 -127275 -165231 -213647 -239973 -224882
35164 -224882 -173465 -109423 -66062 -69655 -111831 -146184 -135476 -98263 -83789 -104439 -125925 -127754
35152 -127754 -132736 -156206 -163776 -118486 -49381 -27235 -72162 -126103 -131495 -105585 -111212 -172024
35140 -172024 -247558 -290084 -296946 -294498 -292402 -278786 -252859 -232450 -220632 -191713 -133617 -86907
35128 -86907 -107238 -188474 -256564 -254238 -204638 -167238 -152198 -115906 -38514 34325 46759 4062
35116 4062 -40847 -62160 -89132 -151320 -224216 -255123 -233042 -204266 -211921 -242419 -249518 -219935
35104 -219935 -192438 -209008 -263824 -311073 -315395 -283124 -244974 -219878 -204290 -191964 -189558 -204226
35092 -204226 -224217 -226166 -201950 -166786 -139505 -127127 -130577 -148833 -169658 -172249 -150956 -123390
35080 -123390 -105222 -94614 -94542 -124859 -184567 -223831 -194059 -116915 -61138 -52892 -55852 -46301 -53331
35067 -53331 -98130 -141735 -137296 -104954 -108373 -170388 -250568 -296908 -285155 -216936 -117322 -31977
35055 -31977 7982 19481 38565 64982 69570 48128 21874 -15267 -94569 -202679 -271097 -269271
35043 -269271 -259284 -309352 -388442 -404759 -330040 -224972 -145226 -84253 -23518 18119 20587 9992
35031 9992 27013 65591 81582 56534 18780 -2170 -12839 -34363 -63445 -73928 -53452 -25914
35019 -25914 -33246 -95778 -190084 -267517 -298993 -301656 -317411 -366659 -430388 -477401 -496945 -497207
35007 -497207 -482340 -446755 -391802 -333970 -289385 -257780 -230263 -210230 -216790 -260673 -317445 -333962
34995 -333962 -275115 -168959 -93595 -106128 -188975 -276255 -322101 -322316 -280331 -194009 -89632
34984 -89632 -28609 -45315 -100739 -133997 -141668 -161473 -188450 -166964 -80931 1845 9704 -45987
34972 -45987 -102847 -137311 -175098 -227096 -266625 -274954 -266941 -258668 -244250 -222266 -215712 -241502
34960 -241502 -279079 -293476 -278712 -257882 -248888 -250819 -259602 -275695 -293039 -295392 -269467 -215828
34948 -215828 -149251 -96627 -87185 -126848 -182715 -212263 -212115 -217980 -248772 -275880 -267985 -244551
34936 -244551 -250706 -286564 -300318 -260261 -198847 -164368 -156358 -140094 -110219 -103871 -148352 -223644
34924 -223644 -287459 -320473 -335884 -353480 -372904 -371960 -334092 -280345 -261075 -300374 -358461 -371683
34912 -371683 -325725 -265115 -232894 -231536 -248406 -284273 -336092 -377025 -379914 -348870 -310508 -286952
34900 -286952 -291814 -333592 -398987 -445203 -436350 -387816 -356595 -384237 -456084 -514377 -510139 -451878
34888 -451878 -402472 -410878 -449038 -444444 -376463 -300183 -263923 -253963 -248366 -268770 -326903 -367229
34876 -367229 -333539 -264731 -250225 -305950 -370400 -414526 -470480 -545062 -593816 -607559 -642934
34865 -642934 -727372 -804382 -817355 -783755 -742010 -691795 -638843 -627461 -659083 -646236 -537328
34854 -537328 -433179 -471356 -624415 -728837 -710444 -665278 -694843 -770628 -812265 -811065 -806853
34843 -806853 -801842 -770019 -720252 -688123 -679519 -668533 -641478 -606223 -565162 -510069 -443442 -386958
34831 -386958 -368970 -404336 -470709 -506422 -462826 -366507 -295828 -284541 -287782 -260328 -221419 -209366
34819 -209366 -214603 -202132 -169007 -134250 -98953 -64522 -66036 -131889 -224102 -272981 -262380 -228583
34807 -228583 -186563 -121691 -53422 -34424 -66819 -83866 -44326 12319 38995 52608 86014
34796 86014 117828 109629 79858 78055 104617 116270 99591 78263 51012 -13143 -106451 -168589
34784 -168589 -165130 -132540 -119311 -125173 -128214 -131691 -145523 -152496 -134515 -111176 -112601 -130079 -131345
34771 -131345 -110610 -85747 -59520 -24498 5707 15850 29812 77747 124183 91649 -28706
34760 -28706 -150463 -202938 -211560 -228936 -241644 -205614 -137920 -104233 -125598 -156225 -154203 -126489
34748 -126489 -100953 -94588 -111125 -133117 -119823 -54533 10252 5087 -57233 -91790 -63140 -34430
34736 -34430 -65571 -121704 -131096 -88670 -43877 -16547 10240 27181 -2875 -73496 -118429 -92568
34724 -92568 -30516 4225 1285 3037 37151 82258 101992 88781 62914 41325 22150 -528
34712 -528 -17037 -3355 58022 155843 243943 264530 197218 90712 25280 29388 52967 42107
34700 42107 14230 22202 62713 73654 24158 -45497 -88462 -106831 -119227 -118722 -96337 -69626
34688 -69626 -52113 -25226 24122 67501 72448 46931 11130 -38821 -94208 -101557 -31022 52176
34676 52176 58489 333 -29873 -1691 17957 -18627 -73339 -99337 -105607 -105226 -71839 61
34664 61 51255 31303 -31766 -87169 -134634 -181344 -181133 -101714 -16524 -32137 -134021 -198961
34652 -198961 -167747 -112017 -104425 -115465 -93765 -74200 -127654 -241172 -324332 -324597 -274968 -226466
34640 -226466 -187323 -142508 -90943 -39872 11965 62290 90118 73870 23511 -18147 -13362 29502
34628 29502 56594 22068 -53885 -96246 -60210 9427 31119 -8522 -40893 -15823 25436 10747
34616 10747 -55395 -91253 -43436 47331 99719 82046 29417 -10186 -23994 -34353 -66423 -117864
34604 -117864 -159198 -169339 -164956 -176388 -197391 -189251 -144113 -109728 -127448 -175037 -203403 -206075
34592 -206075 -212880 -232497 -247090 -255252 -271627 -283777 -258757 -201123 -157164 -147090 -138796 -107653
34580 -107653 -75450 -63469 -53039 -28813 -19641 -51265 -91129 -90847 -62102 -61168 -112053 -188564
34568 -188564 -255865 -282816 -232693 -104074 23542 50745 -22295 -92483 -84333 -28712 7340
34557 7340 7579 -13374 -60997 -136713 -198449 -203943 -175399 -167706 -182265 -164560 -87197 13017
34545 13017 88012 124144 122811 80849 17720 -11963 29058 109142 158481 144880 96244 56330
34533 56330 45465 61659 88147 90252 34574 -65224 -138689 -122981 -35287 40746 43447 -9950
34521 -9950 -58125 -66620 -51079 -43557 -53543 -61916 -46165 -11876 4036 -25232 -71563 -72473 -10227
34508 -10227 53490 48276 -16495 -68460 -70149 -58844 -80324 -121824 -135535 -104491 -57273 -29025
34496 -29025 -31259 -53698 -74946 -72095 -35454 23372 82863 124725 131528 89427 13382 -42291
34484 -42291 -28910 36190 78113 44957 -36659 -98710 -108174 -86570 -63066 -37032 2849 42408
34472 42408 46870 316 -74026 -134854 -154012 -127637 -73328 -24459 -11505 -32195 -47482 -23001
34460 -23001 30624 74578 91866 98142 106187 110727 117305 153009 222874 278011 261264 178032
34448 178032 91984 51587 49166 54432 54685 46919 20835 -21103 -43538 -10655 65228 135494
34436 135494 174514 196442 209325 193259 148632 129360 180798 260193 275140 208776 152001
34425 152001 182484 258863 285253 251446 242109 304680 373520 359848 275055 216036 242838 318457
34413 318457 376790 408195 446173 490107 489366 422128 355869 385467 515397 649249 712481
34402 712481 740714 808430 907272 957959 933404 901353 925640 981691 1004330 976283 926573
34391 926573 871302 804003 730795 671710 631006 600454 587109 603325 632447 641829 633012 641280
34379 641280 675222 694096 666351 620144 605561 624656 632241 602095 561714 551373 569184 575617
34367 575617 547411 509218 505081 550415 624862 703715 774075 819255 816287 766557 706999 666072
34355 666072 625594 558205 492161 496916 596067 729642 820734 854601 873156 913119 973625
34344 973625 1031415 1063292 1058087 1026312 998089 997646 1018961 1035735 1034746 1032089 1056425 1118169 1192248
34331 1192248 1234917 1229993 1215938 1245117 1312390 1355007 1340751 1322198 1366858 1458077 1516222
34320 1516222 1510425 1492568 1510856 1547865 1574001 1610940 1693006 1800294 1888986 1970931 2098844
34309 2098844 2269045 2401158 2439645 2428640 2451584 2528779 2611232 2655118 2665687 2676596 2716346
34298 2716346 2793525 2895580 3005118 3126258 3278294 3451717 3600761 3707608 3823258 4000300
34288 4000300 4207655 4369544 4481619 4625159 4855480 5135459 5401710 5641702 5872533
34279 5872533 6092559 6299205 6520177 6779818 7056029 7311049 7545081 7779801 8008570
34270 8008570 8208473 8389375 8583322 8785811 8948260 9034055 9052780 9039332 9026583 9033969
34260 9033969 9053115 9048258 8997342 8922119 8847574 8751228 8598932 8415437 8258026 8121238 7936586
34249 7936586 7684033 7435811 7253750 7100941 6903323 6654061 6401782 6166505 5926138
34240 5926138 5671526 5420431 5180358 4944334 4724985 4549454 4412118 4270277 4101290
34231 4101290 3933527 3802097 3696780 3576171 3421890 3258539 3122232 3024491 2950617 2882427
34221 2882427 2811486 2732479 2639287 2538025 2453064 2403592 2379837 2359576 2339476 2322774 2281003
34210 2281003 2169058 1992328 1821644 1716510 1663681 1620435 1586644 1588628 1609533 1590554 1508064
34199 1508064 1406410 1337636 1301193 1264183 1215413 1170532 1136071 1099917 1061312 1043476 1057169
34188 1057169 1066876 1023766 934665 864009 846329 829119 744398 617090 544322 565233 612693
34177 612693 615157 586948 578258 587222 577479 548385 527177 512048 483396 460217 484259 548703
34165 548703 599586 613410 618743 631273 624262 585093 550796 556853 588688 612755 622574 625283
34153 625283 613335 581468 547458 524726 494018 432668 356032 300324 276099 265655 256179 248777
34141 248777 241783 230887 222809 226407 230623 209783 152306 72357 -3765 -51602 -56101 -21717
34129 -21717 26876 67163 99959 136964 171069 174599 130877 58502 -229 -12639 21041 71713
34117 71713 105685 106130 76822 37370 20990 61398 159379 264466 312494 288703 239261 216325
34105 216325 226462 236181 210618 140605 47991 -27621 -59592 -56486 -43722 -27227 5979 55484
34093 55484 102075 134594 153983 150892 114980 71132 64244 94126 108847 83438 59408 76122
34081 76122 110062 125743 143730 198221 255110 241596 152802 67362 47533 73328 90422 82489
34069 82489 75130 94104 137226 174736 172638 126849 69779 31469 8781 -10113 -15010 2861
34057 2861 20897 17781 14374 36783 60707 48734 24573 41402 85160 88505 46340 31567
34045 31567 73023 105402 83321 61824 99728 152227 138829 69810 21931 18770 17186 -2698
34033 -2698 -12824 -1300 7224 1721 -1009 3177 2754 9731 49602 109940 152423 178072 221825
34020 221825 276536 288793 248213 214275 225444 245673 238985 232761 252694 251412 173717 57400
34008 57400 -7107 -1061 11918 -3327 -4310 50640 133598 184712 178310 127177 55441 -7841
33996 -7841 -36751 -36511 -42920 -72402 -93250 -69177 -12079 34873 51811 50385 35758 -6495 -78384
33983 -78384 -147380 -171320 -139978 -85687 -53000 -55797 -63351 -36093 21862 58649 33408 -32471
33971 -32471 -78056 -68500 -21177 25993 49637 45517 22984 3713 8196 32772 51927 49808
33959 49808 35510 21012 3037 -20210 -34263 -33253 -45084 -99499 -171922 -193452 -132317 -40245
33947 -40245 5945 -7038 -27599 -18854 -2444 -11696 -35394 -37827 -15002 5679 13413 20052 15506
33934 15506 -34058 -120611 -172526 -141300 -78482 -73404 -132584 -179793 -168772 -129401 -94030 -51291
33922 -51291 -4367 -5215 -74039 -135184 -101056 10803 111429 166819 212370 247562 203804 46896
33910 46896 -151867 -285157 -307712 -237102 -106342 37831 123888 102098 3526 -81999 -94495
33899 -94495 -57443 -45297 -104444 -199804 -242043 -186361 -99159 -91161 -179930 -264956 -258736 -192318
33887 -192318 -152096 -156484 -152994 -112244 -61038 -25555 2511 33334 54739 53953 34250 1666
33875 1666 -40475 -79543 -97492 -87752 -52591 4832 64780 88671 67588 52417 89146 140545
33863 140545 129165 49645 -26293 -56334 -66350 -71954 -43531 16824 41399 -6948 -68016 -72483
33851 -72483 -39644 -20141 4292 77527 160975 165645 85149 10805 9290 62286 135326 224992
33839 224992 312676 344886 299445 219747 152083 97871 54524 46705 78772 107710 106230 104479
33827 104479 122434 112298 31879 -64153 -80902 -10990 65659 98019 106141 108385 86592 46577
33815 46577 43099 102384 167779 166906 100962 26998 -22858 -60775 -95634 -111059 -97472 -76092
33803 -76092 -75234 -93524 -99560 -71696 -33367 -34106 -85316 -132740 -120388 -71456 -64345 -122231 -171691
33790 -171691 -136829 -40010 25842 4240 -77709 -151586 -162982 -97024 13215 102439 124667
33779 124667 92883 52808 28036 12956 3681 -300 -17704 -66307 -118368 -117749 -57239 -1954
33767 -1954 -11570 -66922 -101355 -85261 -49523 -34411 -43306 -49057 -28357 15118 53544 58625 25062
33754 25062 -30035 -86885 -132205 -151793 -132846 -82122 -29253 -2725 -8750 -34073 -56622 -53581
33742 -53581 -19337 17969 17409 -27695 -81695 -114313 -134945 -166218 -205009 -228142 -219927 -177441
33730 -177441 -106757 -31778 13470 23620 35019 77919 136217 179905 211168 239745 234804 155001
33718 155001 24209 -72277 -77381 -11918 68669 125189 133901 82163 -9702 -93255 -139401 -155160
33706 -155160 -143336 -87453 -730 53279 30491 -31063 -59815 -40909 -16304 -13256 -21437 -33542
33694 -33542 -58199 -87753 -98579 -95198 -113287 -161903 -201106 -201854 -194936 -225803 -281403 -299772
33682 -299772 -247104 -155351 -83684 -67200 -103134 -159542 -188296 -153823 -68282 12015 39961
33671 39961 22059 857 3366 21498 36297 41842 43433 48039 61175 81251 94835 91729 86829
33658 86829 107004 147972 166831 134967 78988 44912 36711 20796 -16083 -47822 -50253 -29067
33646 -29067 3900 54052 126282 202514 253797 264449 236011 181894 126995 97144 97810 114226
33634 114226 136771 168565 202115 211685 183356 135639 97888 85073 103450 158168 238749 316344
33622 316344 371579 408221 429760 429525 418312 427834 462334 480026 453304 414506 405514 416541
33610 416541 421024 436699 491215 553116 570138 564947 613428 721473 801556 793638 737952 697126
33598 697126 674456 652855 653999 701430 766482 806688 828545 862430 901585 916284 909444 911628
33586 911628 935494 974955 1031072 1097973 1143389 1147651 1142188 1161338 1177646 1144473 1088625 1090318
33574 1090318 1166645 1242345 1255193 1231656 1229454 1252035 1253025 1194396 1076865 940469 849087
33563 849087 839365 870231 862527 803994 765044 783882 793401 712894 568205 456380 415801 397885
33551 397885 357870 307035 268003 238475 219766 232202 273765 300093 276776 226078 192183
33540 192183 179144 153519 97404 29540 -24280 -57616 -76211 -81864 -71568 -45237 -9720 22137
33528 22137 37817 35320 25091 15932 1277 -31536 -76718 -105237 -95422 -65924 -63849 -110889
33516 -110889 -170911 -187595 -150982 -103976 -77427 -48471 12652 78808 90971 41599 -12414
33505 -12414 -30417 -36181 -59320 -70979 -25959 53295 90391 52672 -12313 -46105 -40048 -11834
33493 -11834 30913 72217 73013 19563 -38452 -46211 -24495 -39196 -94345 -114092 -46718 65333
33481 65333 147489 180766 187721 164849 83386 -49154 -172972 -230057 -210557 -147503 -91843
33470 -91843 -89590 -150086 -227767 -260606 -236103 -198052 -182553 -175599 -149258 -113625 -106016 -139542
33458 -139542 -185874 -207174 -190041 -149531 -112210 -96548 -102839 -119855 -139219 -157355 -166733 -160029
33446 -160029 -146352 -147500 -170089 -195206 -204461 -201405 -196160 -185139 -162508 -138188 -124647 -114968
33434 -114968 -94536 -68917 -60615 -81260 -123520 -174368 -217475 -230845 -208539 -181042 -183261 -200584
33422 -200584 -182782 -123180 -85084 -121561 -200099 -246463 -244030 -242084 -270032 -295790 -286036 -262125
33410 -262125 -261612 -273724 -254945 -195556 -129606 -82053 -47429 -27589 -47406 -109222 -164095 -161528
33398 -161528 -111304 -67420 -62240 -82360 -98619 -93156 -66465 -45461 -73580 -158870 -239329 -238831
33386 -238831 -156237 -59735 4973 50285 83720 71105 -4609 -96168 -146332 -156772 -165085 -184929
33374 -184929 -209324 -243518 -289580 -322619 -326215 -326311 -344263 -346934 -301199 -248932 -255244 -300799 -308293
33361 -308293 -270064 -258084 -295961 -316796 -280915 -244627 -261310 -294614 -291633 -269707 -258018 -219516
33349 -219516 -120469 -26508 -26260 -87601 -96633 -32090 7580 -32705 -78200 -44746 36728 74932
33337 74932 40705 -24707 -85390 -136801 -176592 -198742 -209308 -214253 -201227 -163650 -133582 -158146
33325 -158146 -240578 -325121 -345122 -279585 -168650 -81764 -62989 -99132 -145232 -177490 -204730
33314 -204730 -232261 -246356 -245109 -252878 -282146 -306241 -296798 -269072 -259940 -273687 -281972 -273082 -268850
33301 -268850 -285322 -300619 -277221 -208395 -132582 -99597 -121635 -160012 -167199 -139243 -113457 -116530
33289 -116530 -138015 -161599 -194270 -242969 -282170 -273112 -209792 -125942 -60406 -29417 -24760 -24418
33277 -24418 -13539 -7360 -39197 -109510 -165243 -155078 -90799 -24615 21278 64645 107846 117949
33265 117949 76450 13653 -29380 -50105 -72271 -99582 -106466 -72526 -9886 44741 56139 10517
33253 10517 -78159 -173723 -233946 -234576 -188098 -134214 -100217 -75842 -43868 -26162 -62995 -140469
33241 -140469 -183489 -148162 -81766 -51371 -48660 -19502 39261 80949 95816 120957 155275 140514
33229 140514 55165 -39091 -83429 -96574 -118600 -134052 -109104 -64451 -47445 -58332 -65613 -73295
33217 -73295 -107511 -148926 -147606 -106360 -84023 -105199 -127555 -116476 -94272 -88672 -84631 -61627
33205 -61627 -35093 -22488 -4866 36675 77949 91024 101607 153823 229012 255142 203515 129119
33193 129119 97456 107013 106401 62443 -12702 -84193 -119783 -103664 -50319 -2531 6185 -8622
33181 -8622 3110 65269 145123 195166 211330 228386 261144 276148 235227 152260 88167 91388
33169 91388 153461 220734 242419 212648 174268 175849 217367 248781 232733 191306 168383 162794
33157 162794 136608 84977 51342 59054 69699 37011 -28927 -82759 -104067 -102035 -81377 -45863
33145 -45863 -25091 -53209 -119032 -174466 -196028 -202039 -204683 -187285 -145033 -109552 -108846 -133711
33133 -133711 -167531 -216056 -275104 -300564 -257162 -179322 -133227 -124517 -96080 -23715 39298 36286
33121 36286 -17127 -63587 -78473 -78456 -80591 -93404 -132658 -200549 -252566 -230719 -140636 -57947
33109 -57947 -40553 -66187 -79222 -70610 -77980 -121616 -176420 -207497 -204649 -174679 -124115 -66470
33097 -66470 -33858 -58591 -134405 -204474 -204842 -130311 -48153 -29101 -69305 -105603 -108693 -122582
33085 -122582 -190209 -277660 -315667 -294615 -265812 -254817 -230663 -172431 -112088 -84463 -78933 -73780
33073 -73780 -79519 -107527 -128747 -113800 -92369 -116641 -173282 -188253 -126529 -38324 8405 225
33061 225 -32509 -58013 -53499 -11618 35082 28679 -42377 -113589 -123219 -96716 -107272 -166581 -207920
33048 -207920 -182536 -124938 -103318 -140298 -205031 -254409 -254772 -187062 -69154 32521 50422
33037 50422 -12231 -77036 -71385 -2582 60130 67616 38115 22532 38742 53154 24382 -47501
33025 -47501 -121833 -160315 -157087 -125458 -70722 7064 87287 129231 113846 73171 56545 68806
33013 68806 64683 12187 -60686 -100872 -96725 -85278 -98843 -129641 -150308 -147051 -123890 -91599
33001 -91599 -63724 -51182 -50066 -42968 -20006 8454 24191 18349 -4414 -27939 -31972 -13215
32989 -13215 3065 -6111 -21268 -2616 43360 59606 17923 -38446 -59050 -51016 -40445 -11763
32977 -11763 55405 118900 115439 58135 20190 22253 13024 -27022 -47551 -27341 -29212 -98379
32965 -98379 -172261 -164649 -93671 -48070 -56708 -73876 -80718 -116443 -198020 -279596 -314624 -306273
32953 -306273 -278477 -246592 -235243 -273809 -344962 -379699 -336170 -251560 -187284 -154224 -123847
32942 -123847 -85088 -52863 -37189 -36753 -50449 -66338 -51782 13060 95720 132955 95034 13216
32930 13216 -54431 -71592 -44262 -7731 8825 11331 26932 59425 78199 60813 23105 -9051
32918 -9051 -33249 -53550 -55754 -31906 -9460 -17152 -33766 -12945 43941 81756 64124 13921
32906 13921 -29563 -58175 -81553 -95795 -89725 -65781 -35674 -6602 16412 28274 34831 51031
32894 51031 76953 92876 92104 99360 134029 169269 158184 100310 52956 62634 103645 106228 41731
32881 41731 -41260 -74292 -46972 -9668 -5911 -28004 -45733 -52668 -64356 -88523 -120861 -157798
32869 -157798 -187791 -180920 -119897 -38918 2257 -12626 -45683 -70343 -108859 -182846 -259863 -285630
32857 -285630 -255128 -217495 -210989 -218751 -195559 -123907 -36564 12378 -1528 -49911 -83780 -87888
32845 -87888 -91720 -125190 -181045 -230290 -257513 -264077 -248051 -203319 -139632 -87270 -71868 -86212
32833 -86212 -92576 -60762 -7282 13491 -31139 -110194 -162451 -162571 -132242 -96830 -66307 -56852
32821 -56852 -86882 -137387 -156616 -127621 -96668 -107703 -141162 -150388 -129689 -107735 -96374 -88633
32809 -88633 -92537 -122870 -164467 -181895 -164671 -132321 -100200 -72598 -63559 -87919 -130436 -155493
32797 -155493 -150316 -133751 -125345 -130887 -150798 -175312 -183354 -177185 -198117 -263022 -305426 -243463
32785 -243463 -101544 6344 24426 12592 32326 53119 22783 -33089 -51677 -35862 -47041
32774 -47041 -110486 -186376 -229267 -227628 -187742 -124056 -68556 -50948 -62652 -69361 -61137 -61258 -83794
32761 -83794 -112271 -126981 -127749 -120515 -102446 -72077 -41438 -28487 -42107 -76188 -115379 -149813
32749 -149813 -184077 -219848 -230527 -180237 -81864 -6915 -9653 -63764 -108163 -135822 -190797 -282687
32737 -282687 -355470 -357088 -302067 -243507 -211622 -204546 -216585 -240548 -246606 -192894 -76138 40723
32725 40723 75436 10517 -81841 -113738 -72603 -18668 1292 2754 16478 31128 14207 -31927
32713 -31927 -70726 -80076 -70976 -62313 -63671 -81725 -119353 -164806 -197773 -207979 -199233 -181003 -163380
32700 -163380 -148922 -124300 -81191 -51150 -82073 -159005 -193568 -134760 -50430 -38570 -85450
32689 -85450 -86934 -5315 72477 52354 -52363 -150861 -173216 -114810 -24294 25402 -13881 -119581
32677 -119581 -219956 -269318 -276655 -262145 -229042 -188512 -168051 -176101 -191396 -198082 -197156 -181066
32665 -181066 -142004 -106425 -104609 -101579 -29499 93533 156035 99951 -110 -47949 -39183 -9811
32653 -9811 44759 119733 143035 68194 -24180 -22269 52633 82993 34086 -15219 -16772 -16690 -56578
$$ [...]
##END NTUPLES=NMR SPECTRUM
##END=
