##TITLE=31Pdec_DE-125H_oil
 D2O, 24 sc
 9.2.2026
##JCAMPDX= 6.0         $$ Bruker NMR JCAMP-DX V2.0
##DATA TYPE= NMR SPECTRUM
##DATA CLASS= NTUPLES
##ORIGIN= UXNMR, Bruker Analytische Messtechnik GmbH
##OWNER= root
$$ XWIN-NMR		Version 3.5
$$ Mon Feb  9 14:16:40 2026 Russian Standard Time (UT+4h)  she@DPX200
##.OBSERVE FREQUENCY= 81.013821
##.OBSERVE NUCLEUS= ^31P
##.ACQUISITION MODE= SIMULTANEOUS
##.ACQUISITION SCHEME= undefined
##.AVERAGES= 24
##.DIGITISER RES= 17
##SPECTROMETER/DATA SYSTEM= spect
##.PULSE SEQUENCE= zgpg30
##.SOLVENT NAME= D2O
##.SHIFT REFERENCE= (INTERNAL, D2O, 0, 198.062)
##AUDIT TRAIL= $$ (NUMBER, WHEN, WHO, WHERE, WHAT)
$$ ##TITLE= Audit trail, XWIN-NMR		Version 3.5
$$ ##JCAMPDX= 5.01
$$ ##ORIGIN= Bruker BioSpin GmbH
$$ ##OWNER= she
$$ F:/spectra/data/she/nmr/P31/2/pdata/1/auditp.txt
$$ ##AUDIT TRAIL=  $$ (NUMBER, WHEN, WHO, WHERE, WHAT)
(   1,<2026-02-09 14:15:15.09 +0400>,<she>,<DPX200>,
      <created by zg, POWCHK disabled, PULCHK disabled
       configuration hash MD5:
       00 E9 B6 7A A2 85 ED C7 34 08 36 98 17 FE 4E 26
       data hash MD5: 32K
       3C 6E B8 4E 74 2D 9B B0 90 D1 A9 E7 CC 10 D3 82>)
(   2,<2026-02-09 14:15:17.64 +0400>,<she>,<DPX200>,
      <Start of raw data processing
       efp BC_mod = 2 LB = 1.5 FT_mod = 6 PKNL = 1 PHC0 = 1341.028 PHC1 = 173.3009 SI = 64K 
       data hash MD5: 64K
       23 19 A9 55 B1 47 17 42 37 7C B4 9F A3 C6 2D 7F>)
(   3,<2026-02-09 14:15:42.82 +0400>,<she>,<DPX200>,
      <pk PHC0 = 0.6015088 PHC1 = 0 
       data hash MD5: 64K
       56 4A 69 EF 24 94 34 3B D5 49 C8 0A F1 E5 A8 48>)
(   4,<2026-02-09 14:16:07.23 +0400>,<she>,<DPX200>,
      <pk PHC0 = 1.8 PHC1 = 0 
       data hash MD5: 64K
       D6 56 37 57 D3 F3 BE E1 95 AF 76 AA 1A 02 2F EA>)
$$ ##END=
$$ 
$$ hash MD5
$$ 3C CC 3B 9C 89 E7 AE DE 4B AD 98 4B EC F3 F6 E7
##$RELAX= 
##$RELAX= 
##$RELAX= 
##$RELAX= 
##$RELAX= 
##$RELAX= 
##$RELAX= 
##$RELAX= 
$$ Bruker specific parameters
$$ --------------------------
##$DU= <F:/spectra>
##$EXPNO= 2
##$NAME= <P31>
##$PROCNO= 1
##$TYPE= <nmr>
##$USER= <she>
##$AMP= (0..31)
100 100 100 100 100 100 100 100 100 100 100 100 100 100 100 100 100 100 
100 100 100 100 100 100 100 100 100 100 100 100 100 100 
##$AQSEQ= 0
##$AQ_mod= 1
##$AUNM= <au_zg>
##$AUTOPOS= <>
##$BF1= 81.014009
##$BF2= 200.13
##$BF3= 200.13
##$BF4= 200.13
##$BF5= 200.13
##$BF6= 200.13
##$BF7= 200.13
##$BF8= 200.13
##$BYTORDA= 1
##$CFDGTYP= 0
##$CFRGTYP= 5
##$CHEMSTR= <none>
##$CNST= (0..31)
1 1 145 1 1 1 1 1 1 1 1 1 1 1 1 1 1 1 1 1 1 1 1 1 1 1 1 1 1 1 1 1 
##$CPDPRG= <waltz16>
##$CPDPRG1= <>
##$CPDPRG2= <waltz16>
##$CPDPRG3= <>
##$CPDPRG4= <mlev>
##$CPDPRG5= <mlev>
##$CPDPRG6= <mlev>
##$CPDPRG7= <mlev>
##$CPDPRG8= <mlev>
##$CPDPRGB= <>
##$CPDPRGT= <>
##$D= (0..31)
0 1 0 0 0 0 0 0 0 0.06 0 0.03 2e-05 3e-06 0 0 0.0002 0 0 0 0 0 0 0 0 0 
0 0 0 0 0 0 
##$DATE= 1770632114
##$DBL= (0..7)
120 120 120 11 120 120 24 19 
##$DBP= (0..7)
150 150 150 150 150 150 150 150 
##$DBP07= 0
##$DBPNAM0= <>
##$DBPNAM1= <>
$$ [...]
##$SUBNAM2= <"">
##$SUBNAM3= <"">
##$SUBNAM4= <"">
##$SUBNAM5= <"">
##$SUBNAM6= <"">
##$SUBNAM7= <"">
##$SUBNAM8= <"">
##$SUBNAM9= <"">
##$SW= 400.765351723535
##$SWIBOX= (0..15)
0 1 3 0 0 0 0 0 0 0 0 0 0 0 0 0 
##$SW_h= 32467.5324675325
##$TD= 32768
##$TD0= 1
##$TE= 0
##$TE2= 300
##$TE3= 300
##$TEG= 300
##$TL= (0..7)
0 120 53 12 22 120 120 120 
##$TP= (0..7)
150 150 150 150 150 150 150 150 
##$TP07= 0
##$TPNAME0= <>
##$TPNAME1= <>
##$TPNAME2= <>
##$TPNAME3= <>
##$TPNAME4= <>
##$TPNAME5= <>
##$TPNAME6= <>
##$TPNAME7= <>
##$TPOAL= (0..7)
0.5 0.5 0.5 0.5 0.5 0.5 0.5 0.5 
##$TPOFFS= (0..7)
0 0 0 0 0 0 0 0 
##$TUNHIN= 0
##$TUNHOUT= 0
##$TUNXOUT= 0
##$USERA1= <user>
##$USERA2= <user>
##$USERA3= <user>
##$USERA4= <user>
##$USERA5= <user>
##$V9= 5
##$VALIST= <valist>
##$VCLIST= <CCCCCCCCCCCCCCC>
##$VD= 0
##$VDLIST= <DDDDDDDDDDDDDDD>
##$VPLIST= <PPPPPPPPPPPPPPP>
##$VTLIST= <TTTTTTTTTTTTTTT>
##$WBST= 1024
##$WBSW= 4
##$XGAIN= (0..3)
0 0 0 0 
##$XL= 0
##$YL= 0
##$YMAX_a= 3534
##$YMIN_a= -10309
##$ZGOPTNS= <>
##$ZL1= 120
##$ZL2= 120
##$ZL3= 120
##$ZL4= 120
##$ABSF1= 0
##$ABSF2= 0
##$ABSG= 0
##$ABSL= 0
##$ALPHA= 0
##$AQORDER= 0
##$ASSFAC= 0
##$ASSFACI= 0
##$ASSFACX= 0
##$ASSWID= 0
##$AUNMP= <proc_1d>
##$AZFE= 0.1
##$AZFW= 0.5
##$BCFW= 0
##$BC_mod= 2
##$BYTORDP= 0
##$COROFFS= 0
##$CY= -3
##$DATMOD= 1
##$DC= 0
##$DFILT= <>
##$DTYPP= 0
##$F1P= 0
##$F2P= 0
##$FCOR= 1
##$FTSIZE= 65536
##$FT_mod= 6
##$GAMMA= 0
##$GB= 0
##$INTBC= 1
##$INTSCL= 9.790993e-09
##$ISEN= 30
##$LB= 1.5
##$LEV0= 0
##$LPBIN= 0
##$MAXI= 10000
##$MC2= 0
##$MEAN= 0
##$ME_mod= 0
##$MI= 50
##$NCOEF= 0
##$NC_proc= -9
##$NLEV= 6
##$NOISF1= 182.463
##$NOISF2= 159.3651
##$NSP= 0
##$NTH_PI= 0
##$NZP= 0
##$OFFSET= 198.0616
##$PC= 4
##$PHC0= 1343.43
##$PHC1= 173.3009
##$PH_mod= 1
##$PKNL= yes
##$PPARMOD= 0
##$PSCAL= 0
##$PSIGN= 0
##$REVERSE= no
##$SF= 81.0140089999434
##$SI= 65536
##$SIGF1= 159.3651
##$SIGF2= -187.1042
##$SINO= 113.3802
##$SIOLD= 16384
##$SREGLST= <1H.CDCl3>
##$SSB= 0
##$STSI= 65536
##$STSR= 0
##$SW_p= 32467.5324675325
##$SYMM= 0
##$S_DEV= 0
##$TDeff= 32768
##$TDoff= 0
##$TI= <>
##$TILT= no
##$TM1= 0
##$TM2= 0
##$TOPLEV= 0
##$USERP1= <user>
##$USERP2= <user>
##$USERP3= <user>
##$USERP4= <user>
##$USERP5= <user>
##$WDW= 1
##$XDIM= 65536
##$YMAX_p= 326922549
##$YMIN_p= -116962370
$$ End of Bruker specific parameters
$$ ---------------------------------
##NTUPLES= NMR SPECTRUM
##VAR_NAME=  FREQUENCY,     SPECTRUM/REAL,   SPECTRUM/IMAG
##SYMBOL=    X,             R,               I
##VAR_TYPE=  INDEPENDENT,   DEPENDENT,       DEPENDENT
##VAR_FORM=  AFFN,          ASDF,            ASDF
##VAR_DIM=   65536,         65536,           65536
##UNITS=     HZ,            ARBITRARY UNITS, ARBITRARY UNITS
##FACTOR=    0.49542278885378, 1,            1
##FIRST=     16045.7642231865, 0,            0
##LAST=      -16421.768244346, 0,            0
##MIN=       -16421.768244346, -116962370,   0
##MAX=       16045.7642231865, 326922549,    0
$$ Real data points
##PAGE= N=1
##DATA TABLE= (X++(R..R)), XYDATA
$$ [...]
41146H495294o71116J134692N14042k585146m100791j820011J032924P76156q64602
41137A911442L17497L796397M601193Q60274l376471m227366l001739k734027
41129a852800k896773j051649K061627K979060P84827j460097j255856J25251
41121b566410K98151m74194q1398J981015L872198L930273K545231J321105J250180
41112A2076151J946342K130326P41011j990154m459090n029106l562417j436709
41104D16354j12815O6211k33026k90435j00666k33563q27533r28145M91501K754550
41094A002433L713408K293547k29379k259128l811221n002873m205077l74866
41086h873156L583534L246546j129130m292844l144326p08643p45942j792021
$$ plain form
41146 8495294 7824178 8958870 9472912 6887766 2786975 966964 1999888 2776044 1911442
41137 1911442 2228939 6025336 10626529 11486803 8110332 3882966 881227 -1852800
41129 -1852800 -4749573 -5801222 -3739595 -760535 24292 -1435805 -2691661 -2566410
41121 -2566410 -2268259 -2742453 -2823851 -842836 3029362 6959635 9504866 10825971 12076151
41112 12076151 14022493 16152819 16893830 14903676 10444586 5415480 1853063 416354
41104 416354 303539 369750 136724 -153711 -254377 -487940 -1315473 -2243618 -1752117 1002433
41094 1002433 4715841 7009388 6780009 4520881 709660 -4293213 -8498290 -8873156
41086 -8873156 -5289622 -2043076 -3172206 -7465050 -10609376 -11318019 -12063961 -13855982
41078a3855982k27339L106911L983772J666054J4245J094737J940456l42937l430795
41069f050878k646624K408918O736205N624978P1484m281772l532652M4040J256800
41060c69501p78377j610355J237085L739111J599530k290556k063519J341014
41052H04432J399732k932613m825170o18934L751141J884224l187531m078013
41044g802732j77403K616461J244544j421018k196040j241530P862O88899K45759
41035h035198p36294k00814K111329K856087J01347k163390N43579N167862M723408
41026D367916p91243l949884j133180K688375K549070L37848l77240o14726k522042
41017E54894m114730k513887N78900J379918j22045j022239m72308R4690K16230
$$ plain form
41078 -13855982 -14083321 -10976410 -6992638 -5326584 -5312339 -4217602 -2277146 -2620083 -6050878
41069 -6050878 -8697502 -6288584 447621 6072599 6144083 1862311 -1670341 -1626301 -369501
41060 -369501 -1147878 -2758233 -1521148 2217963 3817493 1526937 -536582 804432
41052 804432 2204164 -728449 -5553619 -6172553 -2421412 -537188 -3724719 -7802732
41044 -7802732 -7980135 -5363674 -4119130 -5540148 -7736188 -8977718 -8969856 -8280957 -8035198
41035 -8035198 -8771492 -8972306 -6860977 -4004890 -3903543 -6066933 -5523354 -355492 4367916
41026 4367916 3576673 -373211 -1506391 1181984 3731054 4068902 3691662 3076936 554894
41017 554894 -3559836 -6073723 -5494823 -4114905 -4236950 -5259189 -5731497 -5636807 -5420577
41008e420577K59516m92512k041783j562098K859647P564581O880674J031576
41000I079024l811082l713507j199833m03762j686054k673893j881066L82358
40992e907815K775770L439581J459709j431110k452929j615123j731890l841747
40984i305554n178166l226062M79018K692819K895201K964321L438098K736815
40976b503510J79870k330578k416888Q8800L129379M377087K915182j92113k466009
40967G81220j882212R09032K605516P10307k937926l658000J07841L985544K970103
40958C591425j616898l818593j731984k39150l016534o029074l333261L360401
40950a2833668O630899M085864R77918R49127N17659l591539o988040l473087
$$ plain form
41008 -5420577 -5161061 -5653573 -7695356 -9257454 -6397807 1166774 8047448 9079024
41000 9079024 5267942 1554435 354602 -49160 -1735214 -4409107 -6290173 -5907815
40992 -5907815 -3132045 307536 1767245 336135 -2116794 -3731917 -5463807 -9305554
40984 -9305554 -14483720 -17709782 -17230764 -14537945 -11642744 -8678423 -5240325 -2503510
40976 -2503510 -2323640 -4654218 -7071106 -6982306 -3852927 524160 3439342 3247229 781220
40967 781220 -1100992 -191960 2413556 3123863 185937 -3472063 -3364222 621322 3591425
40958 3591425 1974527 -1844066 -3576050 -3815200 -6831734 -12860808 -16194069 -12833668
40950 -12833668 -6202769 -2116905 -1138987 -189860 327799 -3263740 -10251780 -13724867
40942a3724867M421025P456140K181269m555308n220218p37142K836488K826135
40934d516478J201389j80751j089736n31855K719685O536192O176993M51624n614756
40925E152307o582286l128948k31861k57610j102536q95701q86723k168951k459969
40916a2562278Q84179N851895P069018K621649l077081m765141k674661j011509
40908g663929j306877p41767K315200M658623K777849j248399k114813J162196
40900b161917M000120L108475O69450j31145j40344j704432l754761l361400q48560
40891d324514O47286L65754Q57461L347858N606604N323419K677403j263212n627755
40882G610304q157935n951014J26757M604734L573945m08440k114674m32133J553903
$$ plain form
40942 -13724867 -9303842 -1847702 333567 -4221741 -9441959 -10179101 -7342613 -4516478
40934 -4516478 -3315089 -3495840 -4585576 -5117431 -2397746 4138446 10315439 10767063 5152307
40925 5152307 -1429979 -4558927 -4790788 -5048398 -6150934 -7046635 -7933358 -10102309 -12562278
40916 -12562278 -11678099 -5826204 1242814 3864463 787382 -3977759 -6652420 -7663929
40908 -7663929 -8970806 -9712573 -7397373 -2738750 39099 -1209300 -3324113 -2161917
40900 -2161917 1838203 4946678 5616128 5484983 5344639 3640207 -114554 -3475954 -4324514
40891 -4324514 -3677228 -3311474 -2454013 893845 6500449 11823868 14501271 13238059 7610304
40882 7610304 -547631 -6498645 -6371888 -1767154 1806791 1398351 -716323 -1148456 405447
40873D05447J798733J217989P58747k05646j828305k489218q38858J973681L166872
40864C959442J244993k247209m008045k339942R31317K639496K086843J285300
40856C552195J541709J879676J307052L15749q24181k784570m809450m301607
40848d123427q37897J964180J233438q35871n96778J240365J299276m02478n21338
40839a580530J795408L433988K261135r5992j368438j418497q74775J46384Q15462
40830C114145l04049k669576l591634j881885M59631J365454J348014J675858
40822d84042J987765J455694P17107Q32884J405860J353784P79826O16095Q67875
40813I532848M99218r66985k606509l130227k460563j841544k046503j983882
$$ plain form
40873 405447 2204180 3422169 4180916 3975270 2146965 -342253 -1181111 792570 3959442
40864 3959442 5204435 2957226 -1050819 -3390761 -2459444 180052 2266895 3552195
40856 3552195 5093904 6973580 8280632 8596381 7772200 4987630 178180 -4123427
40848 -4123427 -4961324 -2997144 -1763706 -2599577 -3196355 -1955990 -656714 -1059192 -1580530
40839 -1580530 214878 3648866 5910001 5814009 4445571 3027074 2152299 2298683 3114145
40830 3114145 2810096 140520 -3451114 -5332999 -4873368 -3507914 -2159900 -484042
40822 -484042 1503723 2959417 3676524 4509408 5915268 7269052 8048878 8664973 9532848
40813 9532848 10032066 9065081 6458572 3328345 867782 -973762 -3020265 -5004147
40805e004147l02967J797706J474506j402446l349900k245257m02276k61341j2979
40796i709101K719304N364797L565922j489122m284400l195273k029179k910652
40788a1967704l175295p63754K414805M377713N566928N518797K044989l655321
40780C61158n987150k460265K106599K484382J16441n61253R47832K269159K805730
40771B082633K827638R45438k845661m436256r70359L487698L036152j233162
40763B894121l138259q24395J615968J480406N97038O68789P65667N43309J397070
40754E999714L074434L007192L56424k436863l054406j532087J022272K935789
40746I372469J613314l547349q139369o970458j448278J876711N86359r82844
$$ plain form
40805 -5004147 -5307114 -3509408 -2034902 -3437348 -6787248 -9032505 -9434781 -9696122 -9709101
40796 -9709101 -6989797 -1625000 1940922 451800 -3832600 -7027873 -9057052 -11967704
40788 -11967704 -15142999 -15906753 -13491948 -9114235 -3547307 1971490 4016479 361158
40780 361158 -5625992 -8086257 -5979658 -3495276 -3378835 -3940088 -2992256 -723097 2082633
40771 2082633 4910271 5855709 3010048 -1426208 -2396567 1091131 4127283 2894121
40763 2894121 -244138 -1068533 547435 2027841 2624879 3293668 4059335 4602644 5999714
40754 5999714 9074148 12081340 12437764 10000901 6946495 5414408 6436680 9372469
40746 9372469 10985783 7438434 -700935 -7671393 -9119671 -7242960 -6656601 -7639445
40738g639445L83291J890095M21730j842214j293585J164379J872458k35034l121686
40729h400011m547307l215403O51747L889219K465513k675585n114454j243325
40721a8189606M298679N175014K113387M30870J366615J528660k02551j104915
40713d583847j97105M7627j170101j025735J630175L253665Q38646l016195l579899
40704g802769l60651L278108N304746O223791N725262K033118m303162q871608
40696A226835p770297k249615K726977L886800K182874M48963K16732J072554
40688A741823J760458J206070p26494k832422l468471k356568r69711p03608j247980
40679g596903j232454P0744K074253L277778K153692j283841m377468l767738
$$ plain form
40738 -7639445 -7256154 -5366059 -4944329 -6786543 -8080128 -6915749 -5043291 -5278325 -8400011
40729 -8400011 -12947318 -16162721 -15510974 -11621755 -9156242 -11831827 -16946281 -18189606
40721 -18189606 -13890927 -8715913 -6602526 -6171656 -4805041 -3276381 -3478932 -4583847
40713 -4583847 -4780952 -4733325 -5903426 -6929161 -5298986 -2045321 -1206675 -4222870 -7802769
40704 -7802769 -8163420 -4885312 419434 6643225 12368487 14401605 10098443 1226835
40696 1226835 -6543462 -8793077 -6066100 -2179300 3574 452537 669269 1741823
40688 1741823 3502281 4708351 3981857 1149435 -2319036 -4675604 -5645315 -6348923 -7596903
40679 -7596903 -8829357 -8758613 -6684360 -3406582 -1252890 -2536731 -6914199 -10681937
40671a0681937N48132M464805M420239J510040o81892j017811j207547k048205
40663d694176k106844n40783J087935Q56377j001091k492717k124085l81234P14255
40654a0682363k20116j934165j662376J207936M054304M638628L952502L779582
40646C133932L491600J772886l15545j079286j455438l064060m345503k658322
40638d519736O86126J890192P02417K71079J032505r022l045712l850769l33239
40629g176159L902696M761131K416231r70830m064463m971164j645754L861089
40621c887223O022982L266955J83241j80448o51682l086162l450709R02736M719970
40612C839660K343424k840130l900971j537191j379049k841893j66728O026613
$$ plain form
40671 -10681937 -10133805 -5669000 -1248761 261279 -420613 -1438424 -2645971 -4694176
40663 -4694176 -6801020 -7341803 -6253868 -5397491 -6398582 -8891299 -11015384 -11396618 -10682363
40654 -10682363 -10902479 -12836644 -14499020 -13291084 -9236780 -4598152 -645650 3133932
40646 3133932 6625532 8398418 8082873 7003587 5548149 2484089 -1861414 -4519736
40638 -4519736 -3833610 -1943418 -1241001 -969922 62583 53561 -2992151 -6842920 -7176159
40629 -7176159 -3273463 1487668 3903899 2933069 -1131394 -6102558 -7748312 -3887223
40621 -3887223 2135759 5402714 5585955 5405507 4753825 1667663 -1783046 -880310 3839660
40612 3839660 6183084 3342954 -558017 -2095208 -3474257 -6316150 -6482878 -456265
40604d56265P868400K622402k555037j390593K980231M091506J119686k307817
40596A1972513l975072l879405k348688n26037j68612p63216L28460L128260M003991
40587G772194J528752m78611J203167L758021K459375k272855n778989n505576
40579B685478k882624J09725K843543M673714M407622J730472k132157n237867
40571F197906n843236l340157P91655L699034L612837J069913k315634m997227
40563a124909n411251k775344J275254L564424K737705L97144j454754k352591
40555e144322k438212j694364p24468l58345o9351J114804K016619M52839k525899
40546i370699k802782J129972N630988O549647L734649l81803l715905m516378
$$ plain form
40604 -456265 7412135 10034537 7479500 6088907 9069138 13160644 14280330 11972513
40596 11972513 7997441 4118036 1769348 1243311 1074699 311483 639943 3768203 7772194
40587 7772194 9300946 8822335 10025502 13783523 16242898 13970043 8191054 2685478
40579 2685478 -197146 -87421 2756122 7429836 11837458 13567930 11435773 6197906
40571 6197906 354670 -2985487 -2193832 1505202 5118039 6187952 3872318 -1124909
40563 -1124909 -6536160 -9311504 -8036250 -4471826 -1734121 -1336977 -2791731 -5144322
40555 -5144322 -7582534 -9276898 -10001366 -10359711 -10429062 -9314258 -7297639 -6844800 -9370699
40546 -9370699 -12173481 -11043509 -5412521 1137126 4871775 4489972 774067 -3742311
40538c742311j628582L110356N522242M159063K026871J534781J094688r75997
40530A1101111k807987k378040j375407k187453l670029l284034r87773K010080
40522c579532N391807P421640M268589l944034r959275p640566o02422K973804
40514e669989J393450q97262j982599l250478l270889N31476M469747J991619
40506f684925m449869m518588M071860J0358908O029274k280615l818052M84663
40498h07344K103050l19061o51997K384211K863193j493474m953504l044659Q20924
40489c098661J662440L54300M33673J559405R42329j026481j177524J164260L064670
40480C878411K292945r4761k011082k921335l280951l051034j986263n61238M17909
$$ plain form
40538 -3742311 -5370893 -2260537 3261705 7420768 9447639 10982420 12077108 11101111
40530 11101111 8293124 5915084 4539677 2352224 -1317805 -4601839 -5589612 -3579532
40522 -3579532 1812275 9233915 13502504 9558470 -400805 -8041371 -8643793 -5669989
40514 -5669989 -4276539 -5173801 -7156400 -10406878 -13677767 -13146291 -8676544 -6684925
40506 -6684925 -11134794 -15653382 -11581522 -1222614 4806660 2526045 -1292007 -807344
40498 -807344 1295706 976645 324648 2708859 5572052 4078578 -874926 -3919585 -3098661
40489 -3098661 -1436221 -1081921 -648248 911157 1853486 827005 -350519 813741 3878411
40480 3878411 6171356 6076595 4065513 1144178 -2136773 -5187807 -7174070 -7735308 -7317399
40471g317399P62901P85054N99126K62775K92075J082531J846000J239660n88338
40462a035615j758049j237329m54752r72270j583575J53020L802427N920419M585726
40453G420002J752694q3014j338977l465703n335847m353239p25925K062107J561630
40444b506272r02075k559742k498394j530601k58128J132284J931334J426959
40436e764635J94476n14000o71994j344595k367177j803463J206065M352978M602267
40427b110078K135792O4570L10294J653368K247813K086141J869595J137843p27805
40418H667533k616314k682701r92558L31450k91683k167995l285474k410684l72983
40409e821409N02696j073059l229992k785935K18083J964537L10087j660989k62083
$$ plain form
40471 -7317399 -6554498 -5769444 -5170318 -4907543 -4615468 -3532937 -1686937 -447277 -1035615
40462 -1035615 -2793664 -4030993 -4485745 -5458015 -7041590 -6888570 -3086143 2834276 7420002
40453 7420002 9172696 9089682 7750705 4285002 -1050845 -5404084 -6130009 -4067902 -2506272
40444 -2506272 -3408347 -5968089 -8466483 -9997084 -10255212 -9122928 -7191594 -5764635
40436 -5764635 -5570159 -6084159 -6756153 -8100748 -10467925 -12271388 -11065323 -6712345 -2110078
40427 -2110078 25714 90284 400578 2053946 4301759 6387900 8257495 9395338 8667533
40418 8667533 6051219 3368518 2375960 2707410 2415727 247732 -3037742 -5448426 -5821409
40409 -5821409 -5318713 -6391772 -9621764 -12407699 -12189616 -10225079 -9914992 -11575981 -11838064
40400a1838064K723527K555549r13029k837503q88091J483415R29755p73765k81634
40391i839840J985126L330641L396295L782050M218269K513316j639679n325435
40383B420743n524711k300777J418723K619321R61206q88597k49329K226759L415219
40374D098557J994476J6901k94067P52752J638759J501033k34731l549154n952258
40365b7732l955523J602039M834180K175068k481192l397640r39179L84693m50444
40356b255730n22711R16816J309233L331l96885J055437J787966K40799j599321
40347E38935j931160j991118l192158m264399l339509q09232J505559K350103
40339a1132979J379389n06487q32169J865152M940718M496187J679131J743425
$$ plain form
40400 -11838064 -9114537 -6558988 -7472017 -10309520 -11197611 -9714196 -8784441 -9558206 -9839840
40391 -9839840 -7854714 -4524073 -1127778 2654272 6872541 9385857 7746178 2420743
40383 2420743 -3103968 -5404745 -3986022 -1366701 -405495 -1294092 -1543421 683338 4098557
40374 4098557 6093033 6109934 5815867 6568619 8207378 9708411 9473680 5924526 -27732
40365 -27732 -3983255 -2381216 2452964 4628032 2146840 -1250800 -2189979 -1805286 -2255730
40356 -2255730 -2778441 -1861625 -552392 -549061 -945946 109491 1897457 2138256 538935
40347 538935 -1392225 -3383343 -6575501 -10839900 -14179409 -14988641 -13483082 -11132979
40339 -11132979 -9753590 -10260077 -11092246 -9227094 -4286376 209811 1888942 3632367
40331C632367N536687P077480K634557k686822k206996K102684K578360k643565
40323A6024752p216335o050103j920057n98982k995373m913519l050017J181128
40315i538506L830002L113454J007371R7172J14484q20146k326886j913397P38176
40306e698276K752443K466268J687816J828351J141049j555111l556513k152176
40298c086149O82944J265436j40639o46438o1275n42242j914017j725621K76333
40289e891668J637301J143127p3573j070191j547471n24398J978741L015150M74232
40280h58750k462506j435981J594537Q33705l601433n048748o08391M453384M935122
40271b199061K288685k8435k066662m434554m912327k424684k38213q07789j204329
$$ plain form
40331 3632367 9169054 16246534 18881091 16194269 13987273 16089957 18668317 16024752
40323 16024752 8808417 2758314 838257 239275 -2756098 -7669617 -10719634 -9538506
40315 -9538506 -5708504 -2595050 -1587679 -1490507 -1376023 -2196169 -4523055 -6436452 -5698276
40306 -5698276 -2945833 -479565 1208251 3036602 4177651 2622540 -933973 -3086149
40298 -3086149 -2403205 -1137769 -1278408 -1924846 -1986121 -2528363 -4442380 -6168001 -5891668
40289 -5891668 -4254367 -3111240 -3184813 -4255004 -5802475 -6326873 -4348132 -1332982 -858750
40280 -858750 -3321256 -4757237 -3162700 -2328995 -5930428 -10979176 -11587567 -7134183 -2199061
40271 -2199061 89624 61189 -2005473 -6440027 -11352354 -13777038 -14015251 -14823040 -16027369
40262a6027369J736972N128469L972133j012888m378083l246213M15913L428006
40254i983060L905272J732731o03021K23609L311172L492188p10772l494954n12240
40245b639075L527427K085039k535675l326408l41386M02142j689245r35799L540724
40236a912256N169929Q25181l877213l767847j433125j033040j142583J060762
40228f110192L450129K364560j009704k747125k275264j914132k160164j427041
40220a1828933O75086K950144M514365M815060L148754J24333k041042k398618
40212d0851k476418l119722k738457o09680R47424J80774r63551q5179J671723
40203g233937J786436N12168j3587Q43178K175739L177348K737234l80704m700151
$$ plain form
40262 -16027369 -14290397 -9161928 -5189795 -6202683 -10580766 -13826979 -13411066 -9983060
40254 -9983060 -6077788 -4345057 -4948078 -4724469 -1413297 2078891 1368119 -2126835 -2639075
40245 -2639075 888352 2973391 437716 -2888692 -3230078 -2827936 -4517181 -5452980 -1912256
40236 -1912256 3257673 4082854 205641 -3562206 -4995331 -6028371 -7170954 -6110192
40228 -6110192 -2660063 -295503 -1305207 -4052332 -6327596 -8241728 -10401892 -11828933
40220 -11828933 -11153847 -8203703 -3689338 1125722 4274476 4398809 2357767 -40851
40212 -40851 -2517269 -5636991 -8375448 -8985128 -8037704 -7856930 -8820481 -8905660 -7233937
40203 -7233937 -5447501 -4935333 -4948920 -4105742 -1930003 1247345 3984579 3603875 -1096276
40194a096276n924645k334510K217642L494661K325513J723892J567588K25942
40186B199807j002282K77379K868559L520481J933935J88727j399446l518618
40178E068542m340290j646319K232850K521270j059222m013290l778421k222293
40170g237173j252468n19025j29399j234587k870585k202217R64731L480404L492880
40161g507439K311324J171147J9417m3792K401004M910939K720693l760075p719588
40152e496370m729600J437928M571475L700308J852225O64459q8542k15909J18278
40143A814252o63430k871457l877280k009714Q3351p53846k904279k138226K074839
40134a1245790N840647N900145K562370j921485n229028n545581k854615K47385
$$ plain form
40194 -1096276 -7020921 -9355431 -7137789 -3643128 -1317615 406277 1973865 2199807
40186 2199807 1197525 1474904 4343463 7863944 9797879 9986606 8587160 5068542
40178 5068542 728252 -918067 1314783 3836053 2776831 -1236459 -5014880 -7237173
40170 -7237173 -8489641 -9008666 -9138065 -10372652 -13243237 -15445454 -14480723 -11000319 -7507439
40161 -7507439 -5196115 -4024968 -4005551 -4049343 -1648339 3262600 5983293 2223218 -5496370
40152 -5496370 -10225970 -8788042 -4216567 -516259 1335966 2000425 1911883 1695974 1814252
40143 1814252 1150822 -1720635 -5597915 -7607629 -7524278 -8278124 -11182403 -13320629 -11245790
40134 -11245790 -5405143 495002 3057372 1135887 -4093141 -9638722 -12493337 -12245952
40126a2245952J025362n2226q2345K261260N021193N308820K266940k214870n015081
40117c726899m464139k120181j120590k250184k827530k95263M332100P584969
40109d887717P015846K820200k635067o017946n261994j747452Q70165P30622
40101i113343o46709j163156m91207R24921K713422L449967J431506k052477l114455
40092h061531o89113J502309O49290p25841Q72171M038070M739037K316534o31090
40083D009836k625561l699649l007241k37982J771416K40959k529756j954674
40075h032652J422001K397991m53094k117342J090883N672308N992999J980697
40067G953791j728536k441199j731181j685252j863482q50570R13334J417030
$$ plain form
40126 -12245952 -11220590 -11272816 -11355161 -9093901 -4072708 1236112 3503052 1288182 -3726899
40117 -3726899 -8191038 -10311219 -11431809 -13681993 -16509523 -16804786 -12472686 -4887717
40109 -4887717 2128129 4948329 2313262 -3704684 -8966678 -10714130 -9843965 -9113343
40101 -9113343 -9760052 -10923208 -11414415 -10489494 -7776072 -4326105 -2894599 -4947076 -8061531
40092 -8061531 -8750644 -7248335 -6599045 -7324886 -6452715 -2414645 2324392 4640926 4009836
40083 4009836 1384275 -2315374 -5322615 -5560597 -3789181 -3548222 -6077978 -8032652
40075 -8032652 -6610651 -4212660 -4665754 -6783096 -5692213 -19905 5973094 7953791
40067 7953791 6225255 3784056 2052875 367623 -1495859 -2346429 -1433095 -16065
40059a6065N0801j128965k76341J017424k99369l501443m019036q6760L848407
40050d411347L217848m5010q86536J063765J901692M95866k67899N48462R3232
40041A710073k721708m605215l119895n78272j5794n34486L30495K090404K294581
40032e149817N19158j346098j885951j189029J17234J275465J609775J425752
40024d623511J672710J954857N41176k560601m489331l170935m02365O83122r9134
40015a0494012m32432O39916J648881J411340Q15710J284142K590740L052245
40007E16530J774138K11010P47686L377243M912794K887463o94242j736056K07507
39998A2204073J414309l51777k805939l192118k380618k455643k545145m20275
$$ plain form
40059 -16065 34736 -1094229 -1370570 -353146 -652515 -4153958 -8172994 -8259754 -4411347
40050 -4411347 -1193499 -1238509 -2125045 -1061280 840412 1336278 1068379 1616841 1710073
40041 1710073 -1011635 -5616850 -8736745 -9315017 -9330811 -9865297 -9534802 -7444398 -5149817
40032 -5149817 -4630659 -5976757 -7862708 -9051737 -8934503 -7659038 -6049263 -4623511
40024 -4623511 -2950801 -995944 -454768 -3015369 -7504700 -10675635 -11078000 -10394878 -10494012
40015 -10494012 -10926444 -10286528 -8637647 -7226307 -6410597 -5126455 -2535715 516530
40007 516530 2290668 2501678 3249364 6626607 11539401 14426864 13732622 11996566 12204073
39998 12204073 13618382 13266605 10460666 7268548 4887930 2432287 -112858 -533133
39990e33133K750155K776847j824692p037226p678399l297475J616249K975748
39982a0251926J423253O51302K069053K893460N09793k882660k522260K184327
39974e925658O026212M424652n53900k789396J04105L824400K792329k835461
39966E067283p040985n066525O52655L364041M81186l365383k851460J127461
39958g631727L571981K420471J03137r32699o67740K88142J504549J543733p66459
39949e66612l456973k990149P25180L943414M175334K463988K24891k366395m006023
39940a853345k471448J162658K437380l21770l338274k975456m41177J284234
39932f517198J581678Q63288j146092l150623k181718J310359K404587q06636
$$ plain form
39990 -533133 2217022 4993869 3169177 -3868049 -11546448 -14843923 -13227674 -10251926
39982 -10251926 -8828673 -8177371 -6108318 -3214858 -2705065 -5587725 -8109985 -5925658
39974 -5925658 100554 4525206 3971306 1181910 1286015 5110415 7902744 5067283
39966 5067283 -1973702 -7040227 -6387572 -3023531 -2542345 -5907728 -8759188 -7631727
39958 -7631727 -4059746 -1639275 -1536138 -2468837 -3136577 -2848435 -1343886 199847 -566612
39949 -566612 -4023585 -7013734 -6288554 -2345140 1830194 4294182 4519073 2152678 -1853345
39940 -1853345 -4324793 -3162135 -724755 -1046525 -4384799 -7360255 -7801432 -6517198
39932 -6517198 -4935520 -4072232 -5218324 -8368947 -10550665 -9240306 -6835719 -7642355
39924g642355l149742j87135M352045M567226J897338J814973L776869K239213
39916G668432l166966o122591l154829J854549M299549M357852L851727K471490
39908A2059213l83803l552026n826207o909542n849637j898449K440719L155727
39900f764005M89373j090789J94149J060167n22252j439460J090542M286320L943892
39891A247937P99260j302152j444162j720389k529467j860012P97731L102295
39883b908959L001928J019319j045613k018927j709513q39686q19499k209472
39875g530422l209926j263954L119782N698092L289431j581521l200833j74852
39867d854203K368867O9705l791662k661761L311069O964314M472899K95138q06347
$$ plain form
39924 -7642355 -10792097 -10979232 -6627187 -2059961 -162623 1652350 5429219 7668432
39916 7668432 4501466 -1621125 -4775954 -2921405 1378144 5735996 9587723 12059213
39908 12059213 11675410 8123384 2297177 -4612365 -10462002 -12360451 -9919732 -6764005
39900 -6764005 -6274632 -7365421 -7171272 -6111105 -6633357 -8072817 -6982275 -2695955 1247937
39891 1247937 2047197 745045 -699117 -2419506 -4948973 -6808985 -6011254 -2908959
39883 -2908959 92969 1112288 66675 -1952252 -3661765 -4501451 -5320950 -7530422
39875 -7530422 -10740348 -12004302 -8884520 -3186428 103003 -1478518 -4679351 -4854203
39867 -4854203 -2485336 -2415631 -6207293 -8869054 -5557985 1406329 5879228 6174366 5368019
39858E368019r52909l624090n795093k337757M460254P088910L700901j32009
39850G776226p32575n37014j714462k191389o12414M76206l45811o6240L340734
39841E393261O267598M345385r04232m106032k829830O69719K944420K211199
39833A3991488q45766l417793l167746j277159p59207j588381j012298Q62300
39825B785438N79250k054330k278697J763513M799382K232958k555577l742855
39817A529082j770942p51893o08089J503287M021575K339496l041312o147090
39809b925886m054110l49607R89941L48740l14398p42240j024513k41145J827463
39800f485755L981911N467148O261949N303234J370031l741312o009245m155933
$$ plain form
39858 5368019 4415110 791020 -5004073 -7341830 -2881576 4207334 7908235 7776226
39850 7776226 7043651 6506637 4792175 2600786 1988372 2464578 2118767 2052527 5393261
39841 5393261 11660859 16006244 15102012 10995980 8166150 8835869 11780289 13991488
39833 13991488 13145722 9727929 6560183 5283024 4523817 2935436 1923138 2785438
39825 2785438 3364688 1310358 -968339 795174 5594556 7827514 5271937 1529082
39817 1529082 -241860 -993753 -1601842 -98555 3923020 6262516 3221204 -2925886
39809 -2925886 -6979996 -7329603 -6339662 -5990922 -6305320 -7047560 -8072073 -8313218 -6485755
39800 -6485755 -2503844 2963304 9225253 14528487 15898518 12157206 6147961 1992028
39792A992028j201132j86210r38790j989024k958779l580999k593336N87674M315406
39783f553162O052998M603656Q28803k831225l833945j985857j6931j21354q07575
39774d664592N54712L096264L588178J733787N09987R30638N86141j339853j693418
39765C301844J577440N261391M896546Q00103k894247l747325k729562j402036
39757E064154j86642P15449R00000N13191M67r24883k858588n294253o754988
39748h826093o428994m808427k619150P6619L354094O421148P643432N886207
39740F98836J924723j783289l101019j919502K00063J590082J472184K59799n09011
39731a167134N33800K507694K644391M6708k177042o59252L145909M329732J042272
$$ plain form
39792 1992028 790896 604686 -334104 -2323128 -5281907 -8862906 -11456242 -10868568 -6553162
39783 -6553162 -500164 4103492 4932295 2101070 -1732875 -3718732 -3735663 -3857017 -4664592
39774 -4664592 -4109880 -1013616 2574562 4308349 4818336 5748974 6335115 4995262 3301844
39765 3301844 4879284 10140675 15037221 15837324 12943077 9195752 6466190 5064154
39757 5064154 4877512 5592961 6492961 7006152 7006619 6081736 3223148 -2071105 -8826093
39748 -8826093 -15255087 -20063514 -22682664 -22606045 -19251951 -12830803 -5187371 698836
39740 698836 2623559 840270 -2260749 -4180251 -3980188 -2390106 -917922 -658123 -1167134
39731 -1167134 -633334 1874360 4518751 4565459 2388417 1729165 4875074 9204806 10247078
39722A0247078l133280m242626k882320k225945k845915k073472J541496N207372
39714d07612M656939m98083n491966n304572k45482M587395N215759K467895m52006
39705D528267j821994j624032n5056K106644L015097J689117m92050j759922k089469
39696C496602j864409m08210K023748K978511J274026m73931J0058M95856j652799
39687E879452l774657j817744J902254J531706k374809l184838P25831L085790
39679A972985M47297j994085L32646L301246J305346k984741l067979R80200L655968
39670C948883L098026K009254J026532j764161n005232m566740p12014J343573
39662f21879n06327k352393j494068r23846l179660m604997o74800N936273Q056009
$$ plain form
39722 10247078 7113798 2871172 -11148 -2237093 -5083008 -7156480 -5614984 -407612
39714 -407612 4249327 3751244 -1740722 -7045294 -7290776 -2703381 2512378 4980273 4528267
39705 4528267 2706273 1082241 1027185 3133829 6148926 7838043 7345993 5586071 3496602
39696 3496602 1632193 1223983 3247731 6226242 7500268 7026337 7036395 7532251 5879452
39687 5879452 2104795 287051 2189305 3721011 1346202 -1838636 -1112805 1972985
39679 1972985 2420282 426197 758843 4060089 5365435 2380694 -687285 292915 3948883
39670 3948883 7046909 9056163 10082695 8318534 3313302 -1253438 -1965452 -621879
39662 -621879 -1128206 -3480599 -4974667 -5898513 -9078173 -13683170 -14357970 -8421697 -365688
39653c65688L913542o23215m54176K304656K515834k68783j744684M24676L398797
39644I100959L578577J376476m40594j100298j750109k282831j481452K9591K57827
39635G288146o29294o48512j99581j896169n086096n012872J57642N575939O149929
39626E699132L116787O23853o57449k138536k797186j281133m6168j776977l654120
39617b911797j368520K567961J587265m037429o549686k346253K971536L801980
39609f284943J974795J184833K96568k562630m218015r11565M631071O562385
39601F72499M322957K113924J410616k34108l230999m363770k190789M08909O33288
39592d57473o77360j333593q82339l0414P27077P82527j85074o42491J582190
$$ plain form
39653 -365688 3547854 2924639 2470463 4775119 7290953 7022170 5277486 5702162 9100959
39644 9100959 12679536 14056012 13615418 12515120 10765011 8482180 7000728 7030319 7288146
39635 7288146 6658852 6010340 5810759 3914590 -1171506 -6184378 -6026736 -450797 5699132
39626 5699132 8815919 9439772 8782323 6643787 3846601 2565468 2519300 742323 -2911797
39617 -2911797 -4280317 -1712356 -125091 -4162520 -10712206 -13058459 -10086923 -6284943
39609 -6284943 -4310148 -3125315 -2828747 -5391377 -9609392 -10520957 -5889886 672499
39601 672499 4995456 7109380 8519996 8285888 5054889 691119 -1499670 -1090761 -457473
39592 -457473 -1134833 -2468426 -3350765 -3381179 -2654102 -1871575 -2056649 -2699140 -1116950
39583a116950N361566O071877J295050n193429p536076m821438j522792j149594
39575h611786j944799k2188M680873P555899M809659j499059n378751l759432
39567d169584K05078J512856m92490k023148j95975L532882N376567L129805k053147
39558D822844o448611o449773k131782J894828J205802k654927l595114R73628
39550a2383105O282627O400521K019168q42923J168467M982899N360642P71577
39542A3759873n285903p549403l802399K442296M867005J346939l322067l752778
39534a296437j176764p27784k808886k392367K387163O443406N230044J378947
39526G037322m9432P35897J54932j650320j177326J795292L236319J051721k187759
$$ plain form
39583 -1116950 4244616 10316493 11611543 6418114 -1117962 -5939400 -7462192 -8611786
39575 -8611786 -10556585 -10578773 -5897900 1657999 6467658 4968599 -410152 -4169584
39567 -4169584 -3964506 -2451650 -2944140 -4967288 -5163263 -1630381 3746186 6875991 4822844
39558 4822844 -1625767 -8075540 -10207322 -8312494 -7106692 -9761619 -13356733 -12383105
39550 -12383105 -6100478 300043 2319211 1476288 2644755 7627654 12988296 13759873
39542 13759873 8473970 924567 -2877832 -435536 4431469 5778408 2456341 -1296437
39534 -1296437 -2473201 -3200985 -6009871 -8402238 -6015075 428331 5658375 7037322
39526 7037322 6987890 7723787 7878719 6228399 5051073 6846365 10082684 11134405 8946646
39517H946646l657202l474649k286191N26604M311533N954058L519713r62863
39509A2877649m000607m083909j732133J389904K390485o96988n089132m987437
39501c932168N28989M863623K471709l203163m797438j500394J077234M09399
39493d082209K41656L219970N884010L907717j421813n237201n257391k938377
39485e683638j25712K438795M058493M211238L627932L236617K233524p12016
39477A3285233m318345n202732k485309K56125n85379l725024m804035k420396
39469i999862L88450R67365M92637J193003K599753K898794K262539K024516J684219
39460D511414p5567j947499j186013J472208J850245j381777l981774k027695
$$ plain form
39517 8946646 5289444 1814795 -471396 55208 4366741 10320799 13840512 12877649
39509 12877649 8877042 4793133 3061000 4450904 6841389 6144401 1055269 -3932168
39501 -3932168 -3403179 1460444 3932153 728990 -4068448 -5568842 -4491608 -4082209
39493 -4082209 -3840553 -620583 5263427 9171144 7749331 2512130 -2745261 -5683638
39485 -5683638 -5809350 -3370555 687938 4899176 8527108 11763725 13997249 13285233
39477 13285233 8966888 3764156 1278847 1534972 949593 -2775431 -7579466 -9999862
39469 -9999862 -9611412 -8644047 -8151410 -6958407 -4358654 -1459860 802679 2827195 4511414
39460 4511414 4435847 2488348 1302335 2774543 4624788 3243011 -738763 -2766458
39452b766458K219790L337094M3156l452264k928200J229602M975025M922703
39444G580448J607426j309425j391771k70937o89588j856243q52564J811421K338198
39435F966965K2231j339929k08533k25505l199902m454024q5032N487461N274854
39426H238586n3779m089075m592632m607290m852133k347094K864640O246440
39418c192337N480658L123099J254954j065101l475288l040683K87044J965766
39410A338112m73695l347961k435111J044737L160371K878925J925296J438300
39402E528974J339607J201665J15820k327724m148555k809439N21845K034232
39394A456425J121389Q06443J485977k90077m729050o330390k093509L007871
$$ plain form
39452 -2766458 -546668 2790426 2833582 -618682 -3546882 -2317280 2657745 7580448
39444 7580448 9187874 7878449 6486678 6215741 5526153 3669910 2817346 4628767 6966965
39435 6966965 6989196 5649267 5440734 5215229 2015327 -2438697 -2523729 2963732 8238586
39426 8238586 8184807 4095732 -496900 -5104190 -9956323 -12303417 -9438777 -3192337
39418 -3192337 2288321 5411420 6666374 5601273 2125985 -914698 -627654 1338112
39410 1338112 864417 -2483544 -4918655 -3873918 -713547 2165378 4090674 5528974
39402 5528974 6868581 8070246 8186066 5858342 1709787 -1099652 -577807 1456425
39394 1456425 2577814 3384257 4870234 4580157 -148893 -6479283 -8572792 -5564921
39386e564921L150518k20449k145749j929550j821711j324913J366962M515596
39378c974217M903244L123909J994454J513179K26952m24398J458014L133979
39370A1955116M26869m899620o822356l810763l02842N10064k01074j203662k892437
39361g240705l960713k049931J170685J261021j237746m33230N173194Q908197
39353A590772N774328L43161m75759K011720J419809k816145m786796j952416
39345A108674R41586n06417l906054m207056r80812J784517J548754k07136r05304
39336e329248R3410J732109K694423J921984q34076m030788n060316l062510n3598
39327a1928610J820599K830975L832959L536909N97676k438501j205724L881994
$$ plain form
39386 -5564921 -2414403 -2634852 -4780601 -6710151 -8531862 -9856775 -8489813 -3974217
39378 -3974217 929027 4052936 6047390 7560569 7787521 7363123 8821137 11955116
39370 11955116 12381985 7482365 660009 -3150754 -3453596 -2943532 -3144606 -4348268 -7240705
39361 -7240705 -11201418 -13251349 -12080664 -10819643 -12057389 -12490619 -7317425 1590772
39353 1590772 7365100 7708261 7232502 9244222 10664031 7847886 3061090 1108674
39345 1108674 2050260 1543843 -2362211 -6569267 -7550079 -5765562 -4216808 -4423944 -5329248
39336 -5329248 -5235838 -3503729 -809306 1112678 278602 -3752186 -8812502 -11875012 -11928610
39327 -11928610 -10108011 -7277036 -3444077 92832 690508 -1747993 -2953717 928277
39319I28277O905326L912717k118452n715938n287346k850974l86890P74112m62570
39310d301738k909669k869873R51939M461337L413541m08701j943208r8706J653586
39301b051492Q57683j406162k859554j923232J589451N090367M613010N32439
39293D442510j174586K556929N758181J670713o098215q186332l289762J187614
39285c132948J723746K467087N082634M585948q79254m841961k483258J516756
39277D038750J276448n68303J321929M593321K950329k651181m951106j690151
39269D320036J633570J019007o91593J14316J654115P5569m032149n969809l063297
39260d940235J980153M516181L549706K274232K864365L069990J93411l547328
$$ plain form
39319 928277 7833603 11746320 9627868 3911930 -1375416 -4226390 -4613280 -3839168 -4301738
39310 -4301738 -7211407 -10081280 -9129341 -4668004 -1254463 -1663164 -3606372 -3705078 -2051492
39301 -2051492 -1193809 -2599971 -5459525 -7382757 -5793306 -702939 3910071 4442510
39293 4442510 3267924 5824853 11583034 13253747 7155532 -1030800 -4320562 -3132948
39285 -3132948 -1409202 1057885 6140519 10726467 9847213 5005252 2521994 4038750
39277 4038750 5315198 4746895 6068824 10662145 13612474 10961293 6010187 4320036
39269 4320036 5953606 6972613 6281020 6395336 8049451 8125020 4092871 -1876938 -4940235
39260 -4940235 -2960082 1556099 5105805 7380037 10244402 13314392 13507803 9960475
39252I960475l658103o60243K21758k627856m553050k398839L12685m77153k624235
39243f504561j816962J065227J710377o97634l170967m110631m239191l251330
39235b1015672L4538M262769O031778M244984J316499j64483M791K77268q06023
39226e813551k797019k792488J356662O658328P129559J948194k510985j410252
39218A768448K068460K606031O27648o13291j628876m162401n410518j884331
39210f628830L183262L698456M92883n15813R89034l75937m607616m557677J902905
39201f419333O707472L388395l134453m452214q10496J212492m70729j609290
39193e588156Q32073M695154O154598L750580r13359m306556l707236m66007J099644
$$ plain form
39252 9960475 6302372 5642129 5863887 3236031 -1317019 -3715858 -3403173 -3880326 -6504561
39243 -6504561 -8321523 -7256296 -5545919 -6243553 -9414520 -13525151 -17764342 -21015672
39235 -21015672 -20981134 -16718365 -10686587 -6441603 -5125104 -5289587 -5284796 -5007528 -5813551
39226 -5813551 -8610570 -11403058 -10046396 -3388068 3741491 5689685 3178700 1768448
39218 1768448 3836908 6442939 7070587 6457296 4828420 666019 -4744499 -6628830
39210 -6628830 -3445568 252888 745771 229958 1218992 843055 -3764561 -8322238 -6419333
39201 -6419333 288139 3676534 542081 -3910133 -4720629 -3508137 -3978866 -5588156
39193 -5588156 -4756083 -60929 6093669 9844249 8930890 4624334 917098 451091 1550735
39184A550735m20534j364462J033230L537147J449874l838546o204741l107091
39176g364388J416094K554721L89283j447356o83570J571736K977535K825263
39168B239318K162613J363503r28218n053137p766642n180091J714039P325413
39160d123202P973317N373805K744780O16371j632595k943814j998463K31739
39152F241938J668350J673159P72171p42131k431728l407715l627550l828136
39144c681642l403010r05032K360498K721589o5848j368720J131215L024232K21002
39135C4284l500611j872812L592528N604642K407579j14447J562769L474081J611847
39126A2799860j494398j627673P5851m59403l405477m967921l030083N60907K894268
$$ plain form
39184 1550735 1130201 -234261 798969 4336116 5785990 1947444 -4257297 -7364388
39176 -7364388 -5948294 -3393573 -3004290 -4451646 -5135216 -3563480 -585945 2239318
39168 2239318 4401931 5765434 4837216 -215921 -7982563 -13162654 -11448615 -4123202
39160 -4123202 3850115 9223920 11968700 12585071 10952476 8008662 6010199 6241938
39152 6241938 7910288 9583447 10355618 9613487 7181759 3774044 146494 -3681642
39144 -3681642 -7084652 -7989684 -5629186 -2907597 -2973445 -4342165 -3210950 -186718 34284
39135 34284 -3466327 -5339139 -1746611 3858031 6265610 6151163 7713932 11188013 12799860
39126 12799860 11305462 9677789 9753640 9294237 5888760 920839 -2109244 -1548337 1345931
39117A345931K753310Q96327o53075k13884J366617J276066j231189l076029j511399
39108I52675J724414K950788J791946P74395N81778o24218l002783l870093k041925
39099g63023k07208q85469k419985j650673R47744J861126l5928j560328K92892
39090d420852L949867N042664J826455k847603n136258m334187k322192Q3252
39082h158854L861725Q274369R310869M380202k830568n840270l648139j469139
39074C880195k189661j885215K984105Q270963P351883J119713l319124l004994
39066A3207865j815029k413131k214318M23473K157774M30689j819953j388175
39058F569195k62408j189331j905284O34966L648757K501166j045911j411638
$$ plain form
39117 1345931 4099241 4995568 4342493 4128609 5495226 6771292 5540103 2464074 952675
39108 952675 2677089 5627877 7419823 8194218 8775996 8151778 5148995 1278902 -763023
39099 -763023 -970231 -1855700 -4275685 -5926358 -4978614 -3117488 -3153416 -4713744 -4420852
39090 -4420852 -470985 4571679 6398134 3550531 -1585727 -5919914 -8242106 -8158854
39082 -8158854 -4297129 3977240 13288109 17668311 14837743 8997473 5349334 3880195
39074 3880195 1690534 -194681 2789424 11060387 18412270 19531983 16212859 13207865
39066 13207865 11392836 8979705 6765387 7188860 9346634 9777323 7957370 6569195
39058 6569195 6306787 5117456 3212172 3847138 7495895 9997061 8951150 7539512
39050G539512J190146R32867l603252o658196m248549K63792K122608J588188
39042h72884J498926K539515L744414M438485L506077r8667m422064n573822l260854
39033A499126j380151j578159r03639J926675L198832O23263j922586n82877J964759
39024B845243J421958n60916K04450K400430J334966k446319l551074n47443K071678
39015C172973J551563N80020J619897K762312J746962m7113m34874o9324n06292
39006A0376124j089574m73176M78140j34775k088342l100453j739635R71965K671128
38997E871402J822279q16873k744643k368998r42054p98911j944141k055541j30599
38988d108079J734734J286828m83274m89386K172534M619880L725518N33098n60208
$$ plain form
39050 7539512 8729658 9662525 6059273 -598923 -4847472 -4583680 -2461072 -872884
39042 -872884 626042 3165557 6909971 11348456 14854533 14755866 10333802 4759980 1499126
39033 1499126 118975 -1459184 -2362823 -436148 2762684 3385947 1463361 880484 2845243
39024 2845243 4267201 3706285 3910735 6311165 7646131 5199812 1648738 1101295 3172973
39015 3172973 4724536 5304556 6924453 9686765 11433727 11386614 10951740 10882416 10376124
39006 10376124 9286550 8813374 9291514 9156739 7068397 3967944 2228309 3200274 5871402
38997 5871402 7693681 6876808 4132165 1763167 821113 22202 -1921939 -3977480 -4108079
38988 -4108079 -2373345 -1086517 -1569791 -2059177 113357 4733237 8458755 8991853 8431645
38979H431645K354226N480290L978055j355910n114012m663567k747967j946254
38971D416506p93476K247314M808771M195200K127680J964828L207984K839079
38963B5013886O63843q46467j133602j859440l062114k929012j367966k20597
38955A4258531J44868J092188K546997K861810J887536R88060R6100j931188m192190
38946A7752712m527584l335732k881391k859497p58443L068703N019884L696764
38938A5175416J608466O04940j72139r01872k13762J058053J4529k796401l002439
38929A1374791L46080K427757M56871j539164K63309K739229J226342k445173
38921A4850042l236736j271588o93998j909017j260813J927533L810145K281735
$$ plain form
38979 8431645 10785871 16266161 20244216 18888306 13774294 9110727 6362760 4416506
38971 4416506 3623030 5870344 10679115 14874315 17001995 18966823 22174807 25013886
38963 25013886 25677729 24831262 23697660 21838220 18776106 15847094 14479128 14258531
38955 14258531 14403399 15495587 18042584 20904394 22791930 23779990 23876090 21944902 17752712
38946 17752712 13225128 9889396 7008005 4148508 3390065 6458768 11478652 15175416
38938 15175416 16783882 17388822 17216683 16314811 16101049 17159102 17173631 14377230 11374791
38929 11374791 11720871 14148628 14605499 13066335 13329644 16068873 17295215 14850042
38921 14850042 11613306 10341718 9647720 7738703 6477890 8405423 12215568 14497303
38913A4497303k7321l46217M41447O6854j924271m432640n997605n064328j372071
38904d158849K328483K338586j278985m100801k534794J998655N154839M707208
38896D454342K384122J287499K373290L586741K376137j198389m523765n584718
38888E155259m891174l880066k840790j321641O85467K938246N056708N619928
38880F521937K927334k005692n094294l789015n76360K48476j857408l583419
38872g208441k398305R41626M100701N432787M682624K885314J480253P77755
38864A0694314m6591j080821j418038j431638k936500n649762o162097k751436
38856a0782569J265328J926754K10018j26917J628276L321593M410868N841849
$$ plain form
38913 14497303 14469982 14123765 14565212 14632066 12707795 8275155 2277550 -2786778 -4158849
38904 -4158849 -1830366 508220 -770765 -4871566 -7406360 -5407705 -252866 4454342
38896 4454342 6838464 8125963 10499253 14085994 16462131 15263742 10739977 5155259
38888 5155259 264085 -3615981 -6456771 -7778412 -7092945 -4154699 902009 6521937
38880 6521937 9449271 7443579 2349285 -1439730 -2016090 -1767614 -3625022 -7208441
38872 -7208441 -9606746 -8665120 -4564419 868368 5550992 8436306 9916559 10694314
38864 10694314 10647723 9566902 8148864 6717226 3780726 -1869036 -8031133 -10782569
38856 -10782569 -9517241 -7590487 -7380469 -7507386 -5879110 -2557517 1853351 7695200
38848G695200O218133K882658k784031n564954l178158O94329J556676o98059
38840F821794l100214l454010j448959J804177L969263L060896j08591k661363
38832D882993l322488l341617l357434j999600J197500L909639L830720J744168
38824C543881J45258o6424r5186j158324k927441l751879k187936J189676L784521
38815a523854L692307J886620M75014l27268j551581k640261j934739J81827J423967
38806c17968J156889J085679J913478K137889J060955K62108Q23167J547849J330777
38797A1000823J001709J284095J090451l79399j740498j564777q74607j424621
38789H393176k551748j855683J251388M290203M338824J282833j862323k118480
$$ plain form
38848 7695200 13913333 16795991 14011960 8447006 5268848 5963177 7519853 6821794
38840 6821794 3721580 267570 -1181389 622788 4592051 7652947 7544356 4882993
38832 4882993 1560505 -1781112 -5138546 -7138146 -5940646 -2031007 1799713 3543881
38824 3543881 3689139 3622715 3527529 2369205 -558236 -4310115 -6498051 -5308375 -1523854
38815 -1523854 2168453 4055073 4530087 4202819 2651238 10977 -1923762 -1741935 -317968
38806 -317968 838921 1924600 3838078 5975967 7036922 7299030 8122197 9670046 11000823
38797 11000823 12002532 13286627 14377078 13997679 12257181 10692404 9817797 8393176
38789 8393176 5841428 3985745 5237133 9527336 13866160 15148993 13286670 11168190
38781A1168190p0246P77055j192802l220843k206531O27979J956900J647149J959806
38772A1446657K493281P98177j970261j540511K034442L090215q98210m733822
38764A0719968l491832j12319O4539j790900q39014K333880K477266j149039l157101
38755E055448o68857K323750J583235j069859j262362J286660K994054J653770
38747A1895839j302420l079757k202131N72387K748330K102050p64493k580357
38739G389448j196407J497789J857421o64094k688525j453043J463691K510457
38731H716737J279958P60022K181397K613178j95480l088332j411379L383321
38723A4239422M698444J84037m406407l294664J156514K259747j312818m202938
$$ plain form
38781 11168190 11097944 11874999 10682197 7461354 5254823 5882802 7839702 9486851 11446657
38772 11446657 13939938 14738115 12767854 11227343 13261785 16352000 15453790 10719968
38764 10719968 7228136 7115817 7180356 5389456 4550442 6884322 9361588 8212549 5055448
38755 5055448 4386591 6710341 8293576 7223717 5961355 7248015 10242069 11895839
38747 11895839 10593419 7513662 5311531 5883918 8632248 10734298 9969805 7389448
38739 7389448 6193041 7690830 9548251 8884157 6195632 4742589 6206280 8716737
38731 8716737 9996695 10756717 12938114 15551292 15355812 12267480 10856101 14239422
38723 14239422 18937866 19121903 14715496 11420832 12577346 14837093 13524275 9321337
38715I321337k257971K345662M767577L233354m04112l663886n015458l574075
38707D752428M55932M536185M714845l21219o353455p034674j238745N097314
38699D608611O353084M113546L411590M237325K113497l213430n910047k837127
38691A2877049J462765J875559j15004o09460l05730j957728l920391k209869
38683G097191K468937N278087M281615K122311R93168M68304L45969J412657L015979
38674B7484218L459968K945141K907383K882376J472874l32206o51442n44751
38666C9623561j923408k721986L47280M712018M054442j686750n067478j968577
38658C5369102K689575L194406J058103N30840J168815J27390j636728q34305
$$ plain form
38715 9321337 7063366 9409028 14176605 17409959 17005847 13341961 8326503 4752428
38707 4752428 5208360 9744545 14459390 14138171 7784716 750042 -488703 4608611
38699 4608611 10961695 15075241 18486831 22724156 24837653 21624223 15714176 12877049
38691 12877049 14339814 16215373 16100369 15490909 15185179 13227451 9307060 7097191
38683 7097191 9566128 14844215 19125830 21248141 22241309 22709613 23055582 24468239 27484218
38674 27484218 30944186 33889327 36796710 39679086 41151960 40819754 40168312 39623561
38666 39623561 37700153 34978167 35325447 40037465 44091907 42405157 37337679 35369102
38658 35369102 38058677 41253083 42311186 42842026 44010841 44138231 42501503 41667198
38650D1667198K373619M538752L812687J434937m39632O3824L664074P869733
38642F4985192Q152782L818166J23832J585685N925464Q145549P843634Q255857
38634A08836161J0252371J1867613J2313079J2149452J0855094Q462190P966667
38627A82702627J1302193J4472916J2332035P219184O392946J0817590J3568714
38620B58808205J0967118Q102211R816898J2658815J0981054O157724L591407
38613C21083432L669875K169242j712474m051857l273285k982915o008628r913024
38605B98980366j0985164r778035r865557j2652105j5911147j6940168j5306601
38598B07541589j2403996r493842o764820m236189l152470n260267r697900j1922836
$$ plain form
38650 41667198 44040817 48579569 52392256 53827193 53387561 53451385 57115459 64985192
38642 64985192 73137974 76956140 77079972 78665657 84591121 92736670 100580304 108836161
38634 108836161 119088532 130956145 143269224 155418676 166273770 174735960 182702627
38627 182702627 194004820 208477736 220809771 228028955 234421901 245239491 258808205
38620 258808205 269775323 277877534 287694432 300353247 311334301 317492025 321083432
38613 321083432 324753307 326922549 325210075 321158218 317884933 314902018 308893390 298980366
38605 298980366 287995202 278217167 268351610 255699505 239788358 222848190 207541589
38598 207541589 195137593 185643751 178878931 174642742 171490272 166230005 156532105 144609269
38590A44609269q325404j770414O86600l168849p238466n308208J01426J255338
38582A20841292l841818r037558r005795n676704l612574l231398k101105m0223
38574H4294117J093868J101448J147982P40169j348945l628648l046270K88422
38566H0642143K975465L366849L339116M117026L695373K59251m269116o154015
38558H7972092m039508k8338K382496J052911k759220n166409m092703k167353
38550G3153968k594168l365936o1293N774996O839251N58138o223294o532101
38542F7549561k420150l00453j168581j112335R43225K024688R35812P5305J046299
38533F7573371K375158K156293J92480k478666m022884k714435L67751J320853
$$ plain form
38590 144609269 136283865 134513451 135200051 132031202 124792736 119484528 119585954 120841292
38582 120841292 116999474 107961916 98956121 93279417 89666843 86435445 84334340 84294117
38574 84294117 85387985 86489433 87637415 88377584 87028639 83399991 80353721 80642143
38566 80642143 83617608 86984457 90323573 94440599 98135972 98395223 94126107 87972092
38558 87972092 83932584 83904246 86286742 87339653 84580433 79414024 75321321 73153968
38550 73153968 70559800 67193864 67132571 72907567 79746818 80304956 74081662 67549561
38542 67549561 65129411 64828958 63660377 62548042 63491267 65515955 66451767 66527072 67573371
38533 67573371 69948529 72104822 72297302 69818636 65795752 63081317 63449068 64769921
38525F4769921j157475k787947L4000L649321K029137l666874o598590m437242
38517E1834251j383012J33947K543028O161420O202097M36708n692154o064439
38509E4171846k129298J4701k012817n169538n778206l135110L68824J264318
38501C7594720j128077k662614N48478N167235M027327k583337n861736j683194
38493C3418802K523917m78080n992299n278381M253J005136l255034m582221K33091
38484A7599184M035141J239185l321129k619924J674966K676696j013894m154912
38476A6115313l073493J04341J781617J695810J881019K775307K328088q38379
38468B2769623m559034n052629k000980M02197q73212l005128j277306L547314
$$ plain form
38525 64769921 63612446 60824499 60858499 64507820 66536957 62870083 56271493 51834251
38517 51834251 50451239 50585186 53128214 59289634 65491731 65928439 60236285 54171846
38509 54171846 52042548 52057249 50044432 44874894 39096688 35961578 36330402 37594720
38501 37594720 36466643 33804029 34352507 39519742 43547069 40963732 35101996 33418802
38493 33418802 35942719 35464639 29472340 24193959 24198212 25203348 21948314 17366093 17599184
38484 17599184 21634325 22873510 19552381 16932457 18607423 21284119 20270225 16115313
38476 16115313 13041820 13146161 14927778 16623588 18504607 21279914 23608002 22769623
38468 22769623 18210589 13157960 11156980 11559177 10685965 7680837 6403531 9950845
38460I950845N683513K228089l133156n320534l529239k46055K581732M383389
38452A2598584M832065L803432J704135q91502l089337l430198j536681L82254
38444A4372752N7401j169365k53015K130894J961664j670204m702818m190050
38436F537259k034297n62455J201312L780000M044151M0487m288102l952960j14256
38427D651139K207167J481996j82095k283137n543195p368242m067769K102647
38419i001489M383518J336177q26601J966502N460341M391349P97612m5247J750058
38410A0212220J904940k69885j269463q7373N0333k308856l791846j389971K604584
38401E654683L557808N05587l212918m304743k467152M80537K553114K589364
$$ plain form
38460 9950845 15634358 17862447 14729291 9408757 5879518 5633463 8215195 12598584
38452 12598584 17430649 21234081 22938216 22046714 18957377 15527179 13990498 14372752
38444 14372752 14430153 13260788 13007773 15138667 17100331 15430127 10727309 6537259
38436 6537259 4502962 3940507 5141819 8921819 12965970 13006457 8718355 4765395 4651139
38427 4651139 6858306 8340302 8158207 5875070 331875 -7036367 -11104136 -9001489
38419 -9001489 -4617971 -3281794 -4108395 -2141893 3318448 7709797 8507409 8462162 10212220
38410 10212220 12117160 11847275 10577812 10490439 10540772 8231916 4440070 3050099 5654683
38401 5654683 9212491 9718078 6505160 2200417 -266735 213802 2766916 5356280
38393E356280O82198j784587l088581k543231q06284J043933K297821K514222
38385C671771J344020r21089k819696k578601p7919K353082J908124j590270m975147
38376c685725m654044l17460M495684N709739K638254j451082k772957q51514
38368h89105J477188J758202O67906M99276J821851K991031K740223J727250J009190
38359A3803012K40042j546366l906081m852120l012964N03190K809908K059456
38351F098077n14485j930214j066940p4529j392535m248339n512481l528029M71732
38342a1697743M333486O436269N447140J227348l408244m376081j041871K790795
38334b88901L770446K612005J448066L09117j427104k554005k023044j439843
$$ plain form
38393 5356280 6038478 4253891 1165310 -1377921 -2184205 -1140272 1157549 3671771
38385 3671771 5015791 4094702 1275006 -1303595 -1381514 971568 2879692 1289422 -3685725
38376 -3685725 -8339769 -8657229 -4161545 1548194 4186448 2735366 -37591 -889105
38368 -889105 588083 2346285 3014191 3513467 5335318 8326349 11066572 12793822 13803012
38359 13803012 14043054 12496688 8590607 3738487 725523 1228713 4038621 6098077
38351 6098077 5583592 3653378 2586438 2511909 1119374 -3128965 -8641446 -12169475 -11697743
38342 -11697743 -7364257 -927988 4519152 5746500 2338256 -2037825 -3079696 -288901
38334 -288901 3481545 6093550 7541616 7850733 6423629 3869624 1846580 406737
38326D06737k283513k473867L62652L712896L044590p78382k268423P1054J560821
38317A354565n08037k263933j63172K493417Q08186l449228m371720q61999K428172
38308d533749K574810J677611K092167K867077K477934J628695J369125Q80171
38300A1033841r29395l202402m065943k817269l22269J834451K245854R48275
38292D725143j6740J201865L343234L181451P8237k677625k133353N44104J998744
38283A0245060J059204m53834o21290K93888M56947j243849l538404l689850p17103
38274A790769K845978L745456K076480O72392P97315J079243Q99808J546411K795040
38265A8248892J817330k138654n049610l397622K15637O73914k042692l388738
$$ plain form
38326 406737 -1876776 -4350643 -3987991 -275095 2769495 1991113 -277310 -206256 1354565
38317 1354565 846528 -1417405 -1580577 912840 1721026 -1728202 -6099922 -6961921 -4533749
38308 -4533749 -1958939 -281328 1810839 4677916 7155850 8784545 10153670 11033841
38300 11033841 10104446 6902044 2836101 18832 -303437 1531014 3776868 4725143
38292 4725143 4708403 5910268 9253502 12434953 12513190 9835565 7702212 8246316 10245060
38283 10245060 11304264 10850430 10229140 10523028 10979975 9736126 6197722 2507872 1790769
38274 1790769 4636747 8382203 10458683 11131075 11928390 13007633 13907441 15453852 18248892
38265 18248892 20066222 17927568 12877958 9480336 9695973 10369887 8327195 4938457
38257D938457j802520p09956k063031k727600R0061L581617L190283m69360k510861
38248A517090q76722J200929M63581j703880j654319J157931L341792J923941
38240E370343j968210m409707l057915N32197L024572L035926K025548J662104
38232F214858J476629n5279k782833m592671m051346k165661p85984j58135P96829
38223f103593K331512L527731M020799M268062L633047L73946m922757p878129
38215g49382n007266J049883M035377J779672j632238j907286M77848K651968
38207F98576L481993L085026R98841k177105l423503r50963K277211K194937l31147
38198E853866j055876O72790J049663j526603l519757j880055J220420J944298
$$ plain form
38257 4938457 3135937 2425981 362950 -2364650 -2274589 1307028 4497311 4027951 1517090
38248 1517090 640368 1841297 2304878 600998 -1053321 104610 3446402 5370343
38240 5370343 3402133 -1007574 -4065489 -3533292 -508720 2527206 4552754 6214858
38232 6214858 7691487 7636208 4853375 260704 -3790642 -5956303 -6742287 -6900422 -6103593
38223 -6103593 -3772081 -244350 3776449 8044511 11677558 12051504 7128747 -749382
38215 -749382 -5756648 -4706765 -671388 1108284 -523954 -2431240 -1953392 698576
38207 698576 4180569 7265595 8264436 6087331 2663828 1712865 3990076 6185013 5853866
38198 5853866 4797990 5470780 6520443 4993840 1474083 -405972 814448 2758746
38190B758746K22133j284192j607244j921083k790601l513328l451064k166627
38182a3753260P01506L948674M655405J782326j394838j055435J955684L536719
38174C76781K277578Q27859J345240K765480L290900K792612J702046m5868j790916
38165A3541712k101500j203460j249043k703081k823887Q5689K993961J698916
38157H239307l038979o123313m733471j292042P60418J298483K038896K867816
38149A7115K053489n17371k433183j555383J360043L414255K588797k15535k055078
38140B657149r24433K068889L831050K756916N24615j01083J289391K449778J433940
38131A5986212j274489l868204n352410n751789m911040k363968J421087M555999
$$ plain form
38190 2758746 2980879 1696687 89443 -1831640 -4622241 -8135569 -11586633 -13753260
38182 -13753260 -13051754 -9103080 -4447675 -2665349 -4060187 -5115622 -3159938 376781
38174 376781 2654359 3482218 4827458 7592938 10883838 13676450 15378496 15332628 13541712
38165 13541712 11440212 10236752 8987709 6284628 3460741 3546430 6540391 8239307
38157 8239307 5200328 -922985 -5656456 -6948498 -6188080 -4889597 -2850701 17115
38149 17115 2070604 1553233 -879950 -2435333 -1075290 2338965 4927762 4712227 2657149
38140 2657149 1732716 3801605 7632655 10389571 10914186 10813103 12102494 14552272 15986212
38131 15986212 14711723 10843519 5491109 -260680 -5171720 -7535688 -6114601 -1558602
38123a558602N199536L431249J219462K93768L27221k00942j384405j293189J070128
38114G104226L286493K040657j982010m202585k146266J065781J222261r57933
38106E430624j277911J465304L898084L202529P07134p20344l77309N14529P58582
38097A3601222l99382k985399n180320m345589n52594K724246K827568Q16942
38089F506694j289609l444685n337221m206735J114234N953915M519213j666240
38081B149566n017769k134748K161660K715936J170544J965637M822590N496271
38073A3329687K359983j652037l322240k505784j217037j419092l606908o014494
38065d047922n701197j955205K139458L274088K118646J689117K302650J291849
$$ plain form
38123 -1558602 3640934 7072183 8291645 8585413 8912634 8711692 7327287 6034098 7104226
38114 7104226 10390719 12431376 10449366 6246781 4100515 5166296 6388557 5430624
38106 5430624 4152713 5618017 9516101 12718630 13425764 12705420 12328111 12842640 13601222
38097 13601222 13201840 10216441 5036121 690532 137938 2862184 5689752 6506694
38089 6506694 5217085 1772400 -3564821 -7771556 -6657322 -703407 3815806 2149566
38081 2149566 -2868203 -5002951 -2841291 -125355 1045189 3010826 7833416 13329687
38073 13329687 15689670 14037633 10715393 8209609 6992572 5573480 1966572 -4047922
38065 -4047922 -9749119 -11704324 -9564866 -6290778 -4172132 -2483015 -180365 1111484
38057A111484j867759l342615K16778O468930R372543O048626o2772l328505k164834
38048A2451876j57000j059312m030784n199129l272903j140728j175975j631274
38040e215229P5325K522918K064682j293874l334211j462571J864929K680954
38032b097077J99934l165486m597733k759450J213108L745755J926490k492514
38024h026973m447327j894604J967102M111957N662260P740356P203723J322869
38016A3639363n713596o863001k240163Q48493j307228l925879k059561J655717
38008e965855J874533p14843q91586K572433N081811L008386j789925n174814
38000a999860n422781l512281r28383J419689L176296M249709M180398K241243
$$ plain form
38057 1111484 -756275 -4098890 -3882112 2586818 11959361 18007987 17945215 14616710 12451876
38048 12451876 12294876 11235564 7204780 2005651 -1267252 -2407980 -3583955 -5215229
38040 -5215229 -5139904 -2616986 -552304 -1846178 -5180389 -6642960 -4778031 -2097077
38032 -2097077 -1897143 -5062629 -9660362 -12419812 -11206704 -7460949 -5534459 -8026973
38024 -8026973 -12474300 -14368904 -12401802 -8289845 -2627585 5112771 12316494 13639363
38016 13639363 7925767 1062766 -1177397 -328904 -1636132 -5562011 -7621572 -5965855
38008 -5965855 -4091322 -4806165 -5697751 -3125318 1956493 4964879 3174954 -1999860
38000 -1999860 -7422641 -10934922 -11863305 -10443616 -7267320 -3017611 1162787 3404030
37992C404030r61960l025351k557560j447667k088213l295877k028192J302817
37984a0697973K931202J587750L37646J195961J759517m07429l340423l645655
37976a0279404j306636J577532M445107P185599P625891M251611j01933j614687
37968A1783080j278871k528552m148465j665830L817786N076684l72784n241322
37960E441726k780117L043792L554303j958344o225891n043440j554805O63480
37952d859296K374947M582427M988350J870847k018603k889739j123840p0734
37944B854359j121376k694069l152253k237220j50308K498280L953895K545860
37936B497168j015690l921428m075663j724080J422156L400600K625434q47085
$$ plain form
37992 3404030 2442070 -583281 -3140841 -4588508 -6676721 -9972598 -12000790 -10697973
37984 -10697973 -7766771 -6179021 -5841375 -4645414 -2885897 -3293326 -6633749 -10279404
37976 -10279404 -11586040 -10008508 -5563401 1622198 9248089 13499700 13397767 11783080
37968 11783080 10504209 7975657 3827192 2161362 5979148 11055832 10683048 5441726
37960 5441726 2661609 5705401 9259704 7301360 1075469 -3967971 -5522776 -4859296
37952 -4859296 -2484349 2098078 7086428 8957275 6938672 4048933 2925093 2854359
37944 2854359 1732983 -961086 -4113339 -6350559 -6500867 -4002587 -48692 2497168
37936 2497168 1481478 -2439950 -6515613 -8239693 -6817537 -3416937 -791503 -1638588
37928a638588m180070l591920J423108O688192P480807L555508j208931l663405
37920D864701m045918l631792k117089Q79907L289653K383179r85545k622340
37912a985244l82146K929538L416216Q54141k193851m166062m980743m167952
37904a0676103j505158J158711J705945J060137J633094K737020J363713j952317
37896d474958k458342J682210N667521M590718L81847j602331l44202R04684O90993
37887E038140L46218m53850l759987q125868q350069k711163L527377M763289
37879i725913K129590O63515J861758L018803K736653K786438M039933M188135
37871A1698912J224990l114146n433077m952732l755726l284967k590554n13667
$$ plain form
37928 -1638588 -5818658 -9410578 -7987470 -1299278 6181529 9737037 8528106 4864701
37920 4864701 818783 -2813009 -4930098 -4050191 -760538 1622641 637096 -1985244
37912 -1985244 -2367390 562148 3978364 4832505 2638654 -1527408 -6508151 -10676103
37904 -10676103 -12181261 -11022550 -9316605 -8256468 -6623374 -3886354 -2522641 -4474958
37896 -4474958 -6933300 -5251090 416431 5007149 5388996 3786665 3442463 4347147 5038140
37887 5038140 5384358 4930508 1170521 -6955347 -15305416 -18016579 -14489202 -9725913
37879 -9725913 -7596323 -6932808 -5071050 -2052247 684406 3470844 7510777 11698912
37871 11698912 12923902 9809756 4376679 -576053 -4331779 -7616746 -10207300 -10720967
37863a0720967J934626K639051J252617k81813j73494J279092K526047K596225
37855A051384J539283n1615j157114p97214O15294J153588j75863j651223j139945
37846f13425M41310J90489k261482l811982k346397J75674P50004l16607l11378
37837h103794J516433K947881K395849J497021K865002O104058P532549M349528
37829B1104527j692706n857255n654218l210673j867674k092375k345991k388779
37821d005144k912974k681598L89018M874757O216725K901565j000990j467442
37813B313917M21939J568248J852178K532939K323813l89509k961720j125925
37805F535880M018024O415254L134999k231946n323454n957411n590800l856204
$$ plain form
37863 -10720967 -8786341 -6147290 -4894673 -5176486 -5349980 -4070888 -1544841 1051384
37855 1051384 2590667 2539052 1381938 584724 1200018 2353606 2177743 526520 -613425
37846 -613425 -172115 18374 -2243108 -6055090 -8401487 -8225813 -7475809 -7792416 -8103794
37837 -8103794 -6587361 -3639480 -1243631 253390 3118392 9222450 16754999 21104527
37829 21104527 19411821 13554566 7900348 4689675 2822001 729626 -1616365 -4005144
37821 -4005144 -6918118 -9599716 -9210698 -4335941 1880784 4782349 3781359 2313917
37813 2313917 2735856 4304104 6156282 8689221 11013034 10623525 7661805 6535880
37805 6535880 10553904 16969158 20104157 17872211 12548757 6591346 1000546 -2855658
37797b855658m55832K407987K555570R82732N9696J88599L89530N48710Q57693
37788D679027M68473j177277l018184m151581n136250n592627l002970L069269
37780a3862120P896225O836803K205703K58759K003019K304100j185145l766299
37772B691045r92970M199223N493289J670469k663536l363191m93399L304461
37764I845391N276825L836807j19368l387081l921377l549295n065748p394582
37756d478428o572662j601553L665900N342675L716584J516762K56768j36858
37748A709188P5053L35114m18911k027945k219809O11178M431643N469537K969619
37739A0934667J55472J39739K447178M177415L437184R57921r18956l96290K009442
$$ plain form
37797 -2855658 -3311490 -903503 1652067 2634799 2694495 2883094 3272624 3821334 4679027
37788 4679027 5147500 3970223 952039 -3199542 -8335792 -13928419 -16931389 -13862120
37780 -13862120 -5965895 870908 3076611 3335370 5338389 7642489 6457344 2691045
37772 2691045 1698075 5897298 11390587 13061056 10397520 7034329 6540930 9845391
37764 9845391 15122216 18959023 18839655 15452574 11531197 7981902 2916154 -4478428
37756 -4478428 -11051090 -12652643 -8986743 -3644068 72516 1589278 1846046 1709188
37748 1709188 1784241 2119355 1700444 -327501 -2547310 -1936132 2495511 7965048 10934667
37739 10934667 11090139 11229878 13677056 17854471 21291655 22249576 21330620 20934330 22943772
37730B2943772L572590J897160k385958o057136o570296m206867r68003J656623
37722I881885L387127M449799M820314L945136J266915k434203m648518l400742
37714A7267713P0884K394753K084343P15299m71979k819712p342068j1413997
37706D85236j1054952n978622j0165L524000M722195N095403M706290K586545
37698D075930r57861l750338l695710j103973J324248J406469R8179o6466R48924
37689a720598N16034j828141k366547J444789O171814O683392L471952J184710
37681A3557405Q70084q20341m351895n303119j880660J199047R5809j706509O53036
37672B312857M725317M172998r82470l954045j086895L533040M654669K319613
$$ plain form
37730 22943772 26516362 28413522 26027564 19970428 13400132 9193265 8225262 9881885
37722 9881885 13269012 17718811 22539125 26484261 27751176 25316973 20668455 17267713
37714 17267713 17338597 19733350 21817693 22532992 22061013 19241301 11899233 485236
37706 485236 -10569716 -16548338 -16558503 -13034503 -8312308 -3216905 1489385 4075930
37698 4075930 3118069 -632269 -4327979 -5431952 -4107704 -2701235 -2603056 -2669522 -1720598
37689 -1720598 -1204564 -3032705 -5399252 -3954463 2217351 8900743 12372695 13557405
37681 13557405 14427489 13607148 9255253 3952134 2071474 3270521 3366330 1659821 2312857
37672 2312857 7038174 11211172 10228702 6274657 5187762 8720802 13375471 15695084
37664A5695084k30230j321088j168199k03169O68723J36283j482788k164189j462502
37655H467925j551925l346292m207003k023545P51424N19520j555652j124122
37647d069670K165249L427681j17866m370810l788958Q84453L999209L020768
37639A150056J125639J326609K011910N17442j952935k299436o02482M38920K23781
37630A939504M72821R17163q63835m344320n205519j737860J820556J234018j865858
37621g633330l445587l239880l356649l343505j397635J246667J938907J304092
37613a7926920J488894J130042k244682n715499l611502K922596O091356K994856
37605a4870859m6826K108763N507264M361598M57700p04254J013128J511090q7805
$$ plain form
37664 15695084 15464854 14143766 12975567 12772398 13441121 13577404 12094616 9930427 8467925
37655 8467925 6916000 3569708 -637295 -2660840 -1909416 -1389896 -2945548 -4069670
37647 -4069670 -1904421 1523260 1405394 -2965416 -6754374 -5869921 -1870712 1150056
37639 1150056 2275695 3602304 5614214 6131656 4178721 1879285 1276803 1715723 1939504
37630 1939504 2412325 3329488 2465653 -1878667 -7084186 -8822046 -7001490 -5767472 -7633330
37621 -7633330 -11078917 -14318797 -17675446 -21018951 -22416586 -21169919 -19231012 -17926920
37613 -17926920 -16438026 -15307984 -17552666 -23268165 -26879667 -23957071 -17865715 -14870859
37605 -14870859 -14917685 -12808922 -7301658 -2940060 -2482360 -3186614 -2173486 -662396 -750201
37596g50201j193993j182006j440588j315558O21609K341660Q91488j502377L62394
37587c167572O114106R069026N236594j793398o442620p207457n428744k210100
37579e830165J045331K275557J324561N48126J286653K139524J950946J664744
37571F405277J757952Q57731j154854j567883J134388L976523K984617j473619
37563A2920132n242267n330528k462394N17682J350868J55271o84605O65637K654570
37554D544366K142512p88100k493803j066823J041783J186704J94575l36418j358242
37545C066554l876600n475324l025103K247211N604802M229054n17555n388518
37537c135479p586972n851006j540918K180417L961426N403059O808306M852779
$$ plain form
37596 -750201 -1944194 -3126200 -4566788 -5882346 -5260737 -2919077 -2027589 -3529966 -3167572
37587 -3167572 2946534 12015560 17252154 15458756 9016136 1808679 -3620065 -5830165
37579 -5830165 -4784834 -2509277 -1184716 -636590 650063 2789587 4740533 6405277
37571 6405277 8163229 9020960 7866106 6298223 7432611 11409134 14393751 12920132
37563 12920132 7677865 2347337 -115057 402625 1753493 1908764 1224159 1889796 4544366
37554 4544366 6686878 5898778 3404975 2338152 3379935 4566639 4761214 4424796 3066554
37545 3066554 -810046 -6285370 -9310473 -7063262 -1458460 2770594 2253039 -3135479
37537 -3135479 -10722451 -16573457 -18114375 -15933958 -11972532 -6569473 238833 5091612
37529E091612j839640p614360n745505J715001N956374L389275m70859m88235
37521f337R24634n85700l710977m203931j853229K10580J213808K846337M434791
37512g30024K802044k219699n866370l897972K038785O132200M579779q90562
37504A948181n110628m525299l63653L140192L545244K348065J988657K242638
37496E213397J186389j159998k347124q58276J765224K886520J812920J06918
37488H605970o21889n30495r64045k201269k493020m24354K111469J486244k218472
37479B750139l870605J43967N925542O345880P30290l998197k749015J354391
37471F632392K407111j4680j751095j002343M1522r4987j47821M83123P8933j914692
$$ plain form
37529 5091612 3251972 -4362388 -10107893 -8392892 -2436518 952757 481898 -6337
37521 -6337 918297 332597 -3378380 -7582311 -9435540 -9224960 -8011152 -5164815 -730024
37512 -730024 2072020 -147679 -6014049 -9912021 -7873236 -1741036 2838743 1948181
37504 1948181 -3162447 -7687746 -8051399 -4911207 -1365963 982102 2970759 5213397
37496 5213397 6399786 5239788 2892664 2034388 3799612 6686132 8499052 8605970
37488 8605970 7984081 7453586 6489541 4288272 1795252 1370898 3482367 4968611 2750139
37479 2750139 -1120466 -976499 4949043 11294923 12025213 8027016 5278001 6632392
37471 6632392 9039503 9024823 7273728 6271385 6312907 6217920 6070099 6553222 6632155 4717463
37461D717463k737025q5048L944087N320118L337500P84896n93651k005301m471590
37452H211449o224117m884073j160495J354857K71592k684584l608615j210597
37444i934583J266694j7890m055579n421494j008042N608985Q505298O701469
37436A644858M301642L950474L762116J690341n87505o71931J40651j206170m298890
37427H725586n462164l298021q13598q76068k099951j227900J879973L885933
37419G13790K372773j091302k805971j100458J877990K490013l67077l787681
37411a697923l870422j28338L906383M743673K630075M41268j69553m5532k25897
37402E583734j86984Q18289J950596J675650o0155j854557k827367l164757k691868
$$ plain form
37461 4717463 1980438 1895390 5839477 11159595 14497095 15281991 14688340 12683039 8211449
37452 8211449 1987332 -2896741 -4057236 -2702379 -2430787 -5115371 -8723986 -9934583
37444 -9934583 -8667889 -8685779 -12741358 -18162852 -19170894 -13561909 -5056611 1644858
37436 1644858 5946500 9896974 13659090 15349431 14761926 14089995 14230646 13024476 8725586
37427 8725586 3263422 -34599 -848197 -1724265 -3824216 -5052116 -3172143 713790
37419 713790 3086563 1995261 -810710 -1911168 -33178 2456835 2089758 -1697923
37411 -1697923 -5568345 -5696683 -1790300 2953373 5583448 6024716 5855163 5809631 5583734
37402 5583734 5396750 6215039 8165635 9841285 9781130 7926573 5099206 1934449 -757419
37393g57419p67190J638046J793802r77319k915873j14526N408921P363285L516018
37384A4187745j203735j793988M5199m61975l362904m398112k222585k01937m42151
37375A45557q65648o4622n20181l779788o152779l537635J891499M556492L612088
37366d715017L119132M467640M180037N79470k502577j494280J394526J800158
37358F829089o15231l136681m696841n725821n173981j980005J483136J721203
37350a1295132m88447j200756L02587P71188q51370j494967J98707J054582q38488
37341a3842096k015619Q59002N076341N942355L860325K478871K053298J77181
37333D589658k196793j502146J665933K439723n15357k643578r89513J174497
$$ plain form
37393 -757419 -1524609 113437 1907239 929920 -1985953 -2100479 3308442 10671727 14187745
37384 14187745 12984010 11190022 11235221 10773246 7410342 3012230 789645 587708 145557
37375 145557 -720091 -784713 -1304894 -5084682 -11237461 -14775096 -12883597 -8327105 -4715017
37366 -4715017 -1595885 2871755 7051792 7631262 5128685 3634405 5028931 6829089
37358 6829089 6213858 3077177 -1619664 -7345485 -12519466 -14499471 -13016335 -11295132
37350 -11295132 -11783579 -12984335 -12681748 -11910560 -12761930 -14256897 -14058190 -13003608 -13842096
37341 -13842096 -15857715 -14998713 -9922372 -3980017 -119692 2359179 4412477 4589658
37333 4589658 2392865 890719 2556652 4996375 4481018 1837440 847927 2022424
37325B022424K76112j593453p63555J365784N21065l324263n485595k959053J957613
37316g982921M624767K690254j936897m441388j533139M229790O470367L050760
37308E171593n79676R67213M771225L679016k744067o908290l641828K944159
37300C659345N306987J696731l279474n148414l752669j727569j042008j367843
37292e654914j058018N26054J938318J429619o22162k086432j628780J69689J904920
37283e081706K430679J313918n36133j280441n12058k68756j975942l597552k327618
37274a1835609Q34894K284562J137999k9508J48163N3624j227568j947675q37379
37265a1418497Q14601J753096K605074L501065K683449l94434k968844k308616
$$ plain form
37325 2022424 2298536 705083 -58472 1307312 1828377 -1495886 -6981481 -9940534 -7982921
37316 -7982921 -3358154 -667900 -2604797 -7046185 -8579324 -4349534 2120833 5171593
37308 5171593 4591917 5559130 10330355 14009371 11265304 4357014 715186 3659345
37300 3659345 8966332 10663063 7383589 2235175 -1517494 -3245063 -4287071 -5654914
37292 -5654914 -6712932 -6186878 -4248560 -2818941 -3441103 -5527535 -7156315 -6986626 -5081706
37283 -5081706 -2651027 -1337109 -1873242 -3153683 -3665741 -3934497 -5910439 -9507991 -11835609
37274 -11835609 -11000715 -8716153 -7578154 -7607662 -7459499 -7405875 -8633443 -10581118 -11418497
37265 -11418497 -10603896 -8850800 -6245726 -2744661 -61212 -455646 -3424490 -5733106
37257e733106N33764K285119J382832j101839l000137k466094L97837K656954
37249e044670J548044j213738j308395J388875K161167q28042l137205j286672
37241g720636J661176J960130J733989M067657N811427K341467l386375m376063
37233B092772p41218Q34562j398119j844697J815523M058913J040950k742008
37225C116678k164289K70309l56321k593202j468613K748283M893405K796660
37217G242910m96715j999203j835478j007842J88200J220169J579158J933160
37209F824359K732851K428357k51855l113199k744042M86743K876637K669236
37201A1909087J610899J055849m7861k339659m191241m051164k429248m43060
$$ plain form
37257 -5733106 -5199342 -2914223 -1531391 -2633230 -5633367 -8099461 -7701624 -5044670
37249 -5044670 -3496626 -4710364 -6018759 -4629884 -2468717 -3296759 -6433964 -7720636
37241 -7720636 -6059460 -4099330 -2365341 1702316 7513743 9855210 6468835 2092772
37233 2092772 1351554 2186116 787997 -1056700 758823 4817736 5858686 3116678
37225 3116678 952389 1222698 866377 -1726825 -3195438 -447155 4446250 7242910
37217 7242910 6746195 4746992 2911514 1903672 2091872 3312041 4891199 6824359
37209 6824359 9557210 11985567 11733712 8620513 5876471 6363214 9239851 11909087
37201 11909087 13519986 14575835 14527974 12188315 7997074 3945910 1516662 1073602
37193A073602J510656K587798J196423k651576o319177p208163n197136j698926
37185a6706499J934214M181060L733110J657622J151620L191086M353807J511869
37177E007889k928482l788640m36007K290522R34710k237056l239649j783627
37169f180340k79498N11877J745304L179901K752845O0343k126546j168734J962543
37160D57695L807703K332823j213678l826800l394110l86537K362616K120484
37152B260196p71862l013837k229400J21010R47226k04198r88865n2593J298595
37143b633728J674669J587283J670832R00620j535341l906631l658138q87561
37135f787995J857712K946318K853775K102800L31230j885270k383582r6238K842853
$$ plain form
37193 1073602 2584258 5172056 6368479 3716903 -2602274 -9810437 -15007573 -16706499
37185 -16706499 -14772285 -10591225 -6858115 -5200493 -4048873 -857787 3496020 5007889
37177 5007889 2079407 -1709233 -2145240 145282 1079992 -1157064 -4396713 -6180340
37169 -6180340 -6459838 -5947961 -4202657 -1022756 1730089 1790432 -336114 -1504848 457695
37160 457695 4265398 6598221 5384543 1557743 -1836367 -2222904 139712 2260196
37152 2260196 1488334 -1525503 -3754903 -3633893 -2686667 -2890865 -3879730 -3932323 -2633728
37143 -2633728 -959059 628224 2299056 3199676 1664335 -2242296 -5900434 -6787995
37135 -6787995 -4930283 -1983965 869810 2972610 3303840 1418570 -965012 -1061250 1781603
37126A781603L258390P00513k146338k575082n27274J591326J153154k160461
37118A075831n430047m809600K34724N588529O608953L170629p12579j863016
37110C863424p41580O58576J446792J470437L40753j544339k360258j060109O57826
37101B731522M46286j218564j699954j90748J088186J59396k096792l524357l462675
37092g767700k743344j813742j93237K252057M293278M102796J340371j657173
37084b186694j813829R31522L096331K166044Q9799o7R84016j55885k554465j604562
37074a047790L203622N844316K167269l567793m769795j719036M14470L15294
37066H40557J211908L593835L541385m97171m537821m739005k094439O01910K611122
$$ plain form
37126 1781603 5039993 5740506 3594168 1019086 491812 2083138 3236292 1075831
37118 1075831 -4354216 -9163816 -8929092 -3340563 3268390 6439019 5726440 3863424
37110 3863424 3121844 3780420 5227212 6697649 7038402 5494063 3133805 2073696 2731522
37101 2731522 3177808 1959244 259290 68542 1156728 1316124 -780668 -4305025 -7767700
37092 -7767700 -10511044 -12324786 -12518023 -10265966 -5972688 -1869892 -529521 -2186694
37084 -2186694 -4000523 -3069001 27330 2193374 2283173 2283106 3267122 3111237 556772 -1047790
37074 -1047790 2155832 8000148 10167417 6599624 1829829 110793 525263 840557
37066 840557 2052465 5646300 9187685 8690514 4152693 -586312 -2680751 -2078841 532281
37057E32281L717208K540184n92026k128151j3434K466275J081029k952957m709133
37048e8724k505003O67703K190206K528481K574970J827047M43799J98139J491417
37039I358035J547970k034721p043504q502178m815844J47780K019789J093443
37031h229230O72101J571842J339009q51533k009133N140K560067K146115J1914
37022b783708o3247J795602K148328Q49364J563231M606201M937691N9071n059092
37013H053441m891426j243209L65788q30079j126803P35457K178501J728899P10778
37004E681347q8873j424790k890434k772686j179096k29065o08139p68774l5882
36995d316392K45406p03692j799073k032373j689235j242629p48005l14924K87324
$$ plain form
37057 532281 4249489 6789673 6197647 4069496 4056062 6522337 7603366 4650409 -58724
37048 -58724 -2563727 -1896024 294182 2822663 5397633 7224680 7668479 7866618 9358035
37039 9358035 10906005 8871284 1827780 -6674398 -11490242 -11342462 -9322673 -8229230
37031 -8229230 -7557129 -5985287 -4646278 -5497811 -7506944 -7501804 -4941737 -2795622 -2783708
37022 -2783708 -2846955 -1051353 1096975 1946339 3509570 8115771 13053462 13112533 8053441
37013 8053441 3162015 1918806 2284594 1454515 327712 1063169 3241670 4970569 5681347
37004 5681347 5592474 4167684 1277250 -1495436 -2674532 -2903597 -3511736 -4280510 -4316392
36995 -4316392 -4070986 -4774678 -6573751 -8606124 -10295359 -11537988 -12285993 -12600917 -12313593
36986a2313593J651145K705702O65197m091503n581144M96029Q642073R004432
36978A178338R99571n233619k754056L418862M891398J373128j395019r29261
36970A549342L71273M90520l48693j808791l352996l131228m04228K194710K076642
36961b363449Q04519J301476K692188K058135l1316m19759Q52533N66767j726271
36952C734823k685394j055765J80262p18661j068820J298460L695187K571186
36944E951278q91535k797667k308370j759356k110101j942131q03585j63458m44716
36935g269641K221J834812K978924J495149j501029l415066l457768k715921j861604
36926a3909923n99954J005647K300033K964100K828693J293038j271484k192771
$$ plain form
36986 -12313593 -10662448 -7956746 -7291549 -11383052 -16964196 -16468167 -7826094 1178338
36978 1178338 2177909 -3055710 -5809766 -2390904 2500494 3873622 2478603 1549342
36970 1549342 1920615 2411135 2062442 253651 -3099345 -6230573 -6634801 -4440091 -2363449
36961 -2363449 -1558930 -257454 2434734 4492869 4461553 4041794 4894327 5461094 3734823
36952 3734823 1049429 -6336 173926 -544735 -1613555 -315095 3380092 5951278
36944 5951278 5059743 2262076 -46294 -1805650 -3915751 -5857882 -6661467 -6824925 -7269641
36935 -7269641 -7267420 -5432608 -2453684 -958535 -2459564 -5874630 -9332398 -12048319 -13909923
36926 -13909923 -14509877 -13504230 -11204197 -8240097 -5411404 -4118366 -5389850 -7582621
36918g582621O05750M274116L170468l162038p683440m419082L507463Q226694
36910c062690P413430N469673N328481M551033O99491m163335o701241o578643
36902B956199n115526k608735L85517J552041m15558l037069k665126R74822M748561
36893c224874N717561L384198m43015k763646j794542O48837R76041j049680j635212
36884a84332J109327L752471K591556q67950k753063k557035k255153j835091
36876b999270K2144K155189K013649k66834k551529m315587n730356m760695o3540
36867a6496829M379655L275693j554255k891388J044618L965556J656428j771732
36859h392254j250131J437857J960711R32584J560235K993278J860443j256346
$$ plain form
36918 -7582621 -6976871 -2702755 467713 -2694325 -10377765 -14796847 -11289384 -3062690
36910 -3062690 4350740 9820413 15148894 19699927 20399418 16236083 9534842 2956199
36902 2956199 -2159327 -4768062 -4382545 -2830504 -3246062 -6283131 -8948257 -7973435 -3224874
36893 -3224874 2492687 5876885 5433870 2670224 875682 1524519 2500560 1450880 -184332
36884 -184332 924995 4677466 7269022 6401072 3648009 1090974 -1164179 -2999270
36876 -2999270 -2977126 -821937 1191712 924878 -1626651 -5942238 -11672594 -16433289 -16496829
36867 -16496829 -12117174 -8841481 -10395736 -13287124 -12242506 -8276950 -6620522 -8392254
36859 -8392254 -9642385 -8204528 -6243817 -5311233 -3750998 -757720 1102723 -153623
36851a53623k417458q57064L6205j398320k515305p64787K577384M412457L347500
36842B266989K92283k670414l333872r08894K773801M744307L947508J885997
36834H997705K87938o44497j576228k765425l710822l475755j612996O46313R14775
36825b938992j481703l837521k827656J278437M664562M391451J575255k13937
36817F09896J011893L539489L711905O7339m303067m634319k86050L732491K390472
36808E840049l216762p069260n164400L49605M034716K984833m87823j591611
36800d320653J370186M469465K657738l138657o140045k432922L407747M531203
36792D04062J276192q9419K873602N528825L634194p26691l040430k423942q07698
$$ plain form
36851 -153623 -2571081 -3428145 -3391940 -4790260 -7305565 -8070352 -5492968 -1080511 2266989
36842 2266989 2559272 -111142 -3445014 -4353908 -1580107 3164200 7111708 8997705
36834 8997705 9285643 8641146 7064918 4299493 588671 -2887084 -4500080 -3853767 -2938992
36825 -2938992 -4420695 -8258216 -11085872 -9807435 -5142873 -751422 823833 609896
36817 609896 1621789 5161278 8873183 8940522 4637455 3136 -282914 3449577 5840049
36808 5840049 2623287 -4445973 -9610373 -9260768 -5226052 -2241219 -2729042 -4320653
36800 -4320653 -2950467 1518998 4176736 1038079 -5101966 -7534888 -4127141 404062
36792 404062 1680254 1590835 4464437 9993262 13627456 12900765 9860335 7436393 6628695
36783F628695R84703K872907L299426J063440j765758k225708r92356j044640
36775H820709k326329j824672O37714J152693j914716m424661k461052J427953
36767i12361K160907J34596K55682L554817N190996K148211j944675k488977n56643
36758G542553r7133j288347j210813K44199P479k461233l577712j220226J640090
36749d21143J130685k127540m225101l140116n31318J012889Q48250M32106J366261
36740e655027L282443L933948K144887j1718K93266K462025L279298J894710Q39625
36731A2463457J241475N50367k915851o286732n936500k697611j34208O69901
36723c045702J258023J924371J259516o87722j906950j350922l265J036431J383890
$$ plain form
36783 6628695 7613398 10486305 13785731 14849171 13083413 10857705 9865349 8820709
36775 8820709 6494380 4669708 5307422 6460115 4545399 120738 -2340314 -912361
36767 -912361 1248546 1383142 1638824 5193641 10384637 12532848 10588173 8099196 7542553
36758 7542553 7445420 6157073 4946260 5190459 5197938 2736705 -841007 -2061233 -421143
36749 -421143 709542 -1417998 -5643099 -8783215 -9314533 -8301644 -7453394 -7021288 -5655027
36740 -5655027 -2372584 1561364 3706251 3694533 3987799 6449824 9729122 11623832 12463457
36731 12463457 13704932 14255299 11339448 5052716 -883784 -3581395 -3715603 -3045702
36723 -3045702 -1787679 136692 1396208 708486 -1198464 -2549386 -2552651 -1516220 -132330
36714a32330M23207k140776m634905m535250j740295R52369J115494o91148j684789
36705a3068423M38516M956224P733121N037412j142146m047690o04452L836625
36697C139187K662498k668205n304693l339729j462352k298685k418757J053838
36689a0636898N184616N686126K857155R2462o76900M44449K735844M605541M139105
36680A4431500J598360q27732k570836m758320o078961l279844K377707M517625
36672E409499P76680k783510q77649K643283J733442j197222L65033M844621M090389
36663A5004566k993115p575709m157473J360465J200270l133350m854948k582885
36655g732179o68664j054480j025314R20717K206417Q64582o29207J029789M443289
$$ plain form
36714 -132330 290877 -1849899 -6484804 -11020054 -12760349 -11807980 -10692486 -11383634 -13068423
36705 -13068423 -12629907 -7673683 59438 5096850 3954704 -92986 -697438 3139187
36697 3139187 5801685 3133480 -2171213 -5510942 -6973294 -9271979 -11690736 -10636898
36689 -10636898 -5452282 233844 3090999 3183461 2506561 2951010 5686854 10292395 14431500
36680 14431500 16029860 15202128 12631292 7872972 1794011 -1485833 891874 5409499
36672 5409499 6186179 3402669 2525020 5168303 6901745 5704523 6069556 10914177 15004566
36663 15004566 12011451 4435742 278269 1638734 2839004 -294346 -5149294 -7732179
36655 -7732179 -8400843 -9455323 -10480637 -9559920 -7353503 -6488921 -7118128 -6088339 -1645050
36646a645050M782369O09478l473188k755312J054474K418996K71779o93130J871612
36637B442028L527404K11774m427615m317255p68054k97223l701579m685368l35302
36628a2351190M283607M631422L102250K957181J939905k529405o567057m848464
36620i381751N29045K910253J241926P86578M043024P271719O958124M207299
36612A8566217J175454j974764m614543m626918k315322j452080l657637n221531
36604d121124k712077J379079K503026J206581J812677M930203O050361K355542
36596A3404268k975668n080160l344422q60103L31885R92809K187629L249798
36588G906036K912425J273811l45617j184403j854236l133398m456812m251743
$$ plain form
36646 -1645050 3137319 3746797 273609 -2481703 -1427229 991767 1263546 570416 2442028
36637 2442028 5969432 6181206 1753591 -2563664 -3331718 -3628941 -7330520 -12015888 -12351190
36628 -12351190 -8067583 -3436161 -333911 2623270 4563175 2033770 -4533287 -9381751
36620 -9381751 -8852706 -5942453 -4700527 -3913949 129075 7400794 14358918 18566217
36612 18566217 19741671 17766907 13152364 8525446 6210124 4758044 1100407 -4121124
36604 -4121124 -6833201 -5454122 -2951096 -1744515 68162 4998365 11048726 13404268
36596 13404268 10428600 5348440 2004018 1143915 1475800 2468609 4656238 7906036
36588 7906036 10818461 12092272 11746655 10562252 8708016 5574618 1117806 -3133937
36580c133937j869201J324771L237425L290374K880381L408408M249385L302141
36572A6689747l08512m668748o798007n672531k856376l23105J306385K173653
36564d57494K111157J050223l14557j225728j640225j515479k39721J964277K967733
36555B700186R99140k277807l045895j12631L443912M194872K304798M24157q0209
36546H550523l01253j710813m115295n758582n051294k312248K80019R94449N18085
36537h906409O42257J400487J238341m829n72020Q0632Q0383j531659k601815
36528a0174632j044949J770511L264125L506249L925590L670740R29648k803460
36520C043822l796440j708466k70332j381275k376959r73680P24459j1144j655766
$$ plain form
36580 -3133937 -5003138 -3678367 -440942 2849432 5729813 9138221 13387606 16689747
36572 16689747 16381235 11712487 4914480 -758051 -3614427 -3937532 -2631147 -457494
36564 -457494 1653663 2703886 2389329 1163601 -476624 -1992103 -2231824 -267547 2700186
36555 2700186 3699326 1421519 -1624376 -1737007 1706905 5901777 8206575 8630732 8550523
36546 8550523 8249270 6538457 2423162 -3335420 -8386714 -10698962 -10418943 -9424494 -8906409
36537 -8906409 -8264152 -6863665 -5625324 -5630153 -6202173 -6121541 -6041158 -7572817 -10174632
36528 -10174632 -11219581 -9449070 -6184945 -2678696 1246894 4917634 5847282 3043822
36520 3043822 -752618 -2461084 -2731416 -4112691 -6489650 -7463330 -6738871 -6750015 -8405781
36511h405781q77830J909837L219441K043513J138014K386268L906097K949916
36503H269475l18313l215004l555516j408961J310929K362582R56525j424929
36495B976788k318383n99803K619608N053158M798547J591194k498361m192356
36487G430392k156966J213477K437627J071502l98678o14566j090636l131338
36479D760814n079396m412689j500828O70912L66017q97605o15291J504886L361917
36470a841263L061060R66734r57472j376434o99246j55875m32058j414871k611985
36461e461410l322491k922611j558929r9856J068119K412701L727593L400817
36453b756067O94005k175498k333341k55825R25816K79655M65814L165036N726333
$$ plain form
36511 -8405781 -9283611 -7373774 -4154333 -2110820 -972806 1413462 5319559 8269475
36503 8269475 7951162 4736158 1180642 -228319 1082610 3445192 4401717 2976788
36495 2976788 658405 58602 2678210 7731368 12529915 14121109 11622748 7430392
36487 7430392 5273426 6486903 8924530 9996032 9597354 8982788 7892152 4760814
36479 4760814 -318582 -4731271 -6232099 -5561187 -5195170 -6092775 -6708066 -5203180 -1841263
36470 -1841263 1219797 2186531 1229059 -147375 -846621 -1002496 -1434554 -2849425 -5461410
36461 -5461410 -8783901 -11706512 -13265441 -13365297 -12297178 -9884477 -6156884 -2756067
36453 -2756067 -2062062 -4237560 -6570901 -6826726 -5900910 -5621255 -5155441 -1990405 3735928
36444C735928M530206K7114l951053m969318l804047k037186k56963J141902J451401
36435d132016P39713J34418L46094Q62682J073122J260957J946690K963356L659312
36426H854328L488006K158114j56536k506409l751529l778557l504324l374774
36418b571681k597720l98457K508052M319174L837595J507110r77104k037175
36410C589794j668814j525426k829518m250747l118005Q31838M405591M723610
36402A58323K690285J155425Q58574M50914k25358K05254J569404J759614L74697
36393H997132k50127P49433O27972k316019m863637l428788k93525m99175l582504
36384d859238l935436J89584L744513K845665K67651j96231J9135j905118l986700
$$ plain form
36444 3735928 8266134 8293248 4342195 -627123 -4431170 -6468356 -6725319 -5583417 -4132016
36435 -4132016 -3392303 -3257885 -2911791 -2049109 -975987 284970 2231660 5195016 8854328
36426 8854328 12342334 14500448 14343912 11837503 8085974 4307417 803093 -2571681
36418 -2571681 -5169401 -5567858 -3059806 1259368 5096963 6604073 5626969 3589794
36410 3589794 1920980 395554 -2433964 -6684711 -9802716 -8970878 -4565287 158323
36402 158323 2848608 4004033 4862607 5313521 5088163 5293417 6862821 8622435 8997132
36393 8997132 8747005 9496438 10124410 7808391 2944754 -484034 -777559 -1276734 -4859238
36384 -4859238 -8794674 -8605090 -4860577 -2014912 -1747261 -1943492 -1924357 -3829475 -7816175
36375g816175k517209J177787K640848J488551J194869K442755K328131K70904
36367A210461q00043N3065L42672o01522j95420J905262K165274n85157k465460
36358A029132j211290l95157k864309m712734j198698M859395O676658L462233
36350E645230P89892J804599L682157L196109R95043p74839j484546j528793j394307
36341A0930545j783106k674369k573468p39927Q99194N60134l19390j07875r92948
36332C198790n153175q505728m718270M281943Q688601L955043k761689l087903
36324d102388J098059K111859j292264k670376J799800P363149O700477j152476
36316I855840r712227j1753576o180334J464465N008870L737469J800415K258835
$$ plain form
36375 -7816175 -10333384 -9155597 -6514749 -5026198 -3831329 -1388574 939557 1210461
36367 1210461 410418 463483 806155 204633 9213 1914475 4079749 3494592 1029132
36358 1029132 -182158 -577315 -3441624 -8154358 -9353056 -4493661 2182997 5645230
36350 5645230 6435122 8239721 11921878 15117987 16113030 15338191 13853645 12324852 10930545
36341 10930545 9147439 6473070 3899602 3159675 4058869 4619003 4299613 4191738 3198790
36332 3198790 -1954385 -10460113 -15178383 -10896440 -2207839 1747204 -1014485 -4102388
36324 -4102388 -3004329 -892470 -2184734 -4855110 -3055310 4307839 11008316 9855840
36316 9855840 143613 -11609963 -17790297 -16325832 -11316962 -7579493 -5779078 -3520243
36308c520243L775467L535661J183043j387908k548543j992091m36231Q04537
36300e86308Q84137L84661Q6203q03908l067436m548806k102786L006790N300720
36291a446733K195486k429170l732840j769809N14549J938324K647484J731292
36283c51417j128360l447858k769917l18806J156074J629071K715991L852955
36275A337733L132983J013345k84188m66160j001247j785517j223509O12354J884878
36266C220672J813729R38919o77302k502758j903379K526666O547280L962948
36258A3926775m478127j0376283p681852K38795N586539N017860J208154j829344
36250A612517k223008n33679J167505J247935O56657J886618M982196O471956
$$ plain form
36308 -3520243 255224 3790885 4973928 3586020 1037477 -954614 -1390845 -586308
36300 -586308 297829 682490 768693 -35215 -3102651 -7651457 -9754243 -6747453 -1446733
36291 -1446733 748753 -1680417 -5413257 -7183066 -6668517 -4730193 -2082709 -351417
36283 -351417 -1479777 -4927635 -7697552 -8016358 -6860284 -5231213 -2515222 1337733
36275 1337733 4470716 5484061 5199873 4733713 3732466 1946949 723440 1335794 3220672
36266 3220672 5034401 5973320 5296018 2793260 889881 3416547 9963827 13926775
36258 13926775 9448648 -927635 -8609487 -8370692 -2784153 2233707 3441861 1612517
36250 1612517 -610491 -1144170 23335 1271270 1927927 3814545 8796741 15268697
36242A5268697L694240j471550m851277m709050k670058r47774k90061k21765
36234C801402p9055J82600j26205j365826k598999k719582k283971k612341l142273
36225a0944250j801253J505117L988893L554457J336913m29452j163818j269010
36217e222403o51069L74465L42560j216419k159625l77617K783064L883897J810642
36208d32505j150490k616718k597075k197270j477850J26446J885208J786849
36200f673405p83633l159945j791701L045149O616774N258408J161373n90514
36192C082506J136469K606938J114141j485981k206129r83313L93720R91947M23153
36183E073451j971444n262550o090541k479089K642825M532655K591880M57406
$$ plain form
36242 15268697 18962937 17491387 12640110 7931060 5261002 4313228 4023167 3801402
36234 3801402 3722347 3904947 3778742 2412916 -186083 -2905665 -5189636 -7801977 -10944250
36225 -10944250 -12745503 -11240386 -7251493 -3697036 -2360123 -2789575 -3953393 -5222403
36217 -5222403 -5873472 -5499007 -5156447 -6372866 -8532491 -8910108 -6127044 -2243147 -432505
36208 -432505 -1582995 -4199713 -6796788 -8994058 -10471908 -10345462 -8460254 -6673405
36200 -6673405 -7457038 -10616983 -12408684 -9363535 -2746761 2511647 3673020 3082506
36192 3082506 4218975 6825913 7940054 6454073 4247944 3264631 3658351 4650298 5073451
36183 5073451 3102007 -2160543 -8251084 -10730173 -8087348 -3554693 -962813 -505407
36175e05407M70586J145535P29622L07276J576543L450862L132757n7632l759635
36166F490507n407377m493055j859952J577266M495267N038750K796539J21392
36158H759337n71790l84244k219674n501060o112708k864539j42444j390292l611468
36149a4038882k437199M91474O40014j131455p516L798109M758658J592137l12818
36140f647478J671300K994218P64572l31768L298133O095368J691964n417291
36132D119018n543540J265912N237050J598832l542591l752950p87703O48356
36124g57616J08644p77848k603656n679839o850864l390986K194449N201827M860392
36115g695497L907389L502528K269513j80941k164402k589364k135385j376834
$$ plain form
36175 -505407 -34821 1110714 1840336 2147612 3724155 7175017 10307774 10250142 6490507
36166 6490507 1083130 -3409925 -5269877 -3692611 802656 5841406 8637945 8759337
36158 8759337 8187547 7803303 5583629 82569 -6030139 -8894678 -9037122 -10427414 -14038882
36149 -14038882 -16476081 -15984607 -15344593 -16476048 -16483564 -12685455 -7926797 -6334660 -6647478
36140 -6647478 -4976178 -1981960 -1217388 -1549156 1748977 7844345 9536309 4119018
36132 4119018 -1424522 -158610 5078440 6677272 3134681 -618269 -1405972 -757616
36124 -757616 -648972 -1426820 -4030476 -9710315 -16561179 -19952165 -17757716 -12555889 -7695497
36115 -7695497 -3788108 -285580 1983933 1802992 -361410 -2950774 -5086159 -6462993
36107f462993J28934K270030L623542L125899J375170m67059k157826l876088
36099b440391m867935l823244q00298K231707L518551L518560L680729L729198
36091D746877J939849j668373m515161m921329m425715m829581m634576j154639
$$ plain form
36107 -6462993 -6334059 -4064029 -440487 2685412 4060582 3593523 1435697 -2440391
36099 -2440391 -7308326 -11131570 -11931868 -9700161 -6181610 -2663050 1017679 4746877
36091 4746877 6686726 5018353 503192 -4418137 -8843852 -13673433 -18308009 -19462648
$$ [...]
##END NTUPLES=NMR SPECTRUM
##END=
