##TITLE=31Pdec_DE-122K3_HCl
D2O, 24 sc
 2.2.2026
##JCAMPDX= 6.0         $$ Bruker NMR JCAMP-DX V2.0
##DATA TYPE= NMR SPECTRUM
##DATA CLASS= NTUPLES
##ORIGIN= UXNMR, Bruker Analytische Messtechnik GmbH
##OWNER= root
$$ XWIN-NMR		Version 3.5
$$ Mon Feb  2 13:46:25 2026 Russian Standard Time (UT+4h)  she@DPX200
##.OBSERVE FREQUENCY= 81.013821
##.OBSERVE NUCLEUS= ^31P
##.ACQUISITION MODE= SIMULTANEOUS
##.ACQUISITION SCHEME= undefined
##.AVERAGES= 24
##.DIGITISER RES= 17
##SPECTROMETER/DATA SYSTEM= spect
##.PULSE SEQUENCE= zgpg30
##.SOLVENT NAME= D2O
##.SHIFT REFERENCE= (INTERNAL, D2O, 0, 198.062)
##AUDIT TRAIL= $$ (NUMBER, WHEN, WHO, WHERE, WHAT)
$$ ##TITLE= Audit trail, XWIN-NMR		Version 3.5
$$ ##JCAMPDX= 5.01
$$ ##ORIGIN= Bruker BioSpin GmbH
$$ ##OWNER= she
$$ F:/spectra/data/she/nmr/P31/2/pdata/1/auditp.txt
$$ ##AUDIT TRAIL=  $$ (NUMBER, WHEN, WHO, WHERE, WHAT)
(   1,<2026-02-02 13:44:44.46 +0400>,<she>,<DPX200>,
      <created by zg, POWCHK disabled, PULCHK disabled
       configuration hash MD5:
       00 E9 B6 7A A2 85 ED C7 34 08 36 98 17 FE 4E 26
       data hash MD5: 32K
       55 30 05 38 71 B2 47 53 49 25 2C 93 21 21 FB 2B>)
(   2,<2026-02-02 13:45:14.07 +0400>,<she>,<DPX200>,
      <Start of raw data processing
       efp BC_mod = 2 LB = 1.5 FT_mod = 6 PKNL = 1 PHC0 = 1390.164 PHC1 = 52.50091 SI = 64K 
       data hash MD5: 64K
       03 9D 25 9F 73 98 81 17 0B C6 77 E7 2A 7E C2 D0>)
(   3,<2026-02-02 13:45:35.70 +0400>,<she>,<DPX200>,
      <pk PHC0 = -10.29675 PHC1 = 14.8 
       data hash MD5: 64K
       67 CE FB F9 66 9E CD A1 F1 40 03 EE 8D 16 B0 DF>)
(   4,<2026-02-02 13:45:39.12 +0400>,<she>,<DPX200>,
      <abs ABSG = 5 
       data hash MD5: 64K
       48 3E 06 B8 71 D7 E1 68 D5 AF 1F C2 0F AF FF 58>)
$$ ##END=
$$ 
$$ hash MD5
$$ BE 3E 45 B3 2B 09 32 C7 D7 76 C6 E4 0C 0D 41 36
##$RELAX= 
##$RELAX= 
##$RELAX= 
##$RELAX= 
##$RELAX= 
##$RELAX= 
##$RELAX= 
##$RELAX= 
$$ Bruker specific parameters
$$ --------------------------
##$DU= <F:/spectra>
##$EXPNO= 2
##$NAME= <P31>
##$PROCNO= 1
##$TYPE= <nmr>
##$USER= <she>
##$AMP= (0..31)
100 100 100 100 100 100 100 100 100 100 100 100 100 100 100 100 100 100 
100 100 100 100 100 100 100 100 100 100 100 100 100 100 
##$AQSEQ= 0
##$AQ_mod= 1
##$AUNM= <au_zg>
##$AUTOPOS= <>
##$BF1= 81.014009
##$BF2= 200.13
##$BF3= 200.13
##$BF4= 200.13
##$BF5= 200.13
##$BF6= 200.13
##$BF7= 200.13
##$BF8= 200.13
##$BYTORDA= 1
##$CFDGTYP= 0
##$CFRGTYP= 5
##$CHEMSTR= <none>
##$CNST= (0..31)
1 1 145 1 1 1 1 1 1 1 1 1 1 1 1 1 1 1 1 1 1 1 1 1 1 1 1 1 1 1 1 1 
##$CPDPRG= <waltz16>
##$CPDPRG1= <>
##$CPDPRG2= <waltz16>
##$CPDPRG3= <>
##$CPDPRG4= <mlev>
##$CPDPRG5= <mlev>
##$CPDPRG6= <mlev>
##$CPDPRG7= <mlev>
##$CPDPRG8= <mlev>
##$CPDPRGB= <>
##$CPDPRGT= <>
##$D= (0..31)
0 1 0 0 0 0 0 0 0 0.06 0 0.03 2e-05 3e-06 0 0 0.0002 0 0 0 0 0 0 0 0 0 
0 0 0 0 0 0 
##$DATE= 1770025483
##$DBL= (0..7)
120 120 120 11 120 120 24 19 
##$DBP= (0..7)
150 150 150 150 150 150 150 150 
##$DBP07= 0
##$DBPNAM0= <>
##$DBPNAM1= <>
$$ [...]
##$SUBNAM3= <"">
##$SUBNAM4= <"">
##$SUBNAM5= <"">
##$SUBNAM6= <"">
##$SUBNAM7= <"">
##$SUBNAM8= <"">
##$SUBNAM9= <"">
##$SW= 400.765351723535
##$SWIBOX= (0..15)
0 1 3 0 0 0 0 0 0 0 0 0 0 0 0 0 
##$SW_h= 32467.5324675325
##$TD= 32768
##$TD0= 1
##$TE= 0
##$TE2= 300
##$TE3= 300
##$TEG= 300
##$TL= (0..7)
0 120 53 12 22 120 120 120 
##$TP= (0..7)
150 150 150 150 150 150 150 150 
##$TP07= 0
##$TPNAME0= <>
##$TPNAME1= <>
##$TPNAME2= <>
##$TPNAME3= <>
##$TPNAME4= <>
##$TPNAME5= <>
##$TPNAME6= <>
##$TPNAME7= <>
##$TPOAL= (0..7)
0.5 0.5 0.5 0.5 0.5 0.5 0.5 0.5 
##$TPOFFS= (0..7)
0 0 0 0 0 0 0 0 
##$TUNHIN= 0
##$TUNHOUT= 0
##$TUNXOUT= 0
##$USERA1= <user>
##$USERA2= <user>
##$USERA3= <user>
##$USERA4= <user>
##$USERA5= <user>
##$V9= 5
##$VALIST= <valist>
##$VCLIST= <CCCCCCCCCCCCCCC>
##$VD= 0
##$VDLIST= <DDDDDDDDDDDDDDD>
##$VPLIST= <PPPPPPPPPPPPPPP>
##$VTLIST= <TTTTTTTTTTTTTTT>
##$WBST= 1024
##$WBSW= 4
##$XGAIN= (0..3)
0 0 0 0 
##$XL= 0
##$YL= 0
##$YMAX_a= 15345
##$YMIN_a= -14060
##$ZGOPTNS= <>
##$ZL1= 120
##$ZL2= 120
##$ZL3= 120
##$ZL4= 120
##$ABSF1= 198.0616
##$ABSF2= -202.7028
##$ABSG= 5
##$ABSL= 3
##$ALPHA= 0
##$AQORDER= 0
##$ASSFAC= 0
##$ASSFACI= 0
##$ASSFACX= 0
##$ASSWID= 0
##$AUNMP= <proc_1d>
##$AZFE= 0.1
##$AZFW= 0.5
##$BCFW= 0
##$BC_mod= 2
##$BYTORDP= 0
##$COROFFS= 0
##$CY= -3
##$DATMOD= 1
##$DC= 0
##$DFILT= <>
##$DTYPP= 0
##$F1P= 0
##$F2P= 0
##$FCOR= 1
##$FTSIZE= 65536
##$FT_mod= 6
##$GAMMA= 0
##$GB= 0
##$INTBC= 1
##$INTSCL= 9.790993e-09
##$ISEN= 30
##$LB= 1.5
##$LEV0= 0
##$LPBIN= 0
##$MAXI= 10000
##$MC2= 0
##$MEAN= 0
##$ME_mod= 0
##$MI= 50
##$NCOEF= 0
##$NC_proc= -6
##$NLEV= 6
##$NOISF1= 182.463
##$NOISF2= 159.3651
##$NSP= 0
##$NTH_PI= 0
##$NZP= 0
##$OFFSET= 198.0616
##$PC= 4
##$PHC0= 1379.867
##$PHC1= 67.30091
##$PH_mod= 1
##$PKNL= yes
##$PPARMOD= 0
##$PSCAL= 0
##$PSIGN= 0
##$REVERSE= no
##$SF= 81.0140089999434
##$SI= 65536
##$SIGF1= 159.3651
##$SIGF2= -187.1042
##$SINO= 113.3802
##$SIOLD= 16384
##$SREGLST= <1H.CDCl3>
##$SSB= 0
##$STSI= 65536
##$STSR= 0
##$SW_p= 32467.5324675325
##$SYMM= 0
##$S_DEV= 0
##$TDeff= 32768
##$TDoff= 0
##$TI= <>
##$TILT= no
##$TM1= 0
##$TM2= 0
##$TOPLEV= 0
##$USERP1= <user>
##$USERP2= <user>
##$USERP3= <user>
##$USERP4= <user>
##$USERP5= <user>
##$WDW= 1
##$XDIM= 65536
##$YMAX_p= 322532479
##$YMIN_p= -14861997
$$ End of Bruker specific parameters
$$ ---------------------------------
##NTUPLES= NMR SPECTRUM
##VAR_NAME=  FREQUENCY,     SPECTRUM/REAL,   SPECTRUM/IMAG
##SYMBOL=    X,             R,               I
##VAR_TYPE=  INDEPENDENT,   DEPENDENT,       DEPENDENT
##VAR_FORM=  AFFN,          ASDF,            ASDF
##VAR_DIM=   65536,         65536,           65536
##UNITS=     HZ,            ARBITRARY UNITS, ARBITRARY UNITS
##FACTOR=    0.49542278885378, 1,            1
##FIRST=     16045.7642231865, 0,            0
##LAST=      -16421.768244346, 0,            0
##MIN=       -16421.768244346, -14861997,    0
##MAX=       16045.7642231865, 322532479,    0
$$ Real data points
##PAGE= N=1
##DATA TABLE= (X++(R..R)), XYDATA
$$ [...]
$$ plain form
38322 -82467 234875 637156 971438 1009372 709217 302117 95759 231152 624710 1084633
38312 1084633 1460214 1699965 1774876 1591859 1100318 508067 205966 322489 497114 332371
38302 332371 -6782 60732 752449 1563137 1808852 1334875 553110 -56268 -324178 -391932
38292 -391932 -489358 -672644 -724372 -406397 164341 578891 657835 676897 897397 1108455
38282 1108455 927706 395308 -91023 -366651 -638387 -1006003 -1247167 -1226730 -1159492 -1219145
38272 -1219145 -1174439 -732869 -52985 430437 576510 576223 480795 105163 -517591 -972018
38262 -972018 -969711 -761578 -796153 -1143585 -1498897 -1614905 -1461356 -1038155 -336344 475105
38252 475105 1055132 1179111 913556 494409 152939 25198 44767 -71540 -518789 -1062747
$$ packed form
38322h2467L17342M02281L34282L7934l00155m07100k06358J35393L93558M59923
38312A084633L75581K39751P4911j83017m91541n92251l02101J16523J74625j64743
38302C32371l39153O7514O91717Q10688K45715m73977p81765o09378k67910o7754
38292c91932r7426j83286n1728L17975N70738M14550P8944J9062K20500K11058
38282A108455j80749n32398m86331k75628k71736l67616k41164K0437O7238n9653
38272a219145M4706M41570O79884M83422J46073k87r5428l75632o22754m54427
38262i72018K307K08133l4575l47432l55312j16008J53549M23201P01811Q11449
38252D75105N80027J23979k65555m19147l41470j27741J9569j16307m47249n43958
$$ plain form
38242 -1062747 -1245258 -993164 -747177 -844498 -1053866 -965616 -615168 -396941 -491724 -725590
38232 -725590 -944745 -1168839 -1331949 -1226224 -860736 -604911 -752306 -1098849 -1168230 -784496
38222 -784496 -255669 -22774 -240768 -673066 -913254 -752005 -397893 -284347 -592542 -1033831
38212 -1033831 -1175355 -887555 -367226 165460 602179 839261 789536 572243 487025 659583
38202 659583 854863 806230 613051 581297 716487 666697 253284 -223605 -414771 -426495
38192 -426495 -581127 -821898 -781806 -451130 -302862 -564376 -806620 -613665 -297197 -426124
38182 -426124 -850010 -820519 -114521 577489 618210 262467 147241 325881 314295 -72637
38172 -72637 -440798 -400120 -25273 394173 764981 1159264 1551905 1801359 1842844 1739465
$$ packed form
38242a062747j82511K52094K45987r7321k09368Q8250L50448K18227r4783k33866
38232g25590k19155k24094j63110J05725L65488K55825j47395l46543o9381L83734
38222g84496N28827K32895k17994m32298k40188J61249L54112J13546l08195m41289
38212a033831j41524K87800N20329N32686M36719K37082m9725k17293q5218J72558
38202F59583J95280m8633j93179l1754J35190m9790m13413m76889j91166j1724
38192d26495j54632k40771M0092L30676J48268k61514k42244J92955L16468j28927
38182d26124m23886K9491P05998O92010M0721l55743j15226J78640j1586l86932
38172g2637l68161M0678L74847M19446L70808L94283L92641K49454M1485j03379
$$ plain form
38162 1739465 1517940 1070336 322762 -520370 -1038100 -999082 -628710 -338304 -255413 -212230
38152 -212230 -140432 -171239 -290043 -247705 -13913 10062 -445032 -989858 -1023191 -558311
38142 -558311 -144955 -12624 195435 717058 1197282 1224009 978983 945185 1144054 1091833
38132 1091833 516064 -247621 -709611 -830235 -962602 -1316240 -1723644 -1960764 -2071498
38123 -2071498 -2209720 -2297713 -2103665 -1658178 -1319522 -1310033 -1423077 -1365290 -1174072 -1057317
38113 -1057317 -1007853 -887311 -768545 -847932 -1069886 -1173129 -1080217 -910552 -665422 -315560
38103 -315560 -171287 -627149 -1423673 -1732640 -1245966 -652067 -656714 -1034057 -1160170 -1046159
38093 -1046159 -1151170 -1415337 -1249399 -497821 269134 583037 627907 725886 755701 423937
$$ packed form
38162A739465k21525m47604p47574q43132n17730L9018L70372K90406Q2891M3183
38152b12230P1798l0807j18804M2338K33792K3975m55094n44826l3333M64880
38142e58311M13356J32331K08059N21623M80224K6727k45026l3798J98869n2221
38132A091833n75769p63685m61990j20624j32367l53638m07404k37120j10734
38123b071498j38222q7993J94048M45487L38656R489j13044N7787J91218J16755
38113a057317M9464J20542J18766p9387k21954j03243R2912J69665K45130L49862
38103c15560J44273m55862p96524l08967M86674N93899m647l77343j26113J14011
38093a046159j05011k64167J65938P51578P66955L13903M4870R7979K9815l31764
$$ plain form
38083 423937 -193977 -708742 -843497 -592521 -126265 266436 294113 -72165 -511134 -644948
38073 -644948 -373906 96324 448066 489684 371832 532607 1186000 1887786 1931415 1217479
38063 1217479 381773 -17944 -39135 60604 295433 695235 997200 1013852 981646 1085325
38053 1085325 943271 152361 -842394 -1101509 -430801 367188 625481 594901 802061 1148826
38043 1148826 1121380 604647 9862 -317125 -434944 -548425 -693584 -753591 -638195 -390585
38033 -390585 -169982 -119175 -228254 -387882 -567096 -793217 -941679 -784495 -378337 -167528
38023 -167528 -455352 -928321 -1004137 -587547 -160873 -86437 -135387 107903 580985 761727
38013 761727 348238 -291055 -480058 14820 736586 1067798 872582 496807 255673 163850
$$ packed form
38083D23937o17914n14765j34755K50976M66256L92701K7677l66278m38969j33814
38073f44948K71042M70230L51742M1618j17852J60775O53393P01786M3629p13936
38063A217479q35706l99717k1191R9739K34829L99802L01965J6652l2206J03679
38053A085325j42054p90910r94755k59115O70708P97989K58293l0580K07160L46765
38043A148826k7446n16733n94785l26987j17819j13481j45159o0007J15396K47610
38033c90585K20603N0807j09079j59628j79214k26121j48462J57184M06158K10809
38023a67528k87824m72969p5816M16590M26674P4436m8950K43290M73082J80742
38013G61727m13489o39293j89003M94878P21766L31212j95216l75775k41134r1823
$$ plain form
38003 163850 158362 280482 487691 536016 290000 -17829 -106362 -104840 -376592 -921866 -1287448
37992 -1287448 -1134577 -624574 -154272 39832 -87565 -486588 -961552 -1235285 -1267085 -1356215
37982 -1356215 -1750908 -2302467 -2681436 -2763648 -2590815 -2150925 -1519606 -1079648 -1188920 -1628583
37972 -1628583 -1770140 -1373724 -856389 -626426 -522258 -174314 374188 760827 846917 804271
37962 804271 727000 502601 97969 -314625 -600487 -817132 -1043300 -1232980 -1324994 -1341693
37952 -1341693 -1284620 -1060939 -616090 -61464 390760 554130 332647 -200907 -759841 -1038195
37942 -1038195 -1029441 -1021561 -1211343 -1472341 -1577979 -1476038 -1232409 -901898 -626618 -667221
37932 -667221 -1076442 -1460206 -1356442 -824939 -400697 -451443 -820278 -1131838 -1201593 -1057288
$$ packed form
38003A63850n488J22120K07209M8325k46016l07829q8533J522k71752n45274l65582
37992a287448J52871N10003M70302J94104j27397l99023m74964k73733l1800q9130
37982a356215l94693n51559l78969q2212J72833M39890O31319M39958j09272m39663
37972a628583j41557L96416N17335K29963J04168L47944N48502L86639Q6090m2646
37962H04271p7271k24399m04632m12594k85862k16645k26168j89680r2014j6699
37952a341693N7073K23681M44849N54626M52224J63370k21483n33554n58934k78354
37942a038195Q754P880j89782k60998j05638J01941K43629L30511K75280m0603
37932f67221m09221l83764J03764N31503M24242n0746l68835l11560o9755J44305
$$ plain form
37922 -1057288 -782254 -483651 -272477 -151056 -28324 70623 -44861 -445463 -871979 -977514
37912 -977514 -720981 -368585 -128269 68471 384097 777681 974190 733663 126776 -479536
37902 -479536 -727666 -560536 -216281 23206 60865 28828 155827 524792 905262 922865
37892 922865 489180 -49887 -328423 -387767 -486580 -628368 -604471 -453048 -478330 -731038
37882 -731038 -845125 -572056 -166644 -25790 -209976 -544764 -923876 -1235225 -1239559 -867979
37872 -867979 -461541 -366595 -441855 -338268 -133043 -230071 -654123 -917421 -700463 -266963
37862 -266963 -25333 -9490 -21166 -29791 -155937 -385538 -539261 -500908 -334003 -169955
37852 -169955 -50160 100238 321667 458792 300156 -24311 -1123 639237 1395435 1468812
$$ packed form
37922a057288K75034K98603K11174J21421J22732R8947j15484m00602m26516j05535
37912i77514K56533L52396K40316J96740L15626L93584J96509k40527o06887o06312
37902d79536k48130J67130L44255K39487L7659l2037J26999L68965L80470J7603
37892I22865m33685n39067k78536n9344r8813j41788K3897J51423k5282k52708
37882g31038j14087K73069M05412J40854j84186l34788l79112l11349m334L71580
37872h67979M06438R4946p5260J03587K05225r7028m24052k63298K16958M33500
37862b66963K41630J5843j1676q625j26146k29601j53723L8353J66905J64048
37852a69955J19795J50398K21429J37125j58636l24467K3188O40360P56198P3377
$$ plain form
37842 1468812 741691 -88767 -386035 -196890 82144 233582 217512 26421 -180592 -95356
37832 -95356 312825 645952 600955 353607 143550 -172426 -743910 -1222152 -1181121 -852524
37822 -852524 -819948 -1033402 -810891 25959 678801 429680 -306480 -512740 92995 792345
37812 792345 889941 494287 123956 -55096 -243507 -440507 -302608 308055 949944 1068823
37802 1068823 705559 418728 533695 822307 984145 1028105 967355 569608 -173052 -651859
37792 -651859 -286720 567121 941818 487867 -198505 -570955 -815538 -1238065 -1549389 -1273164
37782 -1273164 -507524 246418 783849 1200939 1366009 986541 233707 -239122 -72662
37773 -72662 400533 697904 753469 740250 691955 606512 648278 885266 1003260 666075 78902
$$ packed form
37842A468812p27121q30458k97268J89145K79034J51438j6070j91091k07013Q5236
37832i5356M08181L33127m4997k47348k10057l15976n71484m78242M1031L28597
37822h52524L2576k13454K22511Q36850O52842k49121p36160k06260O05735O99350
37812G92345R7596l95654l70331j79052j88411j97000J37899O10663O41889J18879
37802A068823l63264k86831J14967K88612J61838M3960o0750l97747p42660m78807
37792f51859L65139Q53841L74697m53951o86372l72450k44583m22527l11324K76225
37782a273164P65640P53942N37431M17090J65070l79468p52834m72829J66460
37773g2662M73195K97371N5565j3219m8295q5443M1766K36988J17994l37185n87173
$$ plain form
37762 78902 -192772 21535 285884 199104 -73313 -85591 305578 837396 1143139 981595
37752 981595 342042 -471981 -1017704 -1194721 -1395137 -1910808 -2373266 -2183376 -1413822 -804680
37742 -804680 -807601 -1122308 -1337432 -1503720 -1735908 -1728305 -1197685 -505780 -251396 -398335
37732 -398335 -408748 -178420 -170625 -512594 -642145 -189870 348063 308507 -150958 -321942
37722 -321942 -104 303681 193622 -79410 -62896 283169 614770 616223 214192 -437215
37712 -437215 -1005168 -1144821 -823538 -438264 -433298 -781411 -987657 -676274 -61065 299064
37702 299064 168267 -115392 -110246 176159 361617 214567 -110732 -351037 -421732 -357289
37692 -357289 -159260 147704 403357 395739 61990 -415080 -682647 -451554 202331 791824
$$ packed form
37762G8902k71674K14307K64349q6780k72417j2278L91169N31818L05743j61544
37752I81595o39553q14023n45723j77017k00416n15671m62458J89890P69554O09142
37742h04680k921l14707k15124j66288k32188P603N30620O91905K54384j46939
37732c98335j0413K30328P795l41969j29551M52275N37933l9556m59465j70984
37722c21942L21838L03785j10059k73032J6514L46065L31601J453m02031o51407
37712d37215n67953j39653L21283L85274M966l48113k06246L11383O15209L60129
37702B99064j30797k83659N146K86405J85458j47050l25299k40305p0695O4443
37692c57289J98029L06964K55653p618l33749m77070k67567K31093O53885N89493
$$ plain form
37682 791824 862263 503945 226287 304157 513711 585691 580576 602324 450788 -93654 -805332
37671 -805332 -1176517 -984872 -444737 117159 479370 526427 340281 239529 437408 704154
37661 704154 652245 290414 -31080 -154717 -191193 -88836 375070 1058409 1401311 1153066
37651 1153066 739972 617535 635584 409515 -12932 -314484 -511319 -881206 -1365441 -1528889
37641 -1528889 -1167527 -561590 -36685 379345 743656 971574 1020901 1068267 1282606 1558928
37631 1558928 1654075 1491190 1188244 868236 564470 234720 -245416 -1008464 -1953129 -2624836
37621 -2624836 -2529245 -1630096 -447000 385568 605199 381783 33685 -209746 -248810 -111447
37611 -111447 21447 -75311 -396486 -602648 -356760 237448 701637 720025 424937 79155
$$ packed form
37682G91824P0439l58318k77658P7870K09554P1980n115K1748j51536n44442p11678
37671h05332l71185J91645N40135N61896L62211M7057j86146j00752J97879K66746
37661G04154n1909l61831l21494j23637l6476J02357M63906O83339L42902k48245
37651A153066m13094j22437J8049k26069m22447l01552j96835l69887m84235j63448
37641a528889L61362O05937N24905M16030L64311K27918M9327M7366K14339K76322
37631A558928R5147j62885l02946l20008l03766l29750m80136p63048r44665o71707
37621b624836R5591Q99149J183096Q32568K19631k23416l48098k43431l9064J37363
37611a11447J32894r6758l21175k06162K45888N94208M64189J8388k95088l45782
$$ plain form
37601 79155 -276845 -654102 -805856 -440580 303508 942363 1257142 1502743 1893159 2207686
37591 2207686 2146322 1817177 1540478 1315525 863560 200939 -189357 89300 837159 1462255
37581 1462255 1572064 1237632 774031 406692 132652 -181868 -584054 -924272 -1026857
37572 -1026857 -957113 -971313 -1133131 -1135396 -669623 101345 633038 586713 188096 -61792
37562 -61792 59042 315383 356667 132208 -115735 -252368 -484283 -1028056 -1620383 -1656868
37552 -1656868 -949727 -97030 160021 -202117 -564263 -493973 -121865 312789 845321 1505744
37542 1505744 2007810 2051022 1750006 1459860 1299068 1140448 976025 951951 1050560 1059802
37532 1059802 913906 775707 691019 445558 -74122 -613479 -854964 -828457 -796281 -831595
$$ packed form
37601G9155l56000l77257j51754L65276P44088O38855L14779K45601L90416L14527
37591B207686o1364l29145k76699k24953m51965o62621l90296K78657P47859O25096
37581A462255J09809l34432m63601l67339k74040l14520m02186l40218j02585
37572a026857O9744j4200j61818k265M65773P70968N31693m6325l98617k49888
37562f1792J20834K56341M1284k24459k47943j36633k31915n43773n92327l6485
37552a656868P07141Q52697K57051l62138l62146P0290L72108M34654N32532O60423
37542A505744N02066M3212l01016k90146j60792j58620j64423k4074R8609R242
37532A059802j45896j38199q4688k45461n19680n39357k41485K6507L2176l5314
$$ plain form
37522 -831595 -735783 -341619 288523 960177 1482453 1705929 1593416 1309534 1119377 1126179
37512 1126179 1185001 1130242 1008087 995156 1128828 1230752 1132415 898944 740272 710523
37502 710523 599664 194497 -411353 -874329 -965298 -777116 -539327 -324919 -23770 436904
37492 436904 936810 1254200 1289704 1165095 1050906 886244 381524 -566312 -1525830 -1829634
37482 -1829634 -1305250 -531740 -228819 -511944 -898986 -935622 -604424 -166871 156425 282117
37472 282117 211361 -1187 -272630 -524448 -658206 -537066 -99227 512273 1041587 1352307
37462 1352307 1476592 1461830 1318892 1121999 974932 831199 536920 130214 -106783 -20414
37452 -20414 196867 336437 500761 825878 1056439 792158 127931 -353037 -318443 -69275
$$ packed form
37522h31595R5812L94164O30142O71654N22276K23476j12513k83882j90157O802
37512A126179N8822n4759j22155j2931J33672J01924r8337k33471j58672k9749
37502G10523j10859m05167o05850m62976r0969J88182K37789K14408L01149M60674
37492D36904M99906L17390L5504j24609j14189j64662n04720r47836r59518l03804
37482a829634N24384P73510L02921k83125l87042l6636L31198M37553L23296J25692
37472B82117p0756k12548k71443k51818j33758J21140M37839O11500N29314L10720
37462A352307J24285j4762j42938j96893j47067j43733k94279m06706k36997Q6369
37452b0414K17281J39570J64324L25117K30561k64281o64227m80968L4594K49168
$$ plain form
37442 -69275 -36222 -238497 -484664 -792443 -1226331 -1501171 -1201509 -415555 210995 159162
37432 159162 -472422 -1222843 -1734492 -1839046 -1467061 -740640 -28806 340627 406668 452171
37422 452171 582817 594043 284973 -220909 -545474 -420620 44675 464325 545362 337730
37412 337730 90264 -77073 -245127 -468699 -638837 -615592 -370792 35909 479826 740067
37402 740067 643549 328032 161249 273764 374502 182164 -182820 -437765 -526218 -483207
37392 -483207 -147169 584487 1332867 1515414 1043648 357023 -230333 -782774 -1307951 -1578159
37382 -1578159 -1574477 -1646330 -1943840 -2083750 -1710627 -1038216 -450907 103408 836323 1479395
37372 1479395 1515243 1000346 594913 677326 915406 895210 736449 788929 1035622 1154764
$$ packed form
37442f9275L3053k02275k46167l07779m33888k74840K99662P85954O26550n1833
37432A59162o31584p50421n11649j04554L71985P26421P11834L69433O6041M5503
37422D52171J30646J1226l09070n05882l24565J24854M65295M19650Q1037k07632
37412C37730k47466j67337j68054k23572j70138K3245K44800M06701M43917K60241
37402G40067r6518l15517j66783J12515J00738j92338l64984k54945q8453M3011
37392d83207L36038P31656P48380J82547m71766o86625n87356n52441n25177k70208
37382a578159L682p1853k97510j39910L73123O72411N87309N54315P32915O43072
37372A479395L5848n14897m05433Q2413K38080k0196j58761N2480K46693J19142
$$ plain form
37362 1154764 1013955 771010 529335 165903 -450954 -1225830 -1852299 -1990739 -1488472
37353 -1488472 -571488 199721 344658 -88199 -580396 -696149 -462686 -143113 181686
37344 181686 581060 918750 870032 411162 1611 19862 208429 27519 -511956 -775919
37334 -775919 -364133 322905 602585 344833 13357 26131 362688 753887 1004980 1102578
37324 1102578 1175218 1386234 1755293 2069879 2053192 1623828 956364 334375 -30384 -134049
37314 -134049 -189473 -390714 -638647 -672820 -512570 -489843 -708130 -799638 -497445 -137987
37304 -137987 -178602 -441632 -362991 93226 338354 55261 -334677 -304241 107190 501241
37294 501241 641944 499432 88769 -423307 -695173 -607359 -487716 -637658 -821220 -574308
$$ packed form
37362A154764j40809k42945k41675l63432o16857p74876o26469j38440N02267
37353a488472R16984P71209J44937m32857m92197j15753K33463L19573L24799
37344A81686L99374L37690m8718m58870m09551J8251J88567j80910n39475k63963
37334g75919M11786O87038K79680k57752l31476J2774L36557L91199K51093R7598
37324A102578P2640K11016L69059L14586j6687m29364o67464o21989l64759j03665
37314a34049n5424k01241k47933l4173J60250K2727k18287r1508L02193L59458
37304a37987m0615k63030P8641M56217K45128k83093l89938L0436M11431L94051
37294E01241J40703j42512m10663n12076k71866Q7814J19643j49942j83562K46912
$$ plain form
37284 -574308 105644 750014 1045045 1106097 1121998 1090020 1005636 1001771 1119316 1157054 944382
37273 944382 616169 421502 350126 149157 -304277 -813985 -1084014 -1012641 -722074 -391240
37263 -391240 -133367 22235 119461 228526 335197 301302 38635 -287820 -386447 -235459
37253 -235459 -192715 -550675 -1084225 -1263133 -917412 -482316 -487271 -935957 -1316332 -1166210
37243 -1166210 -525730 151339 446741 315626 38369 -89532 1930 168585 225146 105200
37233 105200 -91927 -203715 -178985 -98789 23767 321607 778661 1016054 710657 160754
37223 160754 -2451 293313 472907 273154 180249 534766 806324 378171 -412430 -779344
37213 -779344 -723267 -917099 -1507257 -1924475 -1911963 -1857529 -1940563 -1804294 -1364496 -1145200
$$ packed form
37284e74308O79952O44370K95031O1052J5901l1978q4384l865J17545L7738k12672
37273I44382l28213j94667p1376k00969m53434n09708k70029P1373K90567L30834
37263c91240K57873J55602R7226J09065J06671l3895k62667l26455r8627J50988
37253b35459M2744l57960n33550j78908L45721M35096m955m48686l80375J50122
37243a166210O40480O77069K95402j31115k77257j27901R1462J66655N6561j19946
37233A05200j97127j11788K4730Q0196J22556K97840M57054K37393l05397n49903
37223A60754j63205K95764J79594j99753r2905L54517K71558m28153p90601l66914
37213g79344N6077j93832n90158m17218J2512N4434q3034J36269M39798K19296
$$ plain form
37203 -1145200 -1418112 -1709396 -1571281 -1182074 -777386 -208774 422564 429736 -488268 -1554098
37193 -1554098 -1902564 -1709564 -1601181 -1524658 -1111648 -679360 -811114 -1203518 -994099 -149236
37183 -149236 473440 448338 204192 53130 -237763 -705766 -917760 -724047 -505801 -399361
37173 -399361 -45080 593311 943957 739776 470880 495405 430836 -40288 -431345 -153070
37163 -153070 565378 1069430 1149292 937209 383667 -501672 -1223230 -1283143 -877863 -539045
37153 -539045 -312246 115753 681006 974188 897988 685329 330604 -367208 -1158371 -1358191
37143 -1358191 -715636 173994 546161 257639 -256898 -551972 -514254 -296926 -68758 170339
37133 170339 494433 771877 683367 171031 -335846 -389459 -72140 179336 177415 141896
$$ packed form
37203a145200k72912k91284J38115L89207M04688N68612O31338P172r18004j065830
37193a554098l48466J93000J08383P6523M13010M32288j31754l92404K09419Q44863
37183a49236O22676k5102k44146j51062k90893m68003k11994J93713K18246J06440
37173c99361L54281O38391L50646k04181k68896K4525o4569m71124l91057K78275
37163a53070P18448N04052P9862k12083n53542q85339p21558n9913M05280L38818
37153e39045K26799M27999N65253K93182p6200k12659l54725o97812p91163j99820
37143a358191O42555Q89630L72167k88522n14537k95074L7718K17328K28168K39097
37133A70339L24094K77444q8510n12336n06877n3613L17319K51476j921l5519
$$ plain form
37123 141896 326051 723411 1116653 1273189 1167022 1076554 1280848 1609944 1614869 1272744
37113 1272744 1046853 1017015 548759 -677973 -1852532 -1960711 -1178707 -572712 -639159
37104 -639159 -970130 -1253348 -1677882 -2208509 -2308937 -1741340 -1033086 -804708 -1079336 -1482707
37094 -1482707 -1681451 -1447838 -777656 -149037 -196877 -926613 -1682649 -2011994 -2031108 -1839525
37084 -1839525 -1277812 -536492 -254683 -551258 -631370 70228 953977 1130329 709626 436282
37074 436282 415619 91767 -632426 -1088473 -762964 72519 767959 894614 423198 -258894
37064 -258894 -496559 50858 959549 1524644 1614051 1625201 1710655 1611719 1275296 1038472
37054 1038472 1027046 885201 365950 -209867 -378099 -140968 100889 39280 -294735 -613295
$$ packed form
37123A41896J84155L97360L93242J56536j06167r0468K04294L29096M925l42125
37113A272744k25891k9838m68256j226732j174559j08179P82004O05995o6447
37104f39159l30971k83218m24534n30627j00428N67597P08254K28378k74628m03371
37094a482707j98744K33613O70182O28619m7840p29736p56036l29345j9114J91583
37084a839525N61713P41320K81809k96575q0112P01598Q83749J76352m20703k73344
37074D36282k0663l23852p24193m56047L25509Q35483O95440J26655m71416o82092
37064b58894k37665N47417R08691N65095Q9407J1150Q5454r8936l36423k36824
37054A038472j1426j41845n19251n75817j68232K37131K41857o1609l34015l18560
$$ plain form
37044 -613295 -586680 -143146 363120 447972 13326 -580091 -926377 -856334 -386801 285385
37034 285385 744801 661121 189127 -226687 -437736 -619544 -742555 -523681 -20868 253865
37024 253865 64632 -176991 -82206 111864 -7671 -361566 -604900 -708294 -839137 -925142
37014 -925142 -855565 -911508 -1401066 -1950856 -1799547 -892587 -104782 -135085 -653138 -879517
37004 -879517 -659197 -530906 -886637 -1470856 -1740824 -1442217 -739358 30058 595330 857716
36994 857716 917401 992236 1190229 1337275 1149540 634870 181549 118426 318309 432631
36984 432631 394650 390846 393140 123615 -413644 -757958 -591187 -220530 -177487 -542492 -952186
36973 -952186 -1114888 -1027301 -785976 -457562 -96835 276883 637576 792928 503577 -52596
$$ packed form
37044f13295K6615M43534N06266Q4852m34646n93417l46286P0043M69533O72186
37034B85385M59416q3680m71994m15814k11049j81808j23011K18874N02813K74733
37024B53865j89233k41623R4785J94070j19535l53895k43334j03394j30843q6005
37014i25142O9577n5943m89558n49790J51309R06960P87805l0303n18053k26379
37004h79517K20320J28291l55731n84219k69968K98607P02859P69416N65272K62386
36994H57716N9685P4835J97993J47046j87735n14670m53321o3123J99883J14322
36984D32631l7981l804K294k69525n37259l44314J66771L70657M3043l65005m09694
36973i52186j62702Q7587K41325L28414L60727L73718L60693J55352k89351n56173
$$ plain form
36963 -52596 -233262 329724 1184496 1615800 1530097 1373709 1366436 1306650 1031775 593629
36953 593629 53535 -432816 -448979 207068 971694 1079779 649428 481171 732360 644628
36943 644628 -169617 -1062317 -1433414 -1637682 -2134929 -2462488 -1945078 -949924 -470025 -687673
36933 -687673 -880832 -693358 -584512 -872107 -1144915 -963287 -540841 -335524 -368906 -320048
36923 -320048 -44782 292286 465248 395190 217077 197790 453098 748559 747600 411576
36913 411576 -44866 -500614 -960038 -1336440 -1534180 -1674224 -1879036 -1907370 -1425273 -602709
36903 -602709 21156 252019 296785 96233 -724251 -2005495 -2802234 -2422241 -1278626
36894 -1278626 -284154 219388 478218 626193 539538 258423 53579 45346 59654 -129736
$$ packed form
36963e2596j80666N62986Q54772M31304q5703j56388p273n9786k74875m38146
36953E93629n40094m86351j6163O56047P64626J08085m30351j68257K51189q7732
36943F44628q14245q92700l71097k04268m97247l27559N17410R95154M79899k17648
36933f87673j93159J87474J08846k87595k72808J81628M22446K05317l3382M8858
36923c20048K75266L37068J72962p0058j78113j9287K55308K95461r59l36024
36913D11576m56442m55748m59424l76402j97740j40044k04812k8334M82097Q22564
36903f02709O23865K30863M4766k00552q20484j281244p96739L79993J143615
36894a278626R94472N03542K58830J47975q6655k81115k04844q233J4308j89390
$$ plain form
36884 -129736 -582391 -1114079 -1315267 -880314 -113265 187621 -348723 -1130021 -1348704 -1016414
36874 -1016414 -804122 -1029749 -1332262 -1334710 -1146261 -1092252 -1285837 -1577712 -1694075 -1385952
36864 -1385952 -668173 74889 420813 318474 -1226 -370188 -658618 -595029 -63003 481658
36854 481658 391960 -288868 -776088 -522853 150283 585866 559619 270958 -84487 -387650
36844 -387650 -457389 -178952 316151 821769 1297072 1733375 1924676 1644178 1002582 392121
36834 392121 64776 -60807 -175977 -344512 -529637 -711270 -880431 -968675 -854594 -458747
36824 -458747 155020 760843 1090847 1040149 769754 554556 479106 319123 -171561 -836104
36814 -836104 -1133104 -732242 8767 383616 116922 -443772 -889205 -1143069 -1205904 -924380
$$ packed form
36884a29736m52655n31688k01188M34953P67049L00886n36344p81298k18683L32290
36874a016414K12292k25627l02513k448J88449N4009j93585k91875j16363L08123
36864a385952P17779P43062L45924j02339l19700l68962k88430O3589N32026N44661
36854D81658q9698o80828m87220K53235O73136M35583k6247k88661l55445l03163
36844c87650o9739K78437M95103N05618M75303M36303J91301k80498o41596o10461
36834C92121l27345j25583j15170j68535j85125j81633j69161q8244J14081L95847
36824d58747O13767O05823L30004n0698k70395k15198p5450j59983m90684o64543
36814h36104k97000M00862P41009L74849k66694n60694m45433k53864o2835K81524
$$ plain form
36804 -924380 -299103 292950 522806 515067 498397 326937 -205734 -793173 -897910 -521570
36794 -521570 -164988 -46680 96053 396369 627495 714042 901095 1182563 1111332 531330
36784 531330 32862 229277 890003 1224945 823644 -58106 -948390 -1505443 -1550512 -1154979
36774 -1154979 -687933 -501866 -576459 -651951 -616593 -534932 -386607 -61918 372395 632218
36764 632218 520831 167277 -91233 -31743 252179 466357 436236 236210 -40772 -444980
36754 -444980 -902096 -1009413 -496901 217812 412258 -12545 -490906 -705190 -926897 -1289386
36744 -1289386 -1397051 -1014448 -538361 -325760 -102480 417906 839064 669233 204768
36735 204768 97533 309681 243813 -243563 -693517 -851590 -935149 -1082079 -1149686 -1085664
$$ packed form
36804i24380O25277N92053K29856p739j6670j71460n32671n87439j04737L76340
36794e21570L56582J18308J42733L00316K31126Q6547J87053K81468p1231n80002
36784E31330m98468J96415O60726L34942m01301q81750q90284n57053m5069L95533
36774a154979M67046J86067p4593p5492L5358Q1661J48325L24689M34313K59823
36764F32218j11387l53554k58510N9490K83922K14178l0121k00026k76982m04208
36754d44980m57116j07317N12512P14713J94446m24803m78361k14284k21707l62489
36744a289386j07665L82603M76087K12601K23280N20386M21158j69831m64465
36735B04768j07235K12148o5868m87376m49954j58073q3559j46930o7607O4022
$$ plain form
36725 -1085664 -929372 -468519 480478 1451566 1671711 1105572 486943 208463 -81598
36716 -81598 -581994 -841462 -557563 -170229 -141154 -211355 66446 540080 811298 992304
36706 992304 1448018 2016452 2137016 1674753 1061142 647372 438917 493362 1031540 1927250
36696 1927250 2477464 2037344 790866 -346093 -632476 -213864 146721 5569 -279907
36687 -279907 -124345 452826 911095 1010142 1075363 1345294 1535791 1336928 965504 848961
36677 848961 1009860 1142504 1136463 1157901 1295504 1444233 1514203 1528436 1557881 1715129 2083664
36666 2083664 2478318 2461332 1843553 1008378 474627 306523 260164 331817 735231 1383626
36656 1383626 1819185 1742563 1312255 854643 550843 472862 649616 972787 1241308 1410051
$$ packed form
36725a085664J56292M60853R48997R71088K20145n66139o18629k78480k90061
36716h1598n00396k59468K83899L87334K9075p0201K77801M73634K71218J81006
36706I92304M55714N68434J20564m62263o13611m13770k08455N4445N38178Q95710
36696A927250N50214m40120j246478j136959k86383M18612L60585j41152k85476
36687b79907J55562N77171M58269R9047O5221K69931J90497j98863l71424j16543
36677H48961J60899J32644o041K1438J37603J48729O9970J4233K9445J57248L68535
36666B083664L94654j6986o17779q35175n33751j68104m6359P1653M03414O48395
36656A383626M35559p6622m30308m57612l03800p7981J76754L23171K68521J68743
$$ plain form
36646 1410051 1629767 1950143 2142264 1936428 1354003 727252 429903 584088 953389
36637 953389 1133024 931473 558872 379492 526502 829977 1040218 1018600 801528 609650
36627 609650 711630 1138574 1611802 1879275 1998796 2117402 2120423 1768869 1121199 546097
36617 546097 305502 326135 373009 265047 -42512 -393049 -493776 -245260 74567 184388
36607 184388 229709 504386 841565 744403 181329 -210062 89265 848813 1468903 1682893
36597 1682893 1639870 1571278 1657568 1997346 2414177 2482988 2050608 1563260 1540767 1844637
36587 1844637 1834435 1202536 281902 -493499 -1048253 -1453060 -1589452 -1288733 -651710 -8081
36577 -8081 399123 578098 698967 909983 1158492 1153827 654416 -133472 -637692 -564354
$$ packed form
36646A410051K19716L20376J92121k05836n82425o26751k97349J54185L69301
36637I53389J79635k01551l72601j79380J47010L03475K10241k1618k17072j91878
36627F09650J01980M26944M73228K67473J19521J18606L021l51554o47670n75102
36617E46097k40595K0633M6874j07962l07559l50537j00727K48516L19827J09821
36607A84388M5321K74677L37179r7162n63074l91391K99327P59548O20090K13990
36597A682893m3023o8592Q6290L39778M16831O8811m32380m87348k2493L03870
36587A844637j0202o31899r20634p75401n54754m04807j36392L00719O37023O43629
36577h081M07204J78975J20869K11016K48509m665m99411p87888n04220P3338
$$ plain form
36567 -564354 -286573 -359135 -790475 -1115184 -1120460 -1099068 -1296975 -1504300 -1430043 -1179315
36557 -1179315 -1041790 -1009490 -856214 -578064 -381983 -265976 12831 479775 782477 638399
36547 638399 206392 -133826 -182054 35412 434681 913105 1313155 1482752 1355607 983419
36537 983419 586626 501837 854019 1303150 1395893 1181285 1132120 1378335 1432083 892056
36527 892056 46167 -529177 -648400 -450663 27092 735381 1264917 1159946 587008 244199
36517 244199 511769 1034418 1246354 1016203 643798 451295 530181 756258 926539 917427
36507 917427 740389 447722 80067 -241387 -330537 -177487 -33961 -115404 -361271 -609801
36497 -609801 -786755 -755067 -281276 550408 1168386 1139377 738149 486680 378933 102507
$$ packed form
36567e64354K77781p2562m31340l24709n276K1392j97907k07325P4257K50728
36557a179315J37525L2300J53276K78150J96081J16007K78807M66944L02702j44078
36547F38399m32007l40218m8228K17466L99269M78424M00050J69597j27145l72188
36537I83419l96793q4789L52182M49131R2743k14608m9165K46215N3748n40027
36527H92056q45889n75344j19223J97737M77755P08289N29536j04971n72938l42809
36517B44199K67570N22649K11936k30151l72405j92503P8886K26077J70281r112
36507I17427j77038k92667l67655l21454q9150J53050J43526q1443k45867k48530
36497f09801j76954L1688M73791Q31684O17978k9009m01228k51469j07747k76426
$$ plain form
36487 102507 -163614 124762 918260 1420272 1124108 474963 209716 456221 801382 927450
36477 927450 837240 622965 296777 -172008 -734574 -1143773 -1064840 -503266 11985 -2041
36467 -2041 -324483 -329339 135306 633827 880513 1042982 1227477 1222273 953156 704737 653006
36456 653006 599248 377031 115256 -76599 -237918 -207546 328787 1197382 1676228 1390124
36446 1390124 775455 350689 69958 -221743 -261402 194139 858080 1332744 1621648 1785620
36436 1785620 1595546 1051069 714245 903535 1079292 753592 479961 1021085 1936244
36427 1936244 2064648 1240314 453486 310815 394559 309141 325837 613882 717899 304343
36417 304343 -246166 -469874 -473027 -503529 -403001 8870 427932 459733 221910 97830
$$ packed form
36487A02507k66121K88376P93498N02012k96164o49145k65247K46505L45161J26068
36477I27450r0210k14275l26188m68785n62566m09199P8933N61574N15251j4026
36467b041l22442m856M64645M98521K46686J62469J84495n204k69117k48419n1731
36456F53006n3758k22217k61775j91855j61319L0372N36333Q68595M78846k86104
36446A390124o14669m24766k80731k91701l9659M55541O63941M74664K88904J63972
36436A785620j90074n44477l36824J89290J75757l25700k73631N41124R15159
36427A936244J28404q24334p86828j42671Q3744q5418J6696K88045J04017m13556
36417C04343n50509k23708l153l0502J00528M11871M19062L1801k37823j24080
$$ plain form
36407 97830 131307 95870 -10057 54931 368116 715766 843430 666490 321926 137149
36397 137149 412143 1096461 1790055 2141148 2116354 1863543 1525225 1249004 1163197 1243288
36387 1243288 1341255 1353906 1217248 838706 282118 -122287 -201621 -319440 -868180 -1524834
36377 -1524834 -1622764 -1207982 -986754 -1141107 -1039959 -421581 8059 -288332 -700436 -383278
36367 -383278 395418 666910 207315 -251766 -130395 410049 956120 1288983 1318915 1111357
36357 1111357 997064 1180997 1283518 794770 -46498 -426605 -75102 397852 447589 279023
36347 279023 290416 375510 227754 -30026 -21992 250895 403563 240036 -30261 -168438
36337 -168438 -190209 -181551 -72847 221100 545969 601934 340965 136673 420450 1171881
$$ packed form
36407I7830L3477l5437j05927O4988L13185L47650J27664j76940l44564j84777
36397A37149K74994O84318O93594L51093k4794k52811l38318k76221q5807Q0091
36387A243288R7967J2651j36658l78542n56588m04405p9334j17819n48740o56654
36377a524834r7930M14782K21228j54353J01148O18378M29640k96391m12104L17158
36367c83278P78696K71492m59595m59081J21371N40444N46071L32863K9932k07558
36357A111357j14293J83933J02521m88748q41268l80107L51503M72954M9737j68566
36347B79023J1393Q5094j47756k57780Q034K72887J52668j63527k70297j38177
36337a68438k1771Q658J08704K93947L24869N5965k60969k04292K83777P51431
$$ plain form
36327 1171881 1906321 2197392 2078045 1862981 1731116 1627124 1468772 1269967 1085763
36318 1085763 970749 968317 1022675 930998 512304 -168931 -832482 -1234127 -1344824 -1330469
36308 -1330469 -1407433 -1640505 -1810594 -1575641 -868806 -60829 391113 408442 310109 413370
36298 413370 701629 866325 647418 171559 -92738 144506 566580 583738 101111 -363081
36288 -363081 -408340 -219377 -98338 68428 498143 958532 992772 565820 73504 -209361
36278 -209361 -307621 -256657 -54794 114381 31609 -135995 54649 695219 1343451 1581505
36268 1581505 1466158 1305695 1249941 1234007 1131286 869597 553653 472215 761085 1082771
36258 1082771 951122 409491 46425 235449 692956 947325 922011 815411 666364 354362
$$ packed form
36327A171881P34440K91071j19347k15064j31865j03992j58352j98805j84204
36318A085763j15014k432N4358r1677m18694o81235o63551m01645j10697J4355
36308a330469p6964k33072j70089K34953P06835Q07977M51942J7329r8333J03261
36298D13370K88259J64696k18907m75859k64297K37244M22074J7158m82627m64192
36288c63081m5259J88963J21039J66766M29715M60389L4240m26952m92316k82865
36278b09361r8260N0964K01863J69175q2772j67604J90644O40570O48232K38054
36268A581505j15347j60463n5754j5934j02721k61689l15944q1438K88870L21686
36258A082771j31649n41631l63066J89024M57507K54369k5314j06600j49047l12002
$$ plain form
36248 354362 -80497 -387519 -379903 -125005 139647 229951 185075 217845 454873 795761
36238 795761 1115907 1452512 1780757 1786010 1238038 521992 338265 798835 1256451 1181945
36228 1181945 784963 528972 436861 236150 -92038 -310797 -337786 -324262 -380624 -458845
36218 -458845 -459653 -301115 29982 377457 510651 438716 438668 620078 682835 322193 -311889
36207 -311889 -793619 -912942 -774519 -547449 -331589 -163136 12844 247073 358259 47393
36197 47393 -582455 -917919 -546847 148493 432106 70800 -547383 -949593 -901063 -399182
36187 -399182 256673 533810 198203 -341189 -582963 -636947 -910929 -1273024 -1142752 -409436
36177 -409436 354134 716031 870208 1110787 1331284 1314961 1109478 826002 392351 -237087
$$ packed form
36248C54362m34859l07022P616K54898K64652R0304m4876L2770K37028L40888
36238G95761L20146L36605L28245N253n47972p16046j83727M60570M57616p4506
36228A181945l96982k55991r2111k00711l28188k18759k6989J3524n6362p8221
36218d58845q08J58538L31097L47475J33194p1935m8J81410O2757l60642o34082
36207c11889m81730j19323J38423K27070K15860J68453J75980K34229J11186l10866
36197D7393o29848l35464L71072O95340K83613l61306o18183m02210M8530N01881
36187c99182O55855K77137l35607n39392k41774n3984k73982l62095J30272P33316
36177d09436P63570L61897J54177K40579K20497j6323k05483k83476m33651o29438
$$ plain form
36167 -237087 -901372 -1459658 -1905357 -2086641 -1675019 -668194 386921 947340 999398
36158 999398 823423 550275 217527 -38826 -159326 -279932 -416470 -330270 4099 150365
36148 150365 -183576 -617271 -628085 -318118 -136805 -94124 146733 558460 792369 883100
36138 883100 1241067 1879633 2299735 2300769 2286831 2519340 2634541 2235126 1484686 769186
36128 769186 196566 -216487 -289283 -24604 165442 20928 -138273 -32684 -94086 -859483
36118 -859483 -1930776 -2300841 -1709603 -961395 -756154 -871042 -784331 -524333 -452572 -589331
36108 -589331 -629861 -434624 -116811 223211 509318 538237 161088 -399882 -704753 -599068
36098 -599068 -341436 -192384 -82279 218861 731135 1177077 1251282 951827 624596 618207
$$ packed form
36167b37087o64285n58286m45699j81284M11622J006825J055115N60419N2058
36158I99398j75975k73148l32748k56353j20500j20606j36538Q6200L34369J46266
36148A50365l33941m33695j0814L09967J81313M2681K40857M11727K33909R0731
36138H83100L57967O38566M20102J034j3938K32509J15201l99415p50440p15500
36128G69186n72620m13053p2796K64679J90046j44514j59201J05589o1402p65397
36118h59483j071293l70065N91238P48208K05241j14888Q6711K59998P1761j36759
36108e89331m0530J95237L17813L40022K86107K8919l77149n60970l04871J05685
36098e99068K57632J49052J10105L01140N12274M45942P4205k99455l27231o389
$$ plain form
36088 618207 893463 1097083 1061127 1035369 1273285 1574132 1508224 1011737 450079 89899
36078 89899 -162748 -400853 -437663 -153201 116157 -84924 -641543 -877044 -370831 499200
36068 499200 1032172 1037656 927113 1058336 1310345 1373642 1163869 761361 186857 -457052
36058 -457052 -763793 -347518 553856 1153856 976830 392561 91619 255302 523508 618149
36048 618149 628267 689947 741088 723573 766402 964326 1121165 931214 381327 -199199
36038 -199199 -512746 -586740 -626451 -673243 -554344 -190293 188963 272433 77549 -13993
36028 -13993 325571 1002656 1588137 1703939 1323997 786702 507798 571667 634580 387937
36018 387937 53073 131243 660417 1111150 1156166 1104793 1272599 1348523 893745 192576
$$ packed form
36088F18207K75256K03620l5956k5758K37916L00847o5908m96487n61658l60180
36078H9899k52647k38105l6810K84462K69358k01081n56619k35501N06213Q70031
36068D99200N32972N484j10543J31223K52009O3297k09773m02508n74504o43909
36058d57052l06741M16275R01374O00000j77026n84269l00942J63683K68206R4641
36048F18149J0118O1680N1141j7515M2829J97924J56839j89951n49887n80526
36038a99199l13547p3994l9711m6792J18899L64051L79256Q3470j94884r1542
36028a3993L39564O77085N85481J15802l79942n37295k78904O3869O2913k46643
36018C87937l34864P8170N29174M50733M5016n1373J67806P5924m54778p01169
$$ plain form
36008 192576 396 521763 1196219 1506866 1475584 1306931 1086890 971577 1147356 1393823
35998 1393823 1180499 458892 -110599 -28317 397906 621131 600613 519541 198946 -575640
35988 -575640 -1393281 -1540014 -917881 -102458 460913 782449 886566 653166 216457 -29099
35978 -29099 -32353 -219493 -765218 -1164916 -885482 -112421 544007 856338 1075630 1347049
35968 1347049 1475444 1318641 1051855 887040 778935 605661 461936 503357 565973 280249
35958 280249 -306623 -526956 161393 1370470 2130157 2036423 1606843 1378954 1185717 689763
35948 689763 169286 157712 516023 529108 -60469 -700746 -831088 -512230 -72159 373059
35938 373059 737326 711978 100494 -799748 -1453037 -1574474 -1193013 -505707 76154 48009
$$ packed form
36008A92576j92180N21367O74456L10647l1282j68653k20041j15313J75779K46467
35998A393823k13324p21607n69491Q2282M26223K23225k0518q1072l20595p74586
35988e75640q17641j46733O22133Q15423N63371L21536J04117k33400m36709k45556
35978b9099l254j87140n45725l99698K79434P73061O56428L12331K19292K71419
35968A347049J28395j56803k66786j64815j08105j73274j43725M1421O2616k85724
35958B80249n86872k20333O88349J209077P59687r3734m29580k27889j93237m95954
35948F89763n20477j1574L58311J3085n89577o40277j30342L18858M40071M45218
35938C73059L64267k5348o11484r00242o53289j21437L81461O87306N81861k8145
$$ plain form
35928 48009 -612185 -1166814 -848262 189516 1023831 1049597 550854 164246 159421 402599
35918 402599 709362 953360 968137 621382 26738 -462551 -561618 -332082 -87523 1100
35908 1100 118393 500011 969532 1025229 501570 -65624 39460 910964 1934436 2440716
35898 2440716 2256081 1657656 1034775 655646 574775 632317 591945 337943 -68029 -487880
35888 -487880 -807116 -978076 -1036848 -1041300 -954289 -694533 -371105 -284698 -514200 -675917
35878 -675917 -387487 127347 262272 -128304 -485580 -275094 375270 973053 1308420 1510555
35868 1510555 1645302 1590493 1267928 748921 144772 -412629 -720273 -649800 -346484 -103616
35858 -103616 -44388 -93560 -212936 -419679 -574097 -446960 -98769 75028 -156546 -528548
$$ packed form
35928D8009o60194n54629L18552J037778Q34315K5766m98743l86608m825K43178
35918D02599L06763K43998J4777l46755n94644m89289r9067K29536K44559Q8623
35908A100J17293L81618M69521N5697n23659n67194J05084Q71504J023472N06280
35898B440716j84635n98425o22881l79129q0871N7542m0372k54002m05972m19851
35888d87880l19236j70960n8772m452Q7011K59756L23428Q6407k29502j61717
35878f75917K88430N14834J34925l90576l57276K10486O50364N97783L35367K02135
35868A510555J34747n4809l22565n19007o04149n57401l07644P0473L03316K42868
35858a03616N9228m9172j19376k06743j54418J27137L48191J73797k31574l72002
$$ plain form
35848 -528548 -634819 -429410 -166066 -9230 41794 -21640 -175637 -243298 -141490 -184728
35838 -184728 -738831 -1524591 -1710700 -922547 194698 727559 552770 299999 444091
35829 444091 848504 1171443 1323147 1402307 1443653 1379177 1128994 688116 248589 199765
35819 199765 769763 1624317 2074680 1811156 1234769 925798 981438 1078076 1023283 946096
35809 946096 953202 887199 579328 188934 76916 332920 600513 487738 59141 -240839
35799 -240839 -118262 322237 885444 1567925 2347913 2906023 2852437 2180622 1276792 527565
35789 527565 101181 3480 88607 100245 -6688 125567 775468 1550763 1748888 1333462
35779 1333462 1025001 1263040 1613491 1500750 1032706 682076 562159 524976 662422 1130793
$$ packed form
35848e28548j06271K05409K63344J56836N1024o3434j53997o7661J01808m3238
35838a84728n54103p85760j86109P88153J117245N32861j74789k52771J44092
35829D44091M04413L22939J51704P9160M1346o4476k50183m40878m39527m8824
35819A99765N69998Q54554M50363k63524n76387l08971N5640R6638n4793p7187
35809I46096P106o6003l07871l90394j12018K56004K67593j12775m28597k99980
35799b40839J22577M40499N63207O82481P79988N58110n3586o71815r03830p49227
35789E27565m26384r7701Q5127J1638j06933J32255O49901P75295J98125m15426
35779A333462l08461K38039L50451j12741m68044l50630j19917l7183J37446M68371
$$ plain form
35769 1130793 1656163 1798742 1642805 1663460 1901417 1843900 1263091 652503 571407 952013
35759 952013 1350338 1573411 1721917 1813955 1734623 1530656 1475901 1752531 2177044 2319505
35749 2319505 1901090 1078422 324285 19617 195781 639459 1075479 1195264 778568
35740 778568 29921 -406878 -100719 609984 1045166 1057968 1066315 1273152 1392079 1262759
35730 1262759 1196703 1417463 1601238 1372900 937390 772121 896040 904199 637585 376646
35720 376646 358047 494225 663094 935964 1347513 1682331 1699453 1451580 1219907 1190272
35710 1190272 1300918 1359786 1217941 862748 435979 161626 172582 359329 423892 146642
35700 146642 -380725 -817994 -886777 -587307 -106822 398034 862100 1239246 1490438 1617488
$$ packed form
35769A130793N25370J42579j55937K0655K37957n7517n80809o10588q1096L80606
35759I52013L98325K23073J48506R2038p9332k03967n4755K76630M24513J42461
35749B319505m18415q22668p54137l04668J76164M43678M36020J19785m16696
35740G78568p48647m36799L06159P10703M35182J2802Q347K06837J18927j29320
35730A262759o6056K20760J83775k28338m35510j65269J23919Q159k66614k60939
35720C76646j8599J36178J68869K72870M11549L34818J7122k47873k31673k9635
35710A190272J10646N8868j41845l55193m26769k74353J0956J86747O4563k77250
35700A46642n27367m37269o8783K99470M80485N04856M64066L77146K51192J27050
$$ plain form
35690 1617488 1617859 1463876 1248022 1260235 1695219 2290110 2511145 2191548 1763967 1720517
35680 1720517 2029443 2271288 2212138 2012683 1919725 1971563 2053017 2094561 2132209 2232664
35670 2232664 2435954 2770591 3263826 3878289 4476682 4996494 5731636 7297411 10156083
35661 10156083 14227589 19007175 23787244 27508143 28760538 26669539 21949035 16575353
35653 16575353 12148474 8902468 6411519 4611112 3635201 3159444 2653689 2127822 1973704
35644 1973704 2121801 2016197 1515457 1169268 1327761 1521269 1145713 393947 14795
35635 14795 304349 778424 841908 446018 11270 -60679 307957 892621 1357376 1478305
35625 1478305 1283322 1002203 860620 908085 1041992 1179660 1341282 1502472 1444098 952305
$$ packed form
35690A617488L71j53983k15854J2213M34984N94891K21035l19597m27581m3450
35680A720517L08926K41845n9150j99455r2958N1838Q1454M1544L7648J00455
35670B232664K03290L34637M93235O14463N98393N19812P35142J565775K858672
35661A0156083M071506M779586M780069L720899J252395k090999m720504n373682
35653A6575353m426879l246006k490949j800407r75911m75757n05755n25867j54118
35644A973704J48097j05604n00740l46189J58493J93508l75556p51766l79152
35635A4795K89554M74075O3484l95890m34748p1949L68636N84664M64755J20929
35625A478305j94983k81119j41583M7465J33907J37668J61622J61190n8374m91793
$$ plain form
35615 952305 220833 -180677 67308 616066 917662 970241 1231360 1831647 2317237 2302491
35605 2302491 1970761 1676802 1403379 976729 571084 546470 874255 1163460 1280435 1529749
35595 1529749 2095975 2669010 2840763 2612570 2281821 2038328 1912613 1929298 2018828 1915177
35585 1915177 1463802 946106 753896 796127 646773 320004 411052 1243234 2305788 2896415
35575 2896415 2991392 3048341 3204890 3209516 3038741 3008232 3205257 3323318 3229553 3257460 3702320
35564 3702320 4382369 4947003 5306942 5502706 5451071 5146062 4903796 5112442 5894460 7223083
35554 7223083 9112028 11389011 13542252 15231627 16891356 19514572 23913084 30483452
35546 30483452 39734661 53023152 72886387 102083343 140494301 181423732 211832177
$$ packed form
35615I52305p31472m01510K47985N48758L01596N2579K61119O00287M85590j4746
35605B302491l31730k93959k73423m26650m05645k4614L27785K89205J16975K49314
35595A529749N66226N73035J71753k28193l30749k43493j25715J6685Q9530j03651
35585A915177m51375n17696j92210M2231j49354l26769R1048Q32182J062554N90627
35575B896415R4977N6949J56549M626j70775l0509J97025J18061r3765K7907M44860
35564C702320O80049N64634L59939J95764n1635l05009k42266K08646P82018J328623
35554G223083J888945K276983K153241J689375J659729K623216M398512O570368
35546C0483452R251209J3288491J9863235K9196956L8410958M0929431L0408445
$$ plain form
35539 211832177 219139077 200141120 163618551 123769235 90894750 67593272 51660681
35532 51660681 40461881 32536226 26970844 22878559 19580622 16723494 14106215 11654885
35524 11654885 9582689 8287647 7890696 7944806 7770893 7109663 6306617 5789402 5532304
35515 5532304 5211112 4739880 4349308 4150969 3959112 3658100 3458294 3581478 3879227
35506 3879227 3984868 3759639 3432972 3353982 3682017 4230300 4560762 4367772 3836601 3486639
35496 3486639 3618638 4098033 4717084 5497378 6510223 7686472 9040863 10911693 13810635
35487 13810635 18237881 24746825 33696558 44323603 54094734 59580981 58516949 51322460
35479 51322460 40855240 30667254 23028269 18079124 14680269 12002627 10113249 9135394
$$ packed form
35539B11832177P306900j8997957l6522569l9849316l2874485k3301478j5932591
35532E1660681j1198800p925655n565382m092285l297937k857128k617279k451330
35524A1654885k072196j295042l96951N4110j73913o61230q03046n17215k57098
35515E532304l21192m71232l90572j98339j91857l01012j99806J23184K97749
35506C879227J05641k25229l26667p8990L28035N48283L30462j92990n31171l49962
35496C486639J31999M79395O19051P80294J012845J176249J354391J870830K898942
35487A3810635M427246O508944Q949733J0627045R771131N486247j064032p194489
35479E1322460j0467220j0187986p638985m949145l398855k677642j889378r77855
$$ plain form
35471 9135394 8517853 7609591 6537157 5885020 5707844 5494636 5027015 4607606 4376781
35462 4376781 4043454 3482256 3023856 2875962 2758081 2462070 2362195 2950036 4118296
35453 4118296 5268152 5949423 6114893 5936601 5665503 5540194 5602910 5727185 5956431
35444 5956431 6558084 7542869 8441761 8881363 9129652 9707049 10665916 11665973 12620019
35435 12620019 13832625 15566920 17899255 21020740 25336964 31249054 39140836 49679574
35427 49679574 64204422 85336746 117313679 163926905 223082326 282101171 320676303
35420 320676303 322532479 286934527 229347346 170485168 123884073 91940952 70621398
35413 70621398 55641457 44719339 36630951 30327957 25175376 21131975 18240507 16197160
$$ packed form
35471I135394o17541r08262j072434o52137j77176k13208m67621m19409k30825
35462D376781l33327n61198m58400j47894j17881k96011r9875N87841J168260
35453D118296J149856O81271J65470j78292k71098j25309O2716J24275K29246
35444E956431O01653R84785Q98892M39602K48289N77397R58867J000057R54046
35435A2620019J212606J734295K332335L121485M316224N912090P891782J0538738
35427D9679574J4524848K1132324L1976933M6613226N9155421N9018845L8575132
35420C20676303J856176l5597952n7587181n8862178m6601095l1943121k1319554
35413G0621398j4979941j0922118q088388o302994n152581m043401k891468k043347
$$ plain form
35405 16197160 14580831 13209090 12026121 10845994 9498987 8141461 7135938 6617115
35397 6617115 6390749 6251302 6143318 5967798 5532527 4876688 4418121 4519220 5018584
35388 5018584 5445193 5645472 5933801 6584678 7419065 8043454 8380923 8809371 9774265
35379 9774265 11337945 13142264 14818150 16417865 18405030 21241029 25114809 30170766
35371 30170766 36966911 46812075 61994601 85551638 119416310 160790121 199749576
35364 199749576 222298602 218708918 190621764 150052324 110949009 81113989 60857152
35357 60857152 47114722 37341968 30243907 24964910 20872616 17746784 15472261 13657566
35349 13657566 11935533 10413708 9356047 8544278 7465782 6127302 5130772 4769731
$$ packed form
35405A6197160j616329j371741j182969j180127j347007j357526j005523n18823
35397F617115k26366j39447j07984j75520m35271o55839m58567J01099M99364
35388E018584M26609K00279K88329O50877Q34387O24389L37469M28448R64894
35379I774265J563680J804319J675886J599715J987165K835999L873780N055957
35371C0170766O796145R845164J5182526K3557037L3864672M1373811L8959455
35364A99749576K2549026l589684k8087154m0569440l9103315k9835020k0256837
35357F0857152j3742430r772754p098061n278997m092294l125832k274523j814695
35349A3657566j722033j521825j057661q11769j078496j338480r96530l61041
$$ plain form
35341 4769731 4570795 4084338 3687014 4028898 4896551 5300265 4784094 4056715 4008155 4536336
35331 4536336 4803815 4423442 3878380 3773941 4121707 4537166 4841125 5186159 5681453
35322 5681453 6144353 6328437 6328039 6614223 7569578 9070471 10741656 12622528 15276643
35313 15276643 19161407 24391934 31536634 42036811 56601317 72752024 84823331
35306 84823331 87484658 79654546 65029339 49136753 36023231 27009832 21382908 17708094
35298 17708094 14872655 12482118 10580572 9157980 8016240 6959485 5876492 4693494
35290 4693494 3491086 2637284 2519479 3077850 3809764 4275920 4397868 4238321 3771004
35281 3771004 3014690 2204592 1656918 1526020 1744500 2096290 2323858 2302748 2148697 2041793
$$ packed form
35341D769731j98936m86457l97324L41884Q67653M03714n16171p27379m8560N28181
35331D536336K67479l80373n45062j04439L47766M15459L03959L45034M95294
35322E681453M62900J84084l98K86184R55355J500893J671185J880872K654115
35313A5276643L884764N230527P144700J0500177J4564506J6150707J2071307
35306H4823331K661327p830112j4625207j5892586j3113522r013399n626924l674814
35298A7708094k835439k390537j901546j422592j141740j056755j082993j182998
35290D693494j202408q53802j17805N58371P31914M66156J21948j59547m67317
35281C771004p56314q10098n47674j30898K18480L51790K27568k1110j54051j06904
$$ plain form
35271 2041793 1985162 1923250 2021919 2492027 3102447 3281526 2898582 2558030 2778860 3188156
35261 3188156 2998876 2143336 1398918 1319981 1534696 1377471 882600 727258 1265046 2023181
35251 2023181 2314317 2078050 1826309 1854639 1868737 1510712 954013 696994 923861 1384800
35241 1384800 1839827 2272673 2629514 2689323 2347481 1797100 1297958 962070 846523 991604
35231 991604 1234053 1266842 1076780 1042515 1346066 1559118 1166706 329081 -256105 -181377
35221 -181377 317336 811180 1167862 1542590 2107795 2857183 3567473 3978673 4090090 4155173
35211 4155173 4292914 4346567 4320923 4646667 5638761 6934110 7934735 8658700 9646704
35202 9646704 11123450 12829441 14705163 17171195 20626716 25214140 31260518 39582682
$$ packed form
35271B041793n6631o1912R8669M70108O10420J79079l82944l40552K20830M09296
35261C188156j89280q55540p44418p8937K14715j57225m94871j55342N37788P58135
35251B023181K91136k36267k51741K8330J4098l58025n56699k57019K26867M60939
35241A384800M55027M32846L56841N9809l41842n50381m99142l35888j15547J45081
35231I91604K42449L2789j90062l4265L03551K13052l92412q37625n85186P4728
35221a81377M98713M93844L56682L74728N65205P49388P10290M11200J11417O5083
35211D155173J37741N3653k5644L25744R92094J295349J000625P23965R88004
35202I646704J476746J705991J875722K466032L455521M587424O046378Q322164
$$ plain form
35194 39582682 51501039 69241403 95852495 132478557 173897122 207630263 220199573
35187 220199573 206327431 172619956 132458789 97314353 71795907 54656593 42678235
35180 42678235 33622909 26809939 22126769 19069901 16784940 14730037 12923005 11495242
35172 11495242 10282464 8979909 7499749 6030942 4864162 4226668 4131533 4297814 4356237
35163 4356237 4207179 4035693 3930832 3703695 3204325 2628422 2332306 2448920 2810823
35154 2810823 3139019 3203348 2948012 2603752 2543522 2886347 3392519 3892503 4586000 5629405
35144 5629405 6617604 6919220 6554011 6352374 7105182 8852247 11194147 14085578 18130506
35135 18130506 24220824 32873168 43414172 53373792 59061501 57719727 49734444 38617929
$$ packed form
35194C9582682J1918357J7740364K6611092L6626062M1418565L3733141J2569310
35187B20199573j3872142l3707475m0161167l5144436k5518446j7139314j1978358
35180D2678235r055326o812970m683170l056868k284961k054903j807032j427763
35172A1495242j212778j302555j480160j468807j166780o37494r5135J66281N8423
35163D356237j49058j71486j04861k27137m99370n75903k96116J16614L61903
35154B810823L28196O4329k55336l44260o0230L42825N06172M99984O93497J043405
35144E629405R88199L01616l65209k01637P52808J747065K341900K891431M044928
35135A8130506O090318Q652344J0541004R959620N687709j341774p985283j1116515
$$ plain form
35127 38617929 28491108 21437414 17070418 14071176 11629952 9593559 7954439 6668938
35119 6668938 5786007 5356126 5160093 4756877 3899665 2779100 1778047 1103680 764491
35110 764491 779335 1176896 1769869 2160120 2129131 1899390 1817093 1848853 1643337 1110746
35100 1110746 647594 608383 774920 633927 88029 -415393 -480018 -199600 101976 324266
35090 324266 593642 960989 1309147 1517854 1558886 1438611 1184132 916861 843278 1093646
35080 1093646 1552214 1870597 1736458 1217337 775909 789812 1080643 1122131 731128 287384
35070 287384 164429 234891 164965 -48987 -156886 -111854 -99591 -171748 -176369 -46287 122886
35059 122886 261155 313796 106409 -417854 -851894 -656894 82389 683604 787359 763370
$$ packed form
35127C8617929j0126821p053694m366996k999242k441224k036393j639120j285501
35119F668938q82931m29881j96033m03216q57212j120565j001053o74367l39189
35110G64491J4844L97561N92973L90251l0989k29741q2297L1760k05516n32591
35100A110746m63152l9211J66537j40993n45898n03422o4625K80418L01576K22290
35090C24266K69376L67347L48158K08707M1032j20275k54479k67271p3583K50368
35080A093646M58568L18383j34139n19121m41428J3903K90831M1488l91003m43744
35070B87384j22955P0462o9926k13952j07899M5032J2263p2157m621J30082J69173
35059A22886J38269N2641k07387n24263m34040J95000P39283O01215J03755k3989
$$ plain form
35049 763370 954788 1054409 699527 267823 445067 1177642 1685047 1528404 1127108 1090143
35039 1090143 1471497 1875140 1973805 1731362 1343661 1124353 1288063 1739535 2193080 2497794
35029 2497794 2669718 2665080 2421805 2124952 2075122 2211455 2123120 1673065 1244870 1152202
35019 1152202 1142751 787932 104914 -526532 -858484 -860979 -496371 210836 949075 1311317
35009 1311317 1226417 962585 736113 563491 476189 616175 1057690 1679960 2217015 2346929
34999 2346929 1865739 959189 170167 -130823 -112143 -83986 49451 546882 1198730 1475448
34989 1475448 1325134 1287836 1662076 2046851 1962077 1495771 1009896 562663 27522 -442737
34979 -442737 -486920 -1795 736496 1343593 1535683 1234389 696954 382412 453339 595981
$$ packed form
35049G63370J91418R9621l54882m31704J77244P32575N07405j56643m01296l6965
35039A090143L81354M03643R8665k42443l87701k19308J63710M51472M53545L04714
35029B497794J71924m638k43275k96853m9830J36333q8335m50055m28195r2668
35019A152202r451l54819o83018o31446l31952k495L64608P07207P38239L62242
35009A311317q4900k63832k26472j72622q7302J39986M41515O22270N37055J29914
34999B346929m81190r06550p89022l00990J8680K8157J33437M97431O51848K76718
34989A475448j50314l7298L74240L84775q4774m66306m85875m47233n35141m70259
34979d42737m4183M85125P38291O07097J92090l01294n37435l14542P0927J42642
$$ plain form
34969 595981 590884 807469 1728815 3167646 4451022 5328270 6193966 7407111 8980869
34960 8980869 11135313 14534332 19418748 24723312 28524730 29387642 27135754 22606063
34952 22606063 17120950 12103409 8568869 6584689 5390534 4296241 3362864 3028191
34944 3028191 3246255 3374222 2953801 2252972 1816244 1719803 1581783 1182486 706758 363813
34934 363813 126820 -37338 -8198 221922 394811 341944 266665 404212 612130 626753
34924 626753 558096 734966 1132702 1360981 1233524 974192 798622 652013 471135 370421
34914 370421 404343 418396 306197 195447 245745 475765 879661 1434684 1876517 1815602
34904 1815602 1305213 965782 1219612 1659263 1558814 839027 108908 -171309 -135498 -83860
$$ packed form
34969E95981n097K16585R21346J438831J283376Q77248Q65696J213145J573758
34960H980869K154444L399019M884416N304564L801418Q62912k251888m529691
34952B2606063n485113n017541l534540j984180j194155j094293r33377l34673
34944C028191K18064J27967m20421p00829m36728r6441j38020l99297m75728l42945
34934C63813k36993j64158K9140K30120J72889n2867p5279J37547K07918J4623
34924F26753o8657J76870L97736K28279j27457k59332j75570j46609j80878j00714
34914C70421L3922J4053j12199j10750N0298K30020M03896N55023M41833o0915
34904A815602n10389l39431K53830M39651j00449p19787p30119k80217L5811N1638
$$ plain form
34894 -83860 -22396 168194 360025 247816 -238880 -755017 -852913 -471930 -43571 -16535
34884 -16535 -328560 -525176 -381135 -124089 29968 204641 496457 627344 359908 31589
34874 31589 197945 830953 1344494 1416177 1308308 1286803 1210832 939837 750737 993399
34864 993399 1538182 1883722 1728388 1220877 719295 470264 457477 428171 121005 -448273
34854 -448273 -997968 -1301335 -1341066 -1106676 -497695 391718 1108060 1234020 865647 472295
34844 472295 345379 400480 471953 550133 689959 885207 1107694 1336235 1488081 1436585
34834 1436585 1158498 775639 400266 26490 -354992 -599016 -465056 141247 1019225
34825 1019225 1798414 2226289 2321036 2229030 1987846 1535307 956620 563482 588154 860928
$$ packed form
34894h3860O1464J90590J91831j12209m86696n16137r7896L80983M28359K7036
34884a6535l12025j96616J44041K57046J54057J74673K91816J30887k67436l28319
34874C1589J66356O33008N13541P1683j07869k1505p5971k70995j89100K42662
34864I93399N44783L45540j55334n07511n01582k49031j2787k9306l07166n69278
34854d48273n49695l03367l9731K34390O08981Q89413P16342J25960l68373l93352
34844D72295j26916N5101P1473P8180J39826J95248K22487K28541J51846n1496
34834A436585k78087l82859l75373l73776l81482k44024J33960O06303Q77978
34825A019225P79189M27875R4747r2006k41184m52539n78687l93138K4672K72774
$$ plain form
34815 860928 948717 629170 105929 -272412 -363140 -212442 156864 712912 1196271 1222771
34805 1222771 775805 397090 604150 1191158 1429092 992300 350257 107344 292824
34796 292824 547843 695648 752849 617790 232377 -48857 234907 949626 1448917 1432749
34786 1432749 1229591 1083792 725280 -18183 -669918 -655692 -103765 388065 572189 655298
34776 655298 734885 659549 443947 353240 489448 662818 759302 897854 1111423 1173414
34766 1173414 892970 372346 -135984 -447743 -471102 -235102 24620 15304 -278088 -566311
34756 -566311 -618159 -473120 -252529 24850 347724 618331 759145 780929 688451 462909
34746 462909 176528 -31210 -120263 -140145 -69428 135893 367826 502337 679039 1096074
$$ packed form
34815H60928Q7789l19547n23241l78341r0728J50698L69306N56048M83359K6500
34805A222771m46966l78715K07060N87008K37934m36792o42043k42913J85480
34796B92824K55019J47805N7201j35059l85413k81234K83764P14719M99291j6168
34786A432749k03158j45799l58512p43463o51735J4226N51927M91830J84124Q3109
34776F55298P9587p5336k15602r0707J36208J73370R6484J38552K13569O1991
34766A173414k80444n20624n08330l11759k3359K36000K59722r316k93392k88223
34756e66311n1848J45039K20591K77379L22874K70607J40814K1784r2478k25542
34746D62909k86381k07738q9053j9882P0717K05321K31933J34511J76702M17035
$$ plain form
34736 1096074 1501914 1329513 507163 -277446 -399482 -46943 157611 -27200 -401239
34727 -401239 -827224 -1340005 -1850560 -2146685 -2180783 -2058593 -1786997 -1326725 -837189 -542528
34717 -542528 -376765 -95381 252648 320640 7670 -341792 -441399 -468658 -733532 -1148769
34707 -1148769 -1312356 -1045597 -601842 -315564 -236350 -213704 -218002 -382528 -709948 -940316
34697 -940316 -870604 -669631 -641321 -762259 -765945 -655423 -720916 -959281 -947889 -545355 -254985
34686 -254985 -485073 -839405 -671594 -64671 334050 278621 100040 7836 -121401 -240144
34676 -240144 -79787 279083 420813 339344 510554 986571 1128769 643431 201128 446837
34666 446837 959028 897035 268304 -235355 -418499 -755271 -1390701 -1753467 -1395893 -661222
$$ packed form
34736A096074M05840j72401q22350p84609j22036L52539K04554j84811l74039
34727d01239m25985n12781n10555k96125l4098J22190K71596M60272M89536K94661
34717e42528J65763K81384L48029O7992l12970l49462r9607k7259k64874m15237
34707a148769j63587K66759M43755K86278P9214K2646m298j64526l27420k30368
34697i40316O9712K00973K8310j20938l686J10522o5493k38365J1392M02534K90370
34686b54985k30088l54332J67811O06923L98721n5429j78581r2204j29237j18743
34676b40144J60357L58870J41730q1469J71210M76017J42198m85338m42303K45709
34666D46837N12191o1993o28731n03659j83144l36772o35430l62766L57574P34671
$$ plain form
34656 -661222 -229146 -355392 -775767 -1082814 -1026187 -663917 -347415 -396757 -757694 -1149778
34646 -1149778 -1483684 -1838891 -2075049 -1865339 -1208485 -553057 -251003 -157183 86615 616900
34636 616900 1321664 1984653 2305226 2035792 1306870 623296 347845 354361 351699 337664
34626 337664 487057 747161 856925 757821 732087 1044784 1588413 1992787 2044552 1890337
34616 1890337 1772148 1653872 1299106 741005 402289 545014 832710 768061 405290 200416
34606 200416 221053 30217 -534643 -987599 -882169 -468595 -310359 -543486 -887969 -1155563
34596 -1155563 -1325475 -1251079 -731933 95970 757859 896350 555120 38414 -319325 -299537
34586 -299537 46322 382603 413039 207583 41941 -37064 -260851 -742319 -1239878 -1398182
$$ packed form
34656f61222M32076j26246m20375l07047N6627L62270L16502m9342l60937l92084
34646a149778l33906l55207k36158K09710O56854O55428L02054R3820K43798N30285
34636F16900P04764O62989L20573k69434p28922o83574k75451O516k662j4035
34626C37664J49393K60104J09764r9104k5734L12697N43629M04374N1765j54215
34616A890337j18189j18276l54766n58101l38716J42725K87696o4649l62771k04874
34606B00416K0637j90836n64860m52956J05430M13574J58236k33127l44483k67594
34596a155563j69912P4396N19146Q27903O61889J38491l41230n16706l57739J9788
34586b99537L45859L36281L0436k05456j65642p9005k23787m81468m97559j58304
$$ plain form
34576 -1398182 -1113760 -613653 -227111 -73810 47853 386443 829999 955161 598222
34567 598222 161377 124446 428957 644946 622933 604832 695144 608395 87496 -688028
34557 -688028 -1284232 -1450531 -1249520 -873599 -464074 -68275 305706 617089 814137 934045
34547 934045 1070329 1188840 1139274 950545 890316 1040436 1080845 824773 713378 1263662
34537 1263662 2125103 2288702 1347316 14199 -813619 -998041 -874173 -546545 4286
34528 4286 433415 279746 -324277 -692113 -438946 59576 203960 -109276 -487132 -574825
34518 -574825 -363920 -10354 439351 1005726 1531050 1701220 1465593 1294523 1727612 2642558
34508 2642558 3270133 3079980 2397836 1918239 1805965 1593107 888837 -134774 -1020537
$$ packed form
34576a398182K84422N00107L86542J53301J21663L38590M43556J25162l56939
34567E98222m36845l6931L04511K15989k2013j8101R0312q6749n20899p75524
34557f88028n96204j66299K01011L75921M09525L95799L73981L11383J97048J19908
34547I34045J36284J18511m9566j88729o0229J50120M0409k56072j11395N50284
34537A263662Q61441J63599r41386j333117q27818j84422J23868L27628N50831
34528D286M29129j53669o04023l67836K53167M98522J44384l13236l77856q7693
34518e74825K10905L53566M49705N66375N25324J70170k35627j71070M33089R14946
34508B642558O27575j90153o82144m79597j12274k12858p04270j023611q85763
$$ plain form
34499 -1020537 -1537163 -1772056 -1848249 -1718072 -1267892 -576551 7344 138183 -156951 -474054
34489 -474054 -450832 -100953 329459 712474 1103694 1527052 1863922 1976552 1840760 1536340
34479 1536340 1172795 833076 542131 291824 124293 154818 458596 959390 1488298 1941792
34469 1941792 2321584 2601850 2613938 2158638 1294488 447174 69226 157246 289186 233278
34459 233278 278042 725113 1285269 1386419 998978 687749 780322 947356 795877 453951
34449 453951 269731 271070 273821 262236 285493 181401 -192417 -588435 -648319 -487599 -582086
34438 -582086 -1055417 -1480797 -1490752 -1232097 -1047020 -982592 -841544 -553000 -269216 -141020
34428 -141020 -138944 -97182 120147 480354 789644 865695 703688 448328 237653 130312
$$ packed form
34499a020537n16626k34893p6193J30177M50180O91341N83895J30839k95134l17103
34489d74054K3222L49879M30412L83015L91220M23358L36870J12630j35792l04420
34479A536340l63545l39719k90945k50307j67531L0525L03778N00794N28908M53494
34469A941792L79792K80266J2088m55300q64150q47314l77948Q8020J31940n5908
34459B33278M4764M47071N60156J01150l87441l11229R2573J67034j51479l41926
34449D53951j84220J339K751j1585K3257j04092l73818l96018n9884J60720r4487
34438e82086m73331m25380r955K58655J85077O4428J41048K88544K83784J28196
34428a41020K076M1762K17329L60207L09290P6051j62007k55360k10675j07341
$$ plain form
34418 130312 157590 369337 796249 1361044 1834569 1970685 1783879 1596259 1614918 1543797
34408 1543797 930181 -87078 -754573 -577017 135435 787905 1191487 1433596 1435057 1104495
34398 1104495 715772 639495 779915 702555 283811 -138047 -230530 38886 511050 914547
34388 914547 939328 591380 359675 628604 1058816 1040896 648320 524183 816677 914768
34378 914768 436122 -154583 -244459 121239 506506 739984 898833 960289 881139 816777
34368 816777 916242 1057781 1061255 995826 1023123 1090080 1007787 702765 225461 -309244 -634559
34357 -634559 -423273 306777 1055044 1301876 962246 279744 -451567 -877751 -616974 356285
34347 356285 1484047 2026025 1641252 540479 -696063 -1389365 -1223446 -643586 -469890
$$ packed form
34418A30312K7278K11747M26912N64795M73525J36116j86806j87620J8659p1121
34408A543797o13616j017259o67495J77556P12452O52470M03582K42109J461l30562
34398A104495l88723p6277J40420p7360m18744m21858r2483K69416M72164M03497
34388I14547K4781l47948k31705K68929M30212j7920l92576j24137K92494R8091
34378I14768m78646n90705q9876L65698L85267K33478J58849O1456p9150o4362
34368H16777R9465J41539L474o5429K7297O6957q2293l05022m77304n34705l25315
34357f34559K11286P30050P48267K46832l39630o82502p31311m26184K60777R73259
34347C56285J127762N41978l84773j100773j236542o93302J65919N79860J73696
$$ plain form
34338 -469890 -907666 -1300596 -1099607 -635217 -551621 -881663 -1178138 -1258998 -1279717 -1258560
34328 -1258560 -1063055 -770881 -582417 -456436 -244277 -65058 -106664 -171429 92506 568984
34318 568984 773654 563898 279192 164488 132663 155490 402471 838334 1094789 943613
34308 943613 599421 392782 386450 430514 380808 186619 -41921 -31220 381849 977579
34298 977579 1359593 1378127 1126783 655183 29295 -413435 -276541 416095 1272920 2012493
34288 2012493 2547153 2711851 2382493 1823219 1424097 1105174 504006 -245334 -539511
34279 -539511 -222247 162503 251924 376962 860476 1359559 1347407 857174 355624 199974
34269 199974 523598 1281743 2073255 2294919 1848841 1361400 1348993 1536292 1394421 963508
$$ packed form
34338d69890m37776l92930K00989M64390Q3596l30042k96475q0860k0719K1157
34328a258560J95505K92174J88464J25981K12159J79219m1606o4765K63935M76478
34318E68984K04670k09756k84706j14704l1825K2827K46981M35863K56455j51176
34308I43613l44192k06639o332M4064m9706j94189k28540J0701M13069N95730
34298I77579L82014J8534k51344m71600o25888m42730J36894O92636Q56825P39573
34288B012493N34660J64698l29358n59274l99122l18923o01168p49340k94177
34279e39511L17264L84750Q9421J25038M83514M99083j2152m90233n01550j55650
34269A99974L23624P58145P91512K21664m46078m87441j2407J87299j41871m30913
$$ plain form
34259 963508 650924 542924 460985 453371 669369 915025 885348 734532 893692 1380138
34249 1380138 1770260 1818056 1654824 1440417 1280260 1403454 1874913 2151895 1545037 240437
34239 240437 -729404 -760546 -380059 -359206 -630756 -564079 21859 671341 996677 1077848
34229 1077848 1123004 1117793 948156 621866 225908 -172186 -469070 -536428 -437213 -479198
34219 -479198 -820039 -1107482 -835651 -101230 362667 118857 -342746 -274229 282368 627700
34209 627700 481261 322297 559342 952389 1141052 1247481 1561786 2003083 2313409 2499801
34199 2499801 2664647 2639790 2237311 1703996 1498610 1706893 2027299 2225240 2272502 2178050
34189 2178050 2029146 2063395 2356942 2593828 2484687 2217649 2126577 2166244 2165569 2324444
$$ packed form
34259I63508l12584j08000q1939p614K15998K45656k9677j50816J59160M86446
34249A380138L90122M7796j63232k14407j60157J23194M71459K76982o06858j304600
34239B40437r69841l1142L80487K0853k71550O6677N85938O49482L25336Q1171
34229A077848M5156n211j69637l26290l95958l98094k96884o7358R9215m1985
34219d79198l40841k87443K71831P34421M63897k43810m61603O8517N56597L45332
34209F27700j46439j58964K37045L93047J88663J06429L14305M41297L10326J86392
34199B499801J64846k4857m02479n33315k05386K08283L20406J97941M7262r4452
34189B178050j48904L4249K93547K36886j09141k67038r1072L9667o75J58875
$$ plain form
34179 2324444 2905431 3679563 4298849 4982717 6147001 7624448 9097498 11042236 14225183
34170 14225183 18591457 24126380 32604763 46022583 62017596 72908118 71843797 59633765
34162 59633765 43791089 31130452 23016614 17499643 13362336 10668696 9064389 7622042
34154 7622042 6121082 5159028 4966869 5005803 4772083 4274725 3655114 2977678 2514438
34145 2514438 2645884 3252203 3665198 3485946 3081785 2991889 3155953 3087479 2614691 2058206
34135 2058206 1720672 1556913 1419999 1328388 1301122 1136827 641311 24383 -235417 -42868
34125 -42868 41008 -551018 -1564575 -2081201 -1587861 -597562 4067 10843 -6188 461639
34115 461639 1274125 1911461 2013322 1574765 910913 552718 859452 1516417 1700135 1025300
$$ packed form
34179B324444N80987P74132O19286O83868J164284J477447J473050J944738L182947
34170A4225183M366274N534923Q478383J3417820J5995013J0890522j064321j2210032
34162E9633765j5842676j2660637q113838n516971m137307k693640j604307j442347
34154G622042j500960r62054j92159L8934k33720m97358o19611o77436m63240
34145B514438J31446O06319M12995j79252m04161q9896J64064o8474m72788n56485
34135B058206l37534j63759j36914r1611k7266j64295m95516o16928k59800J92549
34125d2868Q3876n92026j013557n16626M93340R90299O01629O776j7031M67827
34115D61639Q12486O37336J01861m38557o63852l58195L06734O56965J83718o74835
$$ plain form
34105 1025300 79750 -318159 -153996 -63241 -318333 -541242 -420504 -117156 195114 623983
34095 623983 1113896 1234590 823820 408524 488429 737541 491368 -197651 -634376 -549691
34085 -549691 -456135 -824093 -1453103 -1884037 -1996484 -1920651 -1696057 -1333968 -1006361 -876953
34075 -876953 -842913 -661027 -288470 33072 16196 -372567 -795098 -788342 -287225 179163
34065 179163 71414 -436258 -673870 -433322 -250496 -552521 -995415 -1028819 -757368 -719525
34055 -719525 -988608 -1070061 -727076 -379439 -465406 -817284 -1004285 -1012456 -1142578 -1333727
34045 -1333727 -1097450 -289143 477435 559661 191886 191924 820354 1442359 1442456 969134 487799
34034 487799 69684 -402112 -674546 -397677 176899 389564 99551 -117390 197980 827638
$$ packed form
34105A025300r45550l97909J64163R0755k55092k22909J20738L03348L12270M28869
34095F23983M89913J20694m10770m15296P9905K49112k46173o89019m36725Q4685
34085e49691R3556l67958o29010m30934j12447P5833K24594L62089L27607J29408
34075h76953L4040J81886L72557L21542j6876l88763m22531O756N01117M66388
34065A79163j07749n07672k37612K40548J82826l02025m42894l3404K71451L7843
34055g19525k69083q1453L42985L47637q5967l51878j87001q171j30122j91149
34045a333727K36277Q08307P66578Q2226l67775L8O28430O22005R7m73322m81335
34034D87799m18115m71796k72434K76869N74576K12665k90013k16941L15370O29658
$$ plain form
34024 827638 1271236 1258055 736417 -170546 -984518 -1093052 -445845 300764 573427 487522
34014 487522 462057 629404 903568 1235427 1456322 1240491 621507 212221 464953 993804
34004 993804 1107496 776461 545518 647058 762411 625501 333041 -12670 -509705 -1148218
33994 -1148218 -1624829 -1644912 -1242157 -718997 -390471 -384254 -568679 -692992 -650504 -496713
33984 -496713 -210458 266378 657474 442001 -406780 -1172796 -1264176 -949353 -782277 -710797
33974 -710797 -381196 5886 -76777 -545703 -783084 -630169 -536760 -660496 -602639 -220646
33964 -220646 53966 -7348 -38993 177478 248384 -100197 -418550 -215143 215000 225501
33954 225501 -245202 -729432 -977782 -1104905 -1135620 -927787 -536773 -262669 -292955 -532998
$$ packed form
34024H27638M43598j3181n21638r06963q13972j08534O47207P46609K72663q5905
34014D87522k5465J67347K74164L31859K20895k15831o18984m09286K52732N28851
34004I93804J13692l31035k30943J01540J15353j36910k92460l45711m97035o38513
33994a148218m76611k0083M02755N23160L28526O217j84425j24313M2488J53791
33984d96713K86255M76836L91096k15473q48781p66016r1380L14823J67076P1480
33974g10797L29601L87082q2663m68926k37381J52915R3409j23736N7857L81993
33964b20646K74612o1314l1645K16471P0906l48581l18353K03407M30143J0501
33954B25501m70703m84230k48350j27123l0715K07833L91014K74104l0286k40043
$$ plain form
33944 -532998 -768824 -837465 -728991 -644306 -788777 -1003074 -857366 -260210 346942 607915
33934 607915 694348 843969 865942 538246 147668 93958 197973 -7515 -434924 -504207
33924 -504207 -30036 548207 905372 1231379 1697977 2026934 1903481 1470191 1084383 825151
33914 825151 555994 315421 313515 558550 741891 574335 108532 -359466 -647785 -829761
33904 -829761 -983278 -933198 -437163 382227 1024045 1131630 841682 492859 200821 -81986
33894 -81986 -277942 -230634 53295 441127 868438 1279404 1480628 1320117 952657 671877
33884 671877 521109 318126 21891 -193685 -219705 -111595 86820 368551 615074 685933
33874 685933 678458 834937 1140494 1264750 986804 470769 44616 -111198 -4291 241291
$$ packed form
33944e32998k35826o8641J08474Q4685j44471k14297J45708N97156O07152K60973
33934F07915Q6433J49621K1973l27696l90578n3710J04015k05488m27409o9283
33924e04207M74171N78243L57165L26007M66598L28957j23453m33290l85808k59232
33914H25151k69157k40573j906K45035J83341j67556m65803m67998k88319j81976
33904h29761j53517N0080M96035Q19390O41818J07585k89948l48823k92038k82807
33894h1986j95956M7308K83929L87832M27311M10966K01224j60511l67460k80780
33884F71877j50768k02983k96235k15576k6020J08110J98415K81731K46523P0859
33874F85933p475J56479L05557J24256k77946n16035m26153j55814J06907K45582
$$ plain form
33864 241291 422209 384090 179613 -11700 -105604 -112915 3145 229923 328372 83252
33854 83252 -244310 -74153 740082 1606693 1833975 1369032 745999 491028 734516 1234492
33844 1234492 1600301 1593059 1321565 1053406 809064 341379 -409710 -1083402 -1287339 -1058813
33834 -1058813 -787079 -811096 -1208237 -1807300 -2249692 -2182429 -1576130 -785535 -193274 106193
33824 106193 206206 167371 58135 58453 300625 648227 798661 625110 346781 328367
33814 328367 660429 916631 505918 -547352 -1384627 -1255020 -539800 -294809 -774471
33805 -774471 -1093471 -579645 265024 638058 613199 722123 854446 498990 -129945 -193746
33795 -193746 452984 936650 655357 149111 241414 880775 1339874 1190874 630874 112680
$$ packed form
33864B41291J80918l8119k04477j91313r3904p311J16060K26778R8449k45120
33854H3252l27562J70157Q14235Q66611K27282m64943o23033k54971K43488M99976
33844A234492L65809p242k71494k68159k44342m67685p51089o73692k03937K28526
33834a058813K71734k4017l97141n99063m42392O7263O06299P90595N92261K99467
33824A06193J00013l8835j09236L18K42172L47602J50434j73551k78329j8414
33814C28367L32062K56202m10713j053270q37275J29607P15220K44991m79662
33805g74471l19000N13826Q44669L73034k4859J08924J32323l55456o28935o3801
33795a93746O46730M83666k81293n06246R2303O39361M59099j49000n60000n18194
$$ plain form
33785 112680 30098 512041 1177244 1348906 858432 357183 442582 778976 601606 -130118
33775 -130118 -701665 -699371 -460929 -369707 -291225 19715 403361 533204 387337 173837
33765 173837 -21015 -246850 -490687 -675288 -746251 -626373 -245642 254438 560490 600123
33755 600123 681331 1010505 1337036 1375655 1324530 1550662 1938295 2041735 1823872 1721464
33745 1721464 1916261 2047264 1813666 1404936 1094071 822605 500096 350946 582461
33736 582461 977603 1201338 1290325 1450293 1574895 1405494 1011706 638069 190584 -579690
33726 -579690 -1412532 -1667595 -1245297 -804409 -825725 -999923 -881463 -622259 -548370 -430227
33716 -430227 148452 886662 959186 190511 -587119 -599234 -75162 215215 22016 -222663
$$ packed form
33785A12680q2582M81943O65203J71662m90474n01249Q5399L36394j77370p31724
33775a30118n71547K294K38442R1222P8482L10940L83646J29843j45867k13500
33765A73837j94852k25835k43837j84601p0963J19878L80731N00080L06052L9633
33755F00123Q1208L29174L26531L8619n1125K26132L87633J03440k17863j02408
33745A721464J94797J31003k33598m08730l10865k71466l22509j49150K31515
33736E82461L95142K23735Q8987J59968J24602j69401l93788l73637m47485p70274
33726e79690q32842k55063M22298M40888k1316j74198J18460K59204P3889J18143
33716d30227N78679P38210P2524p68675p77630j2115N24072K90377j93199k44679
$$ plain form
33706 -222663 -141196 144386 352920 473720 657478 865437 868260 575012 182312 -68935
33696 -68935 -169164 -265238 -376405 -343974 -98292 168482 223347 125585 187318 570060 1031759
33685 1031759 1154773 773544 104939 -495075 -788788 -690132 -237598 324949 567152 216361
33675 216361 -489437 -982338 -953426 -586984 -173812 221871 538773 471001 -179187 -1029996
33665 -1029996 -1394214 -1028027 -295567 389121 908230 1183182 997826 300256 -586695
33656 -586695 -1247891 -1479570 -1249919 -677672 -166082 -161943 -546472 -644475 -140123 402269
33646 402269 332522 -132168 -272228 83750 479417 649251 756241 818896 561530 -19100
33636 -19100 -513877 -732670 -958997 -1349238 -1603156 -1536869 -1464701 -1589838 -1483928 -734444
$$ packed form
33706b22663Q1467K85582K08534J20800J83758K07959K823k93248l92700k51247
33696f8935j00229r6074j11167L2431K45682K66774N4865r7762O1733L82742M61699
33685A031759J23014l81229o68605o00014k93713R8656M52534N62547K42203l50791
33675B16361p05798m92901K8912L66442M13172L95683L16902o7772o50188q50809
33665a029996l64218L66187P32460O84688N19109K74952j85356o97570q86951
33656e86695o61196k31679K29651N72247N11590M139l84529r8003N04352N42392
33646D02269o9747m64690j40060L55978L95667J69834J06990O2655k57366n80630
33636a9100m94777k18793k26327l90241k53918O6287P2168j25137J05910P49484
$$ plain form
33626 -734444 217771 528040 93385 -369044 -379806 -237147 -357957 -609283 -609579 -355111
33616 -355111 -180286 -229313 -269315 -43104 358168 547087 260237 -289203 -572995 -355202
33606 -355202 -29282 -153216 -716364 -1145883 -1066698 -751530 -686040 -961441 -1314816 -1561827
33596 -1561827 -1712003 -1765667 -1676499 -1498059 -1349903 -1239264 -1092208 -932277 -830618 -710580
33586 -710580 -447391 -169584 -174939 -464338 -651844 -496053 -235315 -151751 -70160 332285
33576 332285 869024 958249 435642 -150719 -216016 205679 685688 1007179 1245389 1387636
33566 1387636 1219907 655309 -19879 -347983 -129466 363204 616325 375386 -105163
33557 -105163 -419663 -575706 -965685 -1714314 -2345673 -2324377 -1727223 -1097570 -754437 -550398
$$ packed form
33626g34444R52215L10269m34655m62429j0762J42659j20810k51326k96K54468
33616c55111J74825m9027m0002K26211M01272J88919k86850n49440k83792K17793
33606c55202L25920j23934n63148m29519P9185L15168O5490k75401l53375k47011
33596a561827j50176n3664Q9168J78440J48156J10639J47056J59931J01659J20038
33586g10580K63189K77807n355k89399j87506J55791K60738Q3564Q1591M02445
33576C32285N36739Q9225n22607n86361o5297M21695M80009L21491K38210J42247
33566A387636j67729n64598o75188l28104K18517M92670K53121k40939m80549
33557a05163l14500j56043l89979p48629o31359K1296N97154O29653L43133K04039
$$ plain form
33547 -550398 -277255 -12364 13064 -279830 -686071 -813062 -405611 277082 569001 144223
33537 144223 -485611 -575115 -140307 118936 -114702 -369760 -255419 -160400 -621570 -1383894
33527 -1383894 -1664850 -1191166 -430165 164989 600443 943205 999595 678247 316882 280361
33517 280361 415433 258423 -283551 -794739 -928269 -818520 -778435 -827727 -757127 -522335
33507 -522335 -284269 -77005 269501 785313 1196185 1264414 1080513 818351 417226 -202383
33497 -202383 -779300 -952015 -789787 -673029 -646824 -369288 171949 402128 -61119 -771381
33487 -771381 -1017440 -735658 -380892 -84591 476791 1358736 2045728 2089877 1673912 1277673
33477 1277673 1059899 869962 696198 751561 1110227 1533990 1776437 1897854 2115130 2406202
$$ packed form
33547e50398K73143K64891K5428k92894m06241j26991M07451O82693K91919m24778
33537A44223o29834q9504M34808K59243k33638k55058J14341R5019m61170p62324
33527a383894k80956M73684P61001N95154M35454L42762N6390l21348l61365l6521
33517B80361J35072j57010n41974n11188j33530J09749M0085m9292P0600K34792
33507e22335K38066K07264L46506N15812M10872O8229j83901k62162m01125o19609
33497b02383n76917j72715J62228J16758K6205K77536N41237K30179m63247p10262
33487g71381k46059K81782L54766K96301N61382Q81945O86992M4149m15965l96239
33477A277673k17774j89937j73764N5363L58666M23763K42447J21417K17276K91072
$$ plain form
33467 2406202 2469898 2148114 1708257 1518609 1547388 1445890 1102608 782208 625895 390204
33457 390204 -68639 -394320 -218568 181559 217113 -109441 -180954 288411 828234 955353
33447 955353 846941 889745 940396 563816 -148793 -541934 -246215 341117 594832 398245
33437 398245 133722 121110 312276 505080 654996 883616 1242454 1562772 1590507 1261474
33427 1261474 788092 448936 350365 437507 644474 897688 1009413 759907 164745 -470139
33417 -470139 -865598 -1040302 -1144273 -1136837 -857482 -411151 -228153 -599444 -1295121 -1791624
33407 -1791624 -1789434 -1388330 -867501 -467837 -309803 -314610 -221913 135555 591778 848222
33397 848222 853247 750710 523077 40953 -505165 -649609 -312330 -21233 -179697 -457232
$$ packed form
33467B406202O3696l21784m39857j89648K8779j01498l43282l20400j56313k35691
33457C90204m58843l25681J75752M00127L5554l26554p1513M69365N39823J27119
33447I55353j08412M2804N0651l76580p12609l93141K95719N87332K53715j96587
33437C98245k64523j2612J91166J92804J49916K28620L58838L20318K7735l29033
33427A261474m73382l39156r8571Q7142K06967K53214J11725k49506n95162o34884
33417d70139l95459j74704j03971P436K79355M46331J82998l71291o95677m96503
33407a791624K190M01104N20829L99664J58034m807R2697L57468M56223K56444
33397H48222N025j02537k27633m82124n46118j44444L37279K91097j58464k77535
$$ plain form
33387 -457232 -308939 166361 385419 164294 -95367 -120895 -143149 -381506 -599167 -484203
33377 -484203 -192086 -147835 -405024 -520656 -145512 429033 480744 -326136 -1407895 -1732719
33367 -1732719 -899010 444139 1387971 1728424 1866919 2005587 1943754 1627697 1352685
33358 1352685 1255455 1060922 586799 124020 -3367 30354 -179304 -643161 -969223 -902013
33348 -902013 -585563 -305954 -180920 -111450 72215 378413 516840 140379 -664236 -1290579
33338 -1290579 -1185202 -400100 546444 1215841 1526044 1661738 1895817 2365379 2853571
33329 2853571 2927976 2452237 1798666 1388746 1227440 1112237 1080477 1324218 1783706 2142644
33319 2142644 2179711 1897749 1411490 946943 802441 1003416 1117469 743658 79688 -350308
$$ packed form
33387d57232J48293M75300K19058k21125k59661k5528k2254k38357k17661J14964
33377d84203K92117M4251k57189j15632L75144N74545N1711q06880j081759l24824
33367a732719Q33709J343149R43832L40453J38495J38668o1833l16057k75012
33358A352685r7230j94533m74123m62779j27387L3721k09658m63857l26062O7210
33348i02013L16450K79609J25034O9470J83665L06198J38427l76461q04615o26343
33338a290579J05377P85102R46544O69397L10203J35694K34079M69562M88192
33329B853571P4405m75739o53571m09920j61306j15203l1760K43741M59488L58938
33319B142644L7067k81962m86259m64547j44502K00975J14053l73811o63970m29996
$$ plain form
33309 -350308 -421628 -441826 -527702 -446694 -133049 120469 134427 86413 110735 57580 -132076
33298 -132076 -201557 -19739 84776 -216453 -691914 -820439 -502363 -185244 -330029 -978011
33288 -978011 -1781413 -2259872 -2095457 -1380815 -563023 -25899 215398 343931 439974 494622
33278 494622 536166 519612 237362 -385974 -986566 -1034361 -423665 425093 1052464 1327861
33268 1327861 1315781 1035403 495806 -176889 -805788 -1319929 -1758757 -2139753 -2381457 -2368180
33258 -2368180 -2077232 -1634898 -1232518 -974469 -804146 -559176 -94387 575035 1176453
33249 1176453 1304458 803502 22763 -462234 -403520 -33221 301069 447029 404172 253969
33239 253969 215388 485170 881187 925142 470016 -33597 -132886 55576 176618 240518
$$ packed form
33309c50308p1320k0198q5876Q1008L13645K53518J3958m8014K4322n3155j89656
33298a32076o9481J81818J04515l01229m75461j28525L18076L17119j44785o47982
33288i78011q03402m78459J64415P14642Q17792N37124K41297J28533R6043N4648
33278D94622M1544j6554k82250o23336o00592m7795O10696Q48758O27371K75397
33268A327861j2080k80378n39597o72695o28899n14141m38828l80996k41704J3277
33258b368180K90948M42334M02380K58049J70323K44970M64789O69422O01418
33249A176453J28005n00956p80739m84997N8714L70299L34290J45960m2857j50203
33239B53969l8581K69782L96017M3955m55126n03613r9289J88462J21042O3900
$$ plain form
33229 240518 457286 682601 564609 166103 -110577 -242677 -658288 -1436718 -1993954 -1867273
33219 -1867273 -1359321 -1038318 -991018 -1006419 -1155342 -1607905 -2039567 -1849286 -1033283 -308827
33209 -308827 -181852 -325628 -151430 356227 727648 703872 447330 140778 -228353 -615743
33199 -615743 -780209 -583188 -235991 -46328 -23651 67210 314552 538409 590539 578573
33189 578573 673952 823549 813023 579644 316458 238668 342704 437129 348205 61055
33179 61055 -282444 -481995 -432279 -249298 -213375 -494142 -907727 -1018827 -549343 329800
33169 329800 1151735 1572220 1586759 1376743 1073345 727689 403386 175722 70885 97984
33159 97984 301903 671040 1021538 1122321 959662 747328 643045 600632 562569 632544
$$ packed form
33229B40518K16768K25315j17992l98506k76680j32100m15611p78430n57236J26681
33219a867273N07952L21003M7300j5401j48923m52563m31662J90281Q16003P24456
33209c08827J26975j43776J74198N07657L71421k3776k56542l06552l69131l87390
33199f15743j64466J97021L47197J89663K2677R0861K47342K23857N2130j1966
33189E78573R5379J49597j0526k33379k63186p7790J04036R4425q8924k87150
33179F1055l43499j99551M9716J82981L5923k80767m13585j11100M69484Q79143
33169C29800Q21935M20485J4539k10016l03398l45656l24303k27664j04837K7099
33159I7984K03919L69137L50498J00783j62659k12334j04283m2413l8063O9975
$$ plain form
33149 632544 920517 1325839 1627155 1726690 1667607 1463068 1073613 562964 144903 32283
33139 32283 294909 837645 1415238 1691230 1446385 818538 258783 155673 505119 975757
33129 975757 1259713 1304959 1228449 1110036 966139 890427 1057308 1468988 1776917 1520560
33119 1520560 578693 -695658 -1783222 -2360816 -2412168 -2145088 -1820027 -1534053 -1167120
33110 -1167120 -638152 -111052 272730 746199 1612058 2589730 2951420 2477350 1803851
33101 1803851 1543040 1524605 1309155 986350 873066 764302 214479 -580989 -936569 -730129
33091 -730129 -587026 -862529 -1114063 -853159 -225619 398617 986527 1588970 1974794 1972226
33081 1972226 1831507 1800295 1631539 981865 68164 -565297 -794255 -947478 -1145669 -1067128
$$ packed form
33149F32544K87973M05322L01316R9535n9083k04539l89455n10649m18061j12620
33139C2283K62626N42736N77593K75992k44845o27847n59755j03110L49446M70638
33129I75757K83956M5246p6510j18413j43897p5712J66881M11680L07929k56357
33119A520560r41867j274351j087564n77594n1352K67080L25061K85974L66933
33110a167120N28968N27100L83782M73469Q65859R77672L61690m74070o73499
33101A803851k60811j8435k15450l22805j13284j08764n49823p95468l55580K06440
33091g30129J43103k75503k51534K60904O27540O24236N87910O02443L85824k568
33081A972226j40719l1212j68756o49674r13701o33461k28958j53223j98191P8541
$$ plain form
33071 -1067128 -454443 459342 1133248 1172914 620385 -65930 -388617 -298425 -193098 -342240
33061 -342240 -557721 -601821 -594423 -705294 -753041 -535394 -320161 -518900 -1022473 -1353615
33051 -1353615 -1369691 -1306032 -1214516 -934392 -608034 -619632 -937036 -1097944 -975422 -951847
33041 -951847 -1142997 -1103444 -640798 -302910 -573710 -1099405 -1279696 -1216739 -1436769 -1943222
33031 -1943222 -2216685 -2037180 -1689896 -1394257 -1116133 -973851 -1248272 -1847955 -2263782
33022 -2263782 -2240433 -2062162 -1997790 -1921569 -1733851 -1686796 -1895681 -1905567 -1252080 -230147
33012 -230147 427199 534259 572989 819052 932014 633054 281110 369083 763960 905166
33002 905166 606203 217584 34287 -36479 -155782 -276875 -331002 -400721 -558355 -766471
$$ packed form
33071a067128O12685R13785O73906L9666n52529o86315l22687R0192J05327j49142
33061c42240k15481m4100P398j10871m7747K17647K15233j98739n03573l31142
33051a353615j6076O3659R1516K80124L26358j1598l17404j60908J22522K3575
33041i51847j91150L9553M62646L37888k70800n25695j80291O2957k20030n06453
33031a943222k73463J79505L47284K95639K78124J42282k74421n99683m15827
33022b263782K3349J78271O4372P6221J87718M7055k08885r886O53487J021933
33012b30147O57346J07060L8730K46063J12962k98960l51944Q7973L94877J41206
33002I05166k98963l88619j83297p0766j19303j21093n4127o9719j57634k08116
$$ plain form
32992 -766471 -1042208 -1435231 -1715307 -1441445 -595656 178688 304799 -38114 -321780 -470394
32982 -470394 -746466 -1044214 -933189 -398768 66428 214686 321535 543617 571275 219246
32972 219246 -144376 -154798 -33008 -183714 -536989 -747107 -798047 -930971 -1122356 -1100189
32962 -1100189 -818854 -519997 -349301 -248552 -188886 -202724 -241048 -293761 -550986 -1104262
32952 -1104262 -1599185 -1605126 -1278256 -1198603 -1529968 -1816394 -1700825 -1354402 -1006633 -538050
32942 -538050 126098 602774 478818 -27537 -234123 208817 961410 1422097 1322505 912233
32932 912233 681905 862283 1119871 866193 -24942 -972812 -1339353 -1165448 -999101 -1092608
32922 -1092608 -1123302 -772056 -242485 34520 27123 118206 495315 813971 632713 5582
$$ packed form
32992g66471k75737l93023k80076K73862Q45789P74344J26111l42913k83666j48614
32982d70394k76072k97748J11025N34421M65196J48258J06849K22082K7658l52029
32972B19246l63622j0422J21790j50706l53275k10118n0940j32924j91385K2167
32962a100189K81335K98857J70696J00749N9666j3838l8324n2713k57225n53276
32952a104262m94923n941L26870P9653l31365k86426J15569L46423L47769M68583
32942e38050O64148M76676j23956n06355k06586M42940P52593M60687r9592m10272
32932I12233k30328J80378K57588k53678q91135r47870l66541J73905J66347r3507
32922a092608l0694L51246N29571K77005p397R1083L77109L18656j81258o27131
$$ plain form
32912 5582 -599431 -901054 -1042075 -1193436 -1228516 -971384 -537037 -177025 62745 280007
32902 280007 441296 448930 384731 378883 300552 -80428 -641036 -975783 -960057 -887122 -962987
32891 -962987 -1017866 -845312 -502544 -142144 136675 163017 -188907 -601661 -483841 199682
32881 199682 718547 554515 142320 160540 495092 537053 232232 106578 337964 525835
32871 525835 449125 384025 491056 486750 184471 -158831 -337552 -577504 -1082642 -1608518
32861 -1608518 -1854744 -1913800 -1923377 -1623538 -777554 195235 574356 261503 -152716 -244805
32851 -244805 -196016 -295219 -480626 -590916 -692809 -857320 -861623 -452623 198804 614479
32841 614479 587521 402812 394107 457359 184711 -546200 -1299541 -1514714 -1118844 -524296
$$ packed form
32912E582o05013l01623j41021j51361l5080K57132M34347L60012K39770K17262
32902B80007J61289P634o4199n848p8331l80980n60608l34747J5726P2935p5865
32891i62987n4879J72554L42768L60400K78819K6342l51924m12754J17820O83523
32881A99682N18865j64032m12195J8220L34552M1961l04821j25654K31386J87871
32871E25835p6710o5100J07031m306l02279l43302j78721k39952n05138n25876
32861a608518k46226n9056r577K99839Q45984R72789L79121l12853m14219r2089
32851b44805M8789r9203j85407j10290j01893j64511m303M09000O51427M15675
32841F14479k6958j84709q705O3252k72648p30911p53341k15173L95870N94548
$$ plain form
32831 -524296 -40649 439495 1038006 1452946 1258199 547680 -73247 -178019 100612 449541
32821 449541 798522 1167349 1371291 1196678 758491 408249 321977 388147 452556 442014
32811 442014 261429 -179410 -768088 -1203838 -1288154 -1078665 -743939 -440941 -345700 -545662
32801 -545662 -793927 -638323 -6910 559157 552807 219437 238895 727414 1013962 579055
32791 579055 -190345 -541968 -403767 -413441 -930767 -1504799 -1538349 -1131031 -902571 -1139859
32781 -1139859 -1509929 -1623558 -1520113 -1443063 -1405301 -1216540 -810176 -333388 11453 49001
32771 49001 -338119 -1032748 -1589343 -1567658 -995643 -323498 82139 208118 190623 120094
32761 120094 105270 259735 519120 712997 904953 1355841 1999621 2307960 1956445 1329691
$$ packed form
32831e24296M83647M80144N98511M14940j94747p10519o20927j04772K78631L48929
32821D49541L48981L68827K03942j74613m38187l50242q6272O6170O4409j0542
32811D42014j80585m40839n88678m35750q4316K09489L34726L02998R5241j99962
32801e45662k48265J55604O31413N66067o350l33370J9458M88519K86548m34907
32791E79055p69400l51623J38201r674n17326n74032l3550M07318K28460k37288
32781a139859l70070j13629J03445P7050L7762J88761M06364M76788L44841L7548
32771D9001l87120o94629n56595K1685N72015O72145M05637J25979j7495p0529
32761A20094j4824J54465K59385J93877J91956M50888O43780L08339l51515o26754
$$ plain form
32751 1329691 1014635 1030091 955013 625451 236452 -144223 -658455 -1233935 -1531429 -1399842
32741 -1399842 -1012016 -507666 90897 562059 565009 172935 -150412 -287843 -661127 -1399959
32731 -1399959 -1866833 -1494335 -678180 -256439 -365119 -414605 -67158 365929 502063 322502
32721 322502 -54708 -569812 -1045234 -1193646 -959466 -556576 -75032 600547 1342979 1640498
32711 1640498 1195671 415779 -19414 41974 147332 -79520 -467100 -608575 -465825 -441330
32701 -441330 -801678 -1203129 -1028299 -201092 610285 757522 326358 -167666 -549543 -1027778
32691 -1027778 -1590181 -1896214 -1874876 -1934591 -2309380 -2579830 -2212088 -1333901 -589328 -346555
32681 -346555 -418951 -518689 -590758 -610279 -406170 64771 464672 391714 -84488 -461231
$$ packed form
32751A329691l15056J5456p5078l29562l88999l80675n14232n75480k97494J31587
32741a399842L87826N04350N98563M71162K950l92074l23347j37431l73284p38832
32731a399959m66874L72498Q16155M21741j08680m9486L47447M33087J36134j79561
32721C22502l77210n15104m75422j48412K34180M02890M81544O75579P42432K97519
32711A640498m44827p79892m35193O1388J05358k26852l87580j41475J42750K4495
32701d41330l60348m01451J74830Q27207Q11377J47237m31164m94024l81877m78235
32691a027778n62403l06033K1338n9715l74789k70450L67742Q78187P44573K42773
32681c46555p2396r9738p2069j9521K04109M70941L99901p2958m76202l76743
$$ plain form
32671 -461231 -432491 -252356 -329256 -656002 -888502 -877408 -816055 -879744 -1039252 -1271557
32661 -1271557 -1600323 -1818305 -1566158 -903387 -405727 -386784 -417536 -32775 476473 539862
32651 539862 251142 118137 59718 -495426 -1461270 -1910880 -1332526 -338873 268348 484350
32641 484350 655545 639350 94695 -717164 -1102370 -819970 -302889 -43395 -148436 -451500
32631 -451500 -710605 -701610 -378931 51428 345305 406410 198850 -256654 -660575 -563600
32621 -563600 26490 513538 498036 330547 500655 856125 939502 781964 751892 816420
32611 816420 603853 133174 -127296 50864 424101 734806 906281 810278 391713 45968
32601 45968 298251 1012001 1453328 1258381 816758 583372 569141 672791 929812 1191461
$$ packed form
32671d61231K8740J80135p6900l26746k32500J1094O1353o3689j59508k32305
32661a271557l28766k17982K52147O62771M97660J8943l0752L84761N09248O3389
32651E39862k88720j33005n8419n55144r65844m49610N78354R93653O07221K16002
32641D84350J71195j6195n44655q11859l85206K82400N17081K59494j05041l03064
32631d51500k59105Q995L22679M30359K93877O1105k07560m55504m03921R6975
32621e63600N90090M87048j5502j67489J70108L55470Q3377j57538l0072O4528
32611H16420k12567m70679k60470J78160L73237L10705J71475r6003m18565l45745
32601D5968K52283P13750M41327j94947m41623k33386j4231J03650K57021K61649
$$ plain form
32591 1191461 1127109 842337 929731 1534568 1923175 1461006 539511 -31701 -159925 -349377
32581 -349377 -704147 -760738 -297327 284787 505407 313155 -56880 -393014 -560027 -508391
32571 -508391 -350145 -259252 -246476 -179577 -25702 104360 170554 280643 480941 590754
32561 590754 356333 -218396 -735668 -705832 -96789 500235 465877 -107178 -535634 -439111
32551 -439111 -180893 -274433 -683042 -975649 -941773 -750386 -629860 -640784 -681425 -556019
32541 -556019 -169395 219251 154117 -426504 -997163 -1063526 -720494 -337702 13377 445075
$$ packed form
32591A191461o4352k84772Q7394O04837L88607m62169r21495n71212j28224j89452
32581c49377l54770n6591M63411N82114K20620j92252l70035l36134j67013N1636
32571e08391J58246R0893J2776O6899J53875J30062O6194J10089K00298J09813
32561E90754k34421n74729n17272K9836O09043N97024l4358n73055m28456R6523
32551d39111K58218r3540m08609k92607L3876J91387J20526j0924m0641J25406
32541e56019L86624L88646o5134n80621n70659o6363L43032L82792L51079M31698
$$ [...]
##END NTUPLES=NMR SPECTRUM
##END=
