##TITLE=31Pdec_DE-119rm_3h
, 64 sc
 27.10.2025
##JCAMPDX= 6.0         $$ Bruker NMR JCAMP-DX V2.0
##DATA TYPE= NMR SPECTRUM
##DATA CLASS= NTUPLES
##ORIGIN= UXNMR, Bruker Analytische Messtechnik GmbH
##OWNER= root
$$ XWIN-NMR		Version 3.5
$$ Mon Oct 27 14:33:31 2025 Russian Standard Time (UT+4h)  she@DPX200
##.OBSERVE FREQUENCY= 81.013821
##.OBSERVE NUCLEUS= ^31P
##.ACQUISITION MODE= SIMULTANEOUS
##.ACQUISITION SCHEME= undefined
##.AVERAGES= 64
##.DIGITISER RES= 17
##SPECTROMETER/DATA SYSTEM= spect
##.PULSE SEQUENCE= zgpg30
##.SOLVENT NAME= CDCl3
##.SHIFT REFERENCE= (INTERNAL, CDCl3, 0, 198.062)
##AUDIT TRAIL= $$ (NUMBER, WHEN, WHO, WHERE, WHAT)
$$ ##TITLE= Audit trail, XWIN-NMR		Version 3.5
$$ ##JCAMPDX= 5.01
$$ ##ORIGIN= Bruker BioSpin GmbH
$$ ##OWNER= she
$$ F:/spectra/data/she/nmr/P31/2/pdata/1/auditp.txt
$$ ##AUDIT TRAIL=  $$ (NUMBER, WHEN, WHO, WHERE, WHAT)
(   1,<2025-10-27 14:32:14.98 +0400>,<she>,<DPX200>,
      <created by zg, POWCHK disabled, PULCHK disabled
       configuration hash MD5:
       00 E9 B6 7A A2 85 ED C7 34 08 36 98 17 FE 4E 26
       data hash MD5: 32K
       E8 85 73 87 88 0D 69 FE AF C8 8E 5F F7 19 3E 61>)
(   2,<2025-10-27 14:32:19.12 +0400>,<she>,<DPX200>,
      <Start of raw data processing
       efp BC_mod = 2 LB = 1.5 FT_mod = 6 PKNL = 1 PHC0 = 1396.9 PHC1 = 58.10034 SI = 64K 
       data hash MD5: 64K
       BE 91 F5 17 EF CF F6 E6 1E 39 E1 1B CD 62 CF 9D>)
(   3,<2025-10-27 14:32:46.57 +0400>,<she>,<DPX200>,
      <pk PHC0 = 5.353872 PHC1 = -7 
       data hash MD5: 64K
       40 E5 60 E7 43 1C B1 0A 5C 3A 2A 40 E4 DC CA 50>)
(   4,<2025-10-27 14:32:50.57 +0400>,<she>,<DPX200>,
      <abs ABSG = 5 
       data hash MD5: 64K
       19 12 46 62 F7 F7 72 D2 07 64 C6 04 A0 56 6B 3F>)
$$ ##END=
$$ 
$$ hash MD5
$$ 24 26 E2 01 45 C1 D0 71 7F DF 3E A7 8A 38 E4 A9
##$RELAX= 
##$RELAX= 
##$RELAX= 
##$RELAX= 
##$RELAX= 
##$RELAX= 
##$RELAX= 
##$RELAX= 
$$ Bruker specific parameters
$$ --------------------------
##$DU= <F:/spectra>
##$EXPNO= 2
##$NAME= <P31>
##$PROCNO= 1
##$TYPE= <nmr>
##$USER= <she>
##$AMP= (0..31)
100 100 100 100 100 100 100 100 100 100 100 100 100 100 100 100 100 100 
100 100 100 100 100 100 100 100 100 100 100 100 100 100 
##$AQSEQ= 0
##$AQ_mod= 1
##$AUNM= <au_zg>
##$AUTOPOS= <>
##$BF1= 81.014009
##$BF2= 200.13
##$BF3= 200.13
##$BF4= 200.13
##$BF5= 200.13
##$BF6= 200.13
##$BF7= 200.13
##$BF8= 200.13
##$BYTORDA= 1
##$CFDGTYP= 0
##$CFRGTYP= 5
##$CHEMSTR= <none>
##$CNST= (0..31)
1 1 145 1 1 1 1 1 1 1 1 1 1 1 1 1 1 1 1 1 1 1 1 1 1 1 1 1 1 1 1 1 
##$CPDPRG= <waltz16>
##$CPDPRG1= <>
##$CPDPRG2= <waltz16>
##$CPDPRG3= <>
##$CPDPRG4= <mlev>
##$CPDPRG5= <mlev>
##$CPDPRG6= <mlev>
##$CPDPRG7= <mlev>
##$CPDPRG8= <mlev>
##$CPDPRGB= <>
##$CPDPRGT= <>
##$D= (0..31)
0 1 0 0 0 0 0 0 0 0.06 0 0.03 2e-05 3e-06 0 0 0.0002 0 0 0 0 0 0 0 0 0 
0 0 0 0 0 0 
##$DATE= 1761561134
##$DBL= (0..7)
120 120 120 11 120 120 24 19 
##$DBP= (0..7)
150 150 150 150 150 150 150 150 
##$DBP07= 0
##$DBPNAM0= <>
##$DBPNAM1= <>
##$DBPNAM2= <>
$$ [...]
##$SUBNAM3= <"">
##$SUBNAM4= <"">
##$SUBNAM5= <"">
##$SUBNAM6= <"">
##$SUBNAM7= <"">
##$SUBNAM8= <"">
##$SUBNAM9= <"">
##$SW= 400.765351723535
##$SWIBOX= (0..15)
0 1 3 0 0 0 0 0 0 0 0 0 0 0 0 0 
##$SW_h= 32467.5324675325
##$TD= 32768
##$TD0= 1
##$TE= 0
##$TE2= 300
##$TE3= 300
##$TEG= 300
##$TL= (0..7)
0 120 53 12 22 120 120 120 
##$TP= (0..7)
150 150 150 150 150 150 150 150 
##$TP07= 0
##$TPNAME0= <>
##$TPNAME1= <>
##$TPNAME2= <>
##$TPNAME3= <>
##$TPNAME4= <>
##$TPNAME5= <>
##$TPNAME6= <>
##$TPNAME7= <>
##$TPOAL= (0..7)
0.5 0.5 0.5 0.5 0.5 0.5 0.5 0.5 
##$TPOFFS= (0..7)
0 0 0 0 0 0 0 0 
##$TUNHIN= 0
##$TUNHOUT= 0
##$TUNXOUT= 0
##$USERA1= <user>
##$USERA2= <user>
##$USERA3= <user>
##$USERA4= <user>
##$USERA5= <user>
##$V9= 5
##$VALIST= <valist>
##$VCLIST= <CCCCCCCCCCCCCCC>
##$VD= 0
##$VDLIST= <DDDDDDDDDDDDDDD>
##$VPLIST= <PPPPPPPPPPPPPPP>
##$VTLIST= <TTTTTTTTTTTTTTT>
##$WBST= 1024
##$WBSW= 4
##$XGAIN= (0..3)
0 0 0 0 
##$XL= 0
##$YL= 0
##$YMAX_a= 52695
##$YMIN_a= -59180
##$ZGOPTNS= <>
##$ZL1= 120
##$ZL2= 120
##$ZL3= 120
##$ZL4= 120
##$ABSF1= 198.0616
##$ABSF2= -202.7028
##$ABSG= 5
##$ABSL= 3
##$ALPHA= 0
##$AQORDER= 0
##$ASSFAC= 0
##$ASSFACI= 0
##$ASSFACX= 0
##$ASSWID= 0
##$AUNMP= <proc_1d>
##$AZFE= 0.1
##$AZFW= 0.5
##$BCFW= 0
##$BC_mod= 2
##$BYTORDP= 0
##$COROFFS= 0
##$CY= -3
##$DATMOD= 1
##$DC= 0
##$DFILT= <>
##$DTYPP= 0
##$F1P= 0
##$F2P= 0
##$FCOR= 1
##$FTSIZE= 65536
##$FT_mod= 6
##$GAMMA= 0
##$GB= 0
##$INTBC= 1
##$INTSCL= 9.790993e-09
##$ISEN= 30
##$LB= 1.5
##$LEV0= 0
##$LPBIN= 0
##$MAXI= 10000
##$MC2= 0
##$MEAN= 0
##$ME_mod= 0
##$MI= 50
##$NCOEF= 0
##$NC_proc= -6
##$NLEV= 6
##$NOISF1= 182.463
##$NOISF2= 159.3651
##$NSP= 0
##$NTH_PI= 0
##$NZP= 0
##$OFFSET= 198.0616
##$PC= 4
##$PHC0= 1402.254
##$PHC1= 51.10034
##$PH_mod= 1
##$PKNL= yes
##$PPARMOD= 0
##$PSCAL= 0
##$PSIGN= 0
##$REVERSE= no
##$SF= 81.0140089999434
##$SI= 65536
##$SIGF1= 159.3651
##$SIGF2= -187.1042
##$SINO= 113.3802
##$SIOLD= 16384
##$SREGLST= <1H.CDCl3>
##$SSB= 0
##$STSI= 65536
##$STSR= 0
##$SW_p= 32467.5324675325
##$SYMM= 0
##$S_DEV= 0
##$TDeff= 32768
##$TDoff= 0
##$TI= <>
##$TILT= no
##$TM1= 0
##$TM2= 0
##$TOPLEV= 0
##$USERP1= <user>
##$USERP2= <user>
##$USERP3= <user>
##$USERP4= <user>
##$USERP5= <user>
##$WDW= 1
##$XDIM= 65536
##$YMAX_p= 530070894
##$YMIN_p= -35161315
$$ End of Bruker specific parameters
$$ ---------------------------------
##NTUPLES= NMR SPECTRUM
##VAR_NAME=  FREQUENCY,     SPECTRUM/REAL,   SPECTRUM/IMAG
##SYMBOL=    X,             R,               I
##VAR_TYPE=  INDEPENDENT,   DEPENDENT,       DEPENDENT
##VAR_FORM=  AFFN,          ASDF,            ASDF
##VAR_DIM=   65536,         65536,           65536
##UNITS=     HZ,            ARBITRARY UNITS, ARBITRARY UNITS
##FACTOR=    0.49542278885378, 1,            1
##FIRST=     16045.7642231865, 0,            0
##LAST=      -16421.768244346, 0,            0
##MIN=       -16421.768244346, -35161315,    0
##MAX=       16045.7642231865, 530070894,    0
$$ Real data points
##PAGE= N=1
##DATA TABLE= (X++(R..R)), XYDATA
$$ [...]
$$ plain form
46609 1139971 931237 335770 -468963 -1083438 -1258514 -1225266 -1295528 -1291797 -817642 -30947
46599 -30947 354192 -44564 -789268 -1202774 -1111362 -781700 -386652 150194 854512 1467250
46589 1467250 1539396 753969 -716136 -2142612 -2743485 -2374373 -1574485 -869828 -282529
46580 -282529 340655 838287 890932 482758 -114472 -689302 -1101023 -1070474 -384623 662861
46570 662861 1408881 1510476 1224567 927690 663810 307477 -110915 -468740 -769368 -1092248
46560 -1092248 -1414654 -1620385 -1620770 -1402704 -1053728 -768693 -684924 -674822 -474481 -56483
46550 -56483 331555 547866 713669 877246 803075 313916 -351272 -746569 -669018 -253142
46540 -253142 221239 457849 266554 -233660 -658473 -761329 -652003 -512754 -358776 -267152
$$ packed form
46609A139971k08734n95467q04733o14475j75076L3248p0262L731M74155P86695
46599c0947L85139l98756p44704m13506R1412L29662L95048N36846P04318O12738
46589A467250P2146p85427j470105j426476o00873L69112P99888P04657N87299
46580b82529O23184M97632N2645m08174n97230n74830m11721L0549O85851J047484
46570F62861P46020J01595k85909k96877k63880l56333m18392l57825l00628l22880
46560a092248l22406k05731l85K18066L48976K85035Q3769J0102K00341M17998
46550e6483L88038K16311J65803J63577p4171m89159o65188l95297P7551M15876
46540b53142M74381K36610j91295n00214m24813j02856J09326J39249J53978R1624
$$ plain form
46530 -267152 -526627 -1217183 -1861458 -1882660 -1296618 -629207 -287795 -348751 -786379 -1461457
46520 -1461457 -1963323 -1926109 -1509936 -1177749 -1035265 -838519 -614013 -695363 -1037124 -1089450
46510 -1089450 -628733 -190315 -287988 -627155 -574093 -123662 131140 -108745 -482295 -560750
46500 -560750 -423462 -443418 -687830 -766115 -313932 492678 1089723 1246296 1390823 1944385
46490 1944385 2512237 2223566 917416 -512553 -1163143 -1053295 -715080 -337972 155611
46481 155611 518523 360203 -113382 -171289 471531 1251722 1557052 1491908 1499395 1564107
46471 1564107 1282408 592920 -95875 -595810 -1257056 -2281483 -3109531 -3042808 -2342759
46462 -2342759 -2048080 -2526762 -2844821 -2039532 -537677 374533 244807 -170195 -218041
$$ packed form
46530b67152k59475o90556o44275k1202N86042O67411L41412o0956m37628o75078
46520a461457n01866L7214M16173L32187J42484J96746K24506q1350l41761n2326
46510a089450M60717M38418r7673l39167N3062M50431K54802k39885l73550p8455
46500e60750J37288j9956k44412p8285M52183Q06610N97045J56573J44527N53562
46490A944385N67852k88671j306150j429969o50590J09848L38215L77108M93583
46481A55611L62912j58320m73585n7907O42820P80191L05330o5144P487O4712
46471A564107k81699o89488o88795m99935o61246j024427q28048O6723P00049
46462b342759K94679m78682l18059Q05289J501855R12210j29726m15002m7846
$$ plain form
46453 -218041 -204082 -625395 -1255622 -1533270 -1422033 -1313509 -1312567 -1136979 -621878 94093
46443 94093 823757 1427914 1711143 1528573 980741 298370 -381807 -953891 -1243965 -1239513
46433 -1239513 -1261501 -1623429 -2233650 -2762646 -3029305 -2995019 -2648840 -2225545 -2232008 -2804093
46423 -2804093 -3307104 -3128922 -2655315 -2793761 -3630280 -4293805 -4196957 -3658550 -3115478 -2482585
46413 -2482585 -1670119 -1067229 -979682 -1065646 -868502 -535691 -462525 -530377 -303812 189910
46403 189910 490994 485186 582805 1012809 1409068 1313636 773508 210730 -100181 -227089
46393 -227089 -389329 -771376 -1481505 -2507647 -3613780 -4332780 -4226695 -3321151 -2277260
46384 -2277260 -1935354 -2536047 -3452849 -3803718 -3286275 -2326617 -1480817 -872854 -296968
$$ packed form
46453b18041J3959m21313o30227k77648J11237J08524R42J75588N15101P15971
46443I4093P29664O04157K83229j82570n47832o82371o80177n72084k90074M452
46433a239513k1988l61928o10221n28996k66659L4286L46179M23295o463n72085
46423b804093n03011J78182M73607j38446q36519o63525R6848N38407N43072O32893
46413b482585Q12466O02890Q7547q5964J97144L32811P3166o7852K26565M93722
46403A89910L01084n808R7619M30004L96259r5432n40128n62778l10911j26908
46393b27089j62240l82047p10129j026142j106133p19000J06085R05544J043891
46384b277260L41906o00693r16802l50869N17443R59658Q45800O07963N75886
$$ plain form
46375 -296968 249533 366889 -265292 -1303719 -1903747 -1556514 -562602 421502 1019979
46366 1019979 1131343 691683 -70312 -404134 270743 1447853 1931776 1257378 118787
46357 118787 -742030 -1358792 -1943637 -2233849 -2052057 -1936572 -2428831 -3065538 -2886698 -1821428
46347 -1821428 -821327 -608197 -964567 -1351713 -1573404 -1596189 -1272549 -620187 -57551
46338 -57551 -26438 -507191 -1064599 -1257181 -952565 -394728 21476 168746 284404 473750
46328 473750 352577 -423264 -1453631 -1960300 -1814428 -1627615 -1781689 -1990611 -1966871 -1843560
46318 -1843560 -1627474 -910652 352965 1328789 1224090 394786 -139772 -82508 -64011 -521135
46308 -521135 -1087876 -1276601 -1161461 -1037030 -813541 -187929 777222 1656641 2211269 2573162
$$ packed form
46375b96968N46501J17356o32181j038427o00028L47233R93912R84104N98477
46366A019979J11364m39660p61995l33822O74877J177110M83923o74398j138591
46357A18787q60817o16762n84845k90212J81792J15485m92259o36707J78840J065270
46347a821428J000101K13130l56370l87146k21691k2785L23640O52362N62636
46338e7551L1113m80753n57408j92582L04616N57837M16204J47270J15658J89346
46328D73750j21173p75841j030367n06669J45872J86813j54074k08922K3740J23311
46318a843560K16086P16822J263617R75824j04699q29304n34558N7264J8497m57124
46308e21135n66741j88725J15140J24431K23489O25612R65151Q79419N54628L61893
$$ plain form
46298 2573162 2789374 2530068 1582149 478830 164842 886720 1806714 2022541 1641554
46289 1641554 1397313 1464791 1300494 617879 -164363 -608788 -784763 -875463 -846665 -792933
46279 -792933 -996503 -1261746 -853034 358540 1333879 1192360 562843 720858 1771658
46270 1771658 2696138 2966795 2991797 2950093 2366833 1182602 228772 110786 390982 392788
46260 392788 127800 -98453 -333655 -615826 -547664 74823 674119 662002 444348 885521
46250 885521 1970914 2765773 2683092 2139360 1863291 2058518 2375754 2372020 1921333 1362339
46240 1362339 1140870 1133503 636801 -618495 -1800969 -1878467 -939779 291 342114 360084
46230 360084 411690 470737 557883 897000 1372093 1430422 844718 98915 -251610 -156632
$$ packed form
46298B573162K16212k59306r47919j103319l13988P21878R19994K15827l80987
46289A641554k44241O7478j64297o82615p82242m44425j75975r0700K8798N3732
46279g92933k03570k65243M08712J211574R75339j41519o29517J58015J050800
46270A771658R24480K70657K5002m1704n83260j184231r53830j17986K80196J806
46260C92788k64988k26253k35202k82171O8162O22487N99296j2117k17654M41173
46250H85521J085393P94859q2681n43732k76069J95227L17236l734m50687n58994
46240A362339k21469p367m96702j255296j182474p7498R38688R40070L41823J7970
46230C60084N1606N9047Q7146L39117M75093N8329n85704p45803l50525R4978
$$ plain form
46220 -156632 213828 805612 1393961 1443560 717435 -255748 -694815 -349986 429843 1090962
46210 1090962 1117057 297162 -893512 -1529298 -1229888 -626348 -491456 -750615 -766078 -260816
46200 -260816 531585 1343338 1944965 1961057 1213280 162359 -508638 -676028 -682106 -642242
46190 -642242 -444798 -309360 -606873 -1082623 -1013780 -333053 138461 -89403 -415857 -89656
46180 -89656 692228 1247311 1491392 1788815 1977131 1405738 30464 -1256176 -1679561
46171 -1679561 -1454891 -1267330 -1290897 -1179794 -826710 -634237 -974423 -1701848 -2334135 -2527708
46161 -2527708 -2263857 -1723071 -1137654 -702614 -481826 -384108 -293296 -208598 -208875 -313948
46151 -313948 -437864 -445111 -225062 184702 469571 182740 -783047 -1938898 -2613307 -2566971
$$ packed form
46220a56632L70460N91784N88349M9599p26125r73183m39067L44829P79829O61119
46210A090962K6095q19895j190674o35786K99410O03540J34892k59159j5463N05262
46200b60816P92401Q11753O01627J6092p47777j050921o70997j67390o078L9864
46190f42242J97444J35438k97513m75750O8843O80727M71514k27864l26454L26201
46180h9656P81884N55083K44081K97423J88316n71393j375274j286640m23385
46171a679561K24670J87561k3567J11103L53084J92473l40186p27425o32287j93573
46161b527708K63851N40786N85417M35040K20788R7718R0812Q4698k77j05073
46151c13948j23916p247K20049M09764K84869k86831r65787j155851o74409M6336
$$ plain form
46141 -2566971 -2005297 -1123178 -17158 976444 1352541 1070500 755887 978422 1568994
46132 1568994 1916706 1733774 1263111 903544 872750 1081899 1141762 692401 -75849 -488349
46122 -488349 -208238 312752 502903 432820 483830 595593 424300 48090 -106679 31957
46112 31957 137677 123895 261374 636183 1026891 1354677 1725141 2000473 1904914 1598754
46102 1598754 1515226 1538220 1058484 60983 -596967 -387101 81827 -23048 -577729 -814539
46092 -814539 -425804 216047 679948 817501 671541 457091 480800 781396 1047600 1095418
46082 1095418 1087500 1052040 658199 -160622 -845401 -960024 -864280 -1092448 -1478179 -1541589
46072 -1541589 -1394517 -1525313 -1905113 -2052993 -1880769 -1769229 -1849635 -1868390 -1752746 -1689487
$$ packed form
46141b566971N61674Q82119J106020R93602L76097k82041l14613K22535N90572
46132A568994L47712j82932m70663l59567l0794K09149N9863m49361p68250m12500
46122d88349K80111N20990J90151p0083N1010J11763j71293l76210j54769J38636
46112C1957J05720j3782J37479L74809L90708L27786L70464K75332r5559l06160
46102A598754q3528K2994m79736r97501o57950K09866M68928j04875n54681k36810
46092h14539L88735O41851M63901J37553j45960k14450K3709L00596K66204M7818
46082A095418p918l5460l93841q18821o84779j14623R5744k28168l85731o3410
46072a541589J47072j30796l79800j47880J72224J11540q0406j8755J15644O3259
$$ plain form
46062 -1689487 -1649769 -1443444 -1230477 -1350392 -1642685 -1585503 -1131934 -743115 -575850 -387270
46052 -387270 -304609 -807549 -1704312 -2027363 -1387799 -618029 -512295 -690297 -418685 113483
46042 113483 249197 151458 609885 1643657 2216670 1540751 16077 -1351036 -1966257
46033 -1966257 -1848583 -1239085 -356897 613116 1521227 2246633 2706015 2947837 3120321
46024 3120321 3146831 2577624 1136747 -582210 -1401162 -780086 496836 1129848 671711
46015 671711 -156134 -426073 22606 632492 871335 696594 383975 149328 6584 -134350
46005 -134350 -309011 -397237 -205534 247710 588069 436138 -90472 -483777 -528910 -589259
45995 -589259 -1036033 -1659545 -1893597 -1433549 -423754 726219 1449267 1224012 81307
$$ packed form
46062a689487L9718K06325K12967j19915k92293N7182M53569L88819J67265J88580
46052c87270Q2661n02940q96763l23051O39564P69770J05734j78002K71612N32168
46042A13483J35714r7739M58427J033772N73013o75919j524674j367113o15221
46033a966257J17674O09498Q82188R70013R08111P25406M59382K41822J72484
46024C120321K6510n69207j440877j718957q18952O21076J276922O33012m58137
46015F71711q27845k69939M48679O09886K38843j74741l12619k34647j42744j40934
46005a34350j74661q8226J91703M53244L40359j51931n26610l93305m5133o0349
45995e89259m46774o23512k34052M60048J009795J149973P23048k25255j142705
$$ plain form
45986 81307 -1214413 -1837245 -1676524 -1226179 -944114 -1023933 -1465440 -1899200 -1654558 -617703
45976 -617703 208594 -280336 -1818894 -3038421 -3150163 -2575530 -1897056 -1114335 -201639
45967 -201639 456273 622979 552344 414696 40331 -411184 -256774 743391 1868394
45958 1868394 2386346 2397576 2247230 1843492 1231756 1112708 1879610 2665805 2323628 1013251
45948 1013251 -116997 -558945 -762159 -964212 -753115 56465 964948 1455371 1496789
45939 1496789 1237865 799240 501684 705506 1246015 1551104 1470620 1464932 1785212 1979200
45929 1979200 1497038 421794 -667760 -1310500 -1436143 -1193515 -664864 226491 1406313
45920 1406313 2254962 1955954 542806 -824703 -1107462 -557423 -125165 -123089 -194516 -254239
$$ packed form
45986H1307j295720o22832J60721M50345K82065p9819m41507m33760K44642J036855
45976f17703Q26297m88930j538558j219527j11742N74633O78474P82721R12696
45967b01639O57912J66706p0635j37648l74365m51515J54410J000165J125003
45958A868394N17952J1230j50346m03738o11736j19048P66902P86195l42177j310377
45948A013251j130248m41948k03214k02053K11097Q09580R08483M90423M1418
45939A496789k58924m38625k97556K03822N40509L05089q0484n688L20280J93988
45929A979200m82162j075244j089554o42740j25643K42628N28651Q91355J179822
45920A406313Q48649k99008j413148j367509k82759N50039M32258K076p1427n9723
$$ plain form
45910 -254239 -560318 -1007453 -1230725 -1314495 -1505640 -1346435 -174146 1474714 2142301
45901 2142301 1416327 503115 435131 822735 955120 1036843 1501364 1986738 1921629 1469323
45891 1469323 1032935 439804 -486707 -1092537 -606111 677028 1809600 2460588 2894929
45882 2894929 3021453 2457266 1404932 541600 83083 -212946 -221980 411097 1277946 1360763
45872 1360763 474681 -292988 -2087 940378 1427980 980412 7413 -831236 -1115489
45863 -1115489 -800269 -215660 212492 403458 595359 837484 851887 533218 249901 453197
45853 453197 1223341 2308706 3336100 3888345 3704098 2972505 2189139 1621931 1166229
45844 1166229 728644 363168 -20346 -578667 -998877 -608261 616051 1658927 1626242
$$ packed form
45910b54239l06079m47135k23272q3770j91145J59205J172289J648860O67587
45901B142301p25974r13212o7984L87604J32385Q1723M64521M85374o5109m52306
45891A469323m36388n93131r26511o05830M86426J283139J132572O50988M34341
45882B894929J26524n64187j052334q63332m58517k96029r034O33077Q66849Q2817
45872A360763q86082p67669K90901R42465M87602m47568r72999q38649k84253
45863a115489L15220N84609M28152J90966J91901K42125J4403l18669k83317K03296
45853D53197P70144J085365J027394N52245j84247p31593p83366n67208m55702
45844A166229m37585l65476l83514n58321m20210L90616J224312J042876l2685
$$ plain form
45835 1626242 933869 713363 1231595 1604394 1121929 191303 -333096 -276773 -162316 -321858
45825 -321858 -445211 -69538 749254 1412729 1368600 641299 -230182 -748983 -907803 -1059285
45815 -1059285 -1414827 -1805258 -1956514 -1843815 -1643534 -1430696 -1108150 -620527 -52555
45806 -52555 526384 1142580 1769694 2262066 2513404 2492246 2041098 956941 -479748 -1385000
45796 -1385000 -1152292 -307690 33173 -452572 -979849 -804894 -154018 208809 -119183
45787 -119183 -963976 -1827096 -2078410 -1343421 -64688 708061 479867 -79623 -52392 609685
45777 609685 1319994 1745205 1849516 1464684 596420 -87422 81862 719124 839046 358476
45767 358476 221904 847592 1402553 1088046 350123 159288 633931 1074223 1036651 712179
$$ packed form
45835A626242o92373k20506N18232L72799m82465r30626n24399N6323J14457j59542
45825c21858j23353L75673Q18792O63475m4129p27301q71481n18801j58820j51482
45815a059285l55542l90431j51256J12699K00281K12838L22546M87623N67972
45806e2555N78939O16196O27114M92372K51338k1158m51148j084157j436689r05252
45796a385000K32708Q44602L40863m85745n27277J74955O50876L62827l27992
45787a19183q44793q63120k51314P34989J278733P72749k28194n59490K7231O62077
45777F09685P10309M25211J04311l84832q68264o83842J69284O37262J19922m80570
45767C58476j36572O25688N54961l14507p37923j90835M74643M40292l7572l24472
$$ plain form
45757 712179 370358 -4855 -486090 -964063 -1203100 -1004230 -400786 227453 454691 345359
45747 345359 407288 849469 1238901 1150313 788105 600338 599584 504152 291023 121877 -75082
45736 -75082 -406803 -528448 35853 1061589 1703454 1570819 1215786 1299962 1708534 1832304
45726 1832304 1427486 835813 525347 716061 1331501 2044444 2460087 2491091 2457335 2599872
45716 2599872 2661476 2270941 1593450 1131655 903404 388101 -523120 -1107833 -770610 42134
45706 42134 475204 491794 744057 1353273 1642699 1218018 551803 196802 100443 85817
45696 85817 344449 920863 1305588 1182133 1055897 1408504 1706252 1141434 16227 -623187
45686 -623187 -573288 -634201 -1164262 -1547899 -1329070 -874825 -554188 -171637 350248 583814
$$ packed form
45757G12179l41821l75213m81235m77973k39037J98870O03444O28239K27238j09332
45747C45359O1929M42181L89432q8588l62208j87767p54r5432k13129j69146j96959
45736g5082l31721j21645N64301J025736O41865j32635l55033Q4176M08572J23770
45726A832304m04818n91673l10466J90714O15440P12943M15643L1004l3756J42537
45716B599872O1604l90535o77491m61795k28251n15303r11221n84713L37223Q12744
45706D2134M33070J6590K52263O09216K89426m24681o66215l55001r6359j4626
45696H5817K58632N76414L84725j23455j26236L52607K97748n64818j125207o39414
45686f23187M9899o0913n30061l83637K18829M54245L20637L82551N21885K33566
$$ plain form
45676 583814 385883 256255 367612 68974 -983600 -2000236 -2145862 -1730712 -1444901
45667 -1444901 -1113380 -277367 566605 579317 135400 462852 1748502 2828316 2928282
45658 2928282 2570398 2432461 2371897 2067688 1719705 1523227 1195151 634181 401590 866106
45648 866106 1393684 1142998 349041 69183 746255 1645325 1781608 989517 -12934
45639 -12934 -361136 197537 1123606 1669035 1679538 1655973 1976782 2380921 2418272 2078001
45629 2078001 1630349 1111103 426770 -131558 10911 955350 2018312 2421412 2136641
45620 2136641 1822672 1975763 2394773 2611019 2650901 3032906 3953799 4825524 4893628 4114722
45610 4114722 3118182 2449087 2184659 2169251 2217830 2132830 1928091 2015844 2743082 3743938
$$ packed form
45676E83814j97931j29628J11357k98638j052574j016636j45626M15150K85811
45667a444901L31521Q36013Q43972J2712m43917L27452J285650J079814R9966
45658B928282l57884j37937o0564l04209l47983j96478l28076n60970k32591M64516
45648H66106N27578k50686p93957k79858O77072Q99070J36283p92091j002451
45639a2934l48202N58673R26069N45429J0503k3565L20809M04139L7351l40271
45629B078001m47652n19246o84333n58328J42469R44439J062962M03100k84771
45620B136641l13969J53091M19010K16246L9882L82005R20893Q71725O8104p78906
45610D114722r96540o69095k64428j5408M8579q5000k04739Q7753P27238J000856
$$ plain form
45600 3743938 4222492 3925922 3369150 3065252 3071738 3327178 3749764 3861460 3115756 1923625
45590 1923625 1519451 2303736 3160534 3109344 2761818 3128676 3740500 3357386 2200084
45581 2200084 1905219 3082006 4332992 4245799 3201103 2468621 2431955 2598081 2724780
45572 2724780 2978860 3280337 3330828 3223112 3419418 4168146 5368653 6851653 8341530
45563 8341530 9338322 9582282 9537024 9881002 10570731 10944245 10753847 10524263 10754283 11279509
45553 11279509 11660737 11797911 11902360 12184416 12808074 13848632 15027668 15773129 15868451
45544 15868451 15829315 16285468 17148932 17801389 18046006 18415753 19404638 20763357 21826794
45535 21826794 22330462 22608124 23070834 23789103 24616869 25451067 26208671 26714670 26823512
$$ packed form
45600C743938M78554k96570n56772l03898O486K55440M22586J11696p45704j192131
45590A923625m04174P84285Q56798n1190l47526L66858O11824l83114j157302
45581B200084k94865J176787J250986q7193j044696p32482l6666J66126J26699
45572B724780K54080L01477N0491j07716J96306P48728J200507J483000J489877
45563H341530R96792K43960m5258L43978O89729L73514j90398k29584K30020N25226
45553A1279509L81228J37174J04449K82056O23658J040558J179036P45461R5322
45544A5868451l9136M56153Q63464O52457K44617L69747R88885J358719J063437
45535B1826794N03668K77662M62710P18269Q27766Q34198P57604N05999J08842
$$ plain form
45526 26823512 26605902 26246761 25764685 24980439 23786071 22322991 20854399 19535271 18298766
45517 18298766 16892434 15105680 13116838 11502810 10615489 10007752 8892205 7240375
45509 7240375 5945897 5667197 6001239 6199419 6227970 6513839 6980674 7099082 6771328
45500 6771328 6390080 6004691 5239134 4207182 3678580 3962337 4370648 4281927 4028116
45491 4028116 4075604 3968474 2980517 1450728 522721 649741 1197795 1553492 1823074
45482 1823074 2251440 2635116 2621021 2140832 1357383 582453 337058 991357 2164578
45473 2164578 2928802 2798380 2138292 1503877 1062955 812531 833787 1090637 1426064 1925087
45463 1925087 2748223 3451110 3209849 2129077 1598024 2682506 4668029 5891715 5644571
$$ packed form
45526B6823512k17610l59141m82076p84246j194368j463080j468592j319128j236505
45517A8298766j406332j786754j988842j614028q87321o07737j115547j651830
45509G240375j294478k78700L34042J98180K8551K85869M66835J18408l27754
45500F771328l81248l85389p65557j031952n28602K83757M08311q8721k53811
45491D028116M7488j07130r87957j529789r28007J27020N48054L55697K69582
45482A823074M28366L83676j4095m80189p83449p74930k45395O54299J173221
45473B164578P64224j30422o60088o34415m40922k50424K1256K56850L35427M99023
45463A925087Q23136P02887k41261j080772n31053J084482J985523J223686k47144
$$ plain form
45454 5644571 4561358 3445647 2493862 1594600 731374 44659 -113892 641088 2066645
45445 2066645 3099632 2920242 1985227 1388757 1448945 1655718 1771247 2032805 2288765
45436 2288765 1939943 971374 165598 -23296 -1903 -103022 31631 612765 1023298 690928
45426 690928 90629 127949 869200 1563961 1689318 1355149 850458 372641 126364 210817
45416 210817 457035 705725 1053096 1463718 1461392 767204 16215 161391 1221757 2285986
45406 2285986 2791260 3102137 3646827 4203428 4473330 4774011 5493328 6120579 5538461
45397 5538461 3396923 723121 -1066431 -1479377 -1060771 -469291 148186 880477 1588594
45388 1588594 2011560 2161229 2306378 2579244 2818517 2805355 2464583 1846730 1131348 653729
$$ packed form
45454E644571j083213j115711r51785q99262q63226o86715j58551P54980J425557
45445B066645J032987j79390r35015n96470O0188K06773J15529K61558K55960
45436B288765l48822r68569q05776j88894K1393j01119J34653N81134M10533l32370
45426F90928o00299L7320P41251O94761J25357l34169n04691m77817k46277Q4453
45416B10817K46218K48690L47371M10622k326o94188p50989J45176J060366J064229
45406B285986N05274L10877N44690N56601K69902L00681P19317O27251n82118
45397E538461k141538k673802j789552m12946M18606N91480O17477P32291P08117
45388A588594M22966J49669J45149K72866K39273j3162l40772o17853p15382m77619
$$ plain form
45378 653729 677301 1071808 1425080 1533172 1587063 1841421 2300579 2735631 2802112 2233386
45368 2233386 1259706 718913 1209477 2129292 2226364 1279164 485644 807265 1699020 2107929
45358 2107929 2015878 2086170 2296541 2056287 1510960 1557999 2384975 3025051 2760518 2093991
45348 2093991 1789067 1695313 1255036 679795 781587 1752097 2789019 3035066 2462484
45339 2462484 1725221 1436543 1695991 2129059 2298100 2156359 2087061 2412876 2952492 3233902
45329 3233902 3113087 2970279 3208445 3701050 3904323 3506636 2798504 2282292 2039550
45320 2039550 1736875 1264460 1034904 1426283 2169419 2621678 2542693 2260516 2106351 2051122
45310 2051122 1979899 1998355 2273747 2747223 3164611 3314727 3177241 2920584 2765888 2760347
$$ packed form
45378F53729K3572L94507L53272J08092N3891K54358M59158M35052O6481n68726
45368B233386r73680n40793M90564R19815R7072r47200p93520L21621Q91755M08909
45358B107929r2051P0292K10371k40254n45327M7039Q26976O40076k64533o66527
45348B093991l04924r3754m40277n75241J01792R70510J036922K46047n72582
45339B462484p37263k88678K59448M33068J69041j41741o9298L25815N39616K81410
45329C233902j20815j42808K38166M92605K03273l97687p08132n16212k42742
45320B039550l02675m72415k29556L91379P43136M52259p8985k82177j54165n5229
45310B051122p1223J8456K75392M73476M17388J50116j37486k56657j54696n541
$$ plain form
45300 2760347 2723857 2533639 2350017 2352272 2375601 2135976 1756980 1664179 1896018 1954066
45290 1954066 1547255 1116860 1293968 2053517 2747427 2897393 2678763 2618102 3004165 3639468
45280 3639468 4076848 4065053 3771570 3554801 3560221 3627351 3561136 3377919 3300374 3601664
45270 3601664 4367231 5264297 5690420 5419271 4988548 5083590 5584429 5683267 5032671 4290222
45260 4290222 4275582 4997828 5856624 6467197 6849180 7013553 6878860 6617221 6670151 7240562
45250 7240562 7965283 8249810 7878198 7237458 6969874 7421092 8403245 9438492 10124127
45241 10124127 10232389 9679090 8661960 7734791 7410664 7650256 7983279 8089016 7910303
45232 7910303 7255792 5873699 4134692 3074504 3284540 4097792 4365352 3822257 3190979
$$ packed form
45300B760347l6490j90218j83622K255K3329k39625l78996r2801K31839N8048
45290A954066m06811m30395J77108P59549O93910J49966k18630o0661L86063O35303
45280C639468M37380j1795k93483k16769N420O7130o6215j83217p7545L01290
45270C601664P65567Q97066M26123k71149m30723R5042N00839R8838o50596p42449
45260D290222j4640P22246Q58796O10573L81983J64373j34693k61639N2930N70411
45250G240562P24721K84527l71612o40740k67584M51218R82153J035247O85635
45241A0124127J08262n53299j017130r27169l24127K39592L33023J05737j78713
45232G910303o54511j382093j739007j060188K10036Q13252K67560n43095o31278
$$ plain form
45223 3190979 3072008 3278664 3304092 2953888 2326468 1518470 630485 -75455 -261299 188298
45213 188298 969509 1486950 1296845 538383 -144162 -239667 107421 319499 70441 -390810
45203 -390810 -572446 -251055 376499 949298 1269569 1366820 1298385 1027810 585602 203235
45193 203235 80895 97764 -14575 -266912 -442406 -467951 -425899 -248050 170250 536430
45183 536430 371513 -185869 -324226 401658 1457394 2096883 2261614 2271669 2077395 1413738
45173 1413738 411991 -527690 -1276432 -1846761 -1930798 -1194339 51589 1068011 1561203
45164 1561203 1803002 1928168 1745548 1339114 1232382 1685337 2261185 2349485 1823733 1036690
45154 1036690 462358 424293 828585 1076448 621713 -265475 -679747 -175349 712745 1234431
$$ packed form
45223C190979j18971K06656K5428l50204o27420q07998q87985p05940j85844M49597
45213A88298P81211N17441j90105p58462o82545r5505L47088K12078k49058m61251
45203c90810j81636L21391O27554N72799L20271R7251o8435k70575m42208l82367
45193B03235j22340J6869j12339k52337j75494k5545M2052J77849M18300L66180
45183E36430j64917n57382j38357P25884J055736O39489J64731J0055j94274o63657
45173A413738j001747r39681p48742n70329q4037P36459J245928J016422M93192
45164A561203K41799J25166j82620m06434j06732M52955N75848Q8300n25752p87043
45154A036690n74332l8065M04292K47863m54735q87188m14272N04398Q88094N21686
$$ plain form
45144 1234431 1311880 1378392 1657959 1953674 1982197 1655859 1149092 836810 990682 1394877
45134 1394877 1471751 941067 134607 -481642 -797911 -853385 -492242 340467 1144729 1221731
45124 1221731 533827 -202549 -422423 -343689 -437163 -585909 -247680 617238 1332787 1447747
45114 1447747 1421981 1910450 2662411 2758462 1871292 642385 -253775 -711500 -667585 192003
45104 192003 1675656 2754590 2729137 2210421 2162414 2446556 2257693 1632787 1375654 1569537
45094 1569537 1362864 448501 -325275 -210204 503492 1233390 1885943 2335030 1979005
45085 1979005 608788 -853370 -1266483 -591256 294298 746498 747962 483161 132428
45076 132428 -110748 -297282 -776525 -1589141 -2127541 -1878794 -1201153 -847611 -984044 -1195868
$$ packed form
45144A234431P7449O6512K79567K95715K8523l26338n06767l12282J53872M04195
45134A394877P6874n30684q06460o16249l16269n5474L61143Q32709Q04262P7002
45124A221731o87904p36376k19874P8734r3474j48746L38229Q64918P15549J14960
45114A447747k5766M88469P51961R6051q87170j228907q96160m57725M3915Q59588
45104A92003J483653J078934k5453n18716m8007K84142j88863o24906k57133J93883
45094A569537k06673r14363p73776J15071P13696P29898O52553M49087l56025
45085A979005j370217j462158m13113O75227Q85554M52200J464k64801l50733
45076A32428k43176j86534m79243q12616n38400K48747O77641L53542j36433k11824
$$ plain form
45066 -1195868 -1211424 -1074291 -819479 -531473 -529913 -935334 -1220711 -786137 125957 661839
45056 661839 435134 -169579 -705273 -1095632 -1351732 -1424121 -1457022 -1749284 -2341122 -2947990
45046 -2947990 -3299127 -3230922 -2569835 -1372219 -202609 341855 406945 714582 1589125
45037 1589125 2606214 3246922 3421423 3267288 2924305 2661155 2756472 3021543 2828906
45028 2828906 1894347 754539 191084 346669 663818 660152 564506 1009758 2031884 2638346
45018 2638346 1858978 219396 -542586 414421 1916789 2387990 1895456 1640860 1939150
45009 1939150 1995256 1562719 1420493 1870274 2017038 1204140 180606 8500 479663
45000 479663 475601 -469477 -1684429 -2231698 -1729570 -484261 777646 1448913 1567826
$$ packed form
45066a195868j5556J37133K54812K88006J560m05421k85377M34574R12094N35882
45056F61839k26705o04713n35694l90359k56100p2389l2901k92262n91838o06868
45046b947990l51137O8205O61087J197616J169610N44464O5090L07637Q74543
45037A589125J017089O40708J74501j54135l42983k63150R5317K65071j92637
45028B828906r34559j139808n63455J55585L17149l666r5646M45252J022126O06462
45018B638346p79368j639582p61982R57007J502368M71201m92534k54596K98290
45009A939150N6106m32537j42226M49781J46764q12898j023534j72106M71163
45000D79663m062r45078j214952n47269N02128J245309J261907O71267J18913
$$ plain form
44991 1567826 1606992 1672524 1401251 823330 652060 1279394 2088178 2328924 2156419 2144952
44981 2144952 2232910 1928679 1286078 865933 796036 574229 -127709 -995791 -1480929 -1285273
44971 -1285273 -451731 669413 1565774 1979223 2131504 2340151 2610087 2821349 2989424
44962 2989424 3030752 2677602 2046263 1841772 2450066 3272498 3616795 3774506 4365823 5038325
44952 5038325 4904552 4059542 3452846 3242654 2576867 1299499 548985 998821 1643670
44943 1643670 1256260 183546 -354525 -139104 6276 -281079 -495210 -346891 -255113
44934 -255113 -514168 -736425 -481251 88438 529403 728647 856528 946984 849482 543707
44924 543707 302222 490394 1202091 2057359 2419092 1941359 930915 112395 33196 677328
$$ packed form
44991A567826L9166O5532k71273n77921j71270O27334Q08784K40746j72505j1467
44981B144952Q7958l04231o42601m20145o9897k21807p01938q68082m85138J95656
44971a285273Q33542J121144Q96361M13449J52281K08647K69936K11262J68075
44962B989424M1328l53150o31339k04491O08294Q22432L44297J57711N91317O72502
44952E038325j33773q45010o06696k10192o65787j277368p50514M49836O44849
44943A643670l87410j072714n38071K15421J45380k87355k14131J48319R1778
44934b55113k59055k22257K55174N69689M40965J99244J27881R0456r7502l05775
44924E43707k41485J88172P11697Q55268L61733m77733j010444q18520p9199O44132
$$ plain form
44914 677328 1542180 2047568 1999992 1724565 1638473 1725857 1680481 1548975 1777583 2411951
44904 2411951 2743996 2234899 1449743 1430834 2240173 2784868 2221621 987078 184498
44895 184498 372087 1245599 2151743 2542955 2191548 1407949 961214 1368235 2232712 2649944
44885 2649944 2354235 2080233 2545448 3431837 3851626 3653026 3598809 4075580 4316041 3496774
44875 3496774 2161400 1687711 2409905 3178143 3024649 2392434 2183640 2373043 2397675
44866 2397675 2378013 2918691 3906875 4558386 4712314 5085941 5991216 6724051 6662359 6159097
44856 6159097 5797909 5497348 5040797 4863938 5457914 6387304 6781171 6597807 6590032 7148490
44846 7148490 7997724 8971694 10193079 11375395 11853604 11633552 11621500 12359804 13206252
$$ packed form
44914F77328Q64852N05388m7576k75427q6092Q7384m5376j31506K28608O34368
44904B411951L32045n09097p85156j8909Q09339N44695n63247j234543q02580
44895A84498J87589Q73512R06144L91212l51407p83599m46735M07021Q64477M17232
44885B649944k95709k74002M65215Q86389M19789j98600n4217M76771K40461q19267
44875C496774j335374m73689P22194P68238j53494o32215k08794J89403K4632
44866B397675j9662N40678R88184O51511J53928L73627R05275P32835o1692n03262
44856F159097l61188l00561m56551j76859N93976R29390L93867j83364p775N58458
44846G148490Q49234R73970J221385J182316M78209k20052j2052P38304Q46448
$$ plain form
44837 13206252 13306220 12810703 12498428 12622315 12837803 13026685 13468336 14212791 14871360
44828 14871360 15126024 15045529 14849032 14699759 14742094 15001313 15233260 15198237 15066257 15164944
44818 15164944 15298835 14774166 13288435 11424777 9994678 9163270 8534370 7898796 7475400
44809 7475400 7369016 7149255 6256543 4753367 3394630 2831545 2934636 3111798 3123284
44800 3123284 3204562 3436121 3517931 3349929 3306288 3551434 3560786 2892295 2080039 2041147
44790 2041147 2761878 3349310 3382777 3384144 3731175 3908382 3318522 2261356 1549809 1512517
44780 1512517 1862718 2279990 2668645 3029330 3439819 3984279 4437149 4323360 3620976
44771 3620976 3022267 3013733 3043653 2247790 800910 -191038 -154047 313706 454516 357916
$$ packed form
44837A3206252R9968m95517l12275J23887K15488J88882M41651P44455O58569
44828A4871360K54664q0495j96497j49273M2335K59219K31947l5023j31980R8687
44818A5164944J33891n24669j485731j863658j430099q31408o28900o35574m23396
44809G475400j06384k19761q92712j503176j358737n63085J03091J77162J1486
44800C123284Q1278K31559Q1810j68002m3641K45146R352o68491q12256l8892
44790B041147P20731N87432L3467J367L47031J77207n89860j057166p11547l7292
44780A512517L50201M17272L88655L60685M10489N44460M52870j13789p02384
44771C620976n98709q534K9920p95863j446880r91948L6991M67753J40810r6600
$$ plain form
44761 357916 564061 1117697 1536402 1566467 1531284 1861076 2516058 3015525 2998581 2664728
44751 2664728 2573968 3006801 3647789 3979549 3855814 3547527 3334430 3224296 3019968 2539576
44741 2539576 1843797 1324351 1406209 2037364 2669031 2902221 2926021 3117849 3491989 3832242
44731 3832242 4078438 4196544 3935012 3194193 2444387 2244933 2463759 2508727 2243690 2101963
44721 2101963 2339363 2790273 3363185 4094031 4606594 4253146 3077585 2016108 1791899
44712 1791899 2124893 2350938 2296447 2170688 2076325 2034823 2105169 2145454 1867762 1402165
44702 1402165 1287455 1599631 1732211 1459322 1455931 2101818 2536408 1885225 868659 992887
44692 992887 2357778 3474958 3328632 2494760 1942297 1759847 1591507 1527388 1878491
$$ packed form
44761C57916K06145N53636M18705L0065l5183L29792O54982M99467j6944l33853
44751B664728r0760M32833O40988L31760j23735l08287k13097j10134k04328m80392
44741B539576o95779n19446Q1858O31155O31667K33190K3800J91828L74140L40253
44731C832242K46196J18106k61532p40819p49806j99454K18826M4968k65037j41727
44721B101963K37400M50910N72912P30846N12563l53448j175561j061477k24209
44712A791899L32994K26045n4491j25759r4363m1502P0346M0285k77692m65597
44702A402165j14710L12176J32580k72889l391O45887M34590o51183j016566J24228
44692I92887J364891J117180j46326q33872n52463j82450j68340o4119L51103
$$ plain form
44683 1878491 2504735 2928304 2903638 2564926 2243526 2332079 3025629 4008500 4680460 4811010
44673 4811010 4665771 4479120 4279234 4298558 4947563 6129250 7111552 7364001 7034096
44664 7034096 6379768 5383888 4309415 3925737 4541720 5342687 5391910 4880994 4656661
44655 4656661 4865572 4919810 4627561 4476619 4757567 5166548 5396828 5457953 5277523 4653778
44645 4653778 3827455 3484626 3870769 4401279 4488585 4328080 4491212 5067874 5605648 5733551
44635 5733551 5561606 5537823 6004921 6753754 7041807 6359553 5166337 4446356 4500068 4704026
44625 4704026 4588882 4499842 4849265 5348729 5517149 5440338 5400919 5176818 4440536 3568526
44615 3568526 3245356 3371144 3168006 2418650 1824330 1927325 2357478 2471609 2215661
$$ packed form
44683A878491O26244M23569k4666l38712l21400Q8553O93550R82871O71960J30550
44673D811010j45239j86651j99886J9324O49005J181687R82302K52449l29905
44664G034096o54328r95880j074473l83678O15983Q00967M9223n10916k24333
44655D656661K08911N4238k92249j50942K80948M08981K30280O1125j80430o23745
44645D653778q26323l42829L86143N30510Q7306j60505J63132N76662N37774J27903
44635E733551j71945k3783M67098P48833K88053o82254j193216p19981N3712K03958
44625D704026j15144q9040L49423M99464J68420p6811l9419k24101p36282q72010
44615C568526l23170J25788k03138p49356n94320J02995M30153J14131k55948
$$ plain form
44606 2215661 2019489 2245857 3015241 4178151 5204219 5509020 5169974 4912903 5109693
44597 5109693 5255614 4803005 4005002 3412855 3011022 2557071 2427661 3210079 4481339
44588 4481339 4920482 3960282 2631533 2294065 3001913 3643281 3396545 2481256 1557284
44579 1557284 946501 654861 793315 1544808 2670645 3364418 2932792 1651249 673919
44570 673919 918619 2198257 3592252 4419835 4568766 4157115 3432227 2967529 3339859
44561 3339859 4364779 5103439 4949605 4365161 4181991 4473013 4588164 4180391 3687518
44552 3687518 3690746 4163458 4586255 4629235 4472910 4445855 4520454 4325663 3653455 2781081
44542 2781081 2178261 2040754 2291991 2877063 3728910 4530618 4936145 5070560 5380597
$$ packed form
44606B215661j96172K26368P69384J162910J026068L04801l39046k57071J96790
44597E109693J45921m52609p98003n92147m01833m53951j29410P82418J271260
44588D481339M39143r60200j328749l37468P07848O41368k46736r15289r23972
44579A557284o10783k91640J38454P51493J125837O93773m31626j281543r77330
44570F73919K44700J279638J393995Q27583J48931m11651p24888m64698L72330
44561C339859J024920P38660j53834n84444j83170K91022J15151m07773m92873
44552C687518L228M72712M22797M2980j56325k7055P4599j94791o72208q72374
44542B781081o02820j37507K51237N85072Q51847Q01708M05527J34415L10037
$$ plain form
44533 5380597 5883560 6050555 5659547 5262530 5434953 5995633 6410858 6558622 6553801 6211112
44523 6211112 5396381 4659300 4691967 5211519 5219200 4481605 3921189 4245784 4968953 5249863
44513 5249863 5032987 4758546 4485478 4041595 3737212 4158308 5272993 6327383 6686425
44504 6686425 6361841 5726275 5152051 4963188 5287537 5799036 5927478 5461956 4698332
44495 4698332 3928212 3112604 2228087 1643233 1854384 2916676 4317389 5411986 5925354
44486 5925354 6052853 6099704 6040525 5552442 4570514 3620734 3321523 3623551 3875250 3675044
44476 3675044 3311282 3215426 3311703 3203646 2827855 2596595 2895763 3660361 4496290 5094234
44466 5094234 5464940 5816897 6248710 6603272 6673508 6507134 6377206 6433254 6523099 6425237
$$ packed form
44533E380597N02963J66995l91008l97017J72423N60680M15225J47764m821l42689
44523F211112q14731p37081L2667N19552P681p37595n60416L24595P23169K80910
44513E249863k16876k74441k73068m43883l04383M21096J114685J054390L59042
44504F686425l24584o35566n74224j88863L24349N11499J28442m65522p63624
44495D698332p70120q15608q84517n84854K11151J062292J400713J094597N13368
44486E925354J27499M6851n9179m88083r81928r49780k99211L02028K51699k00206
44476C675044l63762r5856R6277j08057l75791k31260K99168P64598Q35929N97944
44466E094234L70706L51957M31813L54562P0236j66374j29928N6048Q9845r7862
$$ plain form
44456 6425237 6138595 5862352 5784019 5952182 6252233 6434065 6277052 5833205 5442618 5441440
44446 5441440 5907116 6675303 7448199 7869615 7730946 7226451 6811654 6686824 6628276 6442372
44436 6442372 6277915 6273478 6256528 6166030 6427505 7347490 8368842 8645930 8319592 8415742
44426 8415742 9288779 9999998 9713425 8968269 8834341 9344706 9682483 9636244 9820756 10393710
44416 10393710 10598476 10022828 9478817 9941025 11138072 11964115 12022018 11990370 12487285
44407 12487285 13269489 13741212 13727425 13483014 13325327 13513820 14151478 14910139 15145352
44398 15145352 14631615 13967937 13887265 14336325 14649268 14493289 14121361 13706047 13053192
44389 13053192 12216524 11817987 12270164 13047757 13307982 13062295 13139913 13992139 15102704
$$ packed form
44456F425237k86642k76243p8333J68163L00051J81832j57013m43847l90587j178
44446E441440M65676P68187P72896M21416j38669n04495m14797j24830n8548j85904
44436F442372j64457m437j6950r0498K61475R19985J021352K77088l26338R6150
44426H415742Q73037P11219k86573p45156j33928N10365L37777m6239J84512N72954
44416A0393710K04766n75648n44011M62208J197047Q26043N7903l1648M96915
44407A2487285P82204M71723j3787k44411j57687J88493O37658P58661K35213
44398A5145352n13737o63678q0672M49060L12943j55979l71928m15314o52855
44389A3053192q36668l98537M52177P77593K60225k45687P7618Q52226J110565
$$ plain form
44380 15102704 15745036 15845581 15825911 15946942 16134340 16241082 16202299 16051783 15950773 16032663
44370 16032663 16103621 15789538 15200347 15121357 16159942 17903613 19343850 20040883 20479978
44361 20479978 21329504 22745994 24437197 26046015 27364034 28406395 29351845 30282673
44353 30282673 31080362 31763155 32687991 34025779 35243969 35682686 35587472 35931762 37133002
44344 37133002 38609577 39820591 41048114 42737990 44684669 46454201 48165374 50191787
44336 50191787 52370704 54193295 55684834 57467953 59891140 62585272 65003998 67035406
44328 67035406 68941205 70942133 72996454 74898098 76588060 78363472 80552258 82883989
44320 82883989 84539417 85087317 85002705 84871576 84469201 83202731 81200518 79284763 77975024
$$ packed form
44380A5102704O42332J00545j9670J21031J87398J06742l8783j50516j01010Q1890
44370A6032663P0958l14083n89191p8990J038585J743671J440237O97033M39095
44361B0479978Q49526J416490J691203J608818J318019J042361R45450R30828
44353C0282673P97689O82793R24836J337788J218190M38717r5214L44290J201240
44344C7133002J476575J211014J227523J689876J946679J769532J711173K026413
44336E0191787K178917J822591J491539J783119K423187K694132K418726K031408
44328F7035406J905799K000928K054321J901644J689962J775412K188786K331731
44320H2883989J655428N47900q4612j31129m02375j266470k002213j915755j309739
$$ plain form
44311 77975024 77191605 76898795 77296909 78262347 79321511 80437807 82171040 84680259 87110068
44302 87110068 88440894 88635354 88605328 89338646 91308086 94339745 97674678 100443326 102458526
44293 102458526 104363696 106764254 109506224 112093664 114456615 116855737 119262236 121342381
44285 121342381 123006384 124544205 126136848 127481469 127976523 127202934 125293170 122884396
44277 122884396 120545979 118192825 115316455 111875943 108560876 105902781 103489068 100463810
44269 100463810 96588394 92427497 88666822 85620098 83233531 81134464 78721207 75573291
44261 75573291 71801014 67819607 63962036 60572889 58176532 57007527 56427570 55310603
44253 55310603 53123583 50339754 47781752 45861433 44469856 43314760 42298967 41679017
$$ packed form
44311G7975024p83419k92810L98114R65438J059164J116296J733233K509219K429809
44302H7110068J330826J94460l0026P33318J969440L031659L334933K768648K015200
44293A02458526J905170K400558K741970K587440K362951K399122K406499K080145
44285A21342381J664003J537821J592643J344621M95054p73589j909764k408774
44277A22884396k338417k353154k876370l440512l315067k658095k413713l025258
44269A00463810l875416m160897l760675l046724k386567k099067k413257l147916
44261G5573291l772277l981407l857571l389147k396357j169005n79957j116967
44253E5310603k187020k783829k558002j920319j391577j155096j015793o19950
$$ plain form
44245 41679017 41697352 41905546 41241980 39244257 36873335 35495778 35233690 35067774 34492286
44236 34492286 34129345 34451456 34792909 34211990 32733932 31115863 29809457 28810249 28260525
44227 28260525 28502365 29524898 30845032 31989555 32760760 33038148 32685010 31763463 30624819
44218 30624819 29666820 29033060 28506371 27681528 26413051 25151302 24573161 24749384 25015844
44209 25015844 24902972 24771849 25084031 25445959 25122603 24357538 24289117 25310130 26297965
44200 26297965 26005726 24660360 23515247 23176104 23151312 22953228 22802606 23005114 23313054
44191 23313054 23339215 23127767 22845193 22317530 21474049 20949782 21469093 22650710 23204521
44182 23204521 22534525 21457479 20976315 21007022 20900128 20683303 20969974 21848794 22673514
$$ packed form
44245D1679017J8335K08194o63566j997723k370922j377557k62088j65916n75488
44236C4492286l62941L22111L41453n80919j478058j618069j306406r99208n49724
44227B8260525K41840J022533J320134J144523P71205K77388l53138r21547j138644
44218C0624819r57999o33760n26689q24843j268477j261749n78141J76223K66460
44209B5015844j12872j31123L12182L61928l23356p65065o8421J021013R87835
44200B6297965k92239j345366j145113l39143k4792j98084j50622K02508L07940
44191B3313054K6161k11448k82574n27663q43481n24267N19311J181617N53811
44182B3204521o69996j077046m81164L0707j06894k16825K86671Q78820Q24720
$$ plain form
44173 22673514 22993540 23011352 22985907 22818626 22488954 22347681 22600212 22899941 22860122 22685540
44163 22685540 22880186 23492507 24043701 24155150 23925848 23669526 23533594 23476200 23494630 23764641
44153 23764641 24512414 25721536 27014855 27934272 28338118 28442799 28534502 28775388 29200149
44144 29200149 29683458 29984385 30091517 30437270 31388278 32555102 33115979 32962638 32999395
44135 32999395 33996006 35596407 36884049 37546827 37931914 38194331 38071161 37543608 37124073
44126 37124073 37201567 37452093 37216501 36309696 35200925 34452500 34203926 34249132 34435084
44117 34435084 34805094 35381703 36000498 36439799 36568958 36281609 35501285 34459109 33739239
44108 33739239 33697012 33966412 33940346 33625910 33520923 33686746 33585416 32998847 32475796 32529849
$$ packed form
44173B2673514L20026J7812k5445j67281l29672j41273K52531K99729l9819j74582
44163B2685540J94646O12321N51194J11449k29302k56322j35932n7394J8430K70011
44153B3764641P47773J209122J293319R19417M03846J04681R1703K40886M24761
44144B9200149M83309L00927J07132L45753R51008J166824N60877j53341L6757
44135C2999395R96611J600401J287642O62778L85087K62417j23170n27553m19535
44126C7124073P7494K50526k35592r06805j108771p48425k48574M5206J85952
44117C4435084L70010N76609O18795M39301J29159k87349p80324j042176p19870
44108C3739239m2227K69400k6066l14436j04987J65823j01330n86569n23051N4053
$$ plain form
44098 32529849 32932312 33213677 33382103 33630248 33703100 33137236 31952000 30667860 29811460
44089 29811460 29711358 30425783 31421906 31701099 30842091 29660575 29242829 29606972 30003864
44080 30003864 30235003 30722460 31334634 31210219 30063096 28779715 28237277 28212209 27973545
44071 27973545 27346408 26553238 25471294 23821289 21936282 20661082 20416845 20818405 21278834
44062 21278834 21585282 21742634 21602873 20947387 19839071 18664214 17777733 17208778 16769429
44053 16769429 16362915 16062040 15925692 15912286 15994610 16173051 16336480 16336130 16245020 16239513 16155432
44042 16155432 15622048 14851086 14710597 15528170 16355234 16141008 15242851 14884464 15335337
44033 15335337 15649817 15239430 14645196 14452921 14408505 14105612 13750207 13662561 13674945 13602085
$$ packed form
44098C2529849M02463K81365J68426K48145P2852n65864j185236j284140q56400
44089B9811460j00102P14425R96123K79193q59008j181516m17746L64143L96892
44080C0003864K31139M87457O12174j24415j147123j283381n42438k5068k38664
44071B7973545o27137p93170j081944j650005j885007j275200k44237M01560M60429
44062B1278834L06448J57352j39761o55486j108316j174857q86481n68955m39349
44053A6769429m06514l00875j36348j3406Q2324J78441J63429l50r1110n507q4081
44042A6155432n33384p70962j40489Q17573Q27064k14226q98157l58387M50873
44033A5335337L14480m10387n94234j92275m4416l02893l55405q7646J2384p2860
$$ plain form
44023 13602085 13706684 14091196 14219820 13756376 13348941 13744708 14513348 14573738 13786258
44014 13786258 13068337 12929717 12834285 12265029 11616369 11564306 12086287 12619121 12894224 13131877
44004 13131877 13485890 13696943 13452503 12943697 12851548 13657862 15041535 16156910 16527193
43995 16527193 16441480 16437504 16707291 17129738 17510935 17548108 16934413 15876402 15214573 15591833
43985 15591833 16676884 17583748 17856493 17642529 17139085 16421675 15735869 15412747 15425556
43976 15425556 15424328 15264856 15193120 15490597 16174797 16971721 17379539 17009377 16194253 15933129
43966 15933129 16722127 17732500 17785577 16901522 16101271 15818616 15465919 14689164 14079825
43957 14079825 14245830 14965713 15729580 16418697 16917444 16714803 15607341 14369187 14000331
$$ packed form
44023A3602085J04599L84512J28624m63444m07435L95767P68640O0390p87480
44014A3786258p17921j38620r5432n69256o48660n2063N21981N32834K75103K37653
44004A3131877L54013K11053k44440n08806r2149Q06314J383673J115375L70283
43995A6527193q5713l976K69787M22447L81197L7173o13695j058011o61829L77260
43985A5591833J085051R06864K72745k13964n03444p17410o85806l23122J2809
43976A5425556j228j59472p1736K97477O84200P96924M07818l70162q15124k61124
43966A5933129P88998J010373N3077q84055q00251k82655l52697p76755o09339
43957A4079825J66005P19883P63867O89117M98747k02641j107462j238154l68856
$$ plain form
43948 14000331 14524105 15118369 15261169 15193350 15365363 15960226 16959637 18257033 19637892
43939 19637892 20873160 21799878 22218690 21999945 21517119 21577477 22477795 23444170 23569725
43930 23569725 23104904 23186013 24337287 25862117 26788859 26864410 26498592 26285845 26797664
43921 26797664 28310486 30362639 31951260 32572585 32853113 33836348 35858711 38445133
43913 38445133 41066010 43527833 45721277 47557406 49352976 51859190 55528547 59898988
43905 59898988 64029729 67536458 70958726 75101917 80271964 86224704 92569003 98971442
43897 98971442 105146231 110994467 116782538 122937105 129594796 136537116 143614006 151002937
43889 151002937 158916290 167240521 175673141 184136745 192854151 202006825 211496408 221151308
$$ packed form
43948A4000331N23774N94264J42800o7819J72013N94863R99411J297396J380859
43939A9637892J235268R26718M18812k18745m82826O0358R00318R66375J25555
43930B3569725m64821Q1109J151274J524830R26742P5551l65818k12747N11819
43921B6797664J512822K052153J588621O21325K80528R83235K022363K586422
43913C8445133K620877K461823K193444J836129J795570K506214L669357M370441
43905E9898988M130741L506729L422268M143191N170047N952740O344299O402439
43897I8971442O174789N848236N788071O154567O657691O942320P076890P388931
43889A51002937P913353Q324231Q432620Q463604Q717406R152674R489583R654900
$$ plain form
43881 221151308 231067492 241529070 252502217 263417731 273769024 283886836 294706327
43874 294706327 306607841 318911481 330842040 342570570 354761547 367417905 379940763
43867 379940763 392274882 405187645 419195052 433854888 448399373 462515806 476232516
43860 476232516 489564801 502502566 514679101 524644323 530070894 529135021 521135724 505451473
43852 505451473 480972555 447656929 408081362 366297795 325347596 286709538 251547468
43845 251547468 220933662 194788025 172055346 152368443 136355836 123852117 113099744
43838 113099744 102614172 92860276 85031935 78884217 72958569 66603440 60617469 55908977
43830 55908977 52491330 49973967 48225491 47158970 46347232 45238014 43582100 41527430
$$ packed form
43881B21151308R916184J0461578J0973147J0915514J0351293J0117812J0819491
43874B94706327J1901514J2303640J1930559J1728530J2190977J2656358J2522858
43867C79940763J2334119J2912763J4007407J4659836J4544485J4116433J3716710
43860D76232516J3332285J2937765J2176535R965222N426571r35873p999297j5684251
43852E05451473k4478918l3315626l9575567m1783567m0950199l8638058l5162070
43845B51547468l0613806k6145637k2732679j9686903j6012607j2503719j0752373
43838A13099744j0485572r753896p828341o147718n925648o355129n985971m708492
43830E5908977l417647k517363j748476j066521q11738j109218j655914k054670
$$ plain form
43822 41527430 39474394 37865349 36881683 36285456 35712196 35102835 34690087 34619885 34761088
43813 34761088 34819058 34491710 33665900 32665536 32123775 32323265 32804597 32926355 32654604
43804 32654604 32432800 32420044 32353358 32165753 32226429 32784198 33554568 34088565 34273570 34246725
43794 34246725 34053995 33684732 33338652 33378096 33942662 34715166 35155751 35008426 34568545
43785 34568545 34364781 34542343 34697330 34425555 33868707 33499439 33467228 33442605 33148830 32833688
43775 32833688 33082545 34176368 35640108 36505387 36242740 35475345 35455736 36670551 38311337
43766 38311337 39368647 39775741 39975624 39838135 38889474 37492524 36822100 37389009 38343551
43757 38343551 38635323 38256918 37913873 38009835 38471058 39150474 39867458 40351672 40632278
$$ packed form
43822D1527430k053036j609045r83666n96227n73260o09361m12748p0202J41203
43813C4761088N7970l27348q25810j000364n41761J99490M81332J21758k71751
43804C2654604k21804j2756o6686j87605O0676N57769P70370N33997J85005k6845
43794C4246725j92730l69263l46080L9444N64566P72504M40585j47325m39881
43785C4568545k03764J77562J54987k71775n56848l69268l2211k4623k93775l15142
43775C2833688K48857J093823J463740Q65279k62647p67395j9609J214815J640786
43766C8311337J057310M07094J99883j37489r48661j396950o70424N66909R54542
43757C8343551K91772l78405l43045R5962M61223O79416P16984M84214K80606
$$ plain form
43748 40632278 41206351 42360674 43623522 44399026 44859789 45621519 46758440 47804788 48612466
43739 48612466 49507643 50591623 51567864 52366320 53299064 54435418 55446031 56276644 57322804
43730 57322804 58611044 59466716 59503351 59391919 60009002 61208910 62127816 62445742 62605415
43721 62605415 62885495 63037004 62948339 62958572 63220010 63307812 62821741 61947961 61066416 60179997
43711 60179997 59110533 57881235 56432486 54317180 51328261 48216753 45991360 44467746
43703 44467746 42350848 39069602 35730010 33620421 32381044 30544435 27624074 24700119
43695 24700119 22853875 21919839 21145774 20308008 19531418 18521137 16805222 14652926 13049574
43686 13049574 12576091 12748008 12660959 11972980 11028432 10245539 9684585 9199338 8775311
$$ packed form
43748D0632278N74073J154323J262848P75504M60763P61730J136921J046348Q07678
43739D8612466Q95177J083980R76241P98456R32744J136354J010613Q30613J046160
43730E7322804J288240Q55672L6635j11432O17083J199908R18906L17926J59673
43721F2605415K80080J51509q8665J0233K61438Q7802m86071q73780q81545q86419
43711F0179997j069464j229298j448749k115306k988919l111508k225393j523614
43703D4467746k116898l281246l339592k109589j239377j836609k920361k923955
43695B4700119j846244r34036p74065q37766p76590j010281j715915k152296j603352
43686A3049574m73483J71917q7049o87979r44548p82893n60954m85247m24027
$$ plain form
43677 8775311 8544719 8496483 8392302 8160341 8213875 8984753 10103133 10516988 9703762 8368868
43667 8368868 7548211 7358292 7145866 6597871 6033805 5691236 5434105 5253799 5383241
43658 5383241 5716840 5762490 5462967 5444040 6045585 6685905 6701032 6298560 6053462 5893408
43648 5893408 5355601 4603831 4359691 4832927 5452196 5755496 5892218 6080004 6179619 6060524
43638 6060524 5857623 5582598 4964589 3997577 3198326 2941548 2923185 2699347 2423271 2562989
43628 2562989 3101903 3497941 3338958 2670789 1813303 1217084 1310668 2013060 2523671 2137912
43618 2137912 1232430 854080 1278361 1635359 1202012 405265 74390 235203 319110 276386
43608 276386 708413 1842205 3006249 3392424 2964104 2354084 2108514 2267579 2550190
$$ packed form
43677H775311k30592m8236j04181k31961N3534P70878J118380M13855q13226j334894
43667H368868q20657j89919k12426n47995n64066l42569k57131j80306J29442
43658E383241L33599M5650k99523j8927O01545O40320J5127m02472k45098j60054
43648E893408n37807p51770k44140M73236O19269L03300J36722J87786R9615j19095
43638F060524k02901k75025o18009r67012p99251k56778j8363k23838k76076J39718
43628B562989N38914L96038j58983o68169q57486n96219R3584P02392N10611l85759
43618B137912r05482l78350M24281L56998m33347p96747l30875J60813Q3907m2724
43608B76386M32027J133792J164044L86175m28320o10020k45570J59065K82611
$$ plain form
43599 2550190 2742818 2901834 3190474 3482078 3275754 2270072 954547 254908 506872
43590 506872 1127410 1420330 1307758 1043849 649970 72055 -398826 -388860 -5179 332297
43580 332297 544419 889761 1332354 1464366 1191691 992489 1250871 1750990 2115580 2360998
43570 2360998 2652008 2832891 2683815 2478632 2770520 3579927 4218896 4108511 3509535
43561 3509535 3212764 3617292 4334330 4721180 4626950 4455131 4564656 4868060 5113208 5285175
43551 5285175 5471336 5553335 5418939 5334244 5615010 5975671 5798107 5154773 4916200 5533180
43541 5533180 6313742 6376308 5811019 5322290 5143980 5001969 4880694 5073322 5538794 5862206
43531 5862206 5839465 5523062 4772263 3476148 2261852 2174361 3347978 4644672 5000705
$$ packed form
43599B550190J92628J59016K88640K91604k06324j005682j315525o99639K51964
43590E06872O20538K92920j12572k63909l93879n77915m70881R966L83681L37476
43580C32297K12122L45342M42593J32012k72675j99202K58382N00119L64590K45418
43570B360998K91010J80883j49076k05183K91888Q09407O38969j10385n98976
43561C509535k96771M04528P17038L86850r4230j71819J09525L03404K45148J71967
43551E285175J86161Q1999j34396q4695K80766L60661j77564o43334k38573O16980
43541E533180P80562O2566n65289m88729j78310j42011j21275J92628M65472L23412
43531E862206k2741l16403p50799j296115j214296q7491J173617J296694L56033
$$ plain form
43522 5000705 4603550 4301095 4299302 4012843 3033943 1795252 1236283 1941454 3506065
43513 3506065 4738320 4755328 3924728 3385275 3611142 3956772 3769328 3320317 3223930 3470207
43503 3470207 3611465 3533264 3406998 3115174 2393131 1467241 921639 880685 886284 710429
43493 710429 747252 1331495 2111617 2511022 2575379 2903511 3725154 4433716 4284041 3390314
43483 3390314 2691174 2849489 3496772 3823661 3667663 3563337 3786574 3909430 3505478
43474 3505478 2857528 2637231 3140548 4106267 5068061 5651838 5744981 5597715 5562279 5585512
43464 5585512 5253389 4505231 3908203 3934865 4356910 4724688 5074818 5694121 6462359 6913321
43454 6913321 6757118 5954894 4566773 2999622 2112052 2482400 3714981 4950379 5839637
$$ packed form
43522E000705l97155l02455j793k86459r78900j238691n58969P05171J564611
43513C506065J232255J7008q30600n39453K25867L45630j87444m49011r6387K46277
43503C470207J41258p8201j26266k91824p22043r25890n45602m0954N599j75855
43493G10429L6823N84243P80122L99405O4357L28132Q21643P08562j49675q93727
43483C390314o99140J58315O47283L26889j55998j04326K23237J22856m03952
43474C505478o47950k20297N03317R65719R61794N83777R3143j47266l5436K3233
43464E585512l32123p48158n97028K6662M22045L67778L50130O19303P68238M50962
43454F913321j56203q02224j388121j567151q87570L70348J232581J235398Q89258
$$ plain form
43445 5839637 6504719 6864231 6734478 6433579 6519091 6958884 7245144 7264162 7323924 7382055
43435 7382055 7078168 6573150 6495501 6921752 7268309 7372546 7767679 8607525 9274952 9480274
43425 9480274 9803373 10583012 11176909 11037027 10698963 10876391 11292458 11327419 11197938 11467138
43415 11467138 11889214 11879489 11799909 12535630 13852849 14394695 13516216 12052501 10913442
43406 10913442 9895030 8434778 6752779 5521298 4869020 4391059 3906651 3624195 3627368
43397 3627368 3654830 3444086 3022822 2614131 2436464 2642456 3306261 4330269 5348044
43388 5348044 5849178 5589398 4891795 4345540 4157015 4043804 3830539 3741545 3846311 3658121
43378 3658121 2794862 1753053 1384954 1680207 1715164 938424 -51578 -285671 399415
$$ packed form
43445E839637O65082L59512j29753l00899Q5512M39793K86260J9018N9762N8131
43435G382055l03887n05018p7649M26251L46557J04237L95133Q39846O67427K05322
43425I480274L23099P79639N93897j39882l38064J77428M16067L4961j29481K69200
43415A1467138M22076r725p9580P35721J317219N41846q78479j463715j139059
43406A0913442j018412j460252j681999j231481o52278m77961m84408k82456L173
43397C627368K7462k10744m21264m08691j77667K05992O63805J024008J017775
43388E348044N01134k59780o97603n46255j88525j13211k13265q8994J04766j88190
43378C658121q63259j041809l68099K95253L4957p76740r90002k34093O85086
$$ plain form
43369 399415 1270272 1579529 1282516 925625 961835 1254614 1360920 1257100 1436864 2123900
43359 2123900 2810741 2950178 2691971 2405546 1899294 907468 70731 407429 1771059
43350 1771059 2856537 2992031 2914139 3313306 3633482 3103272 2143075 1729472 1859834
43341 1859834 1732207 1244221 1230983 2091048 3084157 3330883 2856940 2269976 1899074 1684018
43331 1684018 1599206 1742947 2095039 2490819 2846321 3240858 3737413 4182817 4235459 3662794
43321 3662794 2663547 1813484 1577276 1903378 2365752 2614333 2584477 2381592 2139738 1956430
43311 1956430 1830689 1689426 1544662 1528384 1687141 1884810 2030893 2240284 2604684 2972813
43301 2972813 3136939 3042914 2606724 1596453 71559 -1259652 -1611196 -1026745 -299881
$$ packed form
43369C99415Q70857L09257k97013l56891L6210K92779J06306j03820J79764O87036
43359B123900O86841J39437k58207k86425n06252r91826q36737L36698J363630
43350A771059J085478J35494p7892L99167L20176n30210r60197m13603J30362
43341A859834j27627m87986j3238Q60065R93109K46726m73943n86964l70902k15056
43331A684018q4812J43741L52092L95780L55502L94537M96555M45404N2642n72665
43321C662794r99247q50063k36208L26102M62374K48581k9856k02885k41854j83308
43311A956430j25741j41263j44764j6278J58757J97669J46083K09391L64400L68129
43301B972813J64126r4025m36190j010271j524894j331211l51544N84451P26864
$$ plain form
43292 -299881 3205 8928 16129 35340 14364 46260 90675 -104881 -514646 -675777 -412304
43281 -412304 -345022 -1137007 -2444441 -3215839 -2986559 -2283345 -1660626 -958629 143462
43272 143462 1307210 1788787 1353084 507605 -139201 -402427 -392705 -218660 25185 194155
43262 194155 205321 120758 6119 -196987 -533458 -838876 -830858 -425110 104069 325325
43252 325325 50595 -433717 -596381 -224835 296420 443552 255904 311027 926588 1686264
43242 1686264 1946414 1553981 831269 126197 -300885 -228639 211446 364548 -228582 -1018059
43232 -1018059 -995719 -103079 631847 569328 279073 433934 663544 305587 -250105 1053
43222 1053 1062611 1776628 1423343 595083 134884 -36703 -501722 -1283594 -1822731 -1764744
$$ packed form
43292b99881L03086N723P201J9211k0976L1896M4415j95556m09765j61131K63473
43281d12304O7282p91985j307434p71398K29280P03214O22719P01997J102091
43272A43462J163748M81577m35703q45479o46806k63226R722J74045K43845J68970
43262A94155J1166q4563j14639k03106l36471l05418Q018M05748N29179K21256
43252C25325k74730m84312j62664L71546N21255J47132j87648N5123O15561P59676
43242A686264K60150l92433p22712p05072m27082P2246M40085J53102n93130p89477
43232a018059K2340Q92640P34926o2519k90255J54861K29610l57957n55692K51158
43222A053J061558P14017l53285q28260m60199j71587m65019p81872n39137N7987
$$ plain form
43212 -1764744 -1277602 -718378 -366503 -368679 -605334 -694212 -404324 32613 258574 264135
43202 264135 234191 118213 -232085 -606253 -590911 -205274 65908 -12127 -79395 261655
43192 261655 882745 1350391 1441236 1224239 907613 872406 1574043 2978173 4191610 4110484
43182 4110484 2582330 690880 -241647 175105 1231604 1925126 1842137 1371947 1185461
43173 1185461 1521331 1979539 2002215 1456328 664864 -18894 -488284 -775906 -870022 -710381
43163 -710381 -294586 231789 588866 586359 413873 525915 1051376 1504537 1377110 871089
43153 871089 658475 984676 1454507 1714284 1843514 1948126 1889509 1679070 1670297 2002647
43143 2002647 2245314 1980649 1396359 900377 509366 93585 -134654 9499 95340 -428867
$$ packed form
43212a764744M87142N59224L51875k176k36655q8878K89888M36937K25961N561
43202B64135k9944j15978l50298l74168J5342L85637K71182p8035o7268L41050
43192B61655O21090M67646R0845k16997l16626l5207P01637J404130J213437q1126
43182D110484j528154j891450r32527M16752J056499O93522q2989m70190j86486
43173A185461L35870M58208K2676n45887p91464o83758m69390k87622r4116J59641
43163g10381M15795N26375L57077k507j72486J12042N25461M53161j27427n06021
43153H71089k12614L26201M69831K59777J29230J04612n8617k10439q773L32350
43143B002647K42667k64665n84290m95982l91011m15781k28239J44153Q5841n24207
$$ plain form
43133 -428867 -1274267 -1582676 -1165813 -730829 -743827 -823080 -559280 -238282 -261769 -370336
43123 -370336 -14165 802929 1559617 1920585 1977945 1911595 1792059 1674085 1577888 1374317
43113 1374317 900944 213874 -370986 -477569 42969 848706 1183777 558651 -575005
43104 -575005 -1199325 -930681 -459533 -567438 -1119253 -1407208 -1167653 -765222 -499543 -189148
43094 -189148 489343 1485001 2252817 2128630 986621 -422390 -1062860 -677993 22091
43085 22091 341442 340674 378981 440496 374684 383525 679813 936185 707275 265588 388448
43074 388448 1290173 2276531 2531384 1856622 622007 -612507 -1364530 -1471384 -1177745
43065 -1177745 -818536 -478674 -138555 53168 -41556 -282633 -480389 -677905 -875443 -777569
$$ packed form
43133d28867q45400l08409M16863M34984j2998p9253K63800L20998k3487j08567
43123c70336L56171Q17094P56688L60968N7360o6350j19536j17974r6197k03571
43113A374317m73373o87070n84860j06583N20538Q05737L35071o25126j133656
43104e75005o24320K68644M71148j07905n51815k87955K39555M02431K65679L10395
43094a89148O78491R95658P67816j24187j142009j409011o40470L84867P00084
43085B2091L19351p68L8307O1515o5812Q841K96288K56372k28910m41687J22860
43074C88448R01725R86358K54853o74762j234615j234514p52023j06854K93639
43065a177745L59209L39862L40119J91723r4724k41077j97756j97516j97538R7874
$$ plain form
43055 -777569 -263274 203950 194551 63901 444039 1223904 1759223 1905364 2022783 2079993
43045 2079993 1696057 1112118 1115040 1747168 2048395 1504359 916852 1300937 2576029 3866270
43035 3866270 4540683 4499519 3983299 3566738 3831999 4597924 4948147 4402507 3528381 3047028
43025 3047028 3006341 3269646 4016374 5086547 5604744 5157065 4737408 5519149 7125002
43016 7125002 8158986 8132005 7755026 7524767 7244952 7017408 7484142 8689404 9690350
43007 9690350 9819003 9560262 9662330 10075823 10383496 10691215 11331261 11999883 11959091 11076034
42997 11076034 10058021 9507112 9165121 8351744 6926149 5500890 4679192 4321137 3786422
42988 3786422 2827098 1923193 1619224 1829192 2061776 2107935 2140730 2235627 2188898 1868161
$$ packed form
43055g77569N14295M67224r399j30650L80138P79865N35319J46141J17419N7210
43045B079993l83936n83939K922O32128L01227n44036n87507L84085J275092J290241
43035C866270O74413m1164n16220m16561K65261P65925L50223n45640q74126m81353
43025C047028m0687K63305P46728J070173N18197m47679m19657P81741J605853
43016G125002J033984k6981l76979k30259k79815k27544M66734J205262J000946
43007I690350J28653k58741J02068M13493L07673L07719O40046O68622m0792q83057
42997A1076034j018013n50909l41991q13377j425595j425259q21698l58055n34715
42988C786422r59324r03905l03969K09968K32584M6159L2795R4897m6729l20737
$$ plain form
42978 1868161 1442298 1134091 905917 503600 -207112 -936980 -1054222 -178827 1242585
42969 1242585 2228923 2289012 1885955 1708554 1831464 1883741 1690961 1352064 977833 778894
42959 778894 1122116 2033256 2941773 3435308 3917329 4851195 5696179 5497023 4388333
42950 4388333 3506644 3321997 3087542 2271300 1545477 1744681 2595739 3205034 3297078 3264829
42940 3264829 3346871 3439466 3516466 3614385 3503719 2918943 2080695 1526984 1441298 1579505
42930 1579505 1865964 2573573 3722089 4683312 4752376 4009560 3299922 3278825 3694384 3803323
42920 3803323 3352206 2814291 2640884 2694641 2653957 2602140 2818641 3242111 3584802 3792054
42910 3792054 3928747 3803383 3262350 2722997 2773361 3273759 3522313 3354376 3365360 3868953
$$ packed form
42978A868161m25863l08207k28174m02317p10712p29868j17242Q75395J421412
42969A242585R86338O0089m03057j77401J22910N2277j92780l38897l74231j98939
42959G78894L43222R11140R08517M93535M82021R33866Q44984j99156j108690
42950D388333q81689j84647k34455q16242p25823J99204Q51058O09295R2044l2249
42940C264829Q2042R2595P7000R7919j10666n84776q38248n53711q5686J38207
42930A579505K86459P07609J148516R61223O9064p42816p09638k1097M15559J08939
42920C803323m51117n37915j73407N3757m0684n1817K16501M23470L42691K07252
42910C792054J36693j25364n41033n39353N0364N00398K48554j67937J0984N03593
$$ plain form
42900 3868953 4306304 3964880 2752457 1081488 -445527 -1120058 -615922 389239 818699
42891 818699 643711 859187 1719547 2089988 1190733 -84553 -529140 -380146 -578126
42882 -578126 -1039477 -1032859 -793742 -1274048 -2399879 -2973896 -2426840 -1419483 -518663 471155
42872 471155 1495859 1800155 1130190 424146 590680 1335593 1849756 1970975 1960018 1730378
42862 1730378 1105324 449443 285775 496673 500622 30722 -733676 -1509780 -1872369 -1239429
42852 -1239429 413386 2041616 2455705 1686537 804149 500408 613038 1029242 2093291
42843 2093291 3725505 4934306 4877724 3982529 3389558 3555877 3976734 4068218 3657526
42834 3657526 2653424 966486 -991548 -2294383 -2400266 -1753581 -1151840 -793791 -325724
$$ packed form
42900C868953M37351l41424j212423j670969j527015o74531N04136J005161M29460
42891H18699j74988K15476Q60360L70441q99255j275286m44587J48994j97980
42882e78126m61351O618K39117m80306j125831n74017N47056J007357R00820R89818
42872D71155J024704L04296o69965p06044J66534P44913N14163J21219j0957k29640
42862A730378o25054o55881j63668K10898L949m69900p64398p76104l62589O32940
42852a239429J652815J628230M14089p69168q82388l03741J12630M16204J064049
42843B093291J632214J208801n6582q95195n92971J66319M20857R1484m10692
42834C657526j004102j686938j958034j302835j05883O46685O01741L58049M68067
$$ plain form
42825 -325724 426708 1265036 2044270 2775687 3267232 3152552 2463056 1785615 1589114 1645075
42815 1645075 1367417 573972 -279312 -515643 206197 1589928 2861244 3396216 3270849
42806 3270849 3037548 2987068 2918651 2623269 2167801 1599809 845562 123391 -8130 648737
42796 648737 1545683 2010258 1893019 1341756 439062 -536862 -1021653 -885324 -792391 -1262889
42786 -1262889 -1844184 -1879599 -1574295 -1430059 -1113711 -30496 1247563 1446228 547311
42777 547311 -9182 594756 1465675 1488408 798840 90124 -576332 -1421309 -2157994 -2419349
42767 -2419349 -2410546 -2357861 -1882656 -771021 180705 101364 -522153 -396824 741055 1854656
42757 1854656 2164861 1982733 1802788 1499190 857382 223767 94579 420499 713058
$$ packed form
42825c25724P52432Q38328P79234P31417M91545j14680o89496o77441j96501N5961
42815A645075k77658p93445q53284k36331P21840J383731J271316N34972j25367
42806C270849k33301n0480o8417k95382m55468n67992p54247p22171j31521O56867
42796F48737Q96946M64575j17239n51263r02694r75924m84791J36329R2933m70498
42786a262889n81295l5415L05304J44236L16348J083215J278059J98665q98917
42777E47311n56493O03938Q70919K2733o89568p08716o66456q44977p36685k61355
42767b419349Q803N2685M75205J111635R51726p9341o23517J25329J137879J113601
42757A854656L10205j82128j79945l03598o41808o33615j29188L25920K92559
$$ plain form
42748 713058 625257 199139 -252298 -357524 19223 610992 1059554 1355081 1675783 1872350
42738 1872350 1582825 933203 632814 1135666 2060067 2667435 2615610 2046097 1272076 660231
42728 660231 529228 828027 1099527 1050226 966165 1244148 1679100 1623226 831265 -207208
42718 -207208 -824261 -767467 -196407 567233 1117858 1095235 527839 -100227 -382604 -461319
42708 -461319 -673082 -863701 -515243 407429 1264100 1643633 1954891 2638031 3189838 2697832
42698 2697832 1236786 -24412 -253321 181190 544290 773381 1183532 1638630 1675810
42689 1675810 1241524 726630 364154 95764 -15724 251757 842804 1372935 1638577
42680 1638577 1865942 2334613 2983408 3456960 3358191 2491876 1138472 72384 -55228
$$ packed form
42748G13058q7801m26118m51437j05226L76747N91769M48562K95527L20702J96567
42738A872350k89525o49622l00389N02852R24401O07368n1825n69513p74021o11845
42728F60231j31003K98799K71500m9301q4061K77983M34952n5874p91961j038473
42718b07208o17053N6794N71060P63640N50625k2623n67396o28066k82377p8715
42708d61319k11763j90619L48458R22672Q56671L79533L11258O83140N51807m92006
42698B697832j461046j261198k28909M34511L63100K29091M10151M55098L7180
42689A675810m34286n14894l62476k68390j11488K67481N91047N30131K65642
42680A638577K27365M68671O48795M73552r8769q66315j353404j066088j27612
$$ plain form
42671 -55228 521664 821383 185437 -973852 -1632717 -1205838 -22838 1073736 1424117
42662 1424117 927347 -54682 -1030916 -1631080 -1684944 -1270031 -702103 -259710 164190 887667
42652 887667 1786175 2159205 1591657 703533 586682 1566858 2919905 3765519 3827545 3324148
42642 3324148 2593499 1982274 1707377 1590157 1179695 331156 -532127 -873681 -587597
42633 -587597 2579 488754 628870 456990 257009 271452 382786 269691 -95050 -357671
42623 -357671 -269967 -1283 150115 105207 -77676 -380774 -720257 -856356 -643350 -268251
42613 -268251 -50360 -52696 -21387 321783 995078 1719632 2141200 2150095 1970149 1866927
42603 1866927 1861262 1868621 1966972 2231206 2378986 1963730 983743 -31142 -632255 -831912
$$ packed form
42671e5228N76892K99719o35946j159289o58865M26879J183000J096574L50381
42662A424117m96770r82029r76234o00164n3864M14913N67928M42393M23900P23477
42652H87667Q98508L73030n67548q88124j16851R80176J353047Q45614O2026n03397
42642C324148p30649o11225k74897j17220m10462q48539q63283l41554K86084
42633e87597N90176M86175J40116j71880j99981J4443J11334j13095l64741k62621
42623c57671Q7704K68684J51398m4908j82883l03098l39483j36099K13006L75099
42613b68251K17891k336L1309L43170O73295P24554M21568Q895j79946j03222
42603A866927n665P359R8351K64234J47780m15256r79987j014885o01113j99657
$$ plain form
42593 -831912 -765868 -350026 475166 1417734 2043985 2218945 2180674 2281199 2732418 3436577
42583 3436577 3981570 4002843 3652540 3499666 3836303 4272228 4153612 3246135 1941659
42574 1941659 960876 872628 1663254 2714776 3410103 3735121 4016512 4204367 3950711
42565 3950711 3413255 3299753 3839628 4339924 4203913 3855051 4088275 4917032 5695384
42556 5695384 6099320 6322076 6458934 6394917 6317028 6694510 7562703 8306802 8413648 8135324
42546 8135324 8169747 8836926 9717771 10028458 9303978 7788186 6174851 4961836 4128291
42537 4128291 3402023 2611630 1728723 849939 254312 184577 448982 585889 542068 707424
42527 707424 1068864 960781 109404 -693747 -643678 -159749 -252814 -991077 -1504628 -1352546
$$ packed form
42593h31912O6044M15842Q25192R42568O26251J74960l8271J00525M51219P04159
42583C436577N44993K1273l50303j52874L36637M35925j18616r07477j304476
42574A941659r80783q8248P90626J051522O95327L25018K81391J87855k53656
42565C950711n37456j13502N39875N00296j36011l48862K33224Q28757P78352
42556E695384M03936K22756J36858o4017p7889L77482Q68193P44099J06846k78324
42546H135324L4423O67179Q80845L10687p24480j515792j613335j213015q33545
42537D128291p26268p90393q82907q78784n95627o9735K64405J36907m3821J65356
42527G07424L61440j08083q51377q03151N0069M83929r3065p38263n13551J52082
$$ plain form
42517 -1352546 -943198 -601058 -168805 288879 290514 -195569 -427179 153063 1211053 2125780
42507 2125780 2735418 3100012 3069277 2578527 1997539 1736513 1755316 1772130 1694922 1616858
42497 1616858 1688225 2153594 3103018 4015700 4095218 3363110 2848935 3251266 3949577 3928338
42487 3928338 3238449 2832858 3193835 3820835 4010956 3556743 2674190 1757646 1261968
42478 1261968 1398522 1855289 2117713 2085468 2093053 2340262 2606158 2562069 2144264 1597690
42468 1597690 1289269 1408440 1729020 1812425 1568483 1369838 1438526 1467600 1159547 769152
42458 769152 652355 598457 210792 -252855 -125995 581178 1025940 649635 -104168 -462140
42448 -462140 -289999 -69030 -162822 -397049 -290364 407315 1360616 1910023 1832041 1651593
$$ packed form
42517a352546M09348L42140M32253M57684J635m86083k31610N80242J057990R14727
42507B125780O09638L64594l0735m90750n80988k61026J8803J6814p7208p8064
42497A616858P1367M65369R49424R12682P9518p32108n14175M02331O98311k1239
42487C928338o89889m05591L60977O27000J90121m54213q82553r16544m95678
42478A261968J36554M56767K62424l2245P585K47209K65896m4089m17805n46574
42468A597690l08421J19171L20580Q3405k43942j98645O8688K9074l08053l90395
42458G69152j16797n3898l87665m63647J26860P07173M44762l76305p53803l57972
42448d62140J72141K20969r3792k34227J06685O97679R53301N49407p7982j80448
$$ plain form
42438 1651593 1905488 2334707 2318499 1964710 2074581 2925387 3773401 3856459 3307144 2698868
42428 2698868 2217242 1772670 1522679 1715975 2247641 2849276 3510543 4244147 4670790
42419 4670790 4439782 3966337 4105374 5001243 5830490 5883261 5404492 5093114 5224066 5660929
42409 5660929 6367263 7339726 8158082 8203963 7512770 6995341 7477245 8684569 9493084
42400 9493084 9170585 8140199 7462907 7759900 8771095 9829064 10525292 10870946 11017460
42391 11017460 11057646 11120030 11453923 12231274 13300092 14300905 15036452 15542867 15761591
42382 15761591 15437006 14577774 13788808 13744585 14376073 14966556 15078895 14953903 14850096
42373 14850096 14478428 13491465 12237130 11531088 11702389 12192232 12137637 11192297 9826093
$$ packed form
42438A651593K53895M29219j6208l53789J09871Q50806Q48014Q3058n49315o08276
42428B698868m81626m44572k49991J93296N31666O01635O61267P33604M26643
42419D670790k31008m73445J39037Q95869Q29247N2771m78769l11378J30952M36863
42409E660929P06334R72463Q18356M5881o91193n17429M81904J207324Q08515
42400I493084l22499j030386o77292K96993J011195J057969O96228L45654J46514
42391A1017460M0186O2384L33893P77351J068818J000813P35547N06415K18724
42382A5761591l24585q59232p88966m4223O31488N90483J12339j24992j03807
42373A4850096l71668r86963j254335p06042J71301M89843n4595r45340j366204
$$ plain form
42364 9826093 8934382 9003858 9526507 9465242 8482720 7389037 7072198 7365127 7464962 7136968
42354 7136968 6804632 6614510 6235471 5667048 5447252 5774861 6110907 6019820 5777217 5675630
42344 5675630 5314229 4238705 2928858 2453335 3236159 4664383 5821922 6176010 5676941
42335 5676941 4709272 3967744 3938657 4386714 4616623 4261857 3585652 3067727 2981899 3323171
42325 3323171 3823383 4042032 3746063 3222430 2962079 3055584 3167668 3054137 2768215 2379363
42315 2379363 1891429 1521582 1667160 2402332 3294068 3901442 4192929 4260740 3898434 2831965
42305 2831965 1305597 89764 -242401 107058 482129 633597 1015785 2040094 3217255
42296 3217255 3480047 2477916 1144639 667265 1182177 1874698 2134011 2123495 2312297
$$ packed form
42364I826093q91711O9476N22649o1265r82522j093683l16839K92929R9835l27994
42354G136968l32336j90122l79039n68423k19796L27609L36046r1087k42603j01587
42344E675630l61401j075524j309847m75523P82824J428224J157539L54088m99069
42335E676941r67669p41528k9087M48057K29909l54766o76205n17925q5828L41272
42325C323171N00212K18649k95969n23633k60351R3505J12084j13531k85922l88852
42315B379363m87934l69847J45578P35172Q91736O07374K91487O7811l62306j066469
42305B831965j526368j215833l32165L49459L75071J51468L82188J024309J177161
42296C217255K62792j002131j333277m77374N14912O92521K59313j0516J88802
$$ plain form
42287 2312297 2934821 3899220 4775812 4895956 3975748 2674306 1968639 1881517 1485490
42278 1485490 400519 -462325 -183395 759026 1137951 705841 440577 1090609 2212034
42269 2212034 2866616 2763532 2418302 2458492 2977361 3421463 3066796 1799161 417328
42260 417328 -89116 445585 1357340 2113069 2812737 3599541 4098618 3899656 3329982 3213032
42250 3213032 3849689 4656095 4937629 4693316 4435898 4462573 4639401 4822861 5099105 5465714
42240 5465714 5600631 5266580 4789554 4759656 5270043 5834665 6148408 6517254 7287603 8205620
42230 8205620 8721947 8692918 8356857 7795014 6937008 6061212 5726614 6061820 6592373 6966445
42220 6966445 7374557 7941897 8176005 7548579 6382313 5612900 5747482 6536102 7603225
$$ packed form
42287B312297O22524R64399Q76592J20144r20208j301442p05667q7122l96027
42278A485490j084971q62844K78930R42421L78925m32110k65264O50032J121425
42269B212034O54582j03084l45230M0190N18869M44102l54667j267635j381833
42260D17328n06444N34701R11755P55729O99668P86804M99077j98962n69674j16950
42250C213032O36657Q06406K81534k44313k57418K6675J76828J83460K76244L66609
42240E465714J34917l34051m77026k9898N10387N64622L13743L68846P70349R18017
42230H205620N16327k9029l36061n61843q58006q75796l34598L35206N30553L74072
42220F966445M08112N67340K34108o27426j166266p69413J34582P88620J067123
$$ plain form
42211 7603225 8800545 9805165 10013638 9305498 8529210 8641035 9459049 9806119 8965038
42202 8965038 7527845 6596299 6536065 6866342 7093844 7159085 7109008 6837693 6360313 6020911
42192 6020911 6149977 6662133 7185535 7449823 7373490 6953905 6341889 5907251 5913531 6143153
42182 6143153 6122105 5730321 5326863 5237280 5386670 5515860 5507103 5387558 5232247 5171535
42172 5171535 5281586 5364907 5070019 4354761 3611941 3225672 3246701 3578637 4100970 4429908
42162 4429908 4042356 3032467 2313729 2512051 2997560 2726694 1852172 1630830 2637348
42153 2637348 3917913 4285786 3777857 3326460 3504384 4168773 4992807 5742562 6181416
42144 6181416 6198609 5970661 5678064 5265996 4839170 4964817 5988489 7232336 7574110
$$ packed form
42211G603225J197320J004620K08473p08140p76288J11825Q18014L47070q41081
42202H965038j437193r31546o0234L30277K27502O5241n0077k71315m77380l39402
42192F020911J29066N12156N23402K64288p6333m19585o12016m34638O280K29622
42182F143153k1048l91784m03458q9583J49390J29190q757j19545j55311o0712
42172E171535J10051Q3321k94888p15258p42820l86269K1029L31936N22333L28938
42162D429908l87552j009889p18738J98322M85509k70866q74522k21342J006518
42153B637348J280565L67873n07929m51397J77924O64389Q24034P49755M38854
42144F181416J7193k27948k92597m12068m26826J25647J023672J243847L41774
$$ plain form
42135 7574110 6848372 6017653 5823681 5926927 5681247 5180632 5060180 5594292 6423693
42126 6423693 6977676 6856239 6032765 5027328 4686055 5406805 6655056 7518083 7635833
42117 7635833 7340705 7044834 6836876 6618427 6305756 5869588 5394999 5097453 5126718 5445137
42107 5445137 6053391 7130300 8656014 10075119 10722957 10505985 9798768 8793997 7453388
42098 7453388 6079374 5338083 5498983 6095358 6561751 6794887 6850471 6573582 5971163
42089 5971163 5602628 6052084 7133000 8072907 8428319 8387202 8180574 7691528 6861321
42080 6861321 6135208 6144545 6990181 8062104 8630713 8524526 8147494 7867743 7546576 6796917
42070 6796917 5609334 4494306 3980137 4168097 4813422 5590241 6161087 6236429 5786271
$$ packed form
42135G574110p25738q30719j93972J03246k45680n00615j20452N34112Q29401
42126F423693N53983j21437q23474j005437l41273P20750J248251Q63027J17750
42117G635833k95128k95871k07958k18449l12671m36168m74589k97546K9265L18419
42107E445137O08254J076909J525714J419105O47838k16972p07217j004771j340609
42098G453388j374014p41291J60900N96375M66393K33136N5584k76889o02419
42089E971163l68535M49456J080916R39907L55412m1117k06628m89046q30207
42080F861321p26113R337Q45636J071923N68609j06187l77032k79751l21167p49659
42070F796917j187583j115028n14169J87960O45325P76819N70846P5342m50158
$$ plain form
42061 5786271 5086126 4447054 4046469 4061416 4661761 5696570 6664486 7200596 7333955
42052 7333955 7122011 6473951 5642088 5357272 5891007 6384842 5861680 4684660 4198432
42043 4198432 4979745 6269081 7183674 7601021 7620791 7094969 6210540 5775044 6264052
42034 6264052 7120468 7592844 7742293 7974410 8123945 7862892 7640003 8222440 9401198
42025 9401198 10091408 9803240 9162489 8790531 8499272 7937403 7276738 6744540 6071385
42016 6071385 5025571 4106370 4059946 4876622 5812494 6330886 6546622 6747731 6931733
42007 6931733 6950281 6809596 6656748 6610751 6694961 6842852 6949787 7017401 7235560 7791627
41997 7791627 8583889 9251371 9543726 9578671 9660184 9874468 9958863 9642418 9076901 8760718
$$ packed form
42061E786271p00145o39072m00585J4947O00345J034809R67916N36110J33359
42052G333955k11944o48060q31863k84816N33735M93835n23162j177020m86228
42043D198432P81313J289336R14593M17347J9770n25822q84429m35496M89008
42034F264052Q56416M72376J49449K32117J49535k61053k22889N82437J178758
42025I401198O90210k88168o40751l71958k91259n61869o60665n32198o73155
42016F071385j045814r19201m6424Q16676R35872N18392K15736K01109J84002
42007F931733J8548j40685j52848m5997Q4210J47891J06935O7614K18159N56067
41997G791627P92262O67482K92355L4945Q1513K14284Q4395l16445n65517l16183
$$ plain form
41987 8760718 8930699 9196890 9025894 8499924 8259378 8659325 9350802 9843794 10102548
41978 10102548 10295264 10296994 9890257 9270957 8854517 8622441 8151498 7343605 6625880 6256860
41968 6256860 5934224 5416277 5085159 5385564 5993424 6167876 5850903 5752576 6201455 6561634
41958 6561634 6196439 5503298 5375061 5887609 6220464 5897390 5439108 5521578 6017633 6305611
41948 6305611 6193818 6041307 6097945 6198958 6150597 6056911 6136908 6420570 6712960 6750073
41938 6750073 6405294 5857648 5464773 5303794 4991355 4239795 3454669 3376672 4151992 5176985
41928 5176985 5907587 6376598 6798287 7157665 7450359 7880988 8457847 8756819 8517335
41919 8517335 8188585 8403756 9093048 9604046 9598342 9337420 9108205 8876855 8618631 8542500
$$ packed form
41987H760718J69981K66191j70996n25970k40546L99947O91477M92992K58754
41978A0102548J92716J730m06737o19300m16440k32076m70943q07893p17725l69020
41968F256860l22636n17947l31118L00405O07860J74452l16973r8327M48879L60179
41958F561634l65195o93141j28237N12548L32855l23074m58282Q2470M96055K87978
41948F305611j11793j52511N6638J01013m8361r3686P9997K83662K92390L7113
41938F750073l44779n47646l92875j60979l12439p51560p85126p7997P75320J024993
41928E176985P30602M69011M21689L59378K92694M30629N76859K98972k39484
41919H517335l28750K15171O89292N10998n704k60922k29215k31350k58224p6131
$$ plain form
41909 8542500 8768454 9085289 9246008 9296400 9428102 9666624 9881848 10021625 10199760 10564998
41899 10564998 11120279 11674408 12037417 12288045 12677976 13164782 13306718 12915571 12590404
41890 12590404 13150912 14612910 16194520 17327057 18103681 18592858 18345554 17059284 15357669
41881 15357669 14335110 14378117 14834269 14868349 14334473 13707810 13381666 13251681 13018256
41872 13018256 12731654 12753657 13079414 13050040 12153904 10907275 10333020 10550347 10552754 9602777
41862 9602777 8164000 7027915 6171873 5156794 4171405 3826304 4113109 4401846 4441199
41853 4441199 4565289 4828553 4756600 4238752 3937189 4373441 5186030 5767804 6122482 6525324
41843 6525324 6777485 6510908 5997870 5903096 6239422 6246920 5445376 4223169 3166736 2351207
$$ packed form
41909H542500K25954L16835J60719N0392J31702K38522K15224J39777J78135L65238
41899A0564998N55281N54129L63009K50628L89931M86806J41936l91147l25167
41890A2590404N60508J461998J581610J132537P76624M89177k47304j286270j701615
41881A5357669j022559M3007M56152L4080n33876o26663l26144j29985k33425
41872A3018256k86602K2003L25757k9374q96136j246629n74255K17327K407r49977
41862I602777j438777j136085q56042j015079r85389l45101K86805K88737L9353
41853D441199J24090K63264p1953n17848l01563M36252Q12589N81774L54678M02842
41843F525324K52161k66577n13038r4774L36326P498q01544j222207j056433q15529
$$ plain form
41833 2351207 1639711 1223741 1375824 1926132 2464953 2914914 3437290 3874455 3826630 3325430
41823 3325430 2890445 2747636 2522939 2008368 1694880 2032644 2574866 2522390 1882669 1349313
41813 1349313 1128980 739060 99552 -79169 560296 1259892 1173699 591926 417643 848639
41803 848639 1361855 1698062 2001408 2146649 1849183 1456321 1701303 2484237 2789993 2159159
41793 2159159 1411924 1443377 2067196 2643560 3125596 3680572 3826618 2927610 1340696
41784 1340696 188725 4213 313462 547605 641126 658228 541468 426207 582914 818412
41774 818412 526578 -371619 -1093220 -971623 -293569 247751 481853 635976 667303 381140
41764 381140 65289 353463 1378244 2547456 3290847 3633882 3883697 4120771 4258388
$$ packed form
41833B351207p11496m15970J52083N50308N38821M49961N22376M37165m7825n01200
41823C325430m34985j42809k24697n14571l13488L37764N42222n2476o39721n33356
41813A349313k20333l89920o39508j78721O39465O99596q6193n81773j74283M30996
41803H48639N13216L36207L03346J45241k97466l92862K44982P82934L05756o30834
41793B159159p47235L1453O23819N76364M82036N54976J46046q99008j586914
41784A340696j151971j84512L09249K34143R3521J7102j16760j15261J56707K35498
41774H18412k91834q98197p21601J21597O78054N41320K34102J54123L1327k86163
41764C81140l15851K88174J024781J169212P43391L43035K49815K37074J37617
$$ plain form
41755 4258388 4356324 4568980 4851867 4939322 4633742 4020629 3395225 3020007 2933917 2972841
41745 2972841 2982577 2968376 2973683 2888657 2543793 1989345 1502329 1273761 1263158 1407352 1726760
41734 1726760 2081622 2095876 1628447 1148298 1246978 1825101 2200279 2103365 2086124 2646822
41724 2646822 3346903 3271801 2185794 749964 -327103 -832743 -709397 207926 1742011
41715 1742011 3062140 3334231 2599325 1663437 1176843 1128478 1189467 1172910 1049952 803568
41705 803568 455272 95808 -235666 -587722 -912191 -967332 -550491 223033 993205 1495073
41695 1495073 1742519 1888267 2006725 2071113 2085350 2132704 2259227 2379030 2361651 2168486
41685 2168486 1836845 1407968 1001669 883569 1231643 1830973 2239464 2296655 2198230 2011217
$$ packed form
41755D258388R7936K12656K82887Q7455l05580o13113o25404l75218q6090L8924
41745B972841R736j4201N307q5026l44864n54448m87016k28568j0603J44194L19408
41734A726760L54862J4254m67429m80149R8680N78123L75178r6914j7241N60698
41724B646822P00081p5102j086007j435830j077067n05640J23346R17323J534085
41715A742011J320129K72091p34906r35888m86594m8365O0989j6557j22958k46384
41705H03568l48296l59464l31474l52056l24469n5141M16841P73524P70172N01868
41695A495073K47446J45748J18458O4388J4237M7354J26523J19803j7379j93165
41685B168486l31641m28877m06299j18100L48074N99330M08491N7191r8425j87013
$$ plain form
41675 2011217 1511218 728453 247991 525225 1149808 1296599 803677 306355 326310 728149
41665 728149 1134731 1385793 1443971 1307048 1213543 1510318 2075116 2276060 1803335 1178619
41655 1178619 1104027 1632159 2337724 2970052 3467735 3597006 3152465 2426457 1939701 1696732
41645 1696732 1213558 378248 -194136 108629 1139492 2194008 2745857 2803390 2733558
41636 2733558 2910024 3377252 3694437 3241387 1856102 111313 -1155743 -1536317 -1220731
41627 -1220731 -618212 21550 640997 1205440 1612036 1759789 1657070 1423884 1203477
41618 1203477 1109151 1216959 1496425 1737338 1690061 1356218 1027750 958760 1107739 1266609
41608 1266609 1293455 1137705 834492 610659 781887 1351119 1912596 2174139 2348070 2742456
$$ packed form
41675B011217m99999p82765m80462K77234O24583J46791m92922m97322J9955M01839
41665G28149M06582K51062N8178j36923r3505K96775N64798K00944m72725o24716
41655A178619p4592N28132P05565O32328M97683J29271m44541p26008m86756k42969
41645A696732m83174q35310n72384L02765J030863J054516N51849N7533o9832
41636B733558J76466M67228L17185m53050j385285j744789j267056l80574L15586
41627a220731O02519O39762O19447N64443M06596J47753j02719k33186k20407
41618A203477r4326J07808K79466K40913m7277l33843l28468o8990J48979J58870
41608A266609K6846j55750l03213k23833J71228N69232N61477K61543J73931L94386
$$ plain form
41598 2742456 3199103 3306284 2975611 2394967 1608185 669384 68396 326209 1125166
41589 1125166 1528702 1245951 984384 1218836 1324978 544966 -703625 -1262532 -766376
41580 -766376 3631 308873 310596 491872 748453 540170 -189343 -687057 -200778 1032705
41570 1032705 1921606 1756019 1023722 674969 816123 710977 66228 -399766 10025
41561 10025 973116 1681153 1907713 1944419 1819614 1298937 540077 61359 11439 22621
41551 22621 -145993 -328942 -395832 -466580 -548296 -425350 -95085 101789 -15620 -211603
41541 -211603 -278919 -371488 -662909 -1016285 -1250589 -1420754 -1552301 -1393919 -775413 1203
41531 1203 472586 576228 589996 629588 552070 344292 290876 641128 1268114 1772210 1896416
$$ packed form
41598B742456M56647J07181l30673n80644p86782r38801o00988K57813P98957
41589A125166M03536k82751k61567K34452J06142p80012j248591n58907M96156
41580g66376P70007L05242J723J81276K56581k08283p29513m97714M86279J233483
41570A032705Q88901j65587p32297l48753J41154j05146o44749m65994M09791
41561A0025R63091P08037K26560L6706j24805n20677p58860m78718m9920J1182
41551B2621j68614j82949o6890p0748q1716J22946L30265J96874j17409j95983
41541b11603o7316r2569k91421l53376k34304j70165j31547J58382O18506P76616
41531A203M71383J03642J3768L9592p7518k07778n3416L50252O26986N04096J24206
$$ plain form
41520 1896416 1799430 1871015 2222510 2438652 2016435 1045633 229052 150219 711490 1375575
41510 1375575 1748092 1792916 1673277 1568132 1538869 1446202 1090312 512524 41420 -26499
41500 -26499 316001 842344 1230511 1191628 747711 375043 504720 839673 633003 -204216
41490 -204216 -810044 -515889 217750 493118 198000 -51110 101381 488077 1014022 1817415
41480 1817415 2774922 3444503 3656299 3681508 3679914 3470718 3057144 2901740 3337969 4025319
41470 4025319 4332726 4072488 3574336 3174068 2880695 2485393 1842257 1099300 713238
41461 713238 1088835 2110690 3174539 3756439 3789411 3443211 2822360 2058643 1439670
41452 1439670 1159119 1086527 1063755 1308145 2154024 3356656 4007629 3388773 1784883
$$ packed form
41520A896416r6986P1585L51495K16142m22217r70802q16581p8833N61271O64085
41510A375575L72517M4824j19639j05145k9263r2667l55890n77788m71104o7919
41500b6499L42500N26343L88167l8883m43917l72668J29677L34953k06670q37219
41490b04216o05828K94155P33639K75368k95118k49110J52491L86696N25945Q03393
41480A817415R57507O69581K11796K5209j594k09196m13574j55404M36229O87350
41470D025319L07407k60238m98152m00268k93373l95302o43136p42957l86062
41461G13238L75597J021855J063849N81900L2972l46200o20851p63717o18973
41452A439670k80551p2592k2772K44390Q45879J202632O50973o18856j603890
$$ plain form
41443 1784883 239929 -462977 -417669 -230120 -304791 -645244 -1151347 -1784458 -2427833 -2856786
41433 -2856786 -2941587 -2692489 -2075216 -1062636 35261 620994 395193 -360307 -1217457
41424 -1217457 -1921039 -2059326 -1022104 1101542 3008837 3383015 2463965 1648229 1607248
41415 1607248 1697024 1333567 947634 1114829 1574780 1779630 1820602 2096277 2478884 2531351
41405 2531351 2283742 2097318 1916462 1349110 482421 -11126 269125 923343 1226473
41396 1226473 849933 73273 -442001 -95673 1106944 2390398 2844855 2296761 1392136
41387 1392136 858649 879098 1109492 1048716 416097 -590104 -1401236 -1612898 -1357873 -1003458
41377 -1003458 -641515 -132251 480607 905780 911825 495035 -136498 -550227 -295483 561806
$$ packed form
41443A784883j544954p02906M5308J87549p4671l40453n06103o33111o43375m28953
41433b856786q4801K49098O17273J012580J097897N85733k25801p55500q57150
41424a217457p03582j38287J037222K123646J907295L74178r19050q15736m0981
41415A607248Q9776l63457l85933J67195M59951K04850M0972K75675L82607N2467
41405B531351k47609j86424j80856n67352q66689m93547K80251O54218L03130
41396A226473l76540p76660n15274L46328J202617J283454M54457n48094r04625
41387A392136n33487K0449K30394o0776o32619j006201q11132k11662K55025L54415
41377a003458L61943N09264O12858M25173O045m16790o31533m13729K54744Q57289
$$ plain form
41367 561806 1320529 1399824 969647 454339 -211933 -1197613 -1946784 -1633908 -445798 480737
41357 480737 605610 627806 1229462 1997682 2180898 1863274 1646017 1574900 1166492 342240
41347 342240 -359991 -542480 -403020 -333648 -405382 -338251 208288 1292598 2488427 3151425
41337 3151425 3067516 2661831 2379131 2153960 1833720 1811069 2655584 4188552 5498454
41328 5498454 5980427 5875305 5604086 5064535 3998673 2776920 2268139 2805681 3601876
41319 3601876 3486428 2204826 740183 204915 596245 944342 627530 113937 232308
41310 232308 1095757 2090208 2662549 2700609 2301819 1672838 1257923 1452976 2006204 2116935
41300 2116935 1433708 666402 816528 1909910 2895827 2890873 2208279 1912514 2511682 3424904
$$ packed form
41367E61806P58723P9295m30177n15308o66272r85680p49171L12876J188110R26535
41357D80737J24873K2196O01656P68220J83216l17624k17257p1117m08408q24252
41347C42240p02231j82489J39460O9372p1734O7131N46539J084310J195829O62998
41337C151425q3909m05685k82700k25171l20240k2651Q44515J532968J309902
41328E498454M81973j05122k71219n39551j065862j221753n08781N37542P96195
41319C601876j15448j281602j464643n35268L91330L48097l16812n13593J18371
41310B32308Q63449R94451N72341L8060l98790o28981m14915J95053N53228J10731
41300B116935o83227p67306J50126J093382R85917m954o82594k95765N99168R13222
$$ plain form
41290 3424904 3807048 3598758 3487597 3954159 4689372 5011137 4591636 3641631 2581467
41281 2581467 1715898 1130719 754367 535210 555332 840495 1094325 920112 416442 226334
41271 226334 731386 1440006 1515155 772160 -196502 -816386 -1062116 -1137199 -1001614 -491584
41261 -491584 235496 683015 561098 210154 247782 761983 1141247 927968 550484 744219
41251 744219 1398004 1612219 979061 127991 -271825 -375161 -564310 -616639 -147225 557783
41241 557783 905380 915700 1032799 1231683 1123025 843437 971618 1486475 1648047 1134339
41231 1134339 537918 417407 533511 427715 193875 223689 597134 1117649 1625516 1980812
41221 1980812 2064076 2021318 2135946 2274775 1940038 1111567 491232 554188 878333 842673
$$ packed form
41290C424904L82144k08290j11161M66562P35213L21765m19501r50005j060164
41281B581467q65569n85179l76352k19157K0122K85163K53830j74213n03670j90108
41271B26334N05052P08620P5149p42995r68662o19884k45730p5083J35585N10030
41261d91584P27080M47519j21917l50944L7628N14201L79264k13279l77484J93735
41251G44219O53785K14215o33158q51070l99816j03336j89149n2329M69414P05008
41241E57783L47597J0320J17099J98884j08658k79588J28181N14857J61572n13708
41231A134339n96421j20511J16104j05796k33840K9814L73445N20515N07867L55296
41221A980812Q3264m2758J14628J38829l34737q28471o20335O2956L24145l5660
$$ plain form
41211 842673 502179 287706 292946 389753 633623 981795 987483 388578 -323236 -529562
41201 -529562 -343881 -194728 53248 717943 1337901 1118506 290607 -22189 549504 1127339
41191 1127339 1078445 998429 1583482 2340486 2255428 1254204 179567 -397520 -561196 -395321
41181 -395321 247342 1204810 1896579 2046583 2078366 2479712 3088192 3359262 3156300 2872627
41171 2872627 2772176 2604162 2101248 1604724 1782350 2700438 3566347 3630811 3076749 2668843
41161 2668843 2689188 2681169 2281599 1843909 1970471 2690474 3399311 3514575 2980073 2184661
41151 2184661 1571439 1324649 1318749 1345457 1401104 1690152 2329074 3157138 3897152 4393242
41141 4393242 4618078 4572049 4296429 3890863 3388253 2712737 1944133 1537439 1966131 3036004
$$ packed form
41211H42673l40494k14473N240R6807K43870L48172N688n98905p11814k06326
41201e29562J85681J49153K47976O64695O19958k19395q27899l12796N71693N77835
41191A127339m8894q0016N85053P57004q5058j001224j074637n77087j63676J65875
41181c95321O42663R57468O91769J50004L1783M01346O08480K71070k02962k83673
41171B872627j00451j68014n02914m96524J77626R18088Q65909O4464n54062m07906
41161B668843K0345q019l99570m37690J26562P20003P08837J15264n34502p95412
41151B184661o13222k46790n900K6708N5647K89048O38922Q28064P40014M96090
41141D393242K24836m6029k75620m05566n02610o75516p68604m06694M28692J069873
$$ plain form
41131 3036004 3820401 3548594 2446683 1410036 907286 613469 212519 39991 510472
41122 510472 1290478 1690585 1745328 2165238 3112066 3792665 3650273 3281815 3562104 4343899
41112 4343899 4758704 4520669 4150774 4009124 3911061 3831527 4259723 5494066 7059811
41103 7059811 8208808 8732097 8989042 9299481 9526850 9229698 8223162 7058804 6736399
41094 6736399 7636017 8931296 9508679 9305653 9141404 9319951 9237127 8602925 8225281
41085 8225281 8996869 10627891 12029233 12677703 13023242 13667968 14648768 15567877 16104254
41076 16104254 16301382 16462549 16785879 17154475 17401750 17610121 17802674 17517701 16293466
41067 16293466 14561851 13328040 12809335 12209171 11166001 10503054 10901736 11671884 11743830
$$ packed form
41131C036004P84397k71807j101911j036647n02750k93817m00950j72528M70481
41122E10472P80006M00107N4743M19910R46828O80599j42392l68458K80289P81795
41112D343899M14805k38035l69895j41650r8063p9534M28196J234343J565745
41103G059811J148997N23289K56945L10439K27369k97152j006536j164358l22405
41094F736399Q99618J295279N77383k03026j64249J78547q2824o34202l77644
41085H225281P71588J631022J401342O48470L45539O44726R80800R19109N36377
41076A6104254J97128J61167L23330L68596K47275K08371J92553k84973j224235
41067A6293466j731615j233811n18705o00164j043170o62947L98682P70148P1946
$$ plain form
41058 11743830 11252039 11109546 11471649 11765683 11992816 12753361 13910313 14405550 13767658
41049 13767658 12873716 12762770 13413828 14123515 14457387 14375519 13947941 13415170 13144536
$$ packed form
41058A1743830m91791j42493L62103K94034K27133P60545J156952M95237o37892
41049A3767658q93942j10946O51058P09687L33872q1868m27578n32771k70634
$$ [...]
##END NTUPLES=NMR SPECTRUM
##END=
