##TITLE=31Pdec_DE-118rm_3h
, 64 sc
 21.10.2025
##JCAMPDX= 6.0         $$ Bruker NMR JCAMP-DX V2.0
##DATA TYPE= NMR SPECTRUM
##DATA CLASS= NTUPLES
##ORIGIN= UXNMR, Bruker Analytische Messtechnik GmbH
##OWNER= root
$$ XWIN-NMR		Version 3.5
$$ Tue Oct 21 14:15:38 2025 Russian Standard Time (UT+4h)  she@DPX200
##.OBSERVE FREQUENCY= 81.013821
##.OBSERVE NUCLEUS= ^31P
##.ACQUISITION MODE= SIMULTANEOUS
##.ACQUISITION SCHEME= undefined
##.AVERAGES= 64
##.DIGITISER RES= 17
##SPECTROMETER/DATA SYSTEM= spect
##.PULSE SEQUENCE= zgpg30
##.SOLVENT NAME= DMSO
##.SHIFT REFERENCE= (INTERNAL, DMSO, 0, 198.062)
##AUDIT TRAIL= $$ (NUMBER, WHEN, WHO, WHERE, WHAT)
$$ ##TITLE= Audit trail, XWIN-NMR		Version 3.5
$$ ##JCAMPDX= 5.01
$$ ##ORIGIN= Bruker BioSpin GmbH
$$ ##OWNER= she
$$ F:/spectra/data/she/nmr/P31/2/pdata/1/auditp.txt
$$ ##AUDIT TRAIL=  $$ (NUMBER, WHEN, WHO, WHERE, WHAT)
(   1,<2025-10-21 14:14:00.89 +0400>,<she>,<DPX200>,
      <created by zg, POWCHK disabled, PULCHK disabled
       configuration hash MD5:
       00 E9 B6 7A A2 85 ED C7 34 08 36 98 17 FE 4E 26
       data hash MD5: 32K
       84 FE 24 97 4D 4D FC C6 EC 36 35 8B A7 4D FE 64>)
(   2,<2025-10-21 14:14:30.09 +0400>,<she>,<DPX200>,
      <Start of raw data processing
       efp BC_mod = 2 LB = 1.5 FT_mod = 6 PKNL = 1 PHC0 = 1447.976 PHC1 = -93.69972 SI = 64K 
       data hash MD5: 64K
       E0 62 03 F1 5B 27 7A 0B 75 52 60 26 94 95 BE B3>)
(   3,<2025-10-21 14:15:00.04 +0400>,<she>,<DPX200>,
      <pk PHC0 = -51.07635 PHC1 = 151.8001 
       data hash MD5: 64K
       66 D5 27 50 73 D0 F5 81 08 1A 01 3F F7 F0 F8 2A>)
(   4,<2025-10-21 14:15:09.98 +0400>,<she>,<DPX200>,
      <abs ABSG = 5 
       data hash MD5: 64K
       87 D2 11 8A B4 56 6B E1 29 32 65 2C 38 F3 10 EB>)
$$ ##END=
$$ 
$$ hash MD5
$$ 6E A7 B6 EE 48 4E 24 3E 9F 9B DC 2F DB 4B 7E 1E
##$RELAX= 
##$RELAX= 
##$RELAX= 
##$RELAX= 
##$RELAX= 
##$RELAX= 
##$RELAX= 
##$RELAX= 
$$ Bruker specific parameters
$$ --------------------------
##$DU= <F:/spectra>
##$EXPNO= 2
##$NAME= <P31>
##$PROCNO= 1
##$TYPE= <nmr>
##$USER= <she>
##$AMP= (0..31)
100 100 100 100 100 100 100 100 100 100 100 100 100 100 100 100 100 100 
100 100 100 100 100 100 100 100 100 100 100 100 100 100 
##$AQSEQ= 0
##$AQ_mod= 1
##$AUNM= <au_zg>
##$AUTOPOS= <>
##$BF1= 81.014009
##$BF2= 200.13
##$BF3= 200.13
##$BF4= 200.13
##$BF5= 200.13
##$BF6= 200.13
##$BF7= 200.13
##$BF8= 200.13
##$BYTORDA= 1
##$CFDGTYP= 0
##$CFRGTYP= 5
##$CHEMSTR= <none>
##$CNST= (0..31)
1 1 145 1 1 1 1 1 1 1 1 1 1 1 1 1 1 1 1 1 1 1 1 1 1 1 1 1 1 1 1 1 
##$CPDPRG= <waltz16>
##$CPDPRG1= <>
##$CPDPRG2= <waltz16>
##$CPDPRG3= <>
##$CPDPRG4= <mlev>
##$CPDPRG5= <mlev>
##$CPDPRG6= <mlev>
##$CPDPRG7= <mlev>
##$CPDPRG8= <mlev>
##$CPDPRGB= <>
##$CPDPRGT= <>
##$D= (0..31)
0 1 0 0 0 0 0 0 0 0.06 0 0.03 2e-05 3e-06 0 0 0.0002 0 0 0 0 0 0 0 0 0 
0 0 0 0 0 0 
##$DATE= 1761041640
##$DBL= (0..7)
120 120 120 11 120 120 24 19 
##$DBP= (0..7)
150 150 150 150 150 150 150 150 
##$DBP07= 0
##$DBPNAM0= <>
##$DBPNAM1= <>
$$ [...]
##$SUBNAM3= <"">
##$SUBNAM4= <"">
##$SUBNAM5= <"">
##$SUBNAM6= <"">
##$SUBNAM7= <"">
##$SUBNAM8= <"">
##$SUBNAM9= <"">
##$SW= 400.765351723535
##$SWIBOX= (0..15)
0 1 3 0 0 0 0 0 0 0 0 0 0 0 0 0 
##$SW_h= 32467.5324675325
##$TD= 32768
##$TD0= 1
##$TE= 0
##$TE2= 300
##$TE3= 300
##$TEG= 300
##$TL= (0..7)
0 120 53 12 22 120 120 120 
##$TP= (0..7)
150 150 150 150 150 150 150 150 
##$TP07= 0
##$TPNAME0= <>
##$TPNAME1= <>
##$TPNAME2= <>
##$TPNAME3= <>
##$TPNAME4= <>
##$TPNAME5= <>
##$TPNAME6= <>
##$TPNAME7= <>
##$TPOAL= (0..7)
0.5 0.5 0.5 0.5 0.5 0.5 0.5 0.5 
##$TPOFFS= (0..7)
0 0 0 0 0 0 0 0 
##$TUNHIN= 0
##$TUNHOUT= 0
##$TUNXOUT= 0
##$USERA1= <user>
##$USERA2= <user>
##$USERA3= <user>
##$USERA4= <user>
##$USERA5= <user>
##$V9= 5
##$VALIST= <valist>
##$VCLIST= <CCCCCCCCCCCCCCC>
##$VD= 0
##$VDLIST= <DDDDDDDDDDDDDDD>
##$VPLIST= <PPPPPPPPPPPPPPP>
##$VTLIST= <TTTTTTTTTTTTTTT>
##$WBST= 1024
##$WBSW= 4
##$XGAIN= (0..3)
0 0 0 0 
##$XL= 0
##$YL= 0
##$YMAX_a= 49588
##$YMIN_a= -53145
##$ZGOPTNS= <>
##$ZL1= 120
##$ZL2= 120
##$ZL3= 120
##$ZL4= 120
##$ABSF1= 198.0616
##$ABSF2= -202.7028
##$ABSG= 5
##$ABSL= 3
##$ALPHA= 0
##$AQORDER= 0
##$ASSFAC= 0
##$ASSFACI= 0
##$ASSFACX= 0
##$ASSWID= 0
##$AUNMP= <proc_1d>
##$AZFE= 0.1
##$AZFW= 0.5
##$BCFW= 0
##$BC_mod= 2
##$BYTORDP= 0
##$COROFFS= 0
##$CY= -3
##$DATMOD= 1
##$DC= 0
##$DFILT= <>
##$DTYPP= 0
##$F1P= 0
##$F2P= 0
##$FCOR= 1
##$FTSIZE= 65536
##$FT_mod= 6
##$GAMMA= 0
##$GB= 0
##$INTBC= 1
##$INTSCL= 9.790993e-09
##$ISEN= 30
##$LB= 1.5
##$LEV0= 0
##$LPBIN= 0
##$MAXI= 10000
##$MC2= 0
##$MEAN= 0
##$ME_mod= 0
##$MI= 50
##$NCOEF= 0
##$NC_proc= -5
##$NLEV= 6
##$NOISF1= 182.463
##$NOISF2= 159.3651
##$NSP= 0
##$NTH_PI= 0
##$NZP= 0
##$OFFSET= 198.0616
##$PC= 4
##$PHC0= 1396.9
##$PHC1= 58.10037
##$PH_mod= 1
##$PKNL= yes
##$PPARMOD= 0
##$PSCAL= 0
##$PSIGN= 0
##$REVERSE= no
##$SF= 81.0140089999434
##$SI= 65536
##$SIGF1= 159.3651
##$SIGF2= -187.1042
##$SINO= 113.3802
##$SIOLD= 16384
##$SREGLST= <1H.CDCl3>
##$SSB= 0
##$STSI= 65536
##$STSR= 0
##$SW_p= 32467.5324675325
##$SYMM= 0
##$S_DEV= 0
##$TDeff= 32768
##$TDoff= 0
##$TI= <>
##$TILT= no
##$TM1= 0
##$TM2= 0
##$TOPLEV= 0
##$USERP1= <user>
##$USERP2= <user>
##$USERP3= <user>
##$USERP4= <user>
##$USERP5= <user>
##$WDW= 1
##$XDIM= 65536
##$YMAX_p= 370248782
##$YMIN_p= -40842952
$$ End of Bruker specific parameters
$$ ---------------------------------
##NTUPLES= NMR SPECTRUM
##VAR_NAME=  FREQUENCY,     SPECTRUM/REAL,   SPECTRUM/IMAG
##SYMBOL=    X,             R,               I
##VAR_TYPE=  INDEPENDENT,   DEPENDENT,       DEPENDENT
##VAR_FORM=  AFFN,          ASDF,            ASDF
##VAR_DIM=   65536,         65536,           65536
##UNITS=     HZ,            ARBITRARY UNITS, ARBITRARY UNITS
##FACTOR=    0.49542278885378, 1,            1
##FIRST=     16045.7642231865, 0,            0
##LAST=      -16421.768244346, 0,            0
##MIN=       -16421.768244346, -40842952,    0
##MAX=       16045.7642231865, 370248782,    0
$$ Real data points
##PAGE= N=1
##DATA TABLE= (X++(R..R)), XYDATA
$$ [...]
46774C08381k19500j21182j96817m03808l50274O1469M06907L52439J17712O2193
46764A7520J44986J23277J4608j3125j1140j12093j61024Q8225M51665M27009
46754I69908q6254n45107m25438J18273M67303K83162j63614l87425k46570j1246
46744b7008O7189O8542J64828K38331M1813k95534l20811M7201K75399l8510n18152
46733b96712n22360p3776K21472Q4390j26254o1271J41613K02284J40427J29039
46723a61148J57688Q6314r7440k48615k23397j378K54367K60602r3825n15142
46713e81974n75759k39851J19503K50816K65192K69885J38371j34375k00149J56600
46703e31741N37986L76270k31870n86774l40510L0300p3099n05420n69474K0873
$$ y = [308381, 88881, -32301, -229118, -632926, -983200, -921731, -514824, -162385, -44673, 17520, 162506, 285783, 300391, 287266, 276126, 164033, 3009, 91234, 542899, 969908, 883654, 338547, -86891, 31382, 498685, 781847, 618233, 230808, -15762, -27008, 40181, 108723, 273551, 511882, 553695, 258161, -62650, -15449, 259950, 221440, -296712, -819072, -892848, -671376, -586986, -713240, -774511, -632898, -430614, -290187, -161148, -3460, 82854, -14586, -263201, -486598, -487976, -233609, 26993, -66832, -581974, -1157733, -1397584, -1278081, -1027265, -762073, -492188, -353817, -488192, -688341, -531741, 6245, 382515, 150645, -436129, -776639, -746339, -819438, -1324858, -1894332, -1873459]
46693a873459P30446Q68964M22039j4523k7747J71704J61756r9913l07818k86696
46683b55247j68496j07927o6408M6527J89421K46132J70624J6613j03373q3301
46673a15435M7592P8292j44292m26858l87226K8901L91698K89423j54731m30406
46663h23042k33810K21918M67647K67413j51199l42535j35577J80855K46860Q8800
46653b12670j0355P510m5038j43771J4818M66458P45633M79956p1338l91338l80088
46642D59777k99391k41773q5297J07688R0486j32126k46040j00237P9171O8721
46632b99021k8279J0634J93962L34851K73181k420l29942m40771k15065J03448
46622c99422J42547j12721k95376j81597J6135R819j51783k17533r1867J35952
$$ y = [-1873459, -1143013, -274049, 147990, 133467, 105720, 277424, 439180, 339267, 31449, -255247, -423743, -531670, -598078, -551551, -362130, -115998, 54626, 71239, -32134, -115435, -67843, 10449, -133843, -560701, -947927, -919026, -527328, -237905, -392636, -823042, -1056852, -834934, -367287, -99874, -251073, -593608, -729185, -548330, -301470, -212670, -223025, -215515, -260553, -404324, -389506, 76952, 822585, 1302541, 1231203, 839865, 459777, 160386, -81387, -166684, -58996, 31490, -100636, -346676, -446913, -367742, -299021, -327300, -316666, -122704, 212147, 485328, 482908, 152966, -287805, -502870, -399422, -256875, -369596, -664972, -846569, -830434, -820615, -972398, -1189931, -1281798, -1145846]
46612a145846L62311M74081L33966j5516k51731j18292J97744K67910l4937m10708
46602c41018n26460l30654J2267K88755L27992J35169l5629O4537L22508L70182
46592B87649R8969j67523j23944J15779K33821J46219K3937m694K9993N5448K3662
46581G19316p9401j56259l3460K56025L59010L0276m17283m32682n836K53716
46571D93422l8809m73543m05857J51018N54549L75597j28758m33912l68650j73503
46561d48446r0965q6742O44J44689J14912j54747l30294o0207M38475N30451L1527
46550H9297m46605l17381J54126L00914P7253J6033K36474K07613l11505p56709
46540g50490n77033n0035K13439J77608K20640L47529K22388j10481j94921P3096
$$ y = [-1145846, -783535, -309454, 24512, 8996, -242735, -361027, -163283, 104627, 69690, -341018, -867478, -1198132, -1185865, -897110, -569118, -433949, -469578, -405041, -82533, 287649, 386618, 219095, 95151, 210930, 444751, 590970, 614907, 610213, 640206, 695654, 719316, 639915, 483656, 450196, 706221, 1065231, 1095507, 678224, 245542, 239706, 493422, 454613, -18930, -424787, -273769, 280780, 656377, 527619, 93707, -274943, -448446, -539411, -626153, -625509, -480820, -365908, -520655, -850949, -911156, -472681, 57770, 89297, -357308, -674689, -520563, -219649, -142396, -126363, 110111, 317724, 6219, -750490, -1327523, -1377558, -1164119, -986511, -765871, -418342, -195954, -306435, -501356, -428260]
46530d28260K36662K5181j95964j3465L91616N36739L05558j7031k03257k64157
46520C73622k76245k92465l65892m55528l75470k4472M02190O01178M88796J95356
46510B71070j42164l94032l91894j30265R5831M8973n0425J59134N20883M81032
46500D68143m7006m33062k01921K73888L40672k886k25904j30368m8915j89433
46490a96792l06080j76968P935k4455k03317k58298r3203J86518M51272N74346
46480c9042M44565J29717j15272j53828j20493j35741r9335L3855L5133k34002
46470b54443m57227k50318K19853M23010K22983K1481J11162K92299K55874J8170
46460F02844j80272j76965J0101J93019J20809k01916l80977j43679J35643q2367
$$ y = [-428260, -191598, -166417, -362381, -375846, 15770, 552509, 858067, 841036, 637779, 373622, 97377, -195088, -560980, -1016508, -1391978, -1416450, -1014260, -413082, 75714, 271070, 128906, -265126, -657020, -787285, -691454, -642481, -692906, -533772, -12889, 468143, 421137, -11925, -213846, 60042, 400714, 397828, 171924, 41556, -7359, -196792, -502872, -679840, -671905, -696360, -899677, -1157975, -1251178, -1064660, -613388, -39042, 405523, 535240, 419968, 266140, 145647, 9906, -89429, -55574, -20441, -254443, -711670, -961988, -742135, -319125, -96142, -74661, 36501, 328800, 584674, 602844, 422572, 245607, 255708, 448727, 569536, 367620, -13357, -157036, -21393, -103760]
46450a03760n55880m73953K61694P33112L48146k57816k51649J12424L6776m42837
46440e93743n57588r5218L30966L21648J60576J02316l0683k80110k79130R0632
46430h30334L49312J28947k44951k86340m0726J71286L13013M72740M76860J72761
46420F82568j37130o2321K29262K43254n6741k23988p9627M9964l8865p4441J51311
46409F83246L04205l4293o50341q65008l99738K72208N41888L69363J71611J66515
46399E59656J30533j50917m64233m13472K9494M57419N08801K24909j08583l01977
46389D71630l63223l82302m05227l78484k13406L5341J32036m1981k27032p4224
46379a446872L19826M81562K32794n1130k9224J00305j7488k75482k71029L4921
$$ y = [-103760, -659640, -1133593, -871899, -138787, 209359, -48457, -300106, -187682, -150906, -593743, -1151331, -1246549, -915583, -593935, -433359, -331043, -361726, -641836, -920966, -830334, -481022, -352075, -597026, -883366, -924092, -752806, -439793, 32947, 509807, 682568, 545438, 483117, 712379, 955633, 898892, 674904, 595277, 645241, 606376, 531935, 683246, 987451, 953158, 302817, -562191, -961929, -689721, -147833, 221530, 393141, 559656, 690189, 539272, 75039, -338433, -308939, 148480, 657281, 882190, 773607, 471630, 108407, -273895, -679122, -1057606, -1271012, -1235671, -1103635, -1145616, -1372648, -1446872, -1127046, -645484, -412690, -463820, -493044, -392739, -410227, -685709, -956738, -921817]
46369i21817K48045J46165k0640M2559K46054L14421K21133J78143K56904K60683
46359I71650M2875k19790k37704k7104R1106m6331k08273j47937p026o4475k24355
46348g7364j35882J90313L03544k3760m27720m61918j67502J18527K60797L32422
46338h8543L24389J74399j9306r2509n7938l7521m2529k5650m0517j31558j80416
46327b17699r2386j7880j33156l04199k45966N1424L24036M10964L73224K79085
46317D27447J24322n3995k00024l33458m32001l29053L2660L75696M11311K63346
46307B86251K25502K22367m5051m67282n54171j87381J37097J9254k95507l33572
46297i92493m2733K51152L06309J28816j53516l55642k99487K621L15192M35697
$$ y = [-921817, -673772, -527607, -548247, -505688, -259634, 54787, 275920, 454063, 710967, 971650, 1014525, 794735, 557031, 529927, 621033, 574702, 366429, 218492, 211466, 146991, -77364, -213246, -22933, 280611, 256851, -170869, -632787, -800289, -681762, -420965, -88543, 235846, 410245, 390939, 298430, 240492, 202971, 160442, 134792, 94275, -37283, -217699, -310085, -327965, -461121, -765320, -1011286, -959862, -635826, -224862, 148362, 427447, 551769, 497774, 297750, -35708, -467709, -796762, -764102, -388406, 22905, 286251, 511753, 734120, 689069, 221787, -332384, -519765, -382668, -363414, -658921, -992493, -1035226, -784074, -477765, -348949, -502465, -858107, -1157594, -1154973, -839781, -404084]
46287d04084L76001K41300J05528O5034J94254L51013K55821j08164l99122l65432
46277C12149j66166p3844q4209m5397J3346m7648j82512j93196l7789R1682K3242
46266c90342j80958k93537j64879J05779K64863K07821J05502J21495J36764j8623
46256a06115j78252l2928L13136L86811L5525l25359l20692r9084J2655q664k3077
46245c46044m8740j27907j09110J18898L54641L29618P4307j89083l31899k90580
46235e65899j2608L10608K52973k61534o62858m34614J34335L67294J68399L3309
46225f70595J99216L63034K72388O5289q6040k08061k68883j06865K20878L82430
46215A62791K27294k0534j55623k38874l12502k36135j6343M3489k08184m52709
$$ y = [-404084, -28083, 213217, 318745, 383779, 578033, 929046, 1184867, 1076703, 677581, 312149, 145983, 72139, -12070, -57467, -44121, -91769, -274281, -467477, -505266, -413584, -390342, -571300, -864837, -1029716, -923937, -659074, -451253, -345751, -224256, -87492, -106115, -284367, -317295, -4159, 382652, 418177, 92818, -227874, -326958, -314303, -322967, -346044, -394784, -522691, -631801, -512903, -158262, 171356, 245663, 56580, -275319, -565899, -578507, -267899, -14926, -276460, -939318, -1373932, -1239597, -872303, -703904, -670595, -471379, -108345, 164043, 229332, 143292, -64769, -333652, -440517, -219639, 162791, 390085, 369551, 213928, -24946, -337448, -573583, -589926, -546437, -754621, -1207330]
46205a207330l25088O1527L13105L12248K74419L40644L99964L09210Q5675j33253
46195D31121k04699q3395R6632J06269j12992l36429l12460o7418J46388J50494
46185a86489n515j42111j22813K9482J32298J0761k89165n12818m59152j69724
46175a715246J57120L45639L14550Q9948j91712l76719m26716l81261k09272J37830
46165b255839N03038N71393K67658n7230p771L74903O62308N22541M2664l92393
46155B31272m53129j39123K21245K78126J7804k39520k32991m9933O1050O1881
46145b43318J52951M36633O91308N73028L0462n47850o75334k73968K38262M21335
46135H03509K77257J26279J23194J13182l9944k17993k36170j04725R775j6793
$$ y = [-1207330, -1532418, -1470891, -1157786, -845538, -571119, -230475, 169489, 478699, 564374, 431121, 226422, 143027, 239659, 345928, 232936, -103493, -415953, -483371, -336983, -186489, -192004, -334115, -456928, -427446, -295148, -284387, -573552, -1086370, -1545522, -1715246, -1558126, -1212487, -897937, -807989, -999701, -1376420, -1803136, -2184397, -2393669, -2255839, -1752801, -1181408, -913750, -970980, -978751, -603848, 58460, 581001, 623665, 231272, -221857, -360980, -139735, 138391, 156195, -83325, -316316, -366249, -305199, -243318, -90367, 346266, 1037574, 1610602, 1641064, 1093214, 417880, 143912, 382174, 803509, 1080766, 1207045, 1330239, 1443421, 1403477, 1185484, 949314, 844589, 854364, 837571]
46125H37571j86914m05270n08472l65044l2092K48676K80974J05940o7095q6562
46115a78288m227j2274j97085l47123j41510L85125P52319N99933J70085m8321
46105I78634L014m801j77807k89279k66363k87791l18522p9493L38027L84285
46095B79904j03540m88169k11953L49389M55513Q3261j81598j20194p5659k17739
46085b30785k57288r626K84815L79537L42245K80755J17101j68391l68917l22320
46075D7126j24253O3251J92172K19417P4629j42981j85043L417K00533K68662
46065F16930L14575L61163J98906k06429m78599l25311j6953L569j94616j72413
46055A00822J28881K56791m1833m01431l58672P491K54944K17217J23639J25898
$$ y = [837571, 650657, 245387, -263085, -628129, -660221, -411545, -130571, -24631, -91726, -178288, -182515, -194789, -391874, -738997, -880507, -495382, 256937, 856870, 1026955, 978634, 981648, 976847, 799040, 509761, 243398, -44393, -362915, -442408, -104381, 279904, 176364, -311805, -523758, -174369, 281144, 364405, 182807, 62613, -13046, -230785, -488073, -497699, -212884, 166653, 508898, 789653, 906754, 738363, 369446, 47126, -77127, -13876, 178296, 397713, 472342, 329361, 144318, 147735, 348268, 616930, 931505, 1292668, 1491574, 1285145, 806546, 481235, 464282, 467851, 273235, 100822, 229703, 486494, 444661, 43230, -315442, -307951, -53007, 164210, 287849, 413747]
46045D13747N3427k33521n05316m15823J5447M10005M96043L51881J72035K8982
46035G86907m6658J6363J68956J90643J515j39555J0079K62869K37201p6118l11305
46024A100897k73911j52358j38356j67968j48915j43139j74566j22023L3667J05925
46014h0747J6716m1767M2098N9539j44581l21272j90885L9037m6197l79495m67819
46003a515373j46878J80322J86373Q0934J93333M32231M79049K96242J01617l2983
45993B54867k05462l52120k55938M4897J85031j8708k43247r3415L08552M71491
45983I5948K18346r2383q5882J63099L20094K25611m2408l62266n98554n66586
45973g24981k28691J33767K02539N1390K8966K17577L17946J46810o7057n0587
$$ y = [413747, 467174, 233653, -271663, -687486, -672039, -262034, 234009, 585890, 757925, 786907, 740249, 756612, 925568, 1116211, 1117726, 978171, 988250, 1251119, 1488320, 1412202, 1100897, 826986, 674628, 536272, 368304, 219389, 76250, -98316, -220339, -186672, -80747, -64031, -105798, -63700, -4161, -148742, -470014, -660899, -621862, -668059, -1047554, -1515373, -1662251, -1481929, -1295556, -1214622, -1021289, -589058, -110009, 186233, 287850, 254867, 49405, -302715, -558653, -513756, -328725, -347433, -590680, -684095, -375543, 95948, 314294, 221911, 136029, 299128, 619222, 844833, 802425, 440159, -158395, -724981, -953672, -819905, -617366, -565976, -537010, -319433, -1487, 145323, 78266, 27679]
45963B7679J13094J66372N6044r4088k21473l03629k42146j0200K00920K19574
45953h7853J56453J75507J45246j46325n25558n82575k82097j5418K1472P7252
45943a063896L21760M94048L39125M9432n4169q828l1569r0304m2199j3793j99063
45932b99456l87477j81117L19786N41794K58161p5120p756K80598L27301M8695
45922H25409k56649l45910j87784J29545L79235K84531q6916k34372J19179M90862
45912A117130K16004n59012r89219o47245j101L40269L44527K83286K02946K3650
45902C31235j52002j91472j82078k32797k36020j06348k4631j30197k02929j2467
45892a139706K39366K45606J61291L34333N98464M28607j82724o00829m48133
$$ y = [27679, 140773, 307145, 363189, 269101, 47628, -256001, -498147, -508347, -307427, -87853, 68600, 244107, 389353, 243028, -282530, -865105, -1147202, -1162620, -1141148, -1063896, -742136, -248088, 91037, 140469, 86300, 77472, 45903, -44401, -86600, -100393, -299456, -686933, -868050, -548264, -6470, 251691, 176571, 168815, 449413, 776714, 825409, 568760, 222850, 35066, 164611, 543846, 828377, 741461, 507089, 626268, 1117130, 1333134, 774122, -215097, -862342, -863443, -523174, -178647, 104639, 307585, 331235, 179233, -12239, -194317, -427114, -663134, -769482, -794113, -924310, -1127239, -1139706, -900340, -654734, -493443, -159110, 439354, 867961, 685237, 84408, -363725]
45883c63725q8386J0628r9822j56227j55284j48170M6681M87850P71426N21286
45873H26257O060k12917r4028o6088k51314l00870o9083R2815o6641k54125r6661
45862d86595K69925M34821L27336K19572K05450O3399l01379n95042m96089r8293
45852d56895K11358K39606J51984J53434K06911J71175O8954M2911J03479J03486
45842I96403k7551j83565k53621k54071k45600k52518l02550l91789l70152o8070
45832a353084L73586N38646K67533p5410r6616Q5381J10879J0999J38386N08830
45822E09130O73612L68576r6198k97221k41125k03547k65939k97144k44509j59960
45812b54325j5930K41664M84252M86333K44464R168n0367l6113j00454j97575
$$ y = [-363725, -452111, -441483, -541305, -697532, -852816, -1000986, -954305, -466455, 304971, 826257, 832317, 619400, 525372, 459284, 207970, -92900, -161983, -69168, -135809, -389934, -486595, -216670, 218151, 545487, 765059, 970509, 1033908, 732529, 137487, -358602, -456895, -245537, -5931, 146053, 299487, 506398, 677573, 746527, 789438, 892917, 996403, 968852, 785287, 531666, 277595, 31995, -220523, -523073, -914862, -1285014, -1353084, -979498, -440852, -173319, -248729, -345345, -259964, -149085, -138086, 300, 509130, 1182742, 1551318, 1455120, 1157899, 916774, 713227, 447288, 150144, -94365, -254325, -270255, -28591, 455661, 941994, 1186458, 1195626, 1145259, 1109146, 1008692, 811117]
45802H11117j89224r8903r2055k12652k95363k08148o5859p0793j96192k06160
45792h24232j8574J43543Q3635n0900J3923K45602L45801K07000O0518J02217
45782C08533K13223J82845J8927j16249j36282n5883Q3399J77316Q5705j56646
45772F04888k97912k04235p8851j34628k14823m1299K69979L11892r72k95662
45762h1623k97723j69452j39301j28210J4499J76131J85698J66688L52187O41933
45752G20827O70662L15601j33171l44002k75380j08098l0964j19488k68643k48232
45742A79112J5074K55230J78228r5505j84568k5021O1285o5039j33991J9808J32173
45731C36786p784j33441L1418K02765l7022m51731m12311R9482L99792J45242
$$ y = [811117, 621893, 522990, 430935, 218283, -77080, -285228, -351087, -421880, -618072, -824232, -842806, -699263, -615628, -666528, -652605, -407003, -61202, 145798, 206316, 308533, 521756, 704601, 723528, 607279, 470997, 415114, 498513, 675829, 761534, 604888, 306976, 102741, 23890, -110738, -325561, -366860, -96881, 215011, 214039, -81623, -379346, -548798, -688099, -816309, -801810, -625679, -439981, -273293, 78894, 720827, 1391489, 1707090, 1573919, 1229917, 954537, 846439, 815475, 695987, 427344, 179112, 194186, 449416, 627644, 532139, 347571, 322550, 383835, 318796, 184805, 204613, 336786, 329002, 195561, 226979, 429744, 392722, -59009, -471320, -371838, 27954, 173196]
45721A73196j56851J7856M02302M14294O3628j46058l1750P3790p9506l03952
45711D26949l14467j19096N7505N9690p4885j64580m1092K40306L84305J81715
45701F36350j94300l73236k31158J0911R9635n865j78275k49484j15657J35350
45691d65729K46514J01550o3932K9481K61667K49200j04348m89349o30395n33603
45681a398944k60786J75177N66039N40981Q7905k66789r9728L27194M52473J91456
45671C14978m5219J051J67405K39939K20634J42617o0538l47951m70503k59370
45661i6957J23454L66750L41519J45435p4303k19661k41469j62636p0092j4296
45651I7744L2787P2746L6736n7853j8699K80473O19952O07774J80741k54704k97666
$$ y = [173196, 16345, 34201, 436503, 850797, 914425, 768367, 736617, 810407, 730901, 426949, 112482, -6614, 50891, 110581, 35696, -128884, -169976, 70330, 454635, 636350, 442050, 68814, -162344, -151433, -51798, -57663, -235938, -485422, -601079, -465729, -219215, -117665, -181597, -152116, 109551, 358751, 254403, -234946, -865341, -1398944, -1659730, -1484553, -918514, -377533, -289628, -556417, -656145, -328951, 123522, 314978, 269759, 270810, 438215, 678154, 898788, 1041405, 980867, 632916, 162413, -96957, 26497, 393247, 734766, 880201, 805898, 586237, 344768, 182132, 112040, 97744, 130531, 203277, 240013, 182160, 163461, 443934, 1063886, 1671660, 1852401, 1597697, 1300031]
45640A300031k5161J77368J56051J15170J94261J95481q6535m45544m61728r4810
45630A024584K06957R6373k10964k69411l7847J09114k5458j72451k6899K85107
45620I79105M02726K49812P8608L4006k7336k06871l24827j93711N5640J47910
45610A195062N4860j9241J5444M5419P873n960M7013O4119j9927j21396j45873
45599A117393p8152J03922L97751O02699M39900k9554l73737l58330k72400m32460
45589A117032o30555m47305N9968M09530L80333K32044K10061K16515R2158q4806
45579A554975j42281m7409J27804L14803M48951N03958N44538N94024N02451J77443
45569D579257j19041l0617L49536N71953N11316N26429Q09687J028634Q70549
$$ y = [1300031, 1274870, 1452238, 1608289, 1723459, 1917720, 2113201, 2026666, 1581122, 1119394, 1024584, 1231541, 1327914, 1116950, 847539, 809692, 918806, 893348, 720897, 693998, 979105, 1381831, 1631643, 1710251, 1744257, 1716921, 1510050, 1185223, 991512, 1047152, 1195062, 1249922, 1230681, 1246125, 1291544, 1299417, 1293457, 1340470, 1404589, 1384662, 1263266, 1117393, 1039241, 1143163, 1540914, 2143613, 2583513, 2553959, 2180222, 1821892, 1549492, 1117032, 486477, 39172, 99140, 508670, 889003, 1121047, 1331108, 1547623, 1639781, 1554975, 1412694, 1365285, 1493089, 1807892, 2256843, 2760801, 3305339, 3899363, 4401814, 4579257, 4460216, 4429599, 4779135, 5351088, 5862404, 6388833, 7198520, 8227154, 9097703]
45560I097703N47491M35517N46639P15603J001653J477921J864714J856383J669536
45551A9213160J768307K101725K125787J634628J066196P89698N19294k31460
45543B8987335j367630k255429k477053k235214j957641j755481j468922j125813
45535A4344152j041178j335767j607530j388322q23811n21987p00620r01945p20186
45526E302806l98642l80851n93333o01689k95264K1146J41215J59040J68480J24533
45516C647441M0750J2739m052j61896m11877m82718k40676J30744L56232L05864
45506C192551J9119l17493m51776l33365k37190l77738n04010k27045L08104N16810
45496A587967K01523j63651j49307L8161l8287l67278n61654m31430j57434L6823
$$ y = [9097703, 9645194, 10080711, 10627350, 11342953, 12344606, 13822527, 15687241, 17543624, 19213160, 20981467, 23083192, 25208979, 26843607, 27909803, 28699501, 29218795, 28987335, 27619705, 25364276, 22887223, 20652009, 18694368, 16938887, 15469965, 14344152, 13302974, 11967207, 10359677, 8971355, 8147544, 7625557, 6924937, 6022992, 5302806, 4904164, 4523313, 3929980, 3328291, 3033027, 3054173, 3195388, 3354428, 3522908, 3647441, 3688191, 3700930, 3696878, 3534982, 3123105, 2640387, 2399711, 2530455, 2886687, 3192551, 3211670, 2894177, 2442401, 2109036, 1871846, 1494108, 990098, 763053, 1071157, 1587967, 1789490, 1625839, 1476532, 1514693, 1476406, 1109128, 547474, 116044, -41390, -4567]
45486d567J21576J69013K07821K07603J31277m535j08238r7527m520O8016P2198
45475G58117J4863j07370k45864k51670p0158Q9121L579j96416j75523J21318
45465f0003M16246N18941M82145L22310m9525n17424p21501m90740n9814K60019
45455A00654L74271L01606Q9398p3799K692J50199j4534m49360o10482k27058
45445c56413K69197L71125J58651P025N498M1811J30703K53519J73914j65619
45435H89411l57621r5976K56615J82097j65872k35745O376Q7265j20534k29065
45425B16951o8247N7929L108O2816L66962N15037J78400l20325m20217p6685K41364
45414G57093J78782j47583l57348k11520J46879L05839L6089l81185m61311j39415
$$ y = [-4567, 117009, 286022, 493843, 701446, 832723, 828188, 719950, 622423, 617903, 685919, 758117, 772980, 665610, 419746, 168076, 97918, 187039, 190618, -5798, -181321, -60003, 356243, 875184, 1357329, 1679639, 1630114, 1112690, 391189, -99551, -159365, 100654, 474925, 776531, 865929, 792130, 794822, 945021, 930487, 481127, -129355, -356413, -87216, 283909, 442560, 449585, 455083, 496894, 627597, 881116, 1055030, 889411, 531790, 435814, 692429, 874526, 708654, 472909, 479285, 566550, 446016, 216951, 148704, 206633, 209741, 272557, 639519, 1154556, 1332956, 1012631, 592414, 515729, 757093, 935875, 788292, 430944, 219424, 366303, 672142, 708231, 327046, -134265, -273680]
45404b73680J68657J58091j5179p7423k3224J8544M5116Q8386O0341r0952k21661
45393a62984j90827q7005n7926l5615J40842L98497M66166K51238j3311p1629
45383F37446L4483N9071q5647j96318o3721K17186L74485L52079L48153M16529
45373B093746L15531o2031l77726k74937P1781K03628N1057o1411l5901j47281
45363A776456m79562o71360m38686m354K36104K11629J12664N8362M7375N7425
45353I06053J0696j77002l60165k13108K82712O44991M59407m6369l05507j58188
45343A043520L9647M002j25505r8273N4162J13609L2444n559R6399J29037j50468
45332A133015n62362n91945q7187L90193K31221l74139o78084l82284R6161L85913
$$ y = [-273680, -105023, 53068, 37889, -39534, -62758, -44214, 902, 89288, 149629, 58677, -162984, -353811, -440816, -498742, -534357, -393515, 4982, 471148, 722386, 709075, 637446, 671929, 731000, 645353, 449035, 385314, 602500, 976985, 1329064, 1677217, 2093746, 2409277, 2347246, 1969520, 1694583, 1766364, 1969992, 2021049, 1959638, 1923737, 1776456, 1296894, 625534, 186848, 182494, 418598, 630227, 742891, 801253, 848628, 906053, 916749, 739747, 379582, 166474, 449186, 1094177, 1553584, 1507215, 1201708, 1043520, 1083167, 1087169, 961664, 863391, 917553, 1031162, 1063606, 1058047, 1154446, 1283483, 1133015, 570653, -21292, -108479, 281714, 512935, 138796, -539288, -921572, -825411, -439498]
45322d39498N97259Q00497O77759J10681l71824k66475J27671J75216j02591j30538
45312A178157K35735M77034K27615k36058m85596m63617l23078j29988N0633P9041
45302F09878l2799o9703L1076L5005j72316k88005r03M84908O59428L65987m2499
45291A580057k00204j14385O073P6365J48305K38674L11888L76295M46933M33936
45281C303937K34080l5346p7155J97409M79692M42755J85568O1143J47203J98709
45271E137995J21240J28238L12916M17729K56320P2763J80913M52976M96980K25041
45261G803111o9824j48330o1522J9828k2261k25465m84919n61183l56507j28915
45251E764013k08311n43941p65235o62490l76416j29397k45L2272K8910O7505
$$ y = [-439498, 157761, 958258, 1636017, 1746698, 1374874, 1108399, 1236070, 1411286, 1308695, 1178157, 1413892, 1890926, 2118541, 1882483, 1396887, 933270, 610192, 480204, 530837, 609878, 577079, 507376, 538452, 573457, 401141, 113136, 112233, 597141, 1256569, 1622556, 1580057, 1379853, 1265468, 1271541, 1347906, 1496211, 1734885, 2046773, 2423068, 2870001, 3303937, 3538017, 3502671, 3425516, 3622925, 4102617, 4545372, 4730940, 4792083, 4939286, 5137995, 5259235, 5387473, 5700389, 6118118, 6374438, 6447201, 6628114, 7081090, 7578070, 7803111, 7733287, 7584957, 7523435, 7543263, 7521002, 7295537, 6810618, 6249435, 5892928, 5764013, 5555702, 5011761, 4246526, 3584036, 3207620, 3078223, 3077978, 3110250, 3139160, 3206665]
45241C206665J01724r0346n80172r87689q27987j67306L88456M28356J61623L777
45231A637101K7290J3168j45608l05960k79771n7368J65812J81470J9901o9127
45221A186908K4292O6400j84407n71651p24470n52642k77259m8225J45776K34777
45211g00501R7347j50120k30047j01665K6490P5355J41281J84382P4661o0115
45201f42932M838Q1421k15148o69153n58705K20417Q26968O69454K53214K73001
45191B43375M82035K28737l27957m36167J1641L41418K02154n512M6404J03287
45181H89415o3656j66177O9867L42572K09786j97467l52336r2969J95718J58262
45171I93015r6845k44308k05742j70667k22107j79178O8866K63395R1997k65821
$$ y = [3206665, 3308389, 3218043, 2637871, 1650182, 822195, 654889, 1043345, 1471701, 1633324, 1637101, 1664391, 1677559, 1531951, 1225991, 946220, 888852, 1054664, 1236134, 1256035, 1186908, 1211200, 1277600, 1093193, 521542, -202928, -755570, -1032829, -1081054, -935278, -700501, -603154, -753274, -983321, -1084986, -1058496, -983141, -841860, -657478, -582817, -642932, -638094, -556673, -771821, -1440974, -1999679, -1779262, -952294, -282840, -29626, 243375, 725410, 954147, 626190, 190023, 201664, 543082, 745236, 739724, 786128, 889415, 825759, 659582, 729449, 1072021, 1281807, 1084340, 732004, 639035, 834753, 993015, 896170, 651862, 446120, 275453, 53346, -125832, -56966, 206429, 298426, 32605]
45161C2605k80163J71002N81740N38185K47647O0689j01418l96319n29070j79411
45151A45487K96799K81075j21566k38245N4313J58475j67010l73550r5853J91081
45141A31006j4746l95939l87312j07289m3860j56790j8356L31580M02994J23830
45131a34882J6393L46525O49113L80206l29288q60129q23338l58761J40124L90752
45121e83285L55756J59824o4427k29687k37753k4729K71594L72361K26374J28025
45111C74053K70836L98723K00713j34761j64425J05090K14287l0459k99664l24550
45101F09843k93182m27646n38746l28763J01995L77181L40387J63971N1514M5112
45091A01666O0856l3256k77815m55202k47414K84437O10566L72057r8334k14174
$$ y = [32605, -247558, -76556, 505184, 1043369, 1291016, 1351705, 1250287, 853968, 324898, 145487, 442286, 723361, 601795, 363550, 417863, 576338, 409328, 35778, -60075, 131006, 116260, -279679, -666991, -774280, -818140, -974930, -993286, -661706, -258712, -134882, -118489, 228036, 877149, 1257355, 928067, 67938, -755400, -1114161, -974037, -583285, -227529, -67705, -132132, -361819, -599572, -624301, -352707, 19654, 246028, 374053, 644889, 1043612, 1244325, 1109564, 945139, 1050229, 1264516, 1234057, 934393, 609843, 316661, -110985, -649731, -978494, -876499, -499318, -158931, 5040, 56554, 101666, 162522, 129266, -148549, -603751, -851165, -566728, 43838, 415895, 317561, 103387]
45081A03387P2066K97320K07076M732j20071k48260l86473k95989Q1410L59816
45071G5014J90496k09069l30582n3845K53671K59184J0406k42283l34270k49597
45061f30875p1036O5747P4135J2595Q881R0188J64613J55660P1532m3780j44603
45050b46943j79445j26312k6054O1446J00641O0223n5203j07082R5707M95783
45040G2761P06454M16661k03642o80721p56335n60435l37145j91637p0749J61889
45030a442899N62089Q83455O98962j4869o20184n15599N8068L60839J93435K8912
45020A92209J11793J01978j86819l61512j39091J18777M4577o6121J89751N10789
45010E16331L24980k23840m48408j70102J01516M6596p3992j5250O8431K5312
$$ y = [103387, 175453, 472773, 679849, 684581, 564510, 316250, -70223, -366212, -284802, 75014, 265510, 56441, -274141, -327986, -74315, 184869, 195275, -47008, -381278, -630875, -701911, -636164, -562029, -549434, -540553, -450365, -285752, -130092, -58560, -102340, -246943, -426388, -552700, -578754, -517308, -416667, -356444, -411647, -518729, -423022, 72761, 779215, 1195876, 992234, 311513, -444822, -1005257, -1342402, -1534039, -1604788, -1442899, -880810, 2645, 701607, 686738, 66554, -449045, -390977, -30138, 163297, 192209, 304002, 405980, 219161, -142351, -281442, -162665, -118088, -184209, 5542, 516331, 841311, 617471, 169063, -1039, 100477, 147073, 73081, 57831, 126262, 151574]
45000A51574k3459k5141j51530m03360m86287l00680j39572j62925j01379K17396
44990a425363M55720K67808j04200j67489R2883K40162L9687k65374k95034R7903
44980a063297P33169J173679J002063K56263m96239p22833m77004k12292j84703
44971H806k69465k65403j25784Q2952K57086L01168K11747O2866j40383m32568
44961c08978o52214n15017r0795J16343j37269l65100m950O78007Q81997M01769
44951C793r0486j0053L89401M80376J14103l11726m34403k66929k2611J56095
44941G560K46728K49843J38207p3557k50614k35703o4543L3072p6365k64044l49441
44930f38857l06629j36735K32925O93627Q35951M37613r0326j66686J25437J41016
$$ y = [151574, 128115, 102974, -48556, -451916, -938203, -1238883, -1378455, -1541380, -1642759, -1425363, -969643, -701835, -806035, -973524, -880641, -640479, -600792, -866166, -1161200, -1063297, -330128, 843551, 1845614, 2101877, 1605638, 882805, 405801, 193509, 8806, -260659, -526062, -651846, -568894, -311808, -10640, 201107, 263973, 123590, -308978, -961192, -1476209, -1567004, -1450661, -1587930, -1953030, -1957980, -1279973, -397976, 3793, -86693, -96746, 292655, 773031, 887134, 575408, 141005, -125924, -148535, 7560, 254288, 504131, 642338, 568781, 318167, 82464, 17921, 50993, -25372, -289416, -638857, -945486, -1082221, -849296, -155669, 680282, 1117895, 1027569, 860883, 986320, 1127336]
44920A127336l48039p67746n42971J10517N03393L41392l8051j92407o9668M3480
44910A67236p2915k96840l27202j07868O5743j4736j11714J13660N27611O52145
44900E95120L39142n4975k10087j91839j63038r6800O3722K40413L57119L97692
44890A276469K54902j66221o09798o16254j71958J71751M7870k37882k41765k8259
44880c21145P9195P4643J66877L08240K53204j1554k42038k76222j44086N3828
44870e9058J65128N2249j49046p6915L00820M84591J46045k85045k03529K66254
44860F41494N03347L48890K20235L38894M71250M75294N06391N66323M11725P9179
44850D563022l2572J81460L07099J11748j7907L08288Q47339J112996J081080
$$ y = [1127336, 779297, 11551, -531420, -420903, 82490, 423882, 385831, 193424, 123756, 167236, 94321, -202519, -529721, -637589, -571846, -586582, -698296, -584636, -57025, 595120, 934262, 879287, 669200, 477361, 314323, 217523, 281245, 521658, 878777, 1276469, 1531371, 1365150, 755352, 139098, -32860, 138891, 186761, -51121, -292886, -321145, -241950, -167307, -430, 307810, 561014, 549460, 307422, 31200, -112886, -59058, 106070, 158319, 9273, -67642, 233178, 717769, 863814, 578769, 375240, 641494, 1144841, 1493731, 1713966, 2052860, 2524110, 2999404, 3505795, 4072118, 4483843, 4563022, 4530450, 4711910, 5019009, 5130757, 5112850, 5421138, 6268477, 7381473, 8462553]
44841H462553J073455J162023J114491Q10929L49632j77182o90637r81918q90483
44832A0232863o18349n74014q49955j084031r29854n03119k35150l42619n69145
44823D526627n21951k05497l8734k60534n40651m34391n8681O5328k08372m69182
44813A853962m12775k31126j64231r8274J04595K41173P9458k33819m09783m26488
44803C02692l82656j90982K07030N19089M01717l3912l71788m35190l48258j96779
44793e29037j866R2157K657k4965K42950N25610L54697j41225l25934Q454L43596
44782E47094K43194n0875r8216R3665K34446K44115K42698K58478K30043J46371
44772B091013j3249l00880n99737o31136l46910p0105l4602m8212J28841L41173
$$ y = [8462553, 9536008, 10698031, 11812522, 12623451, 12973083, 12795901, 12105264, 11123346, 10232863, 9614514, 9040500, 8190545, 7106514, 6176660, 5673541, 5438391, 5095772, 4526627, 4004676, 3799179, 3760445, 3499911, 2959260, 2524869, 2466188, 2531516, 2323144, 1853962, 1441187, 1210061, 1045830, 947556, 1052151, 1293324, 1372782, 1138963, 729180, 302692, -79964, -270946, -63916, 455173, 856890, 822978, 451190, 16000, -332258, -529037, -530903, -438746, -436089, -461054, -218104, 307506, 662203, 520978, 195044, 203498, 547094, 790288, 739413, 641197, 734862, 969308, 1213423, 1456121, 1714599, 1944642, 2091013, 2077764, 1776884, 1177147, 546011, 199101, 128996, 94394, 46182, 175023, 516196]
44762E16196L11731J37259J16315K25096J84262j1576o0421J08778J59715j43610
44752A543745n51201o40849l32751P7606K83202K21766L4322j18902j96041k49801
44742G1096k79391j87724M1436K20015J60198m3692j05617Q4451L40418M43145
44732G44335L73586K45702J40709O9678Q870q1403k15638l36719l54599k29064
44722C65457J2508K82563M16592K69943n3758k02215J1295L03406K75689k369
44712A679111q0573J91613M14539J96422l20439o74365o14376k35596K26636N31384
44702A314356N01066J69772k00798l83589l71508k20973Q9843M81224O66441M84477
44692B530311J78477N8826L5003j73878m74163m75120j34437J25248O3673m5449
$$ y = [516196, 827927, 965186, 1081501, 1306597, 1490859, 1479283, 1418862, 1527640, 1687355, 1543745, 992544, 351695, 18944, 96550, 379752, 601518, 635840, 516938, 320897, 71096, -208295, -396019, -354583, -134568, 25630, -18062, -123679, -39228, 301190, 744335, 1117921, 1363623, 1504332, 1574010, 1582880, 1501477, 1285839, 949120, 594521, 365457, 377965, 660528, 1077120, 1347063, 1293305, 1091090, 1102385, 1405791, 1681480, 1679111, 1598538, 1790151, 2204690, 2401112, 2080673, 1406308, 791932, 556336, 782972, 1314356, 1815422, 1985194, 1784396, 1400807, 1029299, 808326, 898169, 1379393, 2045834, 2530311, 2708788, 2767614, 2802617, 2628739, 2154576, 1679456, 1545019, 1670267, 1733940, 1688491]
44682A688491N0776J23034j18517m47644m09337k9348K15111J06491n8506j704
44672A118847J43067J58340J45039L03308M95659L65042j25362n43965m79184
44663A580791j5835L92721M35018J89984j02201l45601n59162o44673m02393J38790
44653F67439N68202M71031o0413m75577l82977K5559K67588J69913R939Q3846
44643A344550L14208L86773J87164n1108o4861R3676J48678r699j91805k08601
44633A948975j39717j64999k46776j83145N7083K64582K85494J95227J10071Q242
44623B135037j51593k89355l19650k88919k57755j61104M9163K18541J49046r4335
44613I89076k33204j39020K5054N6593m1989j25361r6159K3752J36392J47917
$$ y = [1688491, 1739267, 1862301, 1743784, 1296140, 886803, 857455, 1072566, 1179057, 1120551, 1118847, 1261914, 1420254, 1565293, 1868601, 2364260, 2729302, 2603940, 2059975, 1580791, 1564956, 1957677, 2392695, 2582679, 2480478, 2134877, 1575715, 931042, 528649, 667439, 1235641, 1706672, 1646259, 1170682, 787705, 813264, 1080852, 1250765, 1260704, 1344550, 1658758, 2045531, 2232695, 2181587, 2116726, 2210402, 2359080, 2349381, 2157576, 1948975, 1809258, 1644259, 1397483, 1214338, 1271421, 1536003, 1821497, 2016724, 2126795, 2135037, 1983444, 1694089, 1374439, 1085520, 827765, 666661, 715824, 934365, 1083411, 989076, 755872, 616852, 641906, 698499, 656510, 531149, 434990, 458742, 595134, 743051]
44603G43051O4076L871M9535J14123O5454m9689n9370M4642M5544j90423m76225
44592C54589m93349j65058K48571M19615K80742Q4127J14884L37361M09251J12939
44582A703672l40296n72297m90442k73959j1878L36406O30349N61553J08821l17598
44572A334331l64068j21366J39783L37562M48856L04476j21782m18463j63831
44563A375498M17149O44208K63817k43696l40760o3305K06349L00270L29630L58590
44553C247750K98906J09351r1703j51088l6166J40032K04697N8026k35828m94971
44543C049006n62692l97967q0195K00033K12427j02934m89760n88246l41273n8782
44533H39617k0801j55570k04776p4641J23199K92095M31234N08966M24062J53382
$$ y = [743051, 807127, 810998, 860533, 974656, 1040110, 990421, 931051, 975693, 1021237, 830814, 354589, -138760, -303818, -55247, 364368, 645110, 729237, 844121, 1181482, 1590733, 1703672, 1363376, 791079, 300637, 26678, 14800, 351206, 981555, 1543108, 1651929, 1334331, 970263, 848897, 988680, 1326242, 1775098, 2079574, 1957792, 1539329, 1375498, 1792647, 2436855, 2700672, 2456976, 2116216, 2052911, 2259260, 2559530, 2889160, 3247750, 3546656, 3656007, 3564304, 3413216, 3377050, 3517082, 3721779, 3779805, 3543977, 3049006, 2486314, 2088347, 2008152, 2208185, 2420612, 2317678, 1827918, 1239672, 898399, 839617, 818816, 663246, 458470, 383829, 507028, 799123, 1230357, 1739323, 2163385, 2316767]
44523B316767j68859l90380m84644m83004l45775m0440K74031L25468P5987j60710
44513I18441r9604J32962J97468M0134p2741l840Q6182R1418J46943K91289K69176
44502A997828n5392l63749l02668k5141P3577j5391j842R6231m2363m07921n58050
44491C95119k96574J5125L9531o4902j7154J19873J62282J71124K47765K39113
44481A011302K3511j43339J5656K77106K11965r8675j45181J90831M01207J12004
44471A856387l42658m09499r8079R4162p0668k65069j09763K82295M79666L22601
44461A739375Q4387K8290O3942l748j08418p8017p448j13113k70069j24187K71759
44450A482753L97676L5752l44805k75128N2932K13176K54521M58303O67328M88609
$$ y = [2316767, 2147908, 1757528, 1272884, 789880, 444105, 403665, 677696, 1003164, 1079151, 918441, 818837, 951799, 1149267, 1189401, 1116660, 1112820, 1199002, 1290420, 1437363, 1728652, 1997828, 1942436, 1578687, 1276019, 1250878, 1324455, 1309064, 1307222, 1403453, 1361090, 953169, 395119, 98545, 113670, 153201, 88299, 71145, 191018, 353300, 524424, 772189, 1011302, 1034813, 891474, 907130, 1184236, 1396201, 1297526, 1152345, 1343176, 1744383, 1856387, 1513729, 1104230, 1006151, 1100313, 1029645, 764576, 654813, 937108, 1416774, 1739375, 1823762, 1852052, 1915994, 1912246, 1803828, 1725811, 1718363, 1605250, 1335181, 1210994, 1482753, 1880429, 1916181, 1571376, 1296248, 1349180, 1562356, 1816877, 2275180, 2942508, 3431117]
44440C431117M6396j13749J14169K58244J00053J8927K66123M80603L14699P3254
44430D989836K47945P29640R84406Q35243N96070N07475M78280L98505L21545
44421A0088945K47864L8425l26263o29834o96948o16665n66967n62593n15956
44412F460008m34945l93417l61330k42508q7867q7868k64770l36163p0006L16919
44402D498053L71069K4782k76786j94795L9050K6312j58666j06461K39746M45193
44392D907497J98665k74267n47515m74529j85661J50998L84080L86502K03485
44383D749255O6662J16078K39565L03912L59681M52204M31134J95817j7458J06861
44373G003711M77611O69658N06868K97096L79917O53746P24969M24901J2208j32332
$$ y = [3431117, 3477513, 3363764, 3477933, 3736177, 3836230, 3855157, 4121280, 4601883, 4916582, 4989836, 5237781, 5967421, 6951827, 7787070, 8383140, 8890615, 9368895, 9767400, 10088945, 10336809, 10375234, 10048971, 9419137, 8722189, 8105524, 7538557, 6975964, 6460008, 6025063, 5631646, 5270316, 5027808, 4939941, 4852073, 4587303, 4251140, 4181134, 4498053, 4869122, 4893904, 4617118, 4422323, 4461373, 4487685, 4329019, 4222558, 4462304, 4907497, 5106162, 4831895, 4284380, 3809851, 3624190, 3775188, 4159268, 4545770, 4749255, 4815917, 4931995, 5171560, 5475472, 5835153, 6287357, 6718491, 6914308, 6896850, 7003711, 7481322, 8150980, 8657848, 8954944, 9334861, 9988607, 10713576, 11138477, 11150685, 11018353]
44363A1018353R6920M75006P30823Q20791R08255J130516J463721J817907K175582
44354B0637874K571406K976673L290437L474312L648852L978538M423136M658148
44346D9659376M330848L379385K008029M06553j287891k736027l441707l295664
44338D9022902k851061k741990k949280k951950k502441j885069j432644j166048
44330C0542419r70897p97644n96184l31000j20873q8953o4145K22189O22501O91164
44320B9108577M22645M00870R87750J783433K173962K051528J715709J438506
44312D0082980J449508J971179K859512L513378L558348L359927L451088L726599
44304F3972519L677657L196955K624901K125723J524028P11484k10693j137551
$$ y = [11018353, 11115273, 11590279, 12321102, 13141893, 14050148, 15180664, 16644385, 18462292, 20637874, 23209280, 26185953, 29476390, 32950702, 36599554, 40578092, 45001228, 49659376, 53990224, 57369609, 59377638, 59784191, 58496300, 55760273, 52318566, 49022902, 46171841, 43429851, 40480571, 37528621, 35026180, 33141111, 31708467, 30542419, 29571522, 28773878, 28177694, 27846694, 27725821, 27636868, 27572723, 27794912, 28417413, 29108577, 29531222, 29932092, 30919842, 32703275, 34877237, 36928765, 38644474, 40082980, 41532488, 43503667, 46363179, 49876557, 53434905, 56794832, 60245920, 63972519, 67650176, 70847131, 73472032, 75597755, 77121783, 77833267, 77622574, 76485023]
44296G6485023j934558k331721k263835k183911k564255l184556l412449l112152
44288E5497586k738314k568560k425265k199491k065068k049042j931730j727067
44280C7793049j734325j924310j811882j220806o95500p89327j299668j573774
44272B6743457j330311q62789n87076o22609p33657n96827k32087r3473m77533
44263B1207095r69367r06141l26263P5639m6925l31564m36405m60904m38531j18068
44253A7248566M04200N13336o085m98981m03914r1279j34033l17207j24099K52195
44243A6842699K34942r8385j78424J2040p4082n29979p92815n80163k91403k66364
44233A4278066k81767n5713K65211M01045L13604O2477l46147p65921r00831o80962
$$ y = [76485023, 74550465, 72218744, 69954909, 67770998, 65206743, 62022187, 58609738, 55497586, 52759272, 50190712, 47765447, 45565956, 43500888, 41451846, 39520116, 37793049, 36058724, 34134414, 32322532, 31101726, 30406226, 29616899, 28317231, 26743457, 25413146, 24550357, 23963281, 23340672, 22607015, 22010188, 21778101, 21684628, 21207095, 20237728, 19331587, 19005324, 19080963, 19034038, 18702474, 18266069, 17805165, 17366634, 17248566, 17652766, 18166102, 18160017, 17661036, 17257122, 17165843, 17031810, 16714603, 16590504, 16842699, 17077641, 16979256, 16800832, 16812872, 16738790, 16208811, 15415996, 14835833, 14544430, 14278066, 13996299, 13940586, 14205797, 14606842, 14920446, 14982923, 14636776, 13870855, 12970024, 12289062]
44223A2289062l74214k00569j15214n2806o4281j19296r6075n0054j57287l26623
44213A0732643k57025K5839J24864p9940j93506L3636K37777j2050n34392p97160
44203I280686o36077l32589j20512K5417J69698K84917L38223L07795J37320j63216
44193I291662m12344m08720j71272Q3312J83620J50732J33227K39204L99513M07371
44183I896305J71315j05364j27850J28942M10011N03739M04055J87892n1994j67286
44173A1249765q1415M5995J9076n4851Q9742M12192N87417N08811L96239L58626
44163A3531597K71720J85543L76035P94870R40266N63049P9321l8907J27359L03317
44153A7134170N56787R97504J299926J092834O00539L46955L78961L17284N1496
$$ y = [12289062, 11914848, 11714279, 11599065, 11546259, 11481978, 11362682, 11266607, 11216553, 11059266, 10732643, 10475618, 10501457, 10626321, 10546381, 10352875, 10386511, 10624288, 10612238, 10077846, 9280686, 8644609, 8312020, 8191508, 8216925, 8386623, 8671540, 9009763, 9317558, 9454878, 9291662, 8879318, 8470598, 8299326, 8382638, 8566258, 8716990, 8850217, 9089421, 9488934, 9896305, 10067620, 9962256, 9834406, 9963348, 10373359, 10877098, 11281153, 11469045, 11417051, 11249765, 11168350, 11214345, 11233421, 11178570, 11268312, 11680504, 12267921, 12776732, 13172971, 13531597, 13803317, 13988860, 14364895, 15159765, 16100031, 16663080, 16742401, 16703494, 16830853, 17134170, 17690957, 18688461, 19988387, 21081221, 21681760, 22028715, 22407676, 22724960, 22776456]
44144B2776456j75072l06024n25703p65791p19659m27973l15983n10780o27107
44135A8402364m20652j69416j46427j56999N5919K97099K04099j75341m63605
44126A7427041m85729l99103l54528l04964j54531R2347L45509M83770M17904
44117A7067716J82508o6578j91413j58503K896K02537K56326M9419k26145k29407
44107A6889356M0522J73375o8192l63006l03710l6588n2570m34585p34661o57510
44097A4452431m66612m99547n90410l25015K52821N73908K65559l46750o54333
44088A2662052n00567k44845j80086k08935j61522j19277k09624l00257j88010
44079A0548929J8878R103k67136n20453n31183l82366k40222j47457j05989j38195
$$ y = [22776456, 22601384, 22295360, 21769657, 21003866, 20284207, 19856234, 19540251, 19029471, 18402364, 17981712, 17812296, 17665869, 17508870, 17564789, 17861888, 18065987, 17890646, 17427041, 16941312, 16542209, 16187681, 15882717, 15728186, 15820533, 16166042, 16649812, 17067716, 17250224, 17183646, 16992233, 16833730, 16836626, 17039163, 17295489, 17344908, 17118763, 16889356, 16929878, 17103253, 17035061, 16672055, 16368345, 16331757, 16279187, 15844602, 15109941, 14452431, 13985819, 13486272, 12895862, 12570847, 12823668, 13397576, 13663135, 13316385, 12662052, 12161485, 11916640, 11736554, 11527619, 11366097, 11246820, 11037196, 10736939, 10548929, 10567807, 10576910, 10309774, 9789321, 9258138, 8875772, 8635550, 8488093, 8382104, 8243909]
44069H243909j86268j59564j29432k23703k89192j6378M69203N56840k4048p03131
44059G538236p90874l97498j49182k17074k15239K0054J82119J11016P1439K07121
44049F360118K40662P338j79501o3082O5431j45073m57776m04936o3362R2985
44039E452804j088N7953L79216N49868L33413O0750M9824R1082j20701l96475
44029F456646l33398L1308K85476K54494J41444R0990L626j64646k53750j59851
44019F352339J1771J57641L13302M73482M95136L21452J20207M3550K332j51486
44009H139726l41980l63106j94900n1366j24797m01789p06412q17855n96126j39179
43999D402216K07786J76396n6745n503N12619J047386R94762L52620k31027k28251
$$ y = [8243909, 8057641, 7898077, 7768645, 7544942, 7255750, 7239372, 7708575, 8265415, 8241367, 7538236, 6747362, 6349864, 6200682, 5983608, 5768369, 5788423, 5970542, 6081558, 6152997, 6360118, 6600780, 6608118, 6428617, 6365535, 6430966, 6285893, 5828117, 5423181, 5359819, 5452804, 5451716, 5509669, 5888885, 6438753, 6772166, 6832916, 6882740, 6973822, 6853121, 6456646, 6123248, 6154556, 6440032, 6694526, 6835970, 6926960, 6930586, 6765940, 6512190, 6352339, 6364110, 6521751, 6835053, 7308535, 7803671, 8125123, 8245330, 8288880, 8291212, 8139726, 7797746, 7434640, 7239740, 7188374, 7063577, 6661788, 5955376, 5137521, 4541395, 4402216, 4610002, 4786398, 4729653, 4724150, 5236769, 6284155, 7278917, 7631537, 7400510, 7172259]
43989G172259J60193L36205Q9090k27307k72490j54819j59921l02027l74914k96461
43979E969808j61248m0522L9695q071k15479l80819k77529l1859m809k56453m25033
43968D207681k45481Q5690K18255R0182j10313k22797j68938R1191M48712O29870
43958E024052M94553K43234J43283J67753J15969o644K0079K75520N45859N68687
43948G592345L05559n1423k69644k81793k41067l14587m08295k43024K24762O37709
43938F950542O40512L07809O978m8072N7738J33787O0432j31959k29218j1662
43928G736887L98283N53165K40546j66718j72131K07119N57689O65501O40833
43919A0661174N55701L58671J46595J46177L56959N18066N04313M88583O36183
$$ y = [7172259, 7332452, 7668657, 7757747, 7530440, 7257950, 7103131, 6943210, 6641183, 6266269, 5969808, 5808560, 5768038, 5807733, 5799662, 5584183, 5203364, 4925835, 4893976, 4889167, 4632714, 4207681, 3962200, 4047890, 4266145, 4356327, 4246014, 4023217, 3854279, 3945470, 4394182, 5024052, 5518605, 5761839, 5905122, 6072875, 6188844, 6182200, 6202279, 6477799, 7023658, 7592345, 7897904, 7846481, 7576837, 7295044, 7053977, 6739390, 6331095, 6088071, 6312833, 6950542, 7591054, 7898863, 7905841, 7857769, 7915507, 8049294, 8109726, 7977767, 7748549, 7736887, 8135170, 8688335, 8928881, 8762163, 8590032, 8797151, 9354840, 10020341, 10661174, 11216875, 11575546, 11722141, 11868318, 12225277, 12743343, 13247656, 13736239, 14372422]
43910A4372422Q71665J016543R67032P21470M38667M49616R54694J699619K201607
43901B3693335K302467K249025K255533K302972K388861K640814L100557L668681
43893D4602245M312893N063173N801590O396357P072570Q269825J0048664J2011336
43885A03578653J3918018J6007868J8577384K1596773K4851484K8039667L0530666
43878B57100513L1392176K9862338K5543668J8215202Q134885l234670j3514157
43871C53499955k0986368k5545481k7807221k7957484k6107883k3189212k0506519
43864A81399787j8496142j6648369j4602314j2631820j1036860r725915q556748
43857H9701619p574874o763997n984568n266083m769561m404372l904416l337957
$$ y = [14372422, 15244087, 16260630, 17227662, 17949132, 18387799, 18837415, 19792109, 21491728, 23693335, 25995802, 28244827, 30500360, 32803332, 35192193, 37833007, 40933564, 44602245, 48915138, 53978311, 59779901, 66176258, 73248828, 81518653, 91567317, 103578653, 117496671, 133504539, 152081923, 173678696, 198530180, 226569847, 257100513, 288492689, 318355027, 343898695, 362113897, 370248782, 367014112, 353499955, 332513587, 306968106, 279160885, 251203401, 225095518, 201906306, 181399787, 162903645, 146255276, 131652962, 119021142, 107984282, 98258367, 89701619, 82126745, 75362748, 69378180, 64112097, 59342536, 54938164, 51033748, 47695791]
43849D7695791l064266l065688k825948k106774j396055j250635j527171j636391
43841C0822863j347296r66367q07296q22426q07308p29623p01921p13243n82586
43832B3344797k76227j16321m04550q68583q61429k52246K77647J17445m52560
43823B0507973p16495m86364j30200R6692J77250j5978n37825r20443o03062J49979
43813A7521527M46814j51n25935n81504m31651m64765n03304k87648p7882k04817
43803A4890684m36209l51072l7370J04638K793j32653k68213m73095n73649l72069
43793A2353785q1606p8880l08156l64089j10065J84009K77521J66851r7819m48910
43783A1492641o81073o16291l67313j67872k2485J89455L82924L82783K68420
$$ y = [47695791, 44631525, 41565837, 38739889, 36633115, 35237060, 33986425, 32459254, 30822863, 29475567, 28509200, 27701904, 26879478, 26072170, 25342547, 24640626, 23927383, 23344797, 23068570, 22952249, 22547699, 21679116, 20817687, 20565441, 20843088, 20960533, 20507973, 19791478, 19305114, 19174914, 19271606, 19448856, 19432878, 18895053, 17974610, 17371548, 17521527, 17968341, 17968190, 17442255, 16860751, 16429100, 15964335, 15461031, 15173383, 15095501, 14890684, 14454475, 14103403, 14066033, 14170671, 14173464, 14040811, 13772598, 13299503, 12725854, 12353785, 12272179, 12193299, 11885143, 11521054, 11410989, 11594998, 11872519, 12039370, 11941551, 11492641, 10811568, 10195277, 9827964, 9660092, 9637607, 9827062, 10209986, 10592769, 10861189]
43774A0861189K44810K64529J55810K8040J22629L31172L33134J87441K76345
43765A2805099O15462P48492M62371J05392K261L3668M6583K13395O31392R48233
43755A6612348P99641L66858J18940J90882L66010N13327O85807Q72535R64796
43746B1491144R37152Q56017P87872Q53168J187790J641707J759292J376123R98836
43737C1889101J158268J557517J407402N72224k14025l96240k74226l50477n45236
43728C4804308n25544m20191o25224j091374j388804j432165j570549j877867
43720B5872590j914411j441501r09100q62157j180219j318845j109847q90470
43712A6246040r04046r76512q51089n52382l17108l34125n92301q59348q54058
$$ y = [10861189, 11105999, 11370528, 11526338, 11554378, 11677007, 12008179, 12341313, 12528754, 12805099, 13420561, 14169053, 14631424, 14736816, 14739077, 14772745, 14819328, 15032723, 15664115, 16612348, 17411989, 17778847, 17897787, 18088669, 18454679, 18968006, 19653813, 20526348, 21491144, 22428296, 23284313, 24072185, 24925353, 26113143, 27754850, 29514142, 30890265, 31889101, 33047369, 34604886, 36012288, 36584512, 36370487, 35974247, 35700021, 35349544, 34804308, 34278764, 33858573, 33233349, 32141975, 30753171, 29321006, 27750457, 25872590, 23958179, 22516678, 21607578, 20745421, 19565202, 18246357, 17136510, 16246040, 15341994, 14365482, 13514393, 12962011, 12644903, 12310778, 11718477, 10859129, 10005071]
43703A0005071n89838m39508o39930q81384p29407l30864k22363m44572m19660
43694E307545J09816N81691M11239j67680n10626m60926l27927k22562O731K79933
43684E007234L00264R7566N5517K82692L91198Q0101m12700o54279n54219l53093
43674D240281k57001k68244k75879j94103o4456l3009j40619k03211o9308R0249
43664B824700N746k36922k90620r9831O888j35650k58097j07710J53204K30867
43654B092575J22550R806n8570j24974j35900m8335J0519o8095j36246J3081K79024
43643A955435L27087K9131l53850m56137j72475K59544M84849L70446J33925N3214
43633B631169Q3946l6809l06050l82870j25907J23016L7524j95184k04304l4775
$$ y = [10005071, 9415233, 8975725, 8335795, 7454411, 6725004, 6394140, 6171777, 5727205, 5307545, 5417361, 5999052, 6410291, 6242611, 5731985, 5271059, 4943132, 4720570, 4727301, 5007234, 5307498, 5405064, 5460581, 5743273, 6134471, 6214572, 5801872, 5147593, 4593374, 4240281, 3983280, 3715036, 3439157, 3245054, 3180598, 3147589, 3006970, 2803759, 2734451, 2824700, 2830446, 2593524, 2302904, 2203073, 2209961, 2074311, 1816214, 1708504, 1861708, 2092575, 2215125, 2224931, 2166361, 2041387, 1905487, 1857152, 1867671, 1799576, 1663330, 1676411, 1955435, 2282522, 2311653, 1957803, 1501666, 1329191, 1588735, 2073584, 2444030, 2577955, 2631169, 2715115, 2678306, 2372256, 1989386, 1863479, 1986495, 2024019, 1828835, 1624531, 1589756]
43623A589756q335j24162o6296J92222K56209p4258m25526l30279J47205N14062
43613A670598M60137J55216l6162J2522R0885m2953l07350l48966m415M22465
43603B071977M97686J69948k49678n23852o29447n11717o6157N32475Q20121N77871
43593B689227J42428m0309K7807L9741q8036j53053o5871J8969O684P453P4920
43582B659960M7636j75404l78196k70311Q7782L20083K08623n1219j42859l2803
43572B273292N4232n414p6630j1074R0611k076l09361n67345n37735k76541k715
43561F29244K11025M58830P28327P98231N16160N8051k38375k44684j06598J5856
43551B826067R4194J21535O7397N909Q0250K22620J23846l22845p33619o60633
$$ y = [1589756, 1581421, 1457259, 1390963, 1583185, 1839394, 1765136, 1339610, 1009331, 1156536, 1670598, 2130735, 2285951, 2249789, 2262311, 2353196, 2310243, 2002893, 1653927, 1649512, 2071977, 2569663, 2739611, 2489933, 1966081, 1336634, 824917, 758760, 1291235, 2111356, 2689227, 2831655, 2791346, 2819153, 2858894, 2770858, 2617805, 2551934, 2570903, 2577587, 2585040, 2659960, 2707596, 2532192, 2153996, 1883685, 1971467, 2291550, 2500173, 2448954, 2306095, 2273292, 2327524, 2322110, 2245480, 2234406, 2325017, 2322941, 2013580, 1446235, 908500, 631959, 629244, 840269, 1299099, 2027426, 2825657, 3341817, 3399868, 3161493, 2916809, 2810211, 2826067, 2920261, 3041796, 3109193, 3115102, 3195352, 3417972, 3541818, 3218973, 2485354, 1824721]
43541A824721j89777J92146K59008K21428K38787J63032q4407k50901j31743N9872
43531B302166Q467k05792k49400o1606R1002M8204o0500q7044n6829l7452l2341
43520A658875n9069j42980j92790q3197Q9872O0594k03436l67512j58680K37311
43510H38988L96510J72220j91748m00593l79533k18638j7333J57917K53093K28973
43500H39856P4394j72135l91745m29653k48983j3700P8036M2884Q4195K75692
43490A38841L96324K07146j66896l14575n4836K83863K61904p1742k08515J34979
43480F06493N85545N69758Q3264k86910j54783J39378K3349m66581p02168l48945
43470D8400J42081J73971j46014k09607J50027M31312K84621L7141P1541J30094
$$ y = [1824721, 1634944, 1827090, 2086098, 2307526, 2546313, 2709345, 2624938, 2374037, 2242294, 2302166, 2310633, 2104841, 1855441, 1793835, 1884837, 1933041, 1872541, 1785497, 1728668, 1691216, 1658875, 1599806, 1456826, 1264036, 1180839, 1270711, 1331305, 1127869, 760357, 601677, 838988, 1235498, 1407718, 1215970, 815377, 435844, 217206, 199873, 357790, 610883, 839856, 914250, 742115, 350370, -79283, -328266, -341966, -263930, -221046, -136851, 138841, 535165, 742311, 575415, 260840, 206004, 489867, 751771, 680029, 471514, 606493, 1192038, 1761796, 1845060, 1558150, 1403367, 1542745, 1566094, 1099513, 397345, 48400, 190481, 364452, 218438, 8831, 158858, 590170, 874791, 911932, 983473, 1113567]
43460A113567k27733p56269p78577k48112J33477j4070k31415o4579J98157J09807
43450g65747j22244j7793L22152M11984K46174K75197N49167N65145R9349l99483
43440A163901m73453k24460K7916K12884L36725K45413p1077k39757L3600M64176
43430A475868N25738J53686k43796l86101l74442l63344l16151j70210l584P9304
43420C76968R3742J26634K17252L15325L08385J14469j90090l84679l30336j35409
43410E12261j2237k4612o9821n0701M1342J62577K27307J34984r1374k35898r7752
43399D96076K33326M26033K55248j67486n10213n12934j88447K02663L89796L43163
43389I67225K51362K32339J73496n6255l41340m20185k21963L5174J03052k5433
$$ y = [1113567, 885834, 129565, -649012, -897124, -763647, -777717, -1009132, -1073711, -875554, -765747, -887991, -905784, -583632, -171648, 74526, 349723, 898890, 1464035, 1563384, 1163901, 690448, 465988, 493904, 706788, 1043513, 1288926, 1217849, 978092, 1011692, 1475868, 2001606, 2155292, 1911496, 1525395, 1150953, 787609, 471458, 301248, 297664, 376968, 470710, 597344, 814596, 1129921, 1438306, 1552775, 1362685, 978006, 647670, 512261, 500024, 475412, 405591, 354890, 396232, 558809, 786116, 921100, 829726, 593828, 496076, 729402, 1155435, 1410683, 1243197, 732984, 220050, 31603, 234266, 624062, 967225, 1218587, 1450926, 1624422, 1568167, 1226827, 806642, 584679, 619853, 722905, 697472]
43379F97472j30159j3710K60865L86833J37553l13645n17689k61049J72683L59985
43369G79139K33696O9293P1864J73570K13454J32432l4290k15401l12737k50727
43359H60293n4864J63960K92552K55734N3183j75625k29957j01616l2004j66598
43349H65058k91360j40567J50657K15192L4854j4608K27604M21273K44559j00169
43339A612493j77645P9466L54400M10770K81053N2982k32913m53957m42856k39678
43329A244115j02382j68930k79132k36423q4450J6441N3066J18434J81842R5211
43319H37792j67411m24536m66763k23205K31315O94387Q70795N88939O0402k50900
43309A750815j38757J14611J51463P076n7433m6912k18867n78882p40319m42706
$$ y = [697472, 567313, 553603, 814468, 1201301, 1338854, 1025209, 507520, 246471, 419154, 779139, 1012835, 1082128, 1153992, 1327562, 1541016, 1673448, 1639158, 1423757, 1111020, 860293, 805429, 969389, 1261941, 1517675, 1570858, 1395233, 1165276, 1063660, 1031656, 865058, 573698, 433131, 583788, 798980, 833834, 819226, 1046830, 1468103, 1712662, 1612493, 1434848, 1514314, 1868714, 2279484, 2560537, 2613519, 2380606, 1926649, 1483793, 1244115, 1141733, 972803, 693671, 457248, 372798, 389239, 442305, 560739, 742581, 837792, 670381, 245845, -220918, -444123, -212808, 481579, 1352374, 1941313, 2001715, 1750815, 1612058, 1726669, 1878132, 1885208, 1827775, 1780863, 1561996, 983114, 242795, -199911]
43299a99911M3956K48690P4908j77536k68720k52049k54051k45367j36074K4073
43289a142081Q5105L2881O9637L59241P22390P41841K65022l23439n04452k32650
43279G3495O8466R7628P354P9203L08327M53658L39434j5718m28131o12618l85369
43268a4271Q5561L96721L69934K01308P3936p9792k64913k29801R7601K86589
43258I22873n2420o05560p18116l13048N2792L1263j30241j30370n5558q6254
43248a084639j58561j55378j28881j13553J1620K61514L97875K66184N9111K8454
43238f16254J40304K26881K69961K99537K12717l8149k40838j82926J4961R2371
43228A78565M1192J1240m3301k52883m28855j99621L70782P00178M25524r1679
$$ y = [-199911, -155955, 92735, 167643, -9893, -278613, -530662, -784713, -1030080, -1166154, -1142081, -1056976, -1024095, -954458, -595217, 127173, 869014, 1134036, 810597, 306145, 73495, 141961, 239589, 246943, 326146, 634473, 1088131, 1427565, 1411847, 983716, 371098, -14271, 71290, 468011, 837945, 1039253, 1113189, 1033397, 768484, 538683, 636284, 922873, 870453, 264893, -453223, -766271, -713479, -682216, -812457, -942827, -998385, -1084639, -1243200, -1398578, -1527459, -1641012, -1629392, -1367878, -970003, -703819, -644708, -616254, -475950, -249069, 20892, 320429, 533146, 494997, 254159, 71233, 86194, 178565, 219757, 230997, 187696, -65187, -494042, -693663, -322881, 377297, 802821, 711142]
43218G11142k67488o6120P7634j9135n8418J81440M42753L86943J38412Q2167
43208A609330K29930J86423k06892n82805n83380l51020k14253j69224l7352Q1193
43198c8050l2216k11827o9059L32085M68200J41566k15195k24568r0741j40481
43188h0286k51487j34576J25082K38016K00265J91117J60407l3922j96791J0389
43178B28214M60746O13608K60253j89054l09376k00312k09919l82456m39459j96056
43168c63811K00090M22870K83299p4167k82810j34410J71142K62972M8944k21876
43158C12243l17980k50246j16194P1066K98956M47710L92539J60017q1080j58653
43148G58378l1605J60139K06291N1543j41664k25371k51128k95163k47210j1824
$$ y = [711142, 443654, 377534, 455168, 436033, 377615, 559055, 1001808, 1388751, 1527163, 1609330, 1839260, 2025683, 1818791, 1235986, 652606, 301586, 87333, -81891, -119243, -38050, -70266, -282093, -351152, -19067, 449133, 590699, 375504, 150936, 60195, -80286, -331773, -466349, -341267, -103251, 97014, 288131, 448538, 414616, 217825, 228214, 688960, 1302568, 1562821, 1373767, 1064391, 864079, 654160, 271704, -167755, -363811, -163721, 259149, 542448, 468281, 185471, 51061, 222203, 485175, 534119, 312243, -5737, -255983, -372177, -301111, -2155, 445555, 838094, 998111, 917031, 758378, 726773, 886912, 1093203, 1144746, 1003082, 777711, 526583, 231420, -15790, -27614]
43138b7614J89014M8640k93351l22294J25727N45499M06073j32571m46163k59316
43128a66356Q5689J68859J5001n1066J01243K60417K12789O1657P5840K75579
43118A039652L59397J24432k02379k37088L2631K15298L7931k98070l91739j55775
43108E24290Q1412k2940m05997o41070m16683Q8285M16595L90578K66339K89643
43098E70452L60008L03849K15461K28278J55832k34624o90248o75138j46124L05474
43088C93220K28569j40135k93267r8539K05442M04019M41717L34247J67022O3756
43078A706051J4319j15837k99961l02231o7686J05458J2080r9972P4279L57349
43068A383849L34077J2999j85847r8283m6103k76264n33009m32252l6144K30764
$$ y = [-27614, 161400, 210040, -83311, -405605, -279878, 265621, 671694, 539123, 92960, -166356, -80667, 88192, 103193, 52127, 153370, 413787, 626576, 688233, 764073, 1039652, 1399049, 1523481, 1321102, 1084014, 1116645, 1331943, 1369874, 1071804, 680065, 524290, 605702, 582762, 176765, -464305, -880988, -792703, -376108, 14470, 280809, 570452, 930460, 1234309, 1449770, 1678048, 1833880, 1599256, 909008, 233870, 87746, 393220, 621789, 481654, 188387, 89848, 295290, 699309, 1141026, 1475273, 1642295, 1706051, 1720370, 1604533, 1304572, 1002341, 934655, 1040113, 1052193, 952221, 1026500, 1383849, 1717926, 1730925, 1545078, 1446795, 1400692, 1124428, 591419, 159167, 123023, 353787]
43058C53787J59010r190L8671K55725L21771Q5468k38048l42320j69240J13908
43048E69542L55736M85716M24929J44223k00811l92286m13686l98886l42361j29511
43038A02605J27471J20204j77064l92155k90985r3460k2308J02395M57691P17404
43028F51798M47564j57568m49369k09910J16839J36926j4723p5697j25360l53014
43018c2514o09523n30147m8265M53135N46527K15166j35349j05659K69287N61912
43008E84570M42428M1388k52277k58059j38502j26959k54872l30860j24564L56476
42998f1231P37144O02206N2324l13914j65172R9889l3373m04256m68839j87794
42988a43016k8642j20866n8094L12464N29002K58854j21611j18000J12032P5786
$$ y = [353787, 512797, 503607, 542278, 798003, 1119774, 1205242, 967194, 624874, 455634, 569542, 925278, 1410994, 1835923, 1980146, 1779335, 1387049, 973363, 574477, 232116, 102605, 230076, 350280, 173216, -218939, -509924, -603384, -625692, -523297, -65606, 651798, 1099362, 941794, 492425, 282515, 399354, 536280, 521557, 445860, 320500, -32514, -642037, -1172184, -1220449, -767314, -220787, -5621, -140970, -246629, 22658, 584570, 1026998, 1068386, 816109, 558050, 419548, 292589, 37717, -293143, -417707, -61231, 675913, 1278119, 1330443, 1016529, 851357, 951246, 917873, 513617, 44778, -143016, -171658, -292524, -350618, -38154, 490848, 749702, 628091, 510091, 622123, 697909]
42978F97909k28603l26617j1604L85153M81323K46196j19940m14910m86946l01594
42968g9633l4616P0726j1602q2243o747J26245J57236M2379j34748k38618j59037
42957c50658R7281L78661N09472M35266K26737N089r6158J50J95783K59313Q8857
42946A749793j49407k38190j64060n4186J5283J2405j10192k83074k54895R8946
42936F22423M78632M42253j8655m37797m42638j33253J63213K84932K71149J97213
42926A427472J24023R5735O3187j00530m00308o15431n11582j16237L05696N22569
42916G94594N12217L90453K36060J8538k96881n93588o40809l66372j9880Q6979
42906A21311j6091K298K90159N65590M84828J05696j99199k13012o6682K1256
$$ y = [697909, 469306, 142689, 131085, 516238, 997561, 1243757, 1123817, 708907, 221961, -79633, -114249, -43523, -55125, -137368, -144115, -17870, 139366, 181745, 46997, -191621, -350658, -253377, 125284, 634756, 1070022, 1296759, 1301848, 1205690, 1205840, 1401623, 1660936, 1749793, 1600386, 1362196, 1198136, 1143950, 1159233, 1171638, 1061446, 778372, 523477, 622423, 1101055, 1543308, 1524653, 1086856, 644218, 510965, 674178, 959110, 1230259, 1427472, 1551495, 1647230, 1710417, 1609887, 1209579, 594148, 82566, -33671, 272025, 794594, 1306811, 1697264, 1933324, 1951862, 1654981, 1061393, 420584, 54212, 34332, 121311, 105220, 107518, 397677, 963267, 1448095, 1553791, 1354592, 1141580, 1074898, 1096154]
42896A096154J0332p553J8909O3356R0869R1662P0514L6372j4050r5749j75840
42885A184976j45306M9008K50990K24102j2496j46794k07J78516O6428k14099
42875A435118k49765J1707J42455j09840m12322l49391l7219J14047L8258l484
42865E79564M5354j2043j60196j44932J489r2992m66319n81881j03323N02153
42855d33126N82205K12914j8458O3968R7896q6512k04507q3136L8015k8017r4523
42844D6719N333R5499K8124L1481L15776N99888M62346P934k57502j60241l5697
42833A139660j41811l09217l09249k14178j77378j28568N1466K37162K15967M2697
42823D06551k2742J03551K43542K53519J81333P9243j20818m16080n76969l73501
$$ y = [1096154, 1106486, 1098933, 1117842, 1181198, 1272067, 1363729, 1434243, 1470615, 1456565, 1360816, 1184976, 1039670, 1088678, 1339668, 1563770, 1551274, 1404480, 1404273, 1582789, 1649217, 1435118, 1185353, 1197060, 1339515, 1229675, 817353, 467962, 430743, 544790, 583048, 579564, 624918, 612875, 452679, 307747, 309236, 216244, -250075, -831956, -935279, -433126, 149079, 361993, 343535, 407503, 505399, 418887, 214380, 131244, 169259, 141242, 46719, 52052, 147551, 175675, 207156, 522932, 1122820, 1585166, 1593100, 1335598, 1175357, 1139660, 997849, 688632, 379383, 165205, -12173, -140741, -89275, 147887, 363854, 406551, 383809, 487360, 730902, 984421, 1165754, 1244997, 1124179, 708099, 131130, -242371]
42813b42371Q5858M06766L38153N0398p9947Q1809K79616J95043j39503l60301
42803F15521k17154J27703L36052L11352K11415J22133l2962k38282l10695j99917
42793G25166j30999k65144m16642l39087j30946p0538j50808j04662J25915K74296
42783d83449J64751m2922j28235q1514K2388J89616L80421M02104J25579k87940
42773B60799n23010m11656l0203L96225O20325N36146K92945J25699M2716j34234
42763A175752l89204m49555k27959l5265j37074l51662l55451j67172j2752J11463
42753h38879L68119O64331O90239L83357L9572q4616k9767L6187J3998j26590
42743A115951l27660m01512k05614J30965L37386L33064K39282J27075L178j9356
$$ y = [-242371, -156513, 250253, 588406, 638804, 558857, 640666, 920282, 1115325, 975822, 615521, 398367, 526070, 862122, 1173474, 1384889, 1507022, 1474060, 1235778, 925083, 725166, 594167, 329023, -87619, -426706, -557652, -628190, -778998, -883660, -757745, -483449, -318698, -361620, -489855, -571369, -548981, -359365, 21056, 423160, 548739, 260799, -262211, -673867, -704070, -307845, 312480, 848626, 1141571, 1267270, 1309986, 1175752, 786548, 336993, 109034, 73769, -63305, -414967, -770418, -937590, -950342, -838879, -470760, 193571, 883810, 1267167, 1306739, 1222123, 1192356, 1228543, 1242541, 1115951, 788291, 386779, 181165, 312130, 649516, 982580, 1221862, 1348937, 1352115, 1332759]
42733A332759J50663L13016J88952q0700m9391L27752N21460J77265l33270m20248
42723B128258o9985K13432J10840j96510l66909k88459j02909K81k9929q7398
42713A310712r5072j60900l92619n88740l91081J74968O10102N61163K56850J03566
42703A388949J22455R8909N7822J79849L58140K72325q4312l41494l00855k00992
42693A550796k86424m16099l25532o2364J02797Q4776M4551P4143O1658p7241
42683G51061k25905k36032j40474o1550j593R8725J43725l8443l50968m12519
42673d73973m9881L93909M78794K51372J23225K49883L67128K59895O0692j9545
42663A641499K4136J03571J84629J86468j6563l28410m13915j56832R1546j9237
$$ y = [1332759, 1483422, 1796438, 1985390, 1904690, 1855299, 2183051, 2704511, 2881776, 2548506, 2128258, 2058273, 2271705, 2382545, 2186035, 1819126, 1530667, 1427758, 1428039, 1398110, 1310712, 1215640, 1054740, 662121, 73381, -317700, -142732, 467370, 1028533, 1285383, 1388949, 1511404, 1610313, 1668135, 1847984, 2206124, 2478449, 2394137, 2052643, 1751788, 1550796, 1264372, 848273, 522741, 460377, 563174, 647950, 692501, 766644, 828302, 751061, 525156, 289124, 148650, 87100, 85507, 184232, 327957, 289514, -61454, -473973, -523854, -129945, 348849, 600221, 723446, 973329, 1340457, 1600352, 1661044, 1641499, 1665635, 1769206, 1953835, 2140303, 2123740, 1795330, 1381415, 1224583, 1316129, 1296892]
42653A296892l04682k88930J10008M49667L30660j43885n40007n71530l31639
42644F554j11380n0704j9319J23740K67539K27382J03872J65812L68874L56651
42634A439021N0480j55978q525J84859O2034j99349j95263N7453K22077J99404
42624A656213J45189Q4506l6910m1168K52444N60895M19643o8465k85213L4599
42614B721733M83377O36792N34343L42508L6884l19716m20324j61773R1429J3199
42604C958452k07597k21607q4553j04776l13718m51363l75222j74550M2719J98146
42594B265931J50646j58523m88015m79340r0728L32340M46955K42612j9238q0612
42584B122028R5592L02443L06897J36111N6264J93531L12870J28452k66127m79151
$$ y = [1296892, 992210, 703280, 813288, 1262955, 1593615, 1449730, 909723, 338193, 6554, -104826, -155530, -174849, -51109, 216430, 443812, 547684, 713496, 1082370, 1439021, 1489501, 1333523, 1324998, 1509857, 1571891, 1372542, 1177279, 1234732, 1456809, 1656213, 1801402, 1885908, 1848998, 1807830, 2060274, 2621169, 3040812, 2972347, 2687134, 2721733, 3205110, 3841902, 4376245, 4718753, 4755637, 4435921, 4015597, 3853824, 3945253, 3958452, 3750855, 3529248, 3444695, 3339919, 3026201, 2574838, 2199616, 2025066, 2067785, 2265931, 2416577, 2258054, 1770039, 1290699, 1199971, 1532311, 1979266, 2221878, 2202640, 2122028, 2217620, 2520063, 2826960, 2963071, 3019335, 3212866, 3525736, 3654188, 3388061, 2908910]
42574B908910l07746M1340K42400J99821L0154j79586m41887o95121p08737l16720
42564G72828K64643N37749K66650k01048l24089j988L74233M51671K55256j0355
42554B385550k40100m10403m76442m15107k60171k9404K69754N30785N89027M16181
42544B359670J46939r9256k78765l31482k31842j23538j70465k74386k08155l0020
42534G58700k5972j85264j30584K71334O21823N62204K85319J60892J47424l7493
42524B428383l57741m78568k77391N453J22416O8361l6161j16849j72888k31944
42514I53071k73619j95797L2199K10128J25728o8651j8026K48953L06020L7940
42504A357946j14426J18174L52658J97483p9422l5416J87998J91796R0165K69842
$$ y = [2908910, 2601164, 2642504, 2884904, 3084725, 3114879, 2935293, 2493406, 1798285, 1089548, 772828, 1037471, 1575220, 1841870, 1640822, 1316733, 1314745, 1688978, 2140649, 2395905, 2385550, 2145450, 1735047, 1258605, 843498, 583327, 553923, 823677, 1354462, 1943489, 2359670, 2506609, 2407353, 2128588, 1797106, 1565264, 1441726, 1271261, 996875, 788720, 758700, 732728, 547464, 416880, 688214, 1310037, 1872241, 2157560, 2318452, 2465876, 2428383, 2070642, 1592074, 1314683, 1320136, 1442552, 1510913, 1474752, 1357903, 1185015, 953071, 679452, 483655, 515854, 725982, 851710, 783059, 765033, 1013986, 1320006, 1357946, 1243520, 1361694, 1714352, 1911835, 1832413, 1796997, 1984995, 2176791, 2266956, 2536798]
42494B536798N75019M60610r1340m96444m40728j90830K4551K90244N30254M07804
42484C605938n5914l26720j08406K32566K73492J15891O2653J29103J93053K74004
42474D395660L58659K71763j509j81585j34516r7652k00988j54404K43909O53737
42464E153074O52299L40092P2237j24046l95107n70114l64627M3584J62673j07965
42454D862100l75636l74720k60935k13890j38528Q5244L43656M45915L58293J65714
42444D897213o5435l00550m92867n59009l76855R5200O18787P70298M29438K7083
42434E043303N3213M27798O53834N23411L30313L71091N81216P68721R08382J033479
42424A0694761J059685R21104P53520P58610R41125J112696J130220J035421R58285
$$ y = [2536798, 3111817, 3572427, 3481087, 2984643, 2543915, 2353085, 2377636, 2667880, 3198134, 3605938, 3550024, 3223304, 3114898, 3347464, 3620956, 3736847, 3799500, 3928603, 4121656, 4395660, 4754319, 5026082, 5024573, 4842988, 4708472, 4610820, 4409832, 4255428, 4499337, 5153074, 5805373, 6145465, 6217702, 6093656, 5698549, 5128435, 4763808, 4807392, 4970065, 4862100, 4486464, 4111744, 3850809, 3636919, 3498391, 3583635, 3927291, 4373206, 4731499, 4897213, 4831778, 4531228, 4038361, 3479352, 3102497, 3197697, 3816484, 4586782, 5016220, 5043303, 5096516, 5524314, 6178148, 6701559, 7031872, 7402963, 7984179, 8752900, 9661282, 10694761, 11754446, 12675550, 13429070, 14187680, 15128805, 16241501, 17371721, 18407142, 19365427]
42415A9365427R32488Q20963M39628k13800q73514j210008j139846r06600q46657
42406A6368081j074029j374243j413733j089318o44650l79817l12935k73871k66954
42397I538531m72216q38032r76796o53698j52650P2301n7969k78859m02699m45596
42387E332317m40423l91032l59800l75733l17889j04521R0054N4063j09380j27798
42377C249858L119L6466r1181j67923q4737Q530M000P66N5001K7084j72888l90162
42365B477933m16661k23399Q6815L86019N05617L23318j9025j79167l1026J58131
42355C068555J07814r3365j61148k9490J12153J20125N1938M0635J37832K67386
42345C622435K63592J0181l78983n86015m07881k2245J69082k2897l62079m53830
$$ y = [19365427, 20297915, 21118878, 21558506, 21344706, 20471192, 19261184, 18121338, 17214738, 16368081, 15294052, 13919809, 12506076, 11416758, 10772108, 10392291, 10079356, 9805485, 9538531, 9066315, 8228283, 7251487, 6597789, 6445139, 6517440, 6459471, 6180612, 5777913, 5332317, 4891894, 4500862, 4141062, 3765329, 3447440, 3342919, 3432973, 3487036, 3377656, 3249858, 3252977, 3289443, 3198262, 3030339, 2945602, 2954132, 2958132, 2958898, 3013899, 3040983, 2868095, 2477933, 2061272, 1837873, 1924688, 2310707, 2816324, 3139642, 3120617, 2941450, 2910424, 3068555, 3176369, 3083004, 2921856, 2892366, 3004519, 3124644, 3176582, 3217217, 3355049, 3622435, 3886027, 3896208, 3517225, 2931210, 2523329, 2501084, 2670166, 2647269, 2285190, 1831360]
42335A831360j99119R3206J08128l9994L8922M10182O44206M15045k981j48811
42325C150144p0516j65044m17082l38864K19639P01838N60967j4352m02353l22456
42315B901921r352J96261J48018q6624k80040k26901k3330R474j86143k62949
42305B180335k4637K02035R0596q7048J40706O25489P11937J50631n82727r34945
42295B472372q15550m18342O0075L77506L25927O3875L2206L26334M88590J90309
42285C103302k07686j50049K83264M79413J56535k80816l11145Q8914N17489O18449
42275D297670L47080q8044m05337m30617k00733J04919L40861M69568M87142L84670
42265E307179K29466J91902L83838O83586Q20216O79501M64401M69813P24044
$$ y = [1831360, 1632241, 1725447, 1833575, 1793581, 1832503, 2242685, 2886891, 3301936, 3298955, 3150144, 3079628, 2914584, 2497502, 2158638, 2378277, 3080115, 3641082, 3626730, 3224377, 2901921, 2892569, 3088830, 3236848, 3150224, 2870184, 2643283, 2619953, 2629427, 2443284, 2180335, 2155698, 2357733, 2448329, 2361281, 2501987, 3127476, 3839413, 3990044, 3407317, 2472372, 1656822, 1238480, 1298555, 1676061, 2001988, 2065863, 2098069, 2424403, 2912993, 3103302, 2895616, 2745567, 3028831, 3508244, 3664779, 3383963, 3072818, 3161732, 3679221, 4297670, 4644750, 4556706, 4151369, 3720752, 3520019, 3624938, 3965799, 4435367, 4922509, 5307179, 5536645, 5728547, 6112385, 6795971, 7616187, 8295688, 8760089, 9229902, 9953946]
42256I953946R71812J045052J109032J410582J874331K144405K033112J749945
42248B2292217J616634J682142J698339J389482O93898j69713q37594j114407
42240B7250998j191319j415970j805310j985086j719143j272210j039592j007914
42232A5814454q76058n96806m49157n69043p37043p23535n76424m46468l59551
42223A0480369l00844l15582l69346l03339j12475q4747m26853q79352r69365
42214F718466n93081j03431J61978J96044J36733R884k10444m17181l95614m3388
42204E459966M62669P48524N84488J92180O9595L74813O36753L26610l79235p49794
42194G726569m49580J4868j9516n16186q53020o57916k25072p0390k92691n09065
$$ y = [9953946, 10925758, 11970810, 13079842, 14490424, 16364755, 18509160, 20542272, 22292217, 23908851, 25590993, 27289332, 28678814, 29372712, 29202999, 28365405, 27250998, 26059679, 24643709, 22838399, 20853313, 19134170, 17861960, 16822368, 15814454, 14938396, 14341590, 13892433, 13323390, 12586347, 11862812, 11286388, 10839920, 10480369, 10179525, 9863943, 9494597, 9191258, 9078783, 8994036, 8567183, 7687831, 6718466, 6125385, 6021954, 6183932, 6379976, 6516709, 6526593, 6316149, 5898968, 5503354, 5459966, 5922635, 6671159, 7255647, 7447827, 7517422, 7892235, 8528988, 8855598, 8476363, 7726569, 7276989, 7291857, 7272341, 6756155, 5903135, 5245219, 5020147, 4949757, 4657066, 4148001]
42184D148001l53568R6868M57173N18257M31561L79831K90196N8287j40915p6942
42174E808749J13569J01710p2347l9970K44656L69858J53639j5022J80659M42079
42164G287580L67527J43681K20901N46558O69394M84439L38329M14608N04506
42155A0977523M36606L09469K23257J41310P1099M6981p6697m42755p96538p05365
42145A0184890k32346N9391j06122l74025l66715j83310n5561O8214K82063M16074
42135I692553L11464J31052P7462M0216j64007m07897m25322k15013l832O4277
42125I100953l382j31004j49978J00154M68485N40280J84710k30062l85417m28950
42115I065789n56682n72679k84063J2423n0801k75924k32287q249k7551k61737
$$ y = [4148001, 3794433, 3891301, 4348474, 4866731, 5298292, 5678123, 5968319, 6026606, 5885691, 5808749, 5922318, 6024028, 5951681, 5911711, 6156367, 6526225, 6679864, 6664842, 6845501, 7287580, 7655107, 7798788, 8019689, 8566247, 9235641, 9720080, 10058409, 10473017, 10977523, 11414129, 11723598, 11946855, 12088165, 12159264, 12206245, 12129548, 11686793, 10890255, 10184890, 9952544, 10011935, 9905813, 9531788, 9165073, 8981763, 8926202, 8994416, 9276479, 9692553, 10004017, 10135069, 10212531, 10252747, 10088740, 9680843, 9255521, 9040508, 9036676, 9100953, 9097571, 8966567, 8816589, 8916743, 9385228, 9925508, 10110218, 9880156, 9494739, 9065789, 8509107, 7936428, 7652365, 7664788, 7613987, 7338063, 7105776, 7097527, 7069976, 6808239]
42105F808239k84909p6734r5866m68960p44767o31853m01071l23655k48101k7475
42095C504848J15701m215j63837j09725L5498P1312P5110J06392q1693n77674
42085B971717q59661l81134N19281Q74886L03614n32457q19424n12377j26519
42076A437926M1086J11871K02334J92724j0013k39788k70511j22580M200M6185
42066A393434J26349K75637L21070J61070l1599m9949M8541Q2933O8254J51765
42056B547505L04334L38968K17619R3415M9569L3761N0231J67163L19753L53475
42046D475793K72156J91045P0967j78268l51833j35398K92665L29203j79514o03842
42036D182974l97081J23410K95023P9080j9395J78093K96842O3605k85527l81554
$$ y = [6808239, 6523330, 6446596, 6350730, 5881770, 5137003, 4505150, 4104079, 3780424, 3532323, 3504848, 3620549, 3616334, 3452497, 3342772, 3378270, 3449582, 3524692, 3631084, 3549391, 2971717, 2112056, 1730922, 2250203, 3125089, 3428703, 2896246, 2076822, 1564445, 1437926, 1479012, 1590883, 1793217, 1985941, 1975928, 1736140, 1465629, 1343049, 1347249, 1393434, 1519783, 1795420, 2116490, 2277560, 2245961, 2196012, 2244553, 2327486, 2395740, 2547505, 2851839, 3190807, 3408426, 3501841, 3551410, 3585171, 3635402, 3802565, 4122318, 4475793, 4747949, 4938994, 5009961, 4831693, 4479860, 4344462, 4637127, 4966330, 4786816, 4182974, 3785893, 3909303, 4204326, 4283406, 4264011, 4442104, 4738946, 4802551, 4517024, 4135470]
42026D135470j79190J00473K53816K08137K2856j33241j27136k8954k7988j69389
42016D054854k87790k16745K9005K82566L68453K45724O5320K7303J34827J93939
42006D897456J10597K2685L6125L8472m2407o039L12967O53321N89243J44660
41996F757080j93919j32663N1994q0911n51073r29780q18862k63030L00839M87792
41986D627467L38516J76992J30568J2885k45956l58832j11241K30470K88826J64668
41976E254363K42581N21214O11782L98041K05255K05247J31657j83941m02049
41967F984150j32549M67880Q92553R20348P57714O38064N43794L20908q5960n09300
41957A0797602o27529k72924K74308M86045K00305j58543j42317J32903K00793
$$ y = [4135470, 3956280, 4056753, 4310569, 4518706, 4541562, 4408321, 4281185, 4252231, 4224243, 4054854, 3767064, 3550319, 3579324, 3861890, 4230343, 4476067, 4541387, 4568690, 4703517, 4897456, 5008053, 5030738, 5066863, 5105335, 5062928, 5056889, 5369856, 6023177, 6612420, 6757080, 6563161, 6430498, 6482492, 6401581, 5850508, 4920728, 4101866, 3838836, 4139675, 4627467, 4965983, 5142975, 5273543, 5286428, 5040472, 4681640, 4570399, 4800869, 5089695, 5254363, 5496944, 6018158, 6629940, 7027981, 7233236, 7438483, 7570140, 7386199, 6984150, 6851601, 7319481, 8212034, 9132382, 9890096, 10528160, 11071954, 11392862, 11306902, 10797602, 10170073, 9897149, 10171457, 10657502, 10857807, 10699264, 10556947, 10689850, 10890643]
41948A0890643j01517m89490o82966p01092o67356n76687l79532j49902m5272
41939G096829j46972l84923n76236n41752k67430L6337J17663n1333k60775l26105
41929D695303k72514k15791j60364k3906J78320L07019K93567K49579K85709K98636
41919E635558R7575k59449m44349k73170Q943K1363k63508n17629n08520l44670
41909C152144k35170j97207j11330N1769J85072J87329P3557m7277p5962j3469
41899B969456N6936Q7262J13523J50277J23247m655j28250j45132j19734j46788
41889B956142j42794J3015J92602J34131j63468m23711m88309m50630l55790r6246
41879A174942K76197M63111L37649J61405J59544J61885n0127l01866k96334j35928
$$ y = [10890643, 10789126, 10299636, 9616670, 8915578, 8248222, 7671535, 7292003, 7142101, 7096829, 6949857, 6564934, 5988698, 5446946, 5179516, 5215853, 5333516, 5282183, 5021408, 4695303, 4422789, 4206998, 4046634, 4022728, 4201048, 4508067, 4801634, 5051213, 5336922, 5635558, 5733133, 5473684, 5029335, 4756165, 4765108, 4786471, 4522963, 4005334, 3496814, 3152144, 2916974, 2719767, 2608437, 2660206, 2845278, 3032607, 3106164, 3058887, 2982925, 2969456, 3026392, 3113654, 3227177, 3377454, 3500701, 3496046, 3367796, 3222664, 3102930, 2956142, 2813348, 2826363, 3018965, 3153096, 2989628, 2565917, 2077608, 1626978, 1271188, 1174942, 1451139, 1914250, 2251899, 2413304, 2572848, 2734733, 2684606, 2382740, 2086406, 1950478]
41869A950478j52755l07920k05805K52974O32932N22496M1470l70570m56578k76426
41859A630296r466K05114L09932L26061K76919J03286k51638o65239q75755p43444
41849C06066l75003J6146K52534K20522m8862k97661k50077K3837J65025M4494
41839E7021j9261K50898O07467N72560R6463l89191n45613m44888k70326j5268
41829a00138L44932O08265N30035J75169j26893j75871q8457p4241j66775k38418
41819F87608j85268k2456J50288K13816R5710j63699m12815m92332l47585n0754
41809e27487K44607L65212K16071j07546l46043l06672p2402R4705O5869k8094
41799d01780j8676N5551L3761r0794j33772J055J44329Q7023r1150r1987J88355
$$ y = [1950478, 1797723, 1489803, 1283998, 1536972, 2169904, 2692400, 2733870, 2363300, 1906722, 1630296, 1620830, 1825944, 2135876, 2461937, 2738856, 2842142, 2590504, 1925265, 1049510, 306066, -68937, -52791, 199743, 420265, 371403, 73742, -176335, -152498, 12527, 57021, 37760, 288658, 896125, 1468685, 1565148, 1175957, 630344, 185456, -84870, -100138, 244794, 853059, 1383094, 1558263, 1431370, 1255499, 1167042, 1092801, 926026, 687608, 502340, 479884, 630172, 843988, 939698, 775999, 363184, -129148, -476733, -527487, -282880, 82332, 298403, 190857, -155186, -461858, -534260, -439555, -373686, -401780, -420456, -364905, -331144, -421938, -555710, -554655, -410326, -323303, -414453, -506440, -318085]
41788c18085M86644N03163K71221O0677J0441L1265K5968J2870K0700L3543O8752
41777A207159J51887J96450R0222p7461j01392k3847j27246m32524n23825j38308
41767B21115L34103L10932j69152m91565k93750J27085K97969J48527k8900L588
41757D59952J83466K38368j934l36868l50619L7345L58242J72295l13420n37733
41747i0906l52586q7112N9173J95703L14034K07801p3416j86880o7919m8947k20269
41736c51324j96361J99503N30874M03734P1905l3999L2738R950k4521R1876J32311
41725H66686j55221m62751l14234J26979K56518o5536m05254m89852m45694l09648
41715a398007P3306N69535P40796M62507Q6377j25459k56032l27205j57213K10207
$$ y = [-318085, 168559, 671722, 942943, 1003620, 1014061, 1045326, 1071294, 1084164, 1104864, 1138407, 1207159, 1359046, 1555496, 1645718, 1568257, 1466865, 1443018, 1315772, 883248, 359423, 221115, 555218, 866150, 696998, 205433, -88317, 38768, 336737, 485264, 456364, 459952, 643418, 881786, 879852, 542984, 192365, 229710, 587952, 760247, 446827, -90906, -443492, -530604, -471431, -275728, 38306, 246107, 172691, -14189, -82108, -131055, -351324, -547685, -348182, 182692, 586426, 658331, 624332, 657070, 667020, 642499, 734375, 866686, 711465, 248714, -65520, 61459, 317977, 252441, -152813, -642665, -1088359, -1398007, -1324701, -755166, -14370, 448137, 534514, 409055, 153023, -174182, -331395, -121188]
41705a21188M21054L41973K20648J59845n5203l99384m34842o535M06844M03074
41695I36286K27924K27133K21038n8211l43673k65534p5966k64748o58115o16068
41685f69934o9665L42345K61770Q8503K42564M93315L78447o7939l84373l06501
41675C08532k3303J29855L6109j44380j92121q4100R648K1694J33020M42381O32389
41664A269724K99629l87018p26373l29959L61249O17839K73283k06923l72223
41655G99228k31738p5643r1136k35891l54949l19191r9621K08769M30022M26526
41645D56376K16139l4112j57349j30329m8061K0505Q5494J42236J17190l1038
41635F37051k10285k63011j25860J00552K20395J00006j71811l01807r6522K43913
$$ y = [-121188, 299866, 641839, 862487, 1022332, 967129, 567745, 132903, 126368, 533212, 936286, 1164210, 1391343, 1612381, 1554170, 1210497, 944963, 868997, 604249, -53866, -669934, -739599, -397254, -135484, -46981, 195583, 688898, 1067345, 999406, 615033, 308532, 285229, 415084, 451193, 306813, 114692, 30592, 40240, 61934, 194954, 637335, 1269724, 1569353, 1182335, 455962, 126003, 487252, 1105091, 1378374, 1171451, 799228, 567490, 491847, 400711, 164820, -190129, -509320, -608941, -400172, 29850, 456376, 672515, 638403, 481054, 350725, 302664, 323169, 408663, 550899, 668089, 637051, 426766, 163755, 37895, 138447, 358842, 458848, 287037, -14770, -111292, 132621]
41625A32621L05822l007k90842j89339J54792L05283J35024n8469j7196J37766
41615F12455J07246j85714m82716m43457j4678M39890M76482J07514j52125O6001
41605E30898M51792M09801j09399n34006m62036j47047j7158m6321P3805L38069
41595D88398M02727J41972j26142r5453J05015J43801j7506j13627j9663N6536
41585I66058p8395k64851j97855J10270L01723J40532j83043l22353k09664o1675
41575B00747k0708J1541J42123K57214J68414p4499j93016n1511J32879Q8749
41565F61933j13613j86860r7611r7815k18410j19401L01280N27407J17020m83068
41555B90862m42533J95269M72812r1822p74262p08723r2784K59464J48761O9471
$$ y = [132621, 438443, 435436, 144594, -44745, 110047, 415330, 550354, 491885, 474689, 612455, 719701, 533987, 51271, -392186, -406864, 33026, 509508, 617022, 464897, 530898, 982690, 1392491, 1283092, 749086, 287050, 140003, 122845, 76524, 150329, 488398, 891125, 1033097, 906955, 811502, 916517, 1060318, 1042812, 929185, 909522, 966058, 887663, 622812, 424957, 535227, 836950, 977482, 794439, 472086, 262422, 200747, 180039, 191580, 333703, 590917, 759331, 684832, 491816, 440305, 573184, 661933, 548320, 361460, 263849, 166034, -52376, -171777, 129503, 656910, 773930, 290862, -151671, 43598, 516410, 424588, -349674, -1058397, -1151181, -891717, -742956, -673485]
41545f73485K55258L73202K04340L552M778N5156k5584r2896N8284L24886M15991
41534I03482J96701k12116n41786n36855j91727J42457J03849k01024l19134q4589
41524g40742J86462K28591J97807L03235L92681K24361n7787q0578J96421L90534
41514A240985J99087k30554n04766m21359j30900P4837P2822p999n156M6452n822
41503C27627j62117k28795p7890J77371L17708K42097L5124j07944l6340J76241
41493F63082K51376M0060k35771k70657j21513q3279j64931o5362K63485M30987
41483G07477J77376k10910l08701j05166J10550J73500P5209j99952n50888o54152
41473g85657l23867J47742L31211K18638J02690L0718j83060m37396l30005K02498
$$ y = [-673485, -418227, -45025, 159315, 162867, 167645, 222801, 197217, 104321, 162605, 487491, 903482, 1100183, 888067, 346281, -190574, -382301, -239844, -135995, -337019, -656153, -740742, -554280, -325689, -127882, 175353, 568034, 792395, 734608, 654030, 850451, 1240985, 1440072, 1209518, 704752, 283393, 152493, 227330, 300152, 292153, 286997, 333449, 327627, 165510, -63285, -141175, 36196, 353904, 596001, 631125, 523181, 486841, 663082, 914458, 954518, 718747, 448090, 326577, 243298, 78367, 13005, 276490, 707477, 884853, 673943, 365242, 260076, 370626, 544126, 619335, 419383, -131505, -785657, -1109524, -961782, -630571, -411933, -309243, -278525, -461585, -898981, -1228986, -1026488]
41463a026488O51294N82336K07273K6200J21386J40134j01036l25461j98102J87029
41453B64565L98497K11545r7962j06668J85825L36058O2948l37499l83146p0004
41443D64159J49405K9613j56900r5217P8333K1975k35441l01878k4977K14962
41433A44034J046m93484o34611j01498O74078R66891N50718j12712m32682k83996
41423B77784j9636j1348k51582l86693j36620L18637M71581R9549l85334m14016
41413d37678r363K57146Q7635j34767L9095M24212M74471R9244j97203k7852L52993
41402I27933M05829O703m16959m29201r5648J54064R4518o5369p8856m5866j68972
41391B88176l16747k08645M0545K3216k59626l02071J06498M82143L76418N5616
$$ y = [-1026488, -375194, 207142, 414415, 440615, 562001, 702135, 601099, 275638, 77536, 264565, 663062, 874607, 776645, 669977, 855802, 1191860, 1254808, 917309, 534163, 464159, 613564, 643177, 486277, 391060, 469393, 491368, 255927, -45951, -70928, 144034, 145080, -348404, -983015, -1084513, -410435, 556456, 1107174, 994462, 561780, 277784, 258148, 246800, -4782, -391475, -528095, -209458, 262123, 361672, -23662, -437678, -447041, -189895, -102260, -237027, -197932, 226280, 700751, 799995, 602792, 574940, 927933, 1333762, 1340465, 923506, 494305, 398657, 552721, 647239, 581870, 503014, 457148, 288176, -28571, -237216, -196671, -173455, -433081, -735152, -628654, -146511, 229907, 285523]
41381B85523J2398J81698J76519J6738K3291J60714J04608j09819j16254J08518
41371H43934J94782N3539L814J24182Q4681k00612l63167k68789k99552n98158
41361d25346o38945n1967O36682O90680K12309j32295j55591k17710l95938l27209
41351h05330N3410K84058J09104r4655O9842L97038M35294J86258M8374J84576
41341H67969L17450J76820j33168l26907l12965k14388j06015O0850K41868K17345
41331G88859j05237m35603l92452k1358K37859J36138j02976j79887j12236n5498
41321b42391N143J26344J69738p457k45503k56270l4122J72143K40443K61053
41311A89121K74695J98973L4750q7525j02324o6486j9817L5148L8755m8520j11987
$$ y = [285523, 297921, 479619, 656138, 672876, 696167, 856881, 961489, 851670, 735416, 843934, 1038716, 1092255, 1096069, 1220251, 1304932, 1104320, 741153, 472364, 172812, -425346, -1064291, -1116258, -479576, 211104, 423413, 291118, 135527, -82183, -478121, -805330, -751920, -467862, -358758, -453413, -383571, 13467, 448761, 635019, 683393, 867969, 1185419, 1362239, 1229071, 902164, 589199, 374811, 268796, 329646, 571514, 788859, 683622, 248019, -144433, -165791, 72068, 208206, 105230, -74657, -186893, -242391, -237248, -110904, 58834, 51377, -194126, -450396, -484518, -312375, -71932, 189121, 463816, 662789, 697539, 610014, 507690, 441204, 421387, 456535, 495290, 446770, 334783]
41300C34783l6159N9555j2999j59385j20423P3090J11048q1495k06499r1642L3127
41289i6999m5101j54151n5607J34130J55495N0374O2500J98757K12573K325k44689
41278B19607l27032k37639p3514Q6599J85096K09655K37285L34150M06190K77847
41268A318244n4146l53447l75818j17501J76605K23531l9796l61072l91759o5120
41258d0279L08578L91460J76951q4910k06626j67507k040K13556K95805Q1177
41248I66165l36721o33508n66203j89565K24700M09601L00407J12482J40751L60329
41238G88438L69195n3445m85324l22173L43212P42854M40094j20701l05559j32450
41228A264141n0283j75161k22980p7232M4077o263j29029k53467m16413m90724
$$ y = [334783, 298624, 358179, 345180, 185795, 65372, 138462, 249510, 168015, -38484, -130126, -96999, -142100, -296251, -351858, -217728, -62233, -11859, 50641, 249398, 461971, 464296, 219607, -107425, -345064, -418578, -331979, -146883, 62772, 300057, 634207, 1040397, 1318244, 1264098, 910651, 534833, 417332, 593937, 817468, 777672, 416600, 24841, -40279, 268299, 659759, 836710, 751800, 545174, 377667, 375627, 589183, 884988, 966165, 629444, -4064, -570267, -759832, -535132, -125531, 174876, 287358, 428109, 788438, 1157633, 1104188, 618864, 296691, 639903, 1382757, 1822851, 1702150, 1396591, 1264141, 1213858, 1038697, 815717, 738485, 782562, 776299, 647270, 393803, -22610, -513334]
41218e13334k26326K71796M83692J68574j89746m390N43080O94333J49864n15409
41208H62134o10305j67686K25317K35053R4217J26194K63223K13638m4234j88259
41198A009292l442K92707L11743k9279m49279o48013n28517j35600L67439O38268
41188H25319L80685k15607n30368k44918K07489K29909r1009j47810K49049N90399
41178A253138M38659J6797k36113l18916m91464o89667n79365j36557K39960K54898
41168b48630L1844j77265k90000k66547J8238N29119Q79371O71909o43n95675
41158E51721o67462k51418K73153N67788N69391M41250L34615K05402p2227m16589
41148A535624n38585l39048j20077j89068l98282l65403o3592J59686J45336J09852
$$ y = [-513334, -739660, -467864, 15828, 184402, -5344, -9734, 533346, 1227679, 1377543, 862134, 251829, 84143, 309460, 544513, 638730, 764924, 1028147, 1241785, 1197551, 1009292, 1005850, 1298557, 1610300, 1581021, 1131742, 483729, -44788, -180388, 187051, 825319, 1206004, 990397, 460029, 215111, 422600, 652509, 561500, 413690, 662739, 1253138, 1691797, 1708594, 1472481, 1153565, 662101, -27566, -606931, -743488, -503528, -248630, -216786, -394051, -684051, -950598, -932360, -403241, 476130, 1148039, 1147396, 551721, -115741, -367159, -94006, 473782, 1043173, 1484423, 1819038, 2024440, 1952213, 1535624, 997039, 657991, 537914, 348846, -49436, -414839, -478431, -318745, -173409, -63557]
41138f3557J78210J44525q5665k03090K1456K77543J60073j51813j44497K17494
41128C50679M43349K85712N7787O9206J99073K24441J87042J91016J47386l0423
41118B125268k26347l29529l93620m01111j75924K22992L55122m903m13782l32422
41108D25744O6944J64831j47897l22982j9768L76682L09724k08240o48876n90873
41098e94711j18838L16958L55733P9838j03961K7977K60237K91539J33959m7618
41088F01113k58664n09879n31441q6753N28297P51082M83734J27649o8466k02208
41078H34464k68617r3760J76841J06647l07256m92200j59566K28085K04563J4800
41068B44001J33018M74202N85697L43675L928k20126k48116m9738J69753O953
$$ y = [-63557, 114653, 259178, 173513, -29577, -8121, 269422, 429495, 277682, 133185, 350679, 794028, 1079740, 1137527, 1206733, 1405806, 1630247, 1817289, 2008305, 2155691, 2125268, 1898921, 1569392, 1175772, 774661, 598737, 821729, 1176851, 1171948, 758166, 425744, 492688, 657519, 509622, 186640, 166872, 543554, 853278, 645038, -3838, -594711, -713549, -396591, -40858, 38980, -64981, -37004, 223233, 514772, 648731, 601113, 342449, -167430, -698871, -785624, -257327, 493755, 977489, 1105138, 1036672, 834464, 565847, 472087, 648928, 755575, 448319, -43881, -203447, 24638, 229201, 244001, 377019, 851221, 1436918, 1780593, 1784521, 1564395, 1316279, 1266541, 1436294, 1443247]
41058A443247n17212p29425k03814M63192M21303j59184l48016J15988M86651
41049I72730K19872k51225k71242J11901L93680L68417K10473M8347j59031m08830
41039A235092n69085n01569j98274J52191K71249J01882o3567K7994J89637Q7322
41029G32872j74171j79813R7146K02036q7316m00417l24229N4155L64850M04667
41019F89780J87703j46586l05851m9907L95673M75393N8061l19263k21624O6240
41009H29619N2542j98684k88108j93517k15622l38448k02252K50757N88307M88477
40999G73071J57681l0105k2900j2513p9497j55092k28716l54359m48712k87927
40989f89069J79547O30729O60296K73913j00441j68092j18226k38769m00744k60441
$$ y = [1443247, 926035, 196610, -7204, 455988, 877291, 718107, 370091, 486079, 972730, 1192602, 941377, 670135, 782036, 1175716, 1544133, 1754606, 1802953, 1643922, 1235092, 666007, 164438, -33836, 118355, 389604, 491486, 427919, 455913, 645550, 732872, 558701, 378888, 476034, 678070, 590754, 190337, -133892, -79737, 285113, 689780, 877483, 730897, 425046, 375139, 770812, 1246205, 1304266, 985003, 763379, 829619, 882161, 683477, 395369, 201852, -13770, -352218, -554470, -303713, 284594, 773071, 930752, 900647, 877747, 865234, 785737, 630645, 401929, 47570, -401142, -689069, -509522, 121207, 781503, 1055416, 954975, 786883, 668657, 429888, 29144, -231297]
40979b31297J37926L73455K79308J51862K22107L18198K49831J63714K41344L33783
40969B240231K09090m1654j41433k7229J27092J54255k2908l66389o02927l79133
40959A148995K24551O01766L42354k13830m95120m92954n71621p04759n05280
$$ y = [-231297, -93371, 280084, 559392, 711254, 933361, 1251559, 1501390, 1665104, 1906448, 2240231, 2449321, 2407667, 2266234, 2239005, 2366097, 2520352, 2497444, 2131055, 1528128, 1148995, 1373546, 1975312, 2317666, 2103836, 1608716, 1115762, 544141, -160618, -665898]
$$ [...]
##END NTUPLES=NMR SPECTRUM
##END=
