##TITLE=31Pdec_DE-116rm_3h
, 64 sc
 9.10.2025
##JCAMPDX= 6.0         $$ Bruker NMR JCAMP-DX V2.0
##DATA TYPE= NMR SPECTRUM
##DATA CLASS= NTUPLES
##ORIGIN= UXNMR, Bruker Analytische Messtechnik GmbH
##OWNER= root
$$ XWIN-NMR		Version 3.5
$$ Thu Oct  9 13:58:03 2025 Russian Standard Time (UT+4h)  she@DPX200
##.OBSERVE FREQUENCY= 81.013821
##.OBSERVE NUCLEUS= ^31P
##.ACQUISITION MODE= SIMULTANEOUS
##.ACQUISITION SCHEME= undefined
##.AVERAGES= 64
##.DIGITISER RES= 17
##SPECTROMETER/DATA SYSTEM= spect
##.PULSE SEQUENCE= zgpg30
##.SOLVENT NAME= DMSO
##.SHIFT REFERENCE= (INTERNAL, DMSO, 0, 198.062)
##AUDIT TRAIL= $$ (NUMBER, WHEN, WHO, WHERE, WHAT)
$$ ##TITLE= Audit trail, XWIN-NMR		Version 3.5
$$ ##JCAMPDX= 5.01
$$ ##ORIGIN= Bruker BioSpin GmbH
$$ ##OWNER= she
$$ F:/spectra/data/she/nmr/P31/2/pdata/1/auditp.txt
$$ ##AUDIT TRAIL=  $$ (NUMBER, WHEN, WHO, WHERE, WHAT)
(   1,<2025-10-09 13:56:58.37 +0400>,<she>,<DPX200>,
      <created by zg, POWCHK disabled, PULCHK disabled
       configuration hash MD5:
       00 E9 B6 7A A2 85 ED C7 34 08 36 98 17 FE 4E 26
       data hash MD5: 32K
       7C B1 82 73 38 FB B7 9D CB 83 D9 52 41 20 73 C4>)
(   2,<2025-10-09 13:57:00.85 +0400>,<she>,<DPX200>,
      <Start of raw data processing
       efp BC_mod = 2 LB = 1.5 FT_mod = 6 PKNL = 1 PHC0 = 1450.711 PHC1 = -96.89972 SI = 64K 
       data hash MD5: 64K
       2E 29 EA AA F9 8A 4E 3B D4 88 F0 AA D0 A7 66 7A>)
(   3,<2025-10-09 13:57:28.34 +0400>,<she>,<DPX200>,
      <pk PHC0 = -2.735182 PHC1 = 3.2 
       data hash MD5: 64K
       8C 97 FF AA 37 4D 3C 54 CD CB 3F 66 2A 6C 9F BD>)
$$ ##END=
$$ 
$$ hash MD5
$$ EB 38 5F 6D C2 B3 BF 53 50 26 A6 AD B1 97 5A 1A
##$RELAX= 
##$RELAX= 
##$RELAX= 
##$RELAX= 
##$RELAX= 
##$RELAX= 
##$RELAX= 
##$RELAX= 
$$ Bruker specific parameters
$$ --------------------------
##$DU= <F:/spectra>
##$EXPNO= 2
##$NAME= <P31>
##$PROCNO= 1
##$TYPE= <nmr>
##$USER= <she>
##$AMP= (0..31)
100 100 100 100 100 100 100 100 100 100 100 100 100 100 100 100 100 100 
100 100 100 100 100 100 100 100 100 100 100 100 100 100 
##$AQSEQ= 0
##$AQ_mod= 1
##$AUNM= <au_zg>
##$AUTOPOS= <>
##$BF1= 81.014009
##$BF2= 200.13
##$BF3= 200.13
##$BF4= 200.13
##$BF5= 200.13
##$BF6= 200.13
##$BF7= 200.13
##$BF8= 200.13
##$BYTORDA= 1
##$CFDGTYP= 0
##$CFRGTYP= 5
##$CHEMSTR= <none>
##$CNST= (0..31)
1 1 145 1 1 1 1 1 1 1 1 1 1 1 1 1 1 1 1 1 1 1 1 1 1 1 1 1 1 1 1 1 
##$CPDPRG= <waltz16>
##$CPDPRG1= <>
##$CPDPRG2= <waltz16>
##$CPDPRG3= <>
##$CPDPRG4= <mlev>
##$CPDPRG5= <mlev>
##$CPDPRG6= <mlev>
##$CPDPRG7= <mlev>
##$CPDPRG8= <mlev>
##$CPDPRGB= <>
##$CPDPRGT= <>
##$D= (0..31)
0 1 0 0 0 0 0 0 0 0.06 0 0.03 2e-05 3e-06 0 0 0.0002 0 0 0 0 0 0 0 0 0 
0 0 0 0 0 0 
##$DATE= 1760003818
##$DBL= (0..7)
120 120 120 11 120 120 24 19 
##$DBP= (0..7)
150 150 150 150 150 150 150 150 
##$DBP07= 0
##$DBPNAM0= <>
##$DBPNAM1= <>
##$DBPNAM2= <>
##$DBPNAM3= <>
##$DBPNAM4= <>
##$DBPNAM5= <>
##$DBPNAM6= <>
##$DBPNAM7= <>
##$DBPOAL= (0..7)
0.5 0.5 0.5 0.5 0.5 0.5 0.5 0.5 
##$DBPOFFS= (0..7)
$$ [...]
##$SUBNAM3= <"">
##$SUBNAM4= <"">
##$SUBNAM5= <"">
##$SUBNAM6= <"">
##$SUBNAM7= <"">
##$SUBNAM8= <"">
##$SUBNAM9= <"">
##$SW= 400.765351723535
##$SWIBOX= (0..15)
0 1 3 0 0 0 0 0 0 0 0 0 0 0 0 0 
##$SW_h= 32467.5324675325
##$TD= 32768
##$TD0= 1
##$TE= 0
##$TE2= 300
##$TE3= 300
##$TEG= 300
##$TL= (0..7)
0 120 53 12 22 120 120 120 
##$TP= (0..7)
150 150 150 150 150 150 150 150 
##$TP07= 0
##$TPNAME0= <>
##$TPNAME1= <>
##$TPNAME2= <>
##$TPNAME3= <>
##$TPNAME4= <>
##$TPNAME5= <>
##$TPNAME6= <>
##$TPNAME7= <>
##$TPOAL= (0..7)
0.5 0.5 0.5 0.5 0.5 0.5 0.5 0.5 
##$TPOFFS= (0..7)
0 0 0 0 0 0 0 0 
##$TUNHIN= 0
##$TUNHOUT= 0
##$TUNXOUT= 0
##$USERA1= <user>
##$USERA2= <user>
##$USERA3= <user>
##$USERA4= <user>
##$USERA5= <user>
##$V9= 5
##$VALIST= <valist>
##$VCLIST= <CCCCCCCCCCCCCCC>
##$VD= 0
##$VDLIST= <DDDDDDDDDDDDDDD>
##$VPLIST= <PPPPPPPPPPPPPPP>
##$VTLIST= <TTTTTTTTTTTTTTT>
##$WBST= 1024
##$WBSW= 4
##$XGAIN= (0..3)
0 0 0 0 
##$XL= 0
##$YL= 0
##$YMAX_a= 45285
##$YMIN_a= -48982
##$ZGOPTNS= <>
##$ZL1= 120
##$ZL2= 120
##$ZL3= 120
##$ZL4= 120
##$ABSF1= 0
##$ABSF2= 0
##$ABSG= 0
##$ABSL= 0
##$ALPHA= 0
##$AQORDER= 0
##$ASSFAC= 0
##$ASSFACI= 0
##$ASSFACX= 0
##$ASSWID= 0
##$AUNMP= <proc_1d>
##$AZFE= 0.1
##$AZFW= 0.5
##$BCFW= 0
##$BC_mod= 2
##$BYTORDP= 0
##$COROFFS= 0
##$CY= -3
##$DATMOD= 1
##$DC= 0
##$DFILT= <>
##$DTYPP= 0
##$F1P= 0
##$F2P= 0
##$FCOR= 1
##$FTSIZE= 65536
##$FT_mod= 6
##$GAMMA= 0
##$GB= 0
##$INTBC= 1
##$INTSCL= 9.790993e-09
##$ISEN= 30
##$LB= 1.5
##$LEV0= 0
##$LPBIN= 0
##$MAXI= 10000
##$MC2= 0
##$MEAN= 0
##$ME_mod= 0
##$MI= 50
##$NCOEF= 0
##$NC_proc= -6
##$NLEV= 6
##$NOISF1= 182.463
##$NOISF2= 159.3651
##$NSP= 0
##$NTH_PI= 0
##$NZP= 0
##$OFFSET= 198.0616
##$PC= 4
##$PHC0= 1447.976
##$PHC1= -93.69972
##$PH_mod= 1
##$PKNL= yes
##$PPARMOD= 0
##$PSCAL= 0
##$PSIGN= 0
##$REVERSE= no
##$SF= 81.0140089999434
##$SI= 65536
##$SIGF1= 159.3651
##$SIGF2= -187.1042
##$SINO= 113.3802
##$SIOLD= 16384
##$SREGLST= <1H.CDCl3>
##$SSB= 0
##$STSI= 65536
##$STSR= 0
##$SW_p= 32467.5324675325
##$SYMM= 0
##$S_DEV= 0
##$TDeff= 32768
##$TDoff= 0
##$TI= <>
##$TILT= no
##$TM1= 0
##$TM2= 0
##$TOPLEV= 0
##$USERP1= <user>
##$USERP2= <user>
##$USERP3= <user>
##$USERP4= <user>
##$USERP5= <user>
##$WDW= 1
##$XDIM= 65536
##$YMAX_p= 472833217
##$YMIN_p= -10819597
$$ End of Bruker specific parameters
$$ ---------------------------------
##NTUPLES= NMR SPECTRUM
##VAR_NAME=  FREQUENCY,     SPECTRUM/REAL,   SPECTRUM/IMAG
##SYMBOL=    X,             R,               I
##VAR_TYPE=  INDEPENDENT,   DEPENDENT,       DEPENDENT
##VAR_FORM=  AFFN,          ASDF,            ASDF
##VAR_DIM=   65536,         65536,           65536
##UNITS=     HZ,            ARBITRARY UNITS, ARBITRARY UNITS
##FACTOR=    0.49542278885378, 1,            1
##FIRST=     16045.7642231865, 0,            0
##LAST=      -16421.768244346, 0,            0
##MIN=       -16421.768244346, -10819597,    0
##MAX=       16045.7642231865, 472833217,    0
$$ Real data points
##PAGE= N=1
##DATA TABLE= (X++(R..R)), XYDATA
$$ [...]
44623c73240O0235n33237p11920o46420o46453l63831M75524J204670J043406
44614d91266K74264k66835l50983k21464P0245L50407L7517q88286j345483o20893
44604c452777L66620M48318N5636K45086O10546j4195j169372j124202K95377
44595c738963J219951N69611m31114l66387L25649M87649J65874J59961M93008
44586a114761N43832K25715K80l672l7688r4158N0723K61543J35421l36100o66241
44575a035106m81044O3126M83701M25493m3841m84220m89213o9847M27859O68716
44565e34376M43634k95610j160439j363590n98771K93743K29974o03029r07776
44556d496240m7298J153543J644800J402187R88143N51824p6001o99624q51900
$$ y = [-373240, -313005, -846242, -1558162, -2204582, -2851035, -3214866, -2739342, -1534672, -491266, -217002, -483837, -834820, -1056284, -986039, -635632, -598115, -1486401, -2831884, -3452777, -3086157, -2637839, -2582203, -2337117, -1726571, -1740766, -2910138, -4034340, -3738963, -2519012, -1949401, -2380515, -2746902, -2421253, -1933604, -1767730, -1607769, -1114761, -570929, -345214, -344934, -348606, -386294, -480452, -429729, -168186, -32765, -368865, -1035106, -1516150, -1453024, -969323, -543830, -587671, -1071891, -1561104, -1630951, -1203092, -534376, -90742, -386352, -1546791, -2910381, -3509152, -3215409, -2985435, -3588464, -4496240, -4543538, -3389995, -1745195, -343008, 645135, 1196959, 1120958, 421334, -430566]
44547d30566m82377q5791r2775l52111k94366L59312J051398Q39688l50072j318924
44537a156584j001946N7607M46752j14430n37740j73362K94566J24968l68786
44528b428955n71215n22992m43888r8119N87204R47409M65197k99249m80826j43000
44518b988434Q9742J85475N42383R60413P80863J9996n07045k93323L15404P64578
44508a29948Q64176O27351J08598m30725o25684m33674j83375j61068l63515n80941
44498a308805n14863k100O36183P54311K03201l56106l47021p0451r3394k98757
44488a397802k45423r3574k99193n95953k41569O95807J196339O37847m32462
44479g75983j085512r60826k85129M44054O44450J19332n16602m63586J44086
$$ y = [-430566, -912943, -998734, -1091509, -1443620, -1737986, -1378674, -327276, 512412, 162340, -1156584, -2158530, -2100923, -1654171, -1768601, -2306341, -2479703, -2185137, -2060169, -2428955, -3000170, -3523162, -3967050, -4065169, -3477965, -2530556, -2065359, -2364608, -2845434, -2988434, -2898692, -2713217, -2170834, -1210421, -429558, -409562, -916607, -1209930, -894526, -129948, 734228, 1361579, 1470177, 1039452, 413768, -19906, -203281, -364349, -727864, -1308805, -1823668, -1825768, -1189585, -435274, -232073, -588179, -935200, -1005651, -1099045, -1397802, -1643225, -1736799, -2035992, -2631945, -2873514, -2177707, -981368, -343521, -775983, -1861495, -2822321, -3107450, -2663396, -2018946, -1899614, -2416216, -2879802, -2735716]
44470b735716M33994J78359J03734N55462Q04651K47452n13953n30554J36794
44461a319777O85132P58873N90769K59487l67631j025065j108648m56014M12651
44452a570223Q99175Q10233K81439l57039o33483k78215L78341O55536K67194
44443D52958l95296p39717n09454J39720Q18113J096035P61879K1291o56916r44499
44433D4114q57942o17966m14476k67247l6744L49843O41780M46206j89526o53488
44423a555446n31913k49393m72719r92933q24749M10817J769568K057927J258453
44414H69612L87853J32691J98106L9998l14311m58480k52224R3658L84663N40565
44404A622131M30258k8304o05817r18217q79924p12634m97242r9524L67963M61135
$$ y = [-2735716, -2301722, -2123363, -2019629, -1464167, -659516, -412064, -926017, -1456571, -1319777, -634645, 124228, 714997, 974484, 606853, -418212, -1526860, -1982874, -1570223, -671048, 139185, 420624, 63585, -569898, -848113, -469772, 185764, 452958, 57662, -682055, -1191509, -1051789, -233676, 862359, 1624238, 1645529, 988613, 44114, -813828, -1431794, -1846270, -2113517, -2150261, -1800418, -1158638, -712432, -901958, -1555446, -2087359, -2336752, -2809471, -3802404, -4627153, -4216336, -2446768, -388841, 869612, 1257465, 1390156, 1588262, 1628260, 1313949, 855469, 603245, 696903, 1081566, 1622131, 2052389, 2024085, 1418268, 500051, -379873, -1092507, -1589749, -1689273, -1321310, -860175]
44394h60175M4435l67832k69664J36625L00219J34309J1527J16119K79273L63921
44384a11243L51339J33610k81977m46641M2893P13051N64276n31043j433872j120766
44374b120373O2941R60930R64976L35346m26133r02813o98745K66472J356041
44365b01358J631213Q33980l41292j031112r94821n86703k38713j20441j39471
44356a188718j23335k4954L0263p3056k57966l14474j01708L18084O48834M97761
44346e89269k11712r13624q31337M7107P60839N17650k15207k89989N32843J201255
44336H556P95791j95627n25155J38791P97083M96419m13889q33844m17917J14360
44326c5432J83132J18641L26974L67223l27817j190126j028267J69740J006317
$$ y = [-860175, -815740, -1183572, -1453236, -1316611, -1016392, -882083, -870556, -754437, -475164, -111243, 240096, 373706, 91729, -354912, -312019, 401032, 965308, 434265, -999607, -2120373, -2057432, -1096502, -131526, 203820, -222313, -1125126, -1823871, -1557399, -201358, 1429855, 2263835, 1922543, 891431, -103390, -690093, -928806, -1049247, -1188718, -1312053, -1337007, -1306744, -1379800, -1637766, -1952240, -2053948, -1735864, -1087030, -589269, -800981, -1714605, -2545942, -2498835, -1737996, -1220346, -1435553, -1725542, -1192699, 8556, 804347, 608720, 83565, 222356, 1019439, 1515858, 1101969, 268125, -149792, -35432, 147700, 266341, 593315, 960538, 632721, -557405, -1585672, -1415932, -409615]
44317d09615O07073j95279k34439K98272M36452P8703n1044K14709K65363j17831
44307H92364l74984j55904J53705J86068J42069K54773L48323K92575L05582M15950
44297B460521J96517n05763j094097j007152n42288l23789l34998j43165J79232
44288a114982J04724m24379p93855n44911J17856P48049J095778R85160K56320
44279D29760q69857j703346j682881r11547O2957P91302J092635R54654N50282
44270a286041K18603J67480K36880J16973k67020p06856r25962p14581m1546P40762
44260b461308R80353L57158o22204j090529p76794j72000K52657N50002Q69072
44251b113593R82743O14931k7526m41715m20053j51681J21923K41910Q9187k15534
$$ y = [-409615, 197458, 2179, -232260, 66012, 502464, 581167, 530123, 744832, 1010195, 892364, 517380, 361476, 515181, 701249, 843318, 1098091, 1446414, 1738989, 2044571, 2460521, 2657038, 2151275, 1057178, 50026, -492262, -816051, -1151049, -1294214, -1114982, -1010258, -1434637, -2228492, -2773403, -2655547, -1907498, -811720, 173440, 429760, -440097, -2143443, -3826324, -4737871, -4674914, -3883612, -2790977, -1836323, -1286041, -1067438, -899958, -663078, -546105, -813125, -1519981, -2445943, -3160524, -3202070, -2461308, -1480955, -1123797, -1746001, -2836530, -3613324, -3785324, -3532667, -2982665, -2113593, -1130850, -515919, -543445, -985160, -1405213, -1556894, -1434971, -1193061, -1103874, -1319408]
44241a319408k10227L57632R60705P98217r8997q17709p50464k86917p5690j28821
44231a571679n2204K41541M95073N13436K44782k80159p60650p12421j38729K48104
44221a772906j9500l52626P2980R35464J054126P6812r56198j006273l06174J78485
44211b095810M7819k59646j98006L20073R54725J233836R16004K65986j44781
44202A040200o7715J36368r168m73668p75806n71697l3022L29114J59201l70317
44192f36510o86117m10038K08142N83871M53883O6546j80393n4500M41876R98246
44182G85006J086420N09130j93564l10045R9632L07420l2903n05812o91432o68478
44172C85374n46195j65164L42946L24037m86082j265195r82893K45525J262623
$$ y = [-1319408, -1529635, -1172003, -211298, 586919, 487922, -329787, -1080251, -1367168, -1442858, -1571679, -1623883, -1382342, -887269, -373833, -129051, -409210, -1169860, -1882281, -2021010, -1772906, -1792406, -2145032, -2072052, -1136588, -82462, -5650, -961848, -1968121, -2274295, -2095810, -2047991, -2307637, -2505643, -2185570, -1230845, 2991, 918995, 1184981, 1040200, 972485, 1108853, 1099685, 626017, -149789, -721486, -754508, -425394, -266193, -636510, -1322627, -1732665, -1524523, -940652, -486769, -420223, -600616, -655116, -213240, 785006, 1871426, 2380556, 2186992, 1876947, 1976579, 2283999, 2251096, 1745284, 1053852, 385374, -160821, -325985, 16961, 340998, -145084, -1410279, -2393172, -2147647, -885024]
44163h85024J225105L92392l70537m85992q3915K07314n7785n64100n80264J6760
44153a186046M96843K98584k23291m64794m31907l73528j06620N16414Q92753
44144e81592L66430n62821p09761J20732Q71291P81428K86300P2398P6228r7223
44134F23410l94919m92169l48946j64614o3991j10172l40132n90976o03351m17653
44124b903513k93113j78304K23545P66821Q75794M60009J46629K76296L65564
44115b60272L1579k35570J34044P75057Q85043L50799k98442p17194q46613n30327
44105g11896K11619P58601N14922j77706m86087l05338k43739m80061n25715k02825
44095a648225K5313p1523j02162J41013K53873R106j36221J61595M50390K15020
$$ y = [-885024, 340081, 732473, 361936, -124056, -207971, -657, -58442, -622542, -1202806, -1186046, -689203, -390619, -613910, -1078704, -1510611, -1884139, -1990759, -1474345, -581592, -215162, -777983, -1487744, -1367012, -495721, 285707, 572007, 644405, 720633, 623410, 228491, -263678, -612624, -777238, -841229, -951401, -1291533, -1882509, -2485860, -2903513, -3196626, -3374930, -3151385, -2384564, -1508770, -1048761, -902132, -625836, -260272, -228693, -464263, -330219, 444838, 1329881, 1680680, 1382238, 665044, -181569, -711896, -500277, 258324, 773246, 595540, 109453, -195885, -439624, -919685, -1445400, -1648225, -1622912, -1694435, -1796597, -1655584, -1401711, -1392605, -1528826, -1367231, -916841, -701821]
44085g01821k01858j02060M66476P97307N54219R0618k09523l62355n01795n84760
44075g55552m82340j39331L40917O21357L47442l03429n78674q2839N10591K70239
44065b51619o14377r82058k94269O53119Q94249N03171J61830N3040j45975m31924
44055d54813l64281J56229N60816L02757m47392j026726j020601n93098j76410
44046c063519R223J12275L71404P25413Q15826M58452k6215j51358J39124M43840
44036a65535M36901J49543k79980p64390j040830p04971J73213P77518M07680
44027a010851m97796p75708o1217O84609M79928l52627p09173k49005K80484K56417
44017a954939J5462J73129O45451Q54686O26989L37661K34317J32589j14624k86927
$$ y = [-701821, -903679, -1005739, -539263, 258044, 812263, 902881, 693358, 331003, -170792, -755552, -1237892, -1377223, -1036306, -414949, -67507, -370936, -949610, -1032449, -521858, -251619, -865996, -1848054, -2142323, -1489204, -594955, -91784, 70046, 123086, -22889, -454813, -819094, -662865, -102049, 200708, -246684, -1273410, -2294011, -2887109, -3063519, -3054296, -2942021, -2570617, -1845204, -1029378, -570926, -597141, -748499, -609375, -165535, 271366, 420909, 140929, -623461, -1664291, -2369262, -2196049, -1418531, -1010851, -1508647, -2284355, -2345572, -1660963, -1181035, -1533662, -2242835, -2491840, -2211356, -1954939, -1939477, -1766348, -1120897, -266211, 360778, 698439, 932756, 1065345, 950721, 663794]
44007F63794j80287j9780j73420n93398q43849o76112l38070k24193l52727l29055
43997c067097J55442Q68942J199078Q09329K5658n35963o06553l54459Q283L66936
43987a130404M98380J79116l62262n34631j77749J47786P734k01627P9432N65632
43977i28593N07022q2400l90980q4669J82963j62972p33688q10884l33648K42024
43967b595825O39837Q04940O19309J40561j54699N4036L31159O4428n26439o42497
43957a265190j22244L10145J38639k62652k99134N4849M77020Q41483J120773
43948I93689J066496M46828n07398j213955j262241o82891J60124P85049Q55945
43939F41646M25876j41650n47486p19791o30764k65530J42039K08778o4444k01810
$$ y = [663794, 483507, 463727, 290307, -303091, -1146940, -1823052, -2161122, -2385315, -2738042, -3067097, -2911655, -2042713, -843635, -34306, -8648, -544611, -1151164, -1505623, -1497340, -1130404, -632024, -452908, -815170, -1349801, -1527550, -1379764, -1372030, -1573657, -1494225, -928593, -421571, -503971, -894951, -979620, -796657, -959629, -1693317, -2504201, -2837849, -2595825, -1955988, -1151048, -531739, -391178, -545877, -491841, -160682, -96254, -622693, -1265190, -1387434, -1077289, -938650, -1201302, -1500436, -1445587, -968567, -127084, 993689, 2060185, 2507013, 1999615, 785660, -476581, -1159472, -999348, -214299, 641646, 1067522, 925872, 378386, -341405, -972169, -1237699, -1095660, -886882, -951326, -1153136]
43929a153136M8573K71387q203n78447q45324o62202l57333p0969L58641Q18303
43919b178710Q08937J60599n49968o26250p8209M61190N24691K68210J58584L70702
43909f80224N63243K70875m60895r42148n36816N16403J228412R08765j06482
43900G61133r11113j023502p12654m54205l50669j60099K62817O80420O51256
43891a256616L6484o78445p50185l1003P02951N84730k43038p75597m79050K9141
43881b860628l2638m20186k86583M68888J063724J041985P83922N81722Q5294
43872D25500q03809j284410p15084K52077N36731K21592K18494N96756M91897
43863f0256k51209o34075j16357M86392L59656n1852M8415M52688M13563j20408
$$ y = [-1153136, -1104563, -833176, -841379, -1419826, -2265150, -2927352, -3284685, -3355654, -2997013, -2178710, -1369773, -1209174, -1759142, -2385392, -2463601, -2002411, -1477720, -1209510, -1050926, -680224, -116981, 153894, -307001, -1249149, -1785965, -1269562, -41150, 867615, 761133, -149980, -1173482, -1886136, -2340341, -2691010, -2851109, -2588292, -1907872, -1256616, -1220132, -1898577, -2648762, -2679765, -1976814, -1392084, -1635122, -2410719, -2889769, -2860628, -2893266, -3313452, -3600035, -3131147, -2067423, -1025438, -241516, 340206, 425500, -378309, -1662719, -2377803, -2125726, -1588995, -1367403, -1148909, -552153, -60256, -311465, -945540, -1061897, -575505, -215849, -267701, -219286, 233402, 646965, 526557]
43853E26557o11926q13114p34061k21941N80844Q57181J57028o26256l88988M61248
43843h13428O29968l379l52736r8143j48465q36351j163203m87242L50892M28064
43833b494023J54295L38731P69779P69780M45587L31548L35918O0069k80447k43097
43823A88140p9697k83032n53634k49846L96141N93773L56749M13671P91974O79867
43813B254106j24164p62980o70412l40549k99876k68739P5449L45363J44156j56223
43803A96131m5768K60783K88376J55177K42275M01581K48309l0983P6173M99819
43793B291873O36291K55147k78255o63828r31414j016810o93435p1542L61309
43784a10664L93941L65187O05776R74226J125610R44140N79323L11421M15499
$$ y = [526557, -85369, -898483, -1632544, -1854485, -1273641, -416460, -259432, -885688, -1274676, -813428, -183460, -186839, -539575, -637718, -786183, -1622534, -2785737, -3272979, -2922087, -2494023, -2339728, -2000997, -1231218, -461438, -15851, 315697, 651615, 711684, 431237, 188140, 108443, -174589, -728223, -978069, -581928, 11845, 368594, 782265, 1574239, 2254106, 2129942, 1366962, 696550, 356001, 56125, -212614, -137165, 208198, 352354, 196131, 150363, 411146, 699522, 854699, 1096974, 1498555, 1746864, 1715881, 1792054, 2291873, 2928164, 3183311, 2905056, 2241228, 1309814, 293004, -400431, -471973, -110664, 283277, 648464, 1254240, 2228466, 3354076, 4298216, 4877539, 5188960, 5604459]
43775E604459Q36203R99085L76367p00986j282918r87808m37656k90978l84876
43766C730892k01181K88341O99089Q04907N96837P7072n89065j006961j017300
43757C382631q77908o33265J20782J251964J558947K58044j436771j520495Q2949
43748B186878J353001R44944k36805p56155n78236l85239j40635M19906O94781
43739C502440K0436q85673o88501N09553J192050N68482n22233j057804j031230
43730A607520q09894l39425L99879Q99117P15063P5211n42299r62532j115673
43721g3033q26841j89845L25976M76391M76041L90518p1500q12068j094531n67575
43711a966467P9992R3577k56609k13198K92906O89416O58470L75418J23440J48197
$$ y = [5604459, 6440662, 7439747, 7816114, 7115128, 5832210, 4844402, 4406746, 4115768, 3730892, 3529711, 3818052, 4517141, 5322048, 5918885, 5995957, 5406892, 4399931, 3382631, 2504723, 1871458, 1992240, 3244204, 4803151, 5061195, 3624424, 2103929, 2186878, 3539879, 4484823, 4248018, 3491863, 2913627, 2528388, 2387753, 2807659, 3502440, 3522876, 2637203, 1948702, 2458255, 3650305, 4218787, 3696554, 2638750, 1607520, 797626, 458201, 858080, 1757197, 2472260, 2547471, 2005172, 1042640, -73033, -899874, -1089719, -763743, -287352, 188689, 579207, 507707, -304361, -1398892, -1966467, -1886475, -1792898, -2049507, -2262705, -1969799, -1280383, -621913, -246495, -123055, 25142]
43701B5142N39775Q42175L15757r01412j563082r35410P2807K92113N4381L71542
43691h86212R71522O77786m88281j165381p14465L4278L42593M49164M97191L919
43681b77886r51276j298942n56100K73555K38734j38400O6908O19485P19405M10497
43671h94020K55579J80308k19473o55292n62622k20848l35928p07245m34283N79567
43661c014257J371434J270558O25622O4935j88020j47689P8944J75772l6284j71638
43651B9377J57519N12542K01476m38670l70734M45904P95118j8633j151176j485264
43641a322541j035454m98035j69102K1797K5126r9336M9479O08298J047442R16194
43631d56132N24794L40328K23430r5708k98239q422L63754J56820m38281o54363
$$ y = [25142, 564917, 1407092, 1722849, 821437, -741645, -1677055, -1604248, -1312135, -1257754, -886212, 85310, 763096, 274815, -890566, -1605031, -1570753, -1228160, -778996, -281805, -277886, -1229162, -2528104, -3084204, -2810649, -2571915, -2710315, -2643407, -2023922, -1304517, -894020, -638441, -458133, -677606, -1332898, -1895520, -2116368, -2452296, -3159541, -3593824, -3014257, -1642823, -372265, 253357, 318292, 130272, -17417, 61527, 237299, 201015, 29377, 186896, 699438, 900914, 462244, 91510, 537414, 1332532, 1313899, 162723, -1322541, -2357995, -2856030, -3025132, -3003335, -2978209, -3077545, -3028066, -2419768, -1372326, -456132, 68662, 408990, 632420, 536712, 238473, 230051, 593805, 750625, 312344, -342019]
43621c42019l47009p5735j01663j64119k11775m48236n82687O68J060419J410690
43611A98534M96115o97277q78252j8230Q85541J112740O71766j37067r10163j109363
43601c85656n08717L57082O85856L28607j75139l83012l17062r7329K84654P09006
43591D98290Q27168M13071l50217r88532j043496l97825M92204Q69819M82771
43582H03253q5267k41870k26825n29285p68749j23804J086449J374078J32492
43573A420472j272643j281744k48117K73601j65106n47283k04951K80277K66071
43564a479423M2171R7265K48741J56215M1812J86964K32374k29402p20614l99170
43554a823067O16737J277684J028671M65292L42738N57080M79424j13980q12856
$$ y = [-342019, -689028, -764763, -866426, -1030545, -1242320, -1690556, -2273243, -2272575, -1212156, 198534, 694649, -2628, -880880, -899110, -13569, 1099171, 1770937, 1633870, 723707, -385656, -894373, -537291, 148565, 477172, 302033, -80979, -398041, -495370, -210716, 498290, 1325458, 1738529, 1388312, 399780, -643716, -1041541, -549337, 320482, 803253, 717986, 476116, 249291, -279994, -1048743, -1172547, -86098, 1287980, 1420472, 147829, -1133915, -1382032, -1108431, -1273537, -1820820, -2025771, -1745494, -1479423, -1437252, -1339987, -1091246, -935031, -893219, -706255, -473881, -703283, -1423897, -1823067, -1206330, 71354, 1100025, 1565317, 1908055, 2465135, 2944559, 2830579, 2017723]
43545B017723j038561n18247M58672J098867P45801l14174j007394o95564R0995
43536H38118M59930L08399J57268J37965j33459o94539r85875p02358k85560j88153
43526a088264j55955K40244P31187O57931J7639m39842k18754L63839P62073Q35433
43516A705531O71350K51978l35896p03586n79302k03701M0634J63122L51214M71300
43506A832644K78258l4123m7559J73600J78024l2918J07433Q20567J562679J811616
43496F650221J715384J580846J282850P17129L25041M35920M52913m00514j643318
43487A1116472j864456p22274L47796J4735j111123j392963m98122K32651k21014
43478E901702j196690j443113q23691j81510O2186K52332M95398K73588n52931
$$ y = [2017723, 979162, 460915, 919587, 2018454, 2764255, 2450081, 1442687, 747123, 838118, 1298048, 1606447, 1763715, 1901680, 1768221, 1073682, 87807, -614551, -900111, -1088264, -1244219, -1003975, -272788, 385143, 402782, -37060, -255814, 108025, 870098, 1705531, 2376881, 2628859, 2292963, 1589377, 1010075, 806374, 847008, 1010130, 1361344, 1832644, 2110902, 2076779, 2029220, 2202820, 2380844, 2347926, 2455359, 3275926, 4838605, 6650221, 8365605, 9946451, 11229301, 11946430, 12271471, 12707391, 13160304, 12759790, 11116472, 9252016, 8529742, 8877538, 8892273, 7781150, 6388187, 5890065, 6122716, 5901702, 4705012, 3261899, 2438208, 2256698, 2318884, 2571216, 3066614, 3340202, 2787271]
43469B787271j127523o63124L26783O29904m1998q10714r79001q06773p34885
43460a420060n87347o243Q28342J413778J546395J317169P71033q64o21329o89337
43450B551537k26011L71957P22218O85680M31921L72251P04971R56331M63588
43441G034443n52445j070685p36541m51781r22227j423684r12968K59899Q40556
43432B064567M83618m8368k60815l36306k72865J74977O38228M19723k00678j74579
43422B487502N36817P08987j37689q11772l04811O37307P94261L09298R5942J90865
43412D506707n0061n99602q00091n05849j74224j1678R1934J5674l48041n68879
43402A555890k77524O070l90732j007613q11062J13796O39996L95512K23993N95421
$$ y = [2787271, 1659748, 996624, 1323407, 1953311, 1911313, 1100599, 121598, -685175, -1420060, -2007407, -2013650, -1185308, 228470, 1774865, 3092034, 3863067, 3862203, 3240874, 2551537, 2325526, 2697483, 3419701, 4105381, 4537302, 4909553, 5614524, 6570855, 7034443, 6481998, 5411313, 4674772, 4222991, 3300764, 1877080, 964112, 1224011, 2064567, 2548185, 2499817, 2239002, 1902696, 1629831, 1804808, 2443036, 2862759, 2662081, 2487502, 3024319, 3733306, 3595617, 2783845, 2479034, 3116341, 3910602, 4219900, 4315842, 4506707, 4456646, 3857044, 3056953, 2551104, 2376880, 2365202, 2457136, 2472810, 2124769, 1555890, 1278366, 1284436, 893704, -113909, -924971, -811175, -171179, 224333, 448326, 1043747]
43392A043747Q04405K94239l00430j84779L34096M34878P8787q5242J93345M75326
43382C088372L35026j27226m69659l67932M4391K26261j79392q04519r37965m47747
43372C59610J04679K77511J50543j13985m56643n42168M2676R18926J025623O2381
43362A829153r14985r24216l71894j94048l24603L909Q19108J322536J146249
43353B391209P37859M37335O8540l40993k69412M49364J107018R63076K20943
43344E764939l15341l22036k19125l96872n94819k72838N27606R86038L90184
43335E547736q74151j602840j187501l49008j08242l90045k51973O41517J487003
43326B912496J447025O94926K2538j67679p2989K5782M2638n7930l02731n75822
$$ y = [1043747, 1848152, 2142391, 1841961, 1657182, 1991278, 2426156, 2504943, 2419701, 2613046, 3088372, 3423398, 3296172, 2826513, 2458581, 2502972, 2729233, 2549841, 1745322, 807357, 359610, 464289, 741800, 892343, 778358, 321715, -220453, -177777, 741149, 1766772, 1829153, 914168, -10048, -381942, -575990, -900593, -896684, -77576, 1244960, 2391209, 3129068, 3566403, 3634943, 3293950, 3024538, 3473902, 4580920, 5543996, 5764939, 5449598, 5127562, 4908437, 4511565, 3916746, 3643908, 4171514, 5157552, 5547736, 4673585, 3070745, 1883244, 1534236, 1425994, 1035949, 783976, 1425493, 2912496, 4359521, 5054447, 5076985, 4909306, 4836317, 4862099, 4904737, 4846807, 4544076, 3968254]
43316C968254o99967o90411p11459p29772m48408K42881R07429R23688K29277
43307B991512n37526p68712n47252l44120k43824J04881P59654J195466R98569
43298C608648M76077K05185K37744J93976o424j6186L10160O12619N10389P4929
43288F207117l33492m47796j89159L52968Q73041J021163Q13391O72191Q77604
43279I847028J194212J269121J175587J235640J467467J631636J787428K321438
43271B1929557L274252M078604M283573M217643M523134N239640N816117N900840
43263E9263360N533434M535188K443478n62782l263370m541160m611864m523055
43255E4273229m697885m690496m254259l802438l647664l543894l297116l157212
$$ y = [3968254, 3268287, 2577876, 1866417, 1136645, 688237, 931118, 1838547, 2762235, 2991512, 2453986, 1685274, 1138022, 793902, 550078, 654959, 1414613, 2610079, 3608648, 4084725, 4289910, 4527654, 4721630, 4715206, 4699020, 5009180, 5621799, 6132188, 6207117, 5873625, 5425829, 5236670, 5589638, 6462679, 7483842, 8297233, 8969424, 9847028, 11041240, 12310361, 13485948, 14721588, 16189055, 17820691, 19608119, 21929557, 25203809, 29282413, 33565986, 37783629, 42306763, 47546403, 53362520, 59263360, 64796794, 69331982, 71775460, 71212678, 67949308, 63408148, 58796284, 54273229, 49575344, 44884848, 40630589, 36828151, 33180487, 29636593, 26339477, 23182265]
43247B3182265l187030k869447j919264r98509r32094j487751j627502q90223
43239I270445P6239M04930l1387o48408q33493n26976k56940n17013j053156j089769
43229D794472m31921J50234K8350l22027j02637M99386O15698O6674m71379n91293
43219D235557n34524m05018M1485O12003O17522k0907m57156j86654J66580q4749
43209C984139n67698n17639N199L56801L46425K43063N9931l61106p38578o14476
43199B196061j61256r90k28662l17364m9489J66053Q2160O1166M20739Q43338
43189C011756Q04565K48297m62546r77708j086315p09359p2950L25497K25796
43180A307033n8986o2418K23251M23736L52287J73524J2747k48689o40181q30649
$$ y = [23182265, 19995235, 17125788, 15206524, 14208015, 13275921, 11788170, 10160668, 9270445, 9346684, 9751614, 9720227, 9071819, 8238326, 7711350, 7454410, 6937397, 5884241, 4794472, 4362551, 4512785, 4541135, 4219108, 4116471, 4615857, 5231555, 5298229, 4826850, 4235557, 3701033, 3296015, 3337500, 3949503, 4567025, 4546118, 4088962, 3902308, 4068888, 3984139, 3416441, 2898802, 2904001, 3260802, 3607227, 3850290, 3910221, 3549115, 2810537, 2196061, 2034805, 2033815, 1805153, 1487789, 1438300, 1604353, 1686513, 1747679, 2168418, 3011756, 3816321, 4064618, 3602072, 2624364, 1538049, 828690, 755740, 1081237, 1307033, 1248047, 1185629, 1408880, 1832616, 2184903, 2358427, 2371174, 2122485, 1482304, 651655]
43170F51655m71817K71528Q10029P83522L94950K2100k23020l57818k51133J35375
43160A765371M01443R3806n69257q48036m49058J38062M17722M67210M74524K69329
43150B161116k28914n84724m55908k48149m84048q00254l78838O91072J310878
43141I82231Q02969k49943q72330q15897m58671p6989L13644O59390Q28136P79016
43131A891556N43363J60127k04079k48884J25052N73511N94435N2084o53733r35710
43121A897722n68411O2382L55607K01437P4734K83647M87275L13295N9878J82346
43111C349912L90094P6906m74443l04049O51511J198616N26376o79795j331157
43102C403971j326452j143836q00967j45443L67175K14017j85190N821O72490
$$ y = [651655, 179838, 451366, 1261395, 2044917, 2439867, 2461967, 2238947, 1881129, 1629996, 1765371, 2166814, 2260620, 1691363, 843327, 394269, 532331, 950053, 1417263, 1891787, 2161116, 1932202, 1347478, 891570, 643421, 159373, -640881, -1019719, -328647, 982231, 1785200, 1535257, 662927, -152970, -611641, -688630, -374986, 284404, 1112540, 1891556, 2434919, 2595046, 2390967, 2142083, 2267135, 2840646, 3435081, 3487165, 2833432, 1897722, 1329311, 1391693, 1747300, 1948737, 2023471, 2307118, 2794393, 3107688, 3167566, 3349912, 3740006, 3816912, 3342469, 3038420, 3689931, 4888547, 5414923, 4735128, 3403971, 2077519, 933683, 132716, -12727, 354448, 568465, 383275, 389096, 1061586]
43093A061586Q80653L18299l53758o39976p37597p54965l66361L90105Q23517
43084F21503N80843K13685K48220L54394M6671l62932k38314L29252O65642N08620
43074B967584K19993J23932K08816M15152O78931P21111L26470j38506j0149P42696
43064F256030J335379J116923L27789l31786n76429o60522q09746q88444o81327
43055E087867k90218q3719k43334m69929k97689K76437O76000M17521k53768o41685
43045D177483m28015O0227M01428N81290Q30001J202676J500646J487657J077850
43036A0891243M43743K6162K43172J004368J658890J674526J319916J413832K340531
43027B1016383L531806M080639L763078L279950L482772M481442N574081N987873
$$ y = [1061586, 1942239, 2260538, 1906780, 1266804, 529207, -225758, -592119, -202014, 621503, 1202346, 1416031, 1664251, 2018645, 2065316, 1702384, 1464070, 1793322, 2458964, 2967584, 3187577, 3311509, 3520325, 3935477, 4614408, 5335519, 5661989, 5523483, 5513334, 6256030, 7591409, 8708332, 9036121, 8704335, 8127906, 7467384, 6657638, 5769194, 5087867, 4797649, 4713930, 4470596, 4000667, 3702978, 3979415, 4655415, 5072936, 4819168, 4177483, 3749468, 3809695, 4211123, 4792413, 5622414, 6825090, 8325736, 9813393, 10891243, 11334986, 11361148, 11604320, 12608688, 14267578, 15942104, 17262020, 18675852, 21016383, 24548189, 28628828, 32391906, 35671856, 39154628, 43636070, 49210151, 55198024]
43019E5198024N583834M798405L971910K891156J103945j375570l857877n550855
43011F2762972o206190o077820n421887m362666l226074k552803k494344k486081
43003B9935107j918085r87382m51492n88967r07499r67884r38398j038062r61339
42994B1175999l99809K05515J12617o21001j168471j129241r84243j083297r09871
42985A5198198J2671R90172Q35760m08085j322638r46915J5472L39612o813j07019
42975A4600415K79057L53056l12939r52290p48900j48962k46970j167148j864667
42966I790652j536360n42999K22732L24876o1029m79992m31140K79254J127914
42957H693908J242518N08293j24531J43851Q62986J006864M11337j65466k66773
$$ y = [55198024, 60781858, 65580263, 69552173, 72443329, 73547274, 72171704, 68313827, 62762972, 56556782, 50478962, 45057075, 40694409, 37468335, 34915532, 32421188, 29935107, 28017022, 27029640, 26578148, 25989181, 25081682, 24113798, 23175400, 22137338, 21175999, 20776190, 20981705, 21094322, 20473321, 19304850, 18175609, 17191366, 16108069, 15198198, 15210869, 16201041, 17036801, 16628716, 15306078, 14359163, 14374635, 14714247, 14707434, 14600415, 14879472, 15232528, 14919589, 13967299, 13218399, 13069437, 12822467, 11655319, 9790652, 8254292, 7711293, 7934025, 8258901, 8197872, 7717880, 7286740, 7565994, 8693908, 9936426, 10444719, 10320188, 10464039, 11327025, 12333889, 12745226, 12579760, 12312987]
42948A2312987k51827m98546p93954q11135o66867o36512o69926n47619k84675
42939G151926p4068P790o984j32767l49596m82484l71939r6656J31253K27423
42929F003898K55357K38221Q2980k86376p59353j045233r38217n95632l76047
42920B579598l14964n4481M69747O61992J07385n26767k19689Q25296J244807
42911D772924M03249o80731q01578j49889L05731L46025M47617O18507L81002
42902E642857j63045l02074O6990J29909n46374j200544r36432k7498N03581K82656
42892C450026j16071j70039o2907j74901m07973l99687k00967k91769q30526j260710
42882d65524r92772k64589J57935J03002K13803Q37920J335786J014345K51075
$$ y = [12312987, 12061160, 11562614, 10768660, 9957525, 9290658, 8654146, 7984220, 7436601, 7151926, 7077858, 7085648, 7078664, 6945897, 6596301, 6113817, 5741878, 5645222, 5776475, 6003898, 6259255, 6497476, 6580456, 6294080, 5534727, 4489494, 3551277, 2955645, 2579598, 2264634, 2210153, 2679900, 3341892, 3449277, 2922510, 2702821, 3528117, 4772924, 5176173, 4495442, 3693864, 3543975, 3849706, 4195731, 4643348, 5261855, 5642857, 5479812, 5177738, 5244728, 5374637, 4828263, 3627719, 2691287, 2663789, 3167370, 3450026, 3333955, 3163916, 3101009, 2926108, 2518135, 2118448, 1917481, 1625712, 795186, -465524, -1458296, -1722885, -1564950, -1461948, -1248145, -410225, 925561, 1939906, 2190981]
42873B190981l6444K42898L31227j09428n39375m90100k11216q3970l6790Q9161
42863A346944J32687l0431j67013j02055m8880j56939j42824K12302N79851N57783
42853B181425K96095J71896J42932n2202k97164k66602l4313M4372l5419L8775
42843B189795K70207L08300P4613p7112O4840K88483L88272M59453N81235N75673
42833E123759L15465n411j38890j21295j49216k72456l76112l45187j12423L39484
42823D257718Q72641J157897R11935K43039k94283j46893N92222J094832O51805
42814I340913l77600q69069l24404N12998P34753M28153K09774P9829m09418j053894
42804H272035j043068k26299N45072O40867M42889N10876O73958M99195Q5592
$$ y = [2190981, 2154537, 2397435, 2728662, 2619234, 2079859, 1589759, 1378543, 1294573, 1257783, 1346944, 1479631, 1449200, 1282187, 1180132, 1131252, 974313, 831489, 1043791, 1623642, 2181425, 2477520, 2649416, 2792348, 2740146, 2442982, 2176380, 2142067, 2186439, 2151020, 2189795, 2460002, 2768302, 2842915, 2765803, 2830643, 3119126, 3507398, 3966851, 4548086, 5123759, 5439224, 5433813, 5294923, 5173628, 5024412, 4751956, 4375844, 4030657, 3918234, 4257718, 5130359, 6288256, 7200191, 7443230, 7148947, 7002054, 7594276, 8689108, 9340913, 8963313, 8094244, 7769840, 8282838, 9017591, 9445744, 9655518, 9735347, 9325929, 8272035, 7228967, 7002668, 7547740, 8188607, 8631496, 9142372, 9816330, 10315525, 10401117]
42795A0401117k24592m83158q66842j134327r78794o29680m83309m09398r3853
42786E097164J81270j09346p20976q25330k54934K71587L28157L33088N94145
42777D894825O41585Q4906n35369m64786J43100N34132M67388L11019K56663J95869
42767F529332K66349P11786J142096P52745m57006j415209j329655o85971l97051
42758E117416n19554m86583k16673j78428m68744n98598k90924J47881M15631
42749B921424N91093O94822M35990k42040q15393p92814l27648J70054O51919
42740C287407J161764J300762O58816l43233p57843l29252K31431L41845K69453
42731E821150M46731O72164N09641P7404j30898J6763K53225M45020O45823P39162
$$ y = [10401117, 10176525, 9693367, 8826525, 7692198, 6713404, 6083724, 5600415, 5191017, 5097164, 5278434, 5169088, 4448112, 3622782, 3367848, 3639435, 3967592, 4300680, 4894825, 5536410, 5621316, 5085947, 4621161, 4764261, 5298393, 5765781, 6076800, 6333463, 6529332, 6795681, 7507467, 8649563, 9402308, 8945302, 7530093, 6200438, 5514467, 5117416, 4597862, 4111279, 3894606, 3716178, 3247434, 2648836, 2357912, 2505793, 2921424, 3512517, 4207339, 4643329, 4401289, 3585896, 2793082, 2465434, 2635488, 3287407, 4449171, 5749933, 6408749, 6065516, 5307673, 4978421, 5209852, 5551697, 5821150, 6267881, 6940045, 7449686, 7527090, 7396192, 7412955, 7666180, 8111200, 8757023, 9496185]
42721I496185N78491M22440O35152R59677P96677L34768N51561J655139K393562
42712A7823652J752472O67010Q46825K189175K798072J818874P80196J247562
42704B9923838K342395K006770J18062j296607r95685j36786l65364j508817k149698
42695B7938108j740196j042794p82055q98652j164436j645543k259879k498518
42687A5906035j993195j035661k33153J27199J38640p9313m78269q66626q80293
42678A0605364l41082M07660P21027L61140j24264m167O69243J075575P46334
42669A4116830K34132K98696P66337P40266j62677j302903j805741j480446q60073
42660A0544421n83488p97627j027542p13678O787L38475q9637n95684m24416M6744
$$ y = [9496185, 10074676, 10497116, 11132268, 12091945, 12888622, 13223390, 13774951, 15430090, 17823652, 19576124, 20243134, 21089959, 23279134, 26077206, 27896080, 28676276, 29923838, 32266233, 34273003, 34391065, 33094458, 32098773, 31961987, 31596623, 30087806, 27938108, 26197912, 25155118, 24373063, 23474411, 22309975, 20664432, 18404553, 15906035, 13912840, 12877179, 12644026, 12771225, 12909865, 12830552, 12352283, 11485657, 10605364, 10264282, 10671942, 11392969, 11754109, 11629845, 11625678, 12294921, 13370496, 14116830, 14350962, 14649658, 15415995, 16156261, 15993584, 14690681, 12884940, 11404494, 10544421, 9960933, 9163306, 8135764, 7422086, 7428873, 7767348, 7677711, 7082027, 6657611, 6704355]
42650F704355r9931p42307p82081Q1214P28396K73287n86233o22840J82119Q21935
42640E957914P71962M20179J68784l1413j86856m2656L74779N05085j05566j143842
42630F688370j765313j424230l75771N84268Q30697L89770k42539o38234o66535
42621C380483l50185J51353M32401J45023m64984p26534m04633K4594J42288J41345
42611B471151L25514N51798N66587M53808L26021J8154m39063n17958N1601O67484
42601D475097O53583K57140J03719O7434l89972j038341j110146o44195m85696
42592A888623q03680p29051J35058Q74370N84164k60208n23407J1266N50018N13761
42582B240914J74349R4904M09733P69398Q12906O07335N29531O22688L57198n58130
$$ y = [6704355, 6604424, 5862117, 5080036, 5161250, 5889646, 6162933, 5576700, 4953860, 5135979, 5957914, 6729876, 7150055, 7318839, 7287426, 7100570, 7057914, 7432693, 7937778, 7832212, 6688370, 4923057, 3498827, 3123056, 3707324, 4538021, 4927791, 4685252, 4047018, 3380483, 3030298, 3181651, 3614052, 3759075, 3294091, 2567557, 2162924, 2187518, 2329806, 2471151, 2796665, 3348463, 3915050, 4368858, 4694879, 4713033, 4273970, 3756012, 3807613, 4475097, 5128680, 5385820, 5489539, 5556973, 5167001, 4128660, 3018514, 2374319, 1888623, 1084943, 355892, 490950, 1365320, 1949484, 1689276, 1165869, 1177135, 1727153, 2240914, 2415263, 2510167, 2919900, 3689298, 4502204, 5109539, 5639070, 6261758, 6618956, 6060826]
42572F060826j396100j148428K3804R02675Q87197O49303Q16655R79106O25969
42563H401007K29305N45487J412904K102889K441226K716976K788892K186399
42555B2825085R89470j72719r48574j415962j526171j150969o59183o71940j131264
42546A6137773j302456q62079l36116k40558l93764l87275k38300k23510m15194
42537A1738521o72658q35432p52563m05125j15284k80575p61379r25127m96024
42528F494354M2475J66613M2232J27870L18153J6297r10845j685847j433239l28097
42518B849966M31438M4497p39340m54694J013139J942643R04361j243326k367530
42509B381154j695565l68768M70799Q44565R80583O00946j27628j52416R11021
$$ y = [6060826, 4664726, 3516298, 3540102, 4442777, 5329974, 5979277, 6795932, 7775038, 8401007, 8630312, 9175799, 10588703, 12691592, 15132818, 17849794, 20638686, 22825085, 23814555, 23641836, 22693262, 21277300, 19751129, 18600160, 17940977, 17269037, 16137773, 14835317, 13973238, 13637122, 13396564, 13002800, 12615525, 12377225, 12153715, 11738521, 11065863, 10230431, 9477868, 9072743, 8957459, 8676884, 7915505, 6990378, 6494354, 6536829, 6703442, 6745674, 6873544, 7191697, 7207994, 6297149, 4611302, 3178063, 2849966, 3281404, 3325901, 2586561, 2131867, 3145006, 5087649, 5992010, 4748684, 2381154, 685589, 316821, 787620, 1632185, 2612768, 3213714, 3086086, 2933670, 3844691]
42500C844691J726720R67656o06280j170642m66411J09747j33828l64851J1715
42491C918517L50211J05103k00703j27687k09084p48157q79046j9496P47168K23256
42481C160082p24951l07483J211497J625092R3745j530704j425296k30152L43589
42472B215419N8921r6173J33551R6060l12424m14050N248L47268K32033p1809
42462B194044l73432p83380j018161m53205P32316J345146O91487l90171o51259
42453A293385m2200M95473M48580J91294J87367M05172N55633M44499N1295m11699
42443C618799n56968k41027J63026K34510J27530L22669Q12590R90514M45949
42434E917592m91510j150087j188057p35439j13122L95849O37123O38480N61509
$$ y = [3844691, 5571411, 6539067, 5932787, 4762145, 4295734, 4405481, 4271653, 3906802, 3918517, 4268728, 4373831, 4173128, 4045441, 3836357, 3088200, 2209154, 2189658, 2936826, 3160082, 2435131, 2127648, 3339145, 4964237, 5057982, 3527278, 2101982, 1871830, 2215419, 2274340, 2178167, 2311718, 2407778, 2095354, 1681304, 1686552, 2033820, 2265853, 2194044, 1820612, 1037232, 19071, -434134, 298182, 1643328, 2334815, 1944644, 1293385, 1251185, 1746658, 2195238, 2386532, 2573899, 2979071, 3534704, 3979203, 4030498, 3618799, 3061831, 2820804, 2983830, 3218340, 3345870, 3668539, 4481129, 5471643, 5917592, 5426082, 4275995, 3087938, 2352499, 2239377, 2635226, 3272349, 3910829, 4472338]
42425D472338N34604N51912N37861M50967L14243J95434J72075K99703O17591
42416H146728J148604J807825K324554K383809J888810J019940Q3195n90381p54708
42407A7458376n63113o62093j504110k536517k628057j506208k16691J83517j54976
42398G870128m21053l49291j96496M4044N15189P76338J81454r22912j279531
42389F217870l46599Q72390J079437K23783o95206r54221o95237m17586l94734
42380D889897n66559o61061l92273K61888R66760J308621J119667N08716k58783
42371G176873q19545q37519k58244N92412J225198J290468P68173L0002l70618
42362H797200k23951O2908q826l07511k67629K03636N17772K59246k24247l58101
$$ y = [4472338, 5006942, 5558854, 6096715, 6547682, 6861925, 7057359, 7229434, 7529137, 8146728, 9295332, 11103157, 13427711, 15811520, 17700330, 18720270, 18803465, 18213084, 17458376, 16895263, 16233170, 14729060, 12192543, 9564486, 8058278, 7841587, 8025104, 7870128, 7449075, 7099784, 6903288, 6947332, 7462521, 8238859, 8420313, 7497401, 6217870, 5871271, 6743661, 7823098, 8046881, 7351675, 6397454, 5702217, 5284631, 4889897, 4323338, 3662277, 3270004, 3531892, 4498652, 5807273, 6926940, 7435656, 7176873, 6357328, 5519809, 5261565, 5853977, 7079175, 8369643, 9137816, 9167818, 8797200, 8573249, 8636157, 8627331, 8319820, 8052191, 8255827, 8773599, 9032845, 8808598, 8450497]
42352H450497p3731L09980N91132P05870N32129Q3207k92120k95775j31292j90122
42342I689775l87604k17130N21891J390370J786328J533823R44695M78742M08888
42333A6149778P10729J210412J794451K364594K634806K292108J518366J036380
42325B9711624J311249J899653J954162J260307L94003j04568l02707n45906r24574
42316C4653243j269812j462891j542614j590514j632798j617353j451785j124279
42308B2961197p80948n88794n38517n07533m98670o36430q92013j019860r00636
42299A6597796p80712r43373j199766r88254r9409R11174J283209R52623O14428
42290A6347716Q53143J497629J961341J916528J392205N02898n19419j195729
$$ y = [8450497, 8376766, 8686746, 9277878, 9983748, 10515877, 10599084, 10306964, 10011189, 9879897, 9689775, 9302171, 9085041, 9606932, 10997302, 12783630, 14317453, 15262148, 15740890, 16149778, 16860507, 18070919, 19865370, 22229964, 24864770, 27156878, 28675244, 29711624, 31022873, 32922526, 34876688, 36136995, 36530998, 36426430, 36123723, 35577817, 34653243, 33383431, 31920540, 30377926, 28787412, 27154614, 25537261, 24085476, 22961197, 22180249, 21591455, 21052938, 20545405, 20046735, 19410305, 18518292, 17498432, 16597796, 15817084, 14873711, 13673945, 12685691, 12586282, 13497456, 14780665, 15733288, 16347716, 17200859, 18698488, 20659829, 22576357, 23968562, 24471460, 23952041, 22756312]
42282B2756312j155970n79741R8382Q01539J625297K173992J872461J128740J373757
42273C0094769L407445O236143Q064178P948188N963092K433130j980289n749682
42265E6416974p276505o519963n037669m125879l642862k967164k250017k014891
42257B2582024k095231j841157j170677o34665m68241l01017P9551L78599M98373
42248A7027559R44950K002881K955585K799281J534791R5073r23470j731452k481190
42239B2224008k756904k321784j683487j348193j065149m68614M0974r8699n01565
42230A2020587l34053K44479K51472m54693q54301m31976p753l11486p75048n74232
42220H772996j5286R7165j60085j04341L40810O91947Q18592Q59125N56539l00137
$$ y = [22756312, 21600342, 21020601, 21118983, 21920522, 23545819, 25719811, 27592272, 28721012, 30094769, 33502214, 39738357, 47802535, 55750723, 61713815, 64146945, 62166656, 56416974, 49140469, 42620506, 37582837, 33456958, 29814096, 26846932, 24596915, 22582024, 20486793, 18645636, 17474959, 16840294, 16372053, 16071036, 16150587, 16529186, 17027559, 17972509, 19975390, 22930975, 25730256, 27265047, 27360120, 26436650, 24705198, 22224008, 19467104, 17145320, 15461833, 14113640, 13048491, 12579877, 12620851, 12522152, 12020587, 11686534, 11931013, 12182485, 11727792, 10873491, 10441515, 10433762, 10122276, 9347228, 8772996, 8757710, 8854875, 8694790, 8590449, 8931259, 9623206, 10441798, 11300923, 11857462, 11557325]
42210A1557325j034400p89679O5698L92143P7706J12467P42540R43178K15472
42201A2282450l86950J84305J422919K186072K339849K493524K699614K479077
42193B5700860J826264J234494Q58862M65125J43270L36759J131242K111912K975329
42184C6784117L796814M672048N504508O105335O123397N035913K747135J60890
42176G0930157j370079j246600M9866J660517K812841K698389P48320k569116
42168G3714295n730905p376216p333661o301202m950663l666308k731150k195675
42160C3428515j661380o57873P01833J711576J756836Q46984m71750j518091j853835
42151C2282815j539538j052307p60935n08970O4053Q99938J645952K401455L709369
$$ y = [11557325, 10522925, 9733246, 9798944, 10191087, 10268793, 10381260, 11123800, 12066978, 12282450, 11895500, 12079805, 13502724, 15688796, 18028645, 20522169, 23221783, 25700860, 27527124, 28761618, 29620480, 30085605, 30228875, 30565634, 31696876, 33808788, 36784117, 40580931, 45252979, 50757487, 56862822, 62986219, 68022132, 70769267, 70930157, 69560078, 68313478, 68363344, 70023861, 72836702, 75535091, 76283411, 73714295, 67983390, 60607174, 53273513, 46972311, 42021648, 38355340, 35624190, 33428515, 31767135, 31109262, 31811095, 33522671, 35279507, 36126491, 35654741, 34136650, 32282815, 30743277, 29690970, 28930035, 28421065, 28485118, 29385056, 31031008, 33432463, 37141832]
42142C7141832N443568O273026M941265J859427j268853l309438m435336n041898
42134D1603593m954139m145261l327149l050394k838197k056870j143538r74000
42126A9114045j332402j148451k19450M49133K34734k33601j75771L50049J037036
42117A8075322J910888K623596K119622L4793k217198k890613k081218j347250
42109A6227942j385277j336166n41402K44990N271j020076j715962j562827j042280
42100G874213p50031o82125m79799m7016K70395J08569l74682n42783j1666Q14817
42090F179892J222640J089249R13291R69920R30149M77610j50818n23769n59021
42081A0549143l93263l0594M84049P93243O19559L28915N90104J399426J893001
$$ y = [37141832, 42585400, 48858426, 53799691, 55659118, 54390265, 51080827, 46645491, 41603593, 36649454, 32504193, 29177044, 26126650, 23288453, 21231583, 20088045, 19114045, 17781643, 16633192, 16413742, 16862875, 17097609, 16864008, 16688237, 17038286, 18075322, 19986210, 22609806, 24729428, 24764221, 22547023, 19656410, 17575192, 16227942, 14842665, 13506499, 12965097, 13210087, 13215358, 12195282, 10479320, 8916493, 7874213, 7124182, 6442057, 5962258, 5915242, 6185637, 6294206, 5919524, 5376741, 5365075, 6179892, 7402532, 8491781, 9405072, 10374992, 11305141, 11782751, 11631933, 11108164, 10549143, 10155880, 10125286, 10609335, 11402578, 12022137, 12351052, 12941156, 14340582, 16233583]
42072A6233583J353877J21112p45579n56550M10255J252686J245208M48274l48599
42063A9414267m50951j14815k75886j218428j944939j399392k1614O83187R5794
42054A4767223q47675j155052j027816j050429r81100l06401N16822N05990k91958
42045A0129604p57755l19108L48789M76330J54015k12655n52939p71900n25340
42036G969041P9720K66509k84460p42340l03426N33456P55999M28808M53195R76213
42026A0132715J146957N30897k20304l82936m4193L66621P47503J113710J268762
42017A4659732J153914J147188J564199K098967K151487J572912P72993J79852
42009B5301244j29582k86059l61260l46459k94094l28683m50493m34605r8753
$$ y = [16233583, 17587460, 17708572, 16962993, 16406443, 16816698, 18069384, 19314592, 19762866, 19414267, 18963316, 18848501, 18572615, 17354187, 15409248, 14009856, 13988242, 14671429, 14767223, 13919548, 12764496, 11736680, 10686251, 9705151, 9398750, 9915572, 10421562, 10129604, 9371849, 9052741, 9401530, 9877860, 10031875, 9819220, 9266281, 8494381, 7969041, 8048761, 8315270, 8030810, 7288470, 6985044, 7518500, 8274499, 8703307, 9156502, 10132715, 11279672, 11810569, 11590265, 11207329, 11163136, 11529757, 12277260, 13390970, 14659732, 15813646, 16960834, 18525033, 20624000, 22775487, 24348399, 25121392, 25301244, 25171662, 24885603, 24524343, 24177884, 23883790, 23555107, 23104614, 22670009, 22571256]
42000B2571256L78887O47710O56578O04849M50145j1543m74937k37795O52364
41991B5237514J111529N19725j87119J73950J212712J625183J321504J487527
41983C2502525K488351L199606K940729K775805M014074O324163Q299951R335635
41975G1880839J0070909J1343988J3482786J6481941K0339825K5180098L0825371
41968A99605757L5428473L4635754K4075977M366605j7178778l1706200l5867384
41961B13360204l2911248k7635369k2295860j7375980j3622279j1572148j0388741
41954G7558579q896496p240234o260788n782578m898192l651322l016708l184411
41946C4627850l178351k434433j576805j210544j007867n52450j54797j52978
$$ y = [22571256, 22950143, 23597853, 24254431, 24859280, 25309425, 25297882, 24822945, 24585150, 25237514, 26349043, 26868768, 26681649, 26855599, 28068311, 29693494, 31014998, 32502525, 34990876, 38190482, 41131211, 43907016, 47921090, 54245253, 62545204, 71880839, 81951748, 93295736, 106778522, 123260463, 143600288, 168780386, 199605757, 235034230, 269669984, 293745961, 298112566, 280933788, 249227588, 213360204, 180448956, 152813587, 130517727, 113141747, 99519468, 87947320, 77558579, 68662083, 61421849, 55161061, 49378483, 44480291, 40828969, 37812261, 34627850, 31449499, 29015066, 27438261, 26227717, 25219850, 24667400, 24512603, 24359625]
41938B4359625j89131R7297L38736J45700r0765J00072L69221K37412J12302N82393
41928B6062862J171293R85963L13229L06447J195512K096274K636701L450335
41920C8218616M808976N995677O395725O139731N427681M380279L758101M446910
41912G9571696N891906O555656O410170P308827J0196623J3754756J6791962K0155609
41904A66637205K5094288L1589979L9435147M8314490N4774972N2194720L7655272
41897D55696073J7137144l46993j2878007k5374802l9566154m9763968n0528993
41890B94374300m3944627l6154236k9936782k4156902j8263805j3524214j0597439
41883A17796295q878394q025688q028097q113195p390447o184096n240463m264609
$$ y = [24359625, 24170494, 24267791, 24606527, 24752227, 24661462, 24761534, 25130755, 25368167, 25480469, 26062862, 27234155, 28220118, 28533347, 28839794, 30035306, 32131580, 34768281, 38218616, 43027592, 49023269, 55418994, 61558725, 66986406, 71366685, 75124786, 79571696, 85463602, 92019258, 98429428, 105738255, 115934878, 129689634, 146481596, 166637205, 191731493, 223321472, 262756619, 311071109, 365846081, 418040801, 455696073, 472833217, 472486224, 459608217, 434233415, 394667261, 344903293, 294374300, 250429673, 214275437, 184338655, 160181753, 141917948, 128393734, 117796295, 108917901, 100892213, 92864116, 84750921, 77360474, 71176378, 65935915, 61671306]
41875F1671306k728110j299790q10843n88223M34529J728732K193071K462271
41867F3062943M088984O850600R019159J0189516J1883041J5388714K0680819
41860A41163776K6895029L1525853K9628723J7285319k815518k1656479l1454442
41853A90572261l1730686k7243103k2104213j7574898j3799936j1038155r210095
41846E7871175p806897o518989n303133m058487k852420k137180k150731k417186
41838B4626152k348373k012130j843921j907317j864069j461661p75531j43313
41830A2269837P7630p3335j19148J10370L5575p15190j319378p48617N15926R89887
41820A1023557L42412l07988l51483m38021r03231r83349k80750L76439L60821
$$ y = [61671306, 58943196, 57643406, 56832563, 56244340, 56678869, 58407601, 60600672, 63062943, 67151927, 74002527, 83021686, 93211202, 105094243, 120482957, 141163776, 168058805, 199584658, 229213381, 246498700, 243683182, 222026703, 190572261, 158841575, 131598472, 109494259, 91919361, 78119425, 67081270, 57871175, 50064278, 43545289, 38242156, 34183669, 31331249, 29194069, 27043338, 24626152, 22277779, 20265649, 18421728, 16514411, 14650342, 13188681, 12413150, 12269837, 12347467, 12274132, 12154984, 12265354, 12300929, 11585739, 10266361, 9517744, 10033670, 11023557, 11365969, 11057981, 10706498, 10268477, 9365246, 8381897, 8101147, 8477586, 8838407]
41811H838407K69878O44950Q91835M79484O1516K88917N73981K56653J1293P16579
41801A3033493J743569J848349J180690R34537J418239J919999K212690K728050
41793B7019616L286332L029575J807917N36321k4381M9755M56963J089428J756013
41784C9007539K274131K881744L832099M630235M441721L193320J494559l73502
41776F1381846k444731m136212m467818l464895k384565k178965k502605k558926
41768C7243129k153927j482706n52776O14214J616666K016762J889522J756743
41760D0947627K079058K887015L759624M178289M034307L612128K903860J368584
41752F5770492j154641l696425n029770n086198m776576m555436m001175k847738
$$ y = [8838407, 9108285, 9753235, 10645070, 11124554, 11186070, 11474987, 12048968, 12305621, 12316914, 13033493, 14777062, 16625411, 17806101, 18740638, 20158877, 22078876, 24291566, 27019616, 30305948, 33335523, 35143440, 35679761, 35655380, 35705135, 36162098, 37251526, 39007539, 41281670, 44163414, 47995513, 52625748, 57067469, 60260789, 61755348, 61381846, 58937115, 54800903, 50333085, 46868190, 44483625, 42304660, 39802055, 37243129, 35089202, 33606496, 33053720, 33667934, 35284600, 37301362, 39190884, 40947627, 43026685, 45913700, 49673324, 53851613, 57885920, 61498048, 64401908, 65770492, 64615851, 60919426, 55889656, 50803458, 46026882, 41471446, 37470271, 34622533]
41744C4622533j585963p94495n34505o72096j230480k105737k842066k983068
41736B1874123k461187j604542r67561r98420j525233j778495j343833p93889
41728A0400963q14432j068694p33319J02511N57779M07318L63455P86105J136153
41719A1137839J001261P10154N35328J89451l78945n17451J63579J003842J130045
41710A4975103N99532J22382N7292K47096N16847P94571R49676R22840Q34079
41701B0019418P05784L79794l4804j6099P15012J712569K335110K500380K614974
41692C0932138L033227L900955N259553O893500Q142178Q142368O352777K951050
41684G5607746j092308m460376o390646p148065p352790p073863o096135m813449
$$ y = [34622533, 33036570, 32242075, 31707570, 31035474, 29804994, 27699257, 24857191, 21874123, 19412936, 17808394, 16840833, 15842413, 14317180, 12538685, 11194852, 10400963, 9586531, 8517837, 7784518, 7887029, 8444808, 8852126, 9215581, 10001686, 11137839, 12139100, 12849254, 13384582, 13574033, 13195088, 12677637, 12841216, 13845058, 14975103, 15574635, 15697017, 15754309, 16001405, 16518252, 17312823, 18262499, 19185339, 20019418, 20725202, 21104996, 21070192, 21054093, 21769105, 23481674, 25816784, 28317164, 30932138, 33965365, 37866320, 43125873, 50019373, 58161551, 66303919, 72656696, 75607746, 74515438, 70055062, 63664416, 56516351, 49163561, 42089698, 35993563, 31180114]
41676C1180114l997227l651755k999596j833348r92267j078454j512337j443537
41668A3671593r46546o60175p18431o94619l31228J92151N52521N48796K92124
41659A1906186K55665P64641J394465J446910J094144J288714K335863L407911
41651B3894499L778781L575001K865894J162672j344232l080092k753400j046724
41643B7052399M24800J211684J952143K805887L363980L860515N080613O982579
41635E2734600Q529784Q965477Q221888O064311K089515l023279p289017r075114
41627F7218165q482135o848590n499347n129543n619820o042119n414532l809976
41619B0372103k289462j590896j470431j499203j739067k198175k300131j552186
$$ y = [31180114, 27182887, 23531132, 20531536, 18698188, 17705921, 16627467, 15115130, 13671593, 12725047, 12064872, 11346441, 10651822, 10320594, 10512745, 11065266, 11614062, 11906186, 12161851, 12926492, 14320957, 15767867, 16862011, 18150725, 20486588, 23894499, 27673280, 31248281, 34114175, 35276847, 33932615, 30852523, 28099123, 27052399, 27477199, 28688883, 30641026, 33446913, 36810893, 40671408, 45752021, 52734600, 61264384, 70229861, 78451749, 84516060, 86605575, 83582296, 76293279, 67218165, 58736030, 51887440, 46388093, 41258550, 35638730, 29596611, 24182079, 20372103, 18082641, 16491745, 15021314, 13522111, 11783044, 9584869, 7284738, 5732552]
41611E732552l70687L51895L12663k6689j73294p3171J02936K64375L96780M46364
41601F963724L15946m1898n29818r15129r77124o52235o4525M86930O18189K00770
41591E404830l29804l46630J20474L02983k40474q87216p60973K1590N05254J78400
41581C968434m67059o89673l56542P2799J49228p8704j27844K75489O87691N02481
41571C936300J9412K22803J196941J658293P62270m52912m52499N77307J118245
41562H586160N72899j78639l86574l03736l02749k99626l46363p54417j286927
41553E300028j177796l24245M05064M03836M7078j37425j67432j45602K7730J16286
41543D347522l80019j196820j283176l37356N44963L93861l08297n41264k20767
$$ y = [5732552, 5361865, 5713760, 6026423, 5999734, 5826440, 5753269, 5856205, 6120580, 6517360, 6963724, 7279670, 7237772, 6707954, 5792825, 4815701, 4163466, 4098941, 4585871, 5204060, 5404830, 5075026, 4728396, 4848870, 5151853, 4911379, 4024163, 3263190, 3284780, 3790034, 3968434, 3501375, 2811702, 2455160, 2527959, 2677187, 2598483, 2470639, 2746128, 3433819, 3936300, 3955712, 4178515, 5375456, 7033749, 7796019, 7343107, 6890608, 7467915, 8586160, 9159059, 8980420, 8593846, 8290110, 7987361, 7687735, 7341372, 6586955, 5300028, 4122232, 3797987, 4203051, 4606887, 4653965, 4516540, 4349108, 4203506, 4231236, 4347522, 3967503, 2770683, 1487507, 1150151, 1695114, 2088975, 1780678, 1239414, 1018647]
41534A018647M9589Q3686J48322L31554N73873R44507J304168J119436J85976
41525E759758q53961j216382q24406j10178N06912O31598P0051o24631n65128
41516B773633R6853J51465p70524j384353o59801N64624R65708P22105P99013
41507C258723J084408P35700j64769p63558q53266p84989m13271M32711Q85317
41498C417006Q5284j045513q87282J96242K75840r28474j449221k86922R32750
41489C09710O20694l41308l11246M63092O35532J74521J57788O77900O91735r1688
41479B986730o36781j73044P02394R20101K74126m94780o13624p3476L98170K18209
41469C508025k40965j29261N53415Q26048K46056k91697L7494N66597J64054q24504
$$ y = [1018647, 1068236, 1151922, 1300244, 1631798, 2205671, 3150178, 4454346, 5573782, 5759758, 4905797, 3689415, 2865009, 2754831, 3261743, 3893341, 3963392, 3338761, 2773633, 2870486, 3021951, 2251427, 867074, 207273, 771897, 1737605, 2459710, 3258723, 4343131, 5078831, 4914062, 4150504, 3297238, 2512249, 2098978, 2531689, 3417006, 3502290, 2456777, 1569495, 1765737, 2041577, 1113103, -336118, -623040, 309710, 930404, 589096, 277850, 740942, 1376474, 1550995, 1708783, 2386683, 3078418, 2986730, 2349949, 2176905, 2879299, 3799400, 4073526, 3578746, 2965122, 2891646, 3289816, 3508025, 3267060, 3137799, 3691214, 4517262, 4763318, 4471621, 4509115, 5075712, 5239766, 4415262]
41459D415262r27663K22871J233655Q60118l66508r75523m20723M76195O69329
41450E187013J1582p32094p80094k03220J64506k22403q60163q01567J15543J081806
41440B960909J346441R74729M83114J82347J22755L15137O58295Q64760P96686
41431H705173P46101J038758J409816J165389J01900j053673j406644r23778l55682
41422I427360k05403k24635n5967J17190m6685l64279l72316j02955l9537l04682
41412G828091m66529k76675o2049j53411l94111n03911n21483n56994m49624k5416
41402D417888N53637R85604J133680R25332K98647m61817p16370j96903N59616
41393G499314Q99587Q67458R01365J053986J088911J112643J449858J964176K136632
$$ y = [4415262, 3487599, 3710470, 4944125, 5804243, 5437735, 4462212, 4041489, 4517684, 5187013, 5198595, 4466501, 3686407, 3483187, 3647693, 3425290, 2565127, 1763560, 1879103, 2960909, 4307350, 5282079, 5765193, 5947540, 6070295, 6385432, 7043727, 7908487, 8705173, 9451274, 10490032, 11899848, 13065237, 13167137, 12113464, 10706820, 9783042, 9427360, 9221957, 8997322, 8941355, 9058545, 9011860, 8647581, 8275265, 8172310, 8132773, 7828091, 7361562, 7084887, 7022838, 6869427, 6475316, 5971405, 5449922, 4892928, 4443304, 4417888, 4971525, 5957129, 7090809, 8016141, 8314788, 7852971, 7136601, 6939698, 7499314, 8398901, 9266359, 10167724, 11221710, 12310621, 13423264, 14873122, 16837298, 18973930]
41384A8973930J858636J576497J560211J578325J451343J379308J425377J125760
41376C0929387M9653j452720k443723k344232j507799q43423r42363j582988k088987
41367A7772805k117621j911640j732365j393530o75460O9360K32975j87671n51652
41358I505201m56214j79962r7743j18127K5294K99368N30363P67127J121018J419658
41348A2815983J390897J111094R21714Q99501P24267J50564o44732j310267j712670
41339A4346351j909211j871580j478396p89569j42151J20184n5838m39854p38107
41330G041829p77383n76813k97809m5149K81062P67230J119662Q45419k3264p33354
41320G601430o79217j78238M7535j11733k22545j75325k51286l90171k18095R9284
$$ y = [18973930, 20832566, 22409063, 23969274, 25547599, 26998942, 28378250, 29803627, 30929387, 30979040, 29526320, 27082597, 24738365, 23230566, 22387143, 21444780, 19861792, 17772805, 15655184, 13743544, 12011179, 10617649, 9942189, 10011549, 10244524, 10056853, 9505201, 9048987, 8869025, 8771282, 8653155, 8678449, 8977817, 9508180, 10275307, 11396325, 12815983, 14206880, 15317974, 16239688, 17139189, 17863456, 18014020, 17369288, 16059021, 14346351, 12437140, 10565560, 9087164, 8297595, 8155444, 8275628, 8219790, 7779936, 7041829, 6264446, 5687633, 5389824, 5344675, 5625737, 6392967, 7512629, 8358048, 8334784, 7601430, 6922213, 6743975, 6791510, 6679777, 6457232, 6281907, 6030621, 5640450, 5422355, 5521639]
41310E521639q1504p08964q62797k14067K84176j39422p97104o50520M1063K98135
41300B690635J05681K49596P39913P23959N428n75659m94224j69832M0514L98796
41290C714807R03320Q75875O0175p06789o38579j66265k25055q45460j180194
41281A791835o81860L13414J029808R31124J62057m82842l48801K12958K82667
41272C210360k13732l10200M33698J073298O68761k52453n39059j32928J05219
41263D042964q2110j15541K46863N60773N99888O62148P91418N66316m8681m28183
41253F795855k37791J9234j65313n25503n67474l85246l65280m59551l65454j84344
41243C559133k60599m66436l13760J38745J59100n37757j099394n67330O97717
$$ y = [5521639, 5440135, 4731171, 3868374, 3654307, 3938483, 3799061, 3001957, 2351437, 2392500, 2690635, 2796316, 3045912, 3785825, 4509784, 4515212, 3939553, 3445329, 3275497, 3316011, 3714807, 4618127, 5494002, 5554177, 4847388, 4208809, 4042544, 3817489, 2972029, 1791835, 1109975, 1423389, 2453197, 3384321, 3546378, 3063536, 2714735, 2927693, 3210360, 2996628, 2686428, 3120126, 4193424, 4862185, 4609732, 4070673, 3937745, 4042964, 3960854, 3845313, 4092176, 4652949, 5252837, 5914985, 6706403, 7272719, 7224038, 6795855, 6558064, 6577298, 6411985, 5886482, 5319008, 4933762, 4568482, 4108931, 3743477, 3559133, 3298534, 2832098, 2518338, 2657083, 2816183, 2278426, 1179032, 611702, 1309419]
41234A309419J368663R27141K74606K57855M17441n0863p25697m84484O05605
41225C899686J179224N75827k54762l74900k26599n08999p23051j01054O92728
41216D158100L00184j094132j766857r07252K83688M50397j24280l45989k9941
41207I23918J64092L619o5252K18846N83089P53743P64580O47557K72633l28554
41197C938271p74943o92797j71525K73692K16278k45540o22010n87518k64818
41188A069090Q8563M27283P52173Q65069O45446L68192L10911K30356k11306o45748
41178C900029l90530K95912K43882r33322j970165j485993J16283J111478O15313
41169A502887m89515q47360k08198N59669O55339J91107j08145J40271N09397
$$ y = [1309419, 2678082, 3605223, 3879829, 4137684, 4555125, 4504262, 3778565, 3294081, 3899686, 5078910, 5654737, 5399975, 5025075, 4798476, 4289477, 3566426, 3465372, 4158100, 4458284, 3364152, 1597295, 690043, 973731, 1424128, 1299848, 953859, 923918, 1088010, 1091629, 1026377, 1245223, 1828312, 2582055, 3346635, 3994192, 4266825, 3938271, 3163328, 2470531, 2299006, 2572698, 2788976, 2543436, 1921426, 1333908, 1069090, 1157653, 1584936, 2337109, 3202178, 3847624, 4215816, 4526727, 4757083, 4545777, 3900029, 3509499, 3805411, 4049293, 3115971, 1145806, -340187, -223904, 887574, 1502887, 1013372, 166012, -42186, 517483, 1172822, 1363929, 1255784, 1396055, 1905452]
41160A905452L84222j13414k51843J85164M45473j31078j025519j107442j13312
41151A77703J036088J384213Q62970r862q07463j295981j276595p44767o8562
41142g42256L11432L46747L55489N43835P12903M95766j67782q31489q73726j34129
41132A6790P82159J019288M02991l15673l51889J50000M09075J76556L5723L33695
41122B658715M61398k09970j149545j286703n98887p0480m0805K23151R21893
41113I08767R70302k56461j492163j156976L41967J259779R74398L07273k93779
41104A563107j152690j888192j388026J93350J091811M34251m10508j3679R74612
41095e95964J170286P28031O79823Q75821L47339p15361j074250m62016M2622
$$ y = [1905452, 2289674, 2176260, 1924417, 2109581, 2555054, 2423976, 1398457, 291015, 177703, 1213791, 2598004, 3460974, 3451112, 2643649, 1347668, 71073, -673694, -742256, -430824, -84077, 271412, 815247, 1528150, 2023916, 1856134, 1024645, 150919, 16790, 798949, 1818237, 2221228, 1905555, 1553666, 1703666, 2112741, 2289297, 2325020, 2658715, 3120113, 2910143, 1760598, 473895, -124992, -195472, -236277, -13126, 908767, 1879069, 1622608, 130445, -1026531, -684564, 575215, 1549613, 1856886, 1563107, 410417, -1477775, -2865801, -2672451, -1580640, -1146389, -1556897, -1570576, -595964, 574322, 1302353, 1982176, 2857997, 3205336, 2489975, 1415725, 953709, 996331]
41086I96331k07526o16292n60659k53234p6140l1548j15963l65565l89664K11357
41076a408903Q82065O44377k60221n01690K24884N73619k92199j230091q57587
41067b225746K97731O92341J05047l44234j80872j15006m86133n08300L71093
41058b394079J325141J170185M1293p53419m19980M67878R13156O97947K74483
41049A322605j01356m98769p25960l71813L77298O63753J14210n46081n74870
41040c40983l00304l93322o25162l48830J69870Q6795m97378n99665p391M20193
41030b436177L51202N21644J162392J251595J92691r49256r64542k83451n1990
41021a205892k38770l5834M14724K16213n34721o65285K21735J062520Q91464
$$ y = [996331, 788805, 172513, -388146, -641380, -717520, -749068, -865031, -1230596, -1620260, -1408903, -526838, 117539, -142682, -644372, -419488, 154131, -138068, -1368159, -2225746, -1928015, -1235674, -1130627, -1474861, -1655733, -1770739, -2256872, -2765172, -2394079, -1068938, 101247, 142540, -610879, -1030859, -562981, 350175, 1048122, 1322605, 1221249, 722480, -3480, -375293, 2005, 665758, 779968, 233887, -340983, -641287, -1034609, -1659771, -2008601, -1838731, -1751936, -2249314, -2848979, -2856370, -2436177, -2084975, -1563331, -400939, 850656, 1043347, 94091, -870451, -1153902, -1205892, -1444662, -1480496, -1065772, -849559, -1384280, -2049565, -1827830, -765310, 126154]
41012A26154Q1013m59524n08497l87370j94349J85360O04194P20906M87979K56712
41002I12578L57567O80950P20017J05317q74482j460599j243187n81004o5474
40993a448317J38545J89665J47032J2840n4250N4370J61136Q1808p4151j54785
40983i46107k28820l15844k18600N1065J16328j02959q3154M40377Q46698N19240
40973G8224j40762l43505r5925O5081P7422J52310k1628p74209j431218j001064
40963c435274K09175Q72850N65802J86279L14164M25153R9259j86583j6550K22975
40953g42750J39597J6185J55814L12156K52415J70054J53742q31j50413J45556
40943D51525O43735N25170j45719k76764L87775N97228l62203j287970q98133
$$ y = [126154, 207167, -252357, -760854, -1148224, -1342573, -1157213, -553019, 167887, 655866, 912578, 1270145, 1951095, 2671112, 2776429, 1901947, 441348, -801839, -1382843, -1448317, -1309772, -1120107, -973075, -960235, -1014485, -960115, -798979, -717171, -791322, -946107, -1174927, -1490771, -1709371, -1658306, -1541978, -1644937, -1728091, -1287714, -441016, 78224, -62538, -406043, -501968, -436887, -359465, -207155, -228783, -1002992, -2434210, -3435274, -3226099, -2353249, -1787447, -1601168, -1287004, -861851, -762592, -949175, -965725, -742750, -603153, -586968, -431154, -118998, 133417, 303471, 457213, 456382, 305969, 451525, 1095260, 1620430, 1474711, 1197947, 1585722, 2182950, 1820747, 532777, -365356]
40934c65356J32734L96316L7468J75060O93885L96143q48160j737118j424527
40925b543555m32312M64664J067450J286458R44295L08299o2497j55876l87050
40916D89876o44884l83251K97335O23647L20250q9420k25330j98567k0412L41204
40906E10448L52938m60624j261659o65576R92866J699709O30482n71435k73790
40897I53359Q57481J280270J006839J035670J246062O46415o28535j257276p39306
40888D400979o3619j13723n67234p46376o04141m32033l16934k73889l49681l38961
40878E94388L7010M75390K57739o55729j332605j039517j50643N09014O81611
40869f23342N52771J33096n58477j007690o57893J93124O15761K85959p9012K19017
$$ y = [-365356, -232622, 163694, 201162, 376222, 1070107, 1466250, 618090, -1119028, -2543555, -2975867, -2511203, -1443753, -157295, 787000, 1095299, 1032802, 876926, 489876, -155008, -538259, -240924, 382723, 702973, 613553, 388223, 189656, 169244, 510448, 863386, 402762, -858897, -1524473, -531607, 1168102, 1798584, 1227149, 953359, 1810840, 3091110, 4097949, 5133619, 6379681, 7026096, 6397561, 5140285, 4400979, 4337360, 4223637, 3656403, 2910027, 2305886, 1873853, 1556919, 1283030, 933349, 594388, 631398, 1106788, 1364527, 708798, -623807, -1663324, -1813967, -1304953, -623342, -70571, 62525, -495952, -1503642, -2161535, -1968411, -1352650, -1066691, -1145703, -926686]
40859i26686Q51039R57254L80876j32453J0719M61194M41423k24995r42911j115332
40849b39872p35879j67812L23081O09708N46979J24147l08611l18071N1212K95833
40839A80715J66495O6866M54910J041158J028206K16899n47442l54232N78345
40830B831920J119674O16345l74687r04405p77270n17146m53958l60072p008L76005
40820A549398M15240J02005k32454l11122j15188J94910M06860L69853J09245
40811B488747j88366l56190l73714l07124k24918k01378k82969l93382l84803
40802b24097k51933j83189l06333m71010l94008J3780N41730Q84188R01498O78808
40792A189434L57384l3502m98263q63077q38023l89447J38692M45721O28866Q74852
$$ y = [-926686, -75647, 881607, 1262483, 1130030, 1140749, 1601943, 2043366, 1818371, 875460, -239872, -975751, -1143563, -820482, -210774, 336205, 460352, 151741, -166330, -115118, 180715, 347210, 414076, 868986, 1910144, 2938350, 3155249, 2607807, 2253575, 2831920, 3951594, 4567939, 4193252, 3288847, 2511577, 1994431, 1540473, 1180401, 1173393, 1549398, 1964638, 2066643, 1834189, 1523067, 1407879, 1602789, 2009649, 2379502, 2488747, 2300381, 1944191, 1570477, 1263353, 1038435, 837057, 554088, 160706, -224097, -476030, -659219, -965552, -1436562, -1830570, -1816790, -1275060, -390872, 510626, 1189434, 1546818, 1513316, 1015053, 151976, -686047, -1075494, -936802, -491081, 137785, 1012637]
40782A012637R89992O18261j38759p17902p44785l53729J48450N50351O30591
40773A995107K52978k63347l09988K13695O56073M81661L7563N3472O17728J082836
40763D817778Q88771J22496o94078j085013r25091n02034k48296k56748j76255
40754A941530K38137O54930N38572j09151p04977p96602n60709n04543q16066
40745a18879j110953q41087K5173Q19225Q60732K84741j40685o4826K0330l64951
40735f31180q62997p70743q1740M97591M94422J65957K9505K78953P36900J084689
40725I41357J051923N95321l4657n26400p90659r08538r04037p35044m11016M0381
40715a681369N98450J090795J204353Q66939M18534J65463r628l16942o04755
$$ y = [1012637, 2002629, 2620890, 2482131, 1764229, 1019444, 665715, 814165, 1364516, 1995107, 2248085, 1984738, 1674750, 1888445, 2544518, 3026179, 3063742, 3117214, 3734942, 4817778, 5706549, 5829045, 5134967, 4049954, 3124863, 2622829, 2374533, 2117785, 1941530, 2179667, 2834597, 3373169, 3264018, 2559041, 1762439, 1201730, 697187, -118879, -1229832, -2070919, -2045746, -1226521, -365789, -81048, -221733, -286559, -266229, -631180, -1494177, -2264920, -2346660, -1849069, -1354647, -1188690, -1159185, -880232, -143332, 941357, 1993280, 2588601, 2553944, 2027544, 1236885, 328347, -575690, -1310734, -1721750, -1681369, -1082919, 7876, 1212229, 2079168, 2497702, 2663165, 2653537, 2336595, 1731840]
40706A731840o04839l98577k22037l0805K60144L25990j59596p74342p12188L0214
40696e54196N34050K69639j26419J63658Q65409R55307J18548p54295p09870M5692
40686H07523M83521J83177j41939J77137O19175K37248p20122j002818k81854
40677C61048L10629O5719j32032N18296J069076L21273q61367o03502R57154J698719
40667C705013P17596m75533n39946k10802o09963j259748j140401n53547m75548
40658h42879q33382p89549k07855L83216Q37165J256174J233453L90793o46543
40649G80593r41951o47901n95658p49189l18871O68156J204430Q65117L63055
40640F27781K66016K46030J1074m729N46190J178558J248449Q53592N29183M14482
$$ y = [1731840, 1127001, 728424, 506387, 475582, 735726, 1061716, 902120, 127778, -584410, -554196, -20146, 249493, 123074, 286732, 1152141, 2107448, 2225996, 1471701, 761831, 807523, 1291044, 1474221, 1332282, 1509419, 2128594, 2365842, 1645720, 642902, 361048, 671677, 737396, 605364, 1123660, 2192736, 2514009, 1652642, 1049140, 2006294, 3705013, 4422609, 3947076, 3407130, 3196328, 2586365, 1326617, 186216, -367331, -842879, -1676261, -2465810, -2673665, -2290449, -1453284, -197110, 1036343, 1427136, 780593, -161358, -809259, -1404917, -2154106, -2472977, -1804821, -600391, 264726, 627781, 893797, 1139827, 1150901, 1146172, 1692362, 2870920, 4119369, 4972961, 5502144, 5916626]
40630E916626J88090l55801r70032j134848n53235M04278R06947N68500j03146
40621D867379m84674o47793q55612p68021l3467P00171M87554l20133l84925N88696
40611C149175J320765P90954m70051j364085j507498j040128j32664P01917O97039
40602B145424p4235m78270J09195P79630M27503n92842j065686o57438j15962
40593D77319j7722j65593j32849K12002O48000P08864J02955p13581q64348k59183
40583d136J91912J192r6597N29345J130711O68580m40113q50166k37185M20353
40573A313896L71773j37003o11914r03973r85822q70187p53529o48245r7267J040865
40563b281406J859768J382513L9209q30487p93352n76204n90248l87967K56846
$$ y = [5916626, 6104716, 5748915, 4778883, 3644035, 3090800, 3495078, 4402025, 4970525, 4867379, 4382705, 3734912, 2879300, 2111279, 2077812, 2777983, 3265537, 2945404, 2560479, 3149175, 4469940, 5260894, 4790843, 3426758, 1919260, 879132, 746468, 1448385, 2145424, 2071189, 1592919, 1702114, 2481744, 2909247, 2316405, 1250719, 593281, 477319, 459597, 294004, 161155, 373157, 1021157, 1730021, 1832976, 1119395, 255047, -4136, 187776, 188968, 92371, 621716, 1752427, 2421007, 1980894, 1130728, 893543, 1313896, 1685669, 1548666, 936752, 32779, -953043, -1823230, -2576759, -3225004, -3322271, -2281406, -421638, 960875, 1000084, 169597, -623755, -1199959, -1790207, -2178174, -1921328]
40554a921328Q33052R54233Q17354N64680P9537l82629k91460J93997K82863j83590
40544I46709m68432j91406J42127J53580J08320R9372j91537n28101j01866R81487
40534I50253J414935N92021l89484m50324p2876j29123l20366j7991L19654m3788
40524A852911o42983n39205N5083K52806P9169J69844L30925p8710o27960k96887
40514E54993N99170O19579m87023j263812p51363K43970O61794O28130O24933
40505A430371L91580l78027j077393r12689q7906N32417N71731K90165q4479n25461
40495A50309q65300q04117k64786M89197J040452J090430P22025L34043Q5102
40486A977355l53865j068306j311908m52345P55328R16862J4508n27661l3642
$$ y = [-1921328, -1088276, -134043, 683311, 1247991, 1327528, 944899, 653439, 847436, 1130299, 946709, 478277, 286871, 428998, 582578, 690898, 790270, 598733, 70632, -31234, 950253, 2365188, 2957209, 2567725, 2117401, 2044525, 1915402, 1595036, 1577045, 1896699, 1852911, 1209928, 670723, 725806, 978612, 1057781, 1227625, 1558550, 1479840, 851880, 554993, 1154163, 1773742, 1286719, 22907, -728456, -484486, 177308, 805438, 1430371, 1821951, 1443924, 366531, -546158, -634064, -101647, 470084, 760249, 675770, 150309, -714991, -1519108, -1783894, -1294697, -254245, 836185, 1558210, 1892253, 1977355, 1623490, 555184, -756724, -1209069, -453741, 463121, 477629, -50032, -83674]
40477h3674M63389J3104p57822q43206m84023m61639n69419q2529P20061Q12314
40467a273444N6384n77095m70079m6200J42280J44287J88030K44299K84437M15530
40457h91571N37111L63588j8273j11392K32485M72299J13091n70216r05287o93442
40447a471607l28764j28948N9232M46415P92962O84980K58239J63198N89253Q26003
40437A890963L05265l61470k10426M49305L31021p85062j487496p45717N73963
40428c9654J016611M94810m5640k28192l74000m53419r3260N02189O76166L52161
40418A807772O2542J05q8720j34750J81887N69435L09069n45245j064438p59563
40408C38094j48801K12584L98366N15378L18196j60274l69413r2200J52305m820
$$ y = [-83674, 379715, 392819, -365003, -1208209, -1692232, -2153871, -2723290, -2805819, -2085758, -1273444, -1217060, -1794155, -2264234, -2310434, -2168154, -2023867, -1835837, -1591538, -1307101, -891571, -354460, 9128, -9145, -120537, 111948, 584247, 697338, 127122, -778165, -1471607, -1800371, -1929319, -1870087, -1423672, -630710, 54270, 312509, 475707, 1064960, 1890963, 2196228, 1834758, 1624332, 2073637, 2404658, 1619596, 132100, -613617, -39654, 976957, 1471767, 1426127, 1197935, 823935, 370516, 277256, 779445, 1455611, 1807772, 1870314, 1870419, 1781699, 1646949, 1828836, 2398271, 2707340, 2162095, 1097657, 338094, 189293, 401877, 800243, 1315621, 1633817, 1473543, 1104130, 1011930, 1164235, 1159415]
40398A159415j83902k6158J20045j39276m87670m33797j25052M671J9855K95106
40388B03237P96668J085090Q70743K06875o36334j204497j100197n00176q3487
40379c62078j75287l87969l71061l47608n20893n65526k35343J06866J75934L99020
40369b283945J124701J721710J356922L19054l53304l42054k31860l54902m00570
40360E55752k04467l4276N5050L50788P76323Q06336L41209k7371O0082J69539
40350B848965j82859p59854j014414q77827o98679o41800n24120j38457M82244
40341a506801J040406J143966O67272k7312m29209m24971k63759o9962K24448
40332C54078M93882M41444J05530r4535K6051J52859j14k66233l33289j57973
$$ y = [1159415, 975513, 949355, 1069400, 930124, 442454, 8657, -116395, -111724, -91869, 203237, 999905, 2084995, 2955738, 3162613, 2526279, 1321782, 221585, -278591, -362078, -537365, -925334, -1296395, -1644003, -2164896, -2730422, -2965765, -2858899, -2682965, -2283945, -1159244, 562466, 1919388, 2238442, 1885138, 1543084, 1311224, 956322, 555752, 351285, 317009, 372059, 722847, 1499170, 2305506, 2646715, 2619344, 2679426, 2848965, 2666106, 1906252, 891838, 14011, -684668, -1326468, -1850588, -1989045, -1506801, -466395, 677571, 1344843, 1317531, 888322, 463351, 199592, 129630, 354078, 847960, 1289404, 1394934, 1300399, 1326450, 1479309, 1479195, 1212962, 879673, 721700]
40322G21700J18782L84932N14922L88694J13885k0380O6099J50523Q0309m2783
40312B476683j09206j26082p5274L802j61784o85313j007199m70932N00892O66213
40302A011800k43925q76959p1477J409929J842628P58167p33659j546965j565581
40293a6042j082498k93439M55848P20722N60109N02892P06974P45219M33520K02463
40283B935768K93723K34530l56501r54945p85483K483M86166K03628l57476n37757
40273A164136k59889J26500L37608K86690J1574l04234l95717j66739K07139M83622
40263A490690N38233L31794q6737m52542l92557J41472O85335P07073J68825m96740
40253B634846q64746q06040m22825M8876L09096K17331k0592p6795Q0078J88464
$$ y = [721700, 840482, 1225414, 1740336, 2129030, 2242915, 2222535, 2288634, 2439157, 2519466, 2476683, 2367477, 2241395, 2166121, 2169923, 2008139, 1322826, 315627, -155305, 345587, 1011800, 767875, -109084, -180561, 1229368, 3071996, 3830163, 3096504, 1549539, -16042, -1098540, -1391979, -936131, -215409, 344700, 847592, 1554566, 2299785, 2733305, 2935768, 3229491, 3464021, 3107520, 2152575, 1367092, 1369575, 1855741, 2059369, 1701893, 1164136, 904247, 1030747, 1368355, 1655045, 1666619, 1362385, 966668, 799929, 1007068, 1490690, 2028923, 2360717, 2273980, 1821438, 1428881, 1570353, 2255688, 2962761, 3131586, 2634846, 1770100, 964060, 541235, 590111, 899207, 1116538, 1095946, 1019151, 1099229, 1287693]
40243A287693J13316J3119L2651P3259k6539k74732n62889p20189n06590J48394
40233d22507Q19861Q65157K19156m23760m56969n9531K15887J85177J8967j40749
40223H20689j27998L00954R45390R80607J309j072330j001251J7359N81850R9031
40213A545610n05116l63198J26005K32477Q2597J25365J63666j74755n45242m10005
40203B77404o7584j98978o48415o53354j66363Q4387j06441j12480K96198M38761
40193h56865q5786n85538l26020K90119L70194j13539m34177k97962q7744M931
40183b122387K73257P68880R95741O71067K46500K20595L33151J3849n71722n97765
40173B31166J93123R45250P62272q7869n90755l99008j46942k95027m05794M908
$$ y = [1287693, 1401009, 1414128, 1446779, 1520038, 1493499, 1218767, 655878, -64311, -570901, -422507, 397354, 1262511, 1481667, 1057907, 600938, 541407, 757294, 942471, 961438, 820689, 692691, 993645, 1939035, 2919642, 2920951, 1848621, 847370, 864729, 1446579, 1545610, 1040494, 677296, 803301, 1035778, 1118375, 1243740, 1407406, 1232651, 687409, 277404, 209820, 10842, -637573, -1290927, -1457290, -1372903, -1479344, -1591824, -1295626, -856865, -942651, -1528189, -1854209, -1564090, -1193896, -1307435, -1741612, -2039574, -2127318, -2122387, -1849130, -1080250, -84509, 586558, 833058, 1053653, 1386804, 1400653, 828931, 231166, 424289, 1369539, 2131811, 2043942, 1453187, 1054179, 907237, 612210, 206416, 211324]
40163B11324N00990L31209l05168m41094J90241O86438K78903n72462q91113n08575
40153e19307n7550J03371L01836Q71356J562380J794188J247018J63046p58903
40144D707435q76741k97520Q1854l88831j183743j252682n24097p980k39411m84320
40134d66036j5047O13830M36279k99548m57666K03808P00644M20788j4279Q6720
40124A209493L93939K73816j34784l13056k81420l41737l35228O602K96481k1420
40114G52686o05248n73022J14682N70303L66345O3625J21361K05455j9149k49877
40104G47161k08592j86713l51380k24367M43415R14106M27072n47061r26263n73858
40094d86480k73001l02257q1241O17281J057239N79838l95828r01977n58058K17468
$$ y = [211324, 712314, 1043523, 738355, 297261, 487502, 1173940, 1452843, 880381, -10732, -519307, -576857, -473486, -171650, 699706, 2262086, 4056274, 5303292, 5466338, 4707435, 3830694, 3533174, 3615028, 3226197, 2042454, 789772, 265675, 257695, 18284, -466036, -481083, 132747, 569026, 269478, -188188, 15620, 716264, 1137052, 1122773, 1209493, 1603432, 1877248, 1742464, 1429408, 1147988, 806251, 471023, 477625, 774106, 752686, 147438, -425584, -310902, 259401, 625746, 689371, 810732, 1016187, 997038, 747161, 538569, 351856, 476, -223891, 219524, 1133630, 1560702, 1013641, 87378, -486480, -759481, -1061738, -1142979, -525698, 531541, 1111379, 715551, -186426, -744484, -527016]
40084e27016Q26733R46875N67633m7424m57994l47490J98432P59233R33574O52920
40074C505476J97518j08689k21128l10570m05033l29557p9792M2543j21585k68418
40064A900765m8779L94678O16487M49295J10873j38980j89207n7070R9214R8245
40054C235521J9300J10316K80879J21889l36101m59612j9234K88270m4209l51135
40044B845884J84256J071303J177630M97438K7902N6110q9457n32391n11941J17738
40034D844472M21566j9687l16763J76577O84540L18394m29122n65960j81162j0438
40024D922417m1754K50216O75256N28725j21232m07597L8101O03005N89820k3811
40014G013146p24578q99835l10423M54131L87114n53029j058227k27314R50668
$$ y = [-527016, 299717, 1246592, 1814225, 1766801, 1308807, 961317, 1159749, 1918982, 2852556, 3505476, 3702994, 3594305, 3373177, 3062607, 2657574, 2328017, 2248225, 2290768, 2169183, 1900765, 1851986, 2246664, 2863151, 3312446, 3423319, 3284339, 3095132, 3038062, 3137276, 3235521, 3254821, 3365137, 3646016, 3767905, 3431804, 2972192, 2952958, 3241228, 3197019, 2845884, 3030140, 4101443, 5279073, 5776511, 5804413, 5860523, 5771066, 5238675, 4726734, 4844472, 5266038, 5246351, 4929588, 5106165, 5790705, 6109099, 5679977, 5114017, 4932855, 4922417, 4880663, 5130879, 5806135, 6334860, 6213628, 5806031, 5844132, 6447137, 7036957, 7013146, 6288568, 5388733, 5078310, 5532441, 5919555, 5366526, 4308299, 4080985, 5031653]
40005E031653R52930J0039l43674K90288P61878M53956J45435L64090M14526j91143
39995G889978o61395k62921L47897K25390k88724k65149J71264J43005l94661
39986F904684n80650p8526M57199M06218j52876q30526j231239r17513J04169
39977D080940Q69022L63994r02989j246925q3057J149428R89777l2688l65945
39968D821557K31018N65388K5421n77918m64180m9910k5584j35188K28775P58991
39958E378370O09886j39550m60265L6418M65931O7031o15237o40778j46288k3267
39948D532251m51007o96936l63276M4874K1541j98800j80250j7369p6257l62650
39938B252121n76489n73122m16864j48715J86234M08690L69855J58240l4184j21722
$$ y = [5031653, 5984583, 5994622, 5650948, 5941236, 6703114, 7157070, 7302505, 7666595, 8081121, 7889978, 7228583, 6965662, 7313559, 7538949, 7250225, 6985076, 7156340, 7299345, 6904684, 6324034, 6245508, 6702707, 7108925, 6956049, 6125523, 4894284, 3976771, 4080940, 4949962, 5313956, 4410967, 3164042, 3080985, 4230413, 5220190, 5187502, 4821557, 5052575, 5617963, 5643384, 5065466, 4601286, 4551376, 4525792, 4390604, 4619379, 5378370, 5988256, 5848706, 5388441, 5424859, 5890790, 5957821, 5342584, 4701806, 4555518, 4532251, 4081244, 3384308, 3021032, 3065906, 3087447, 2888647, 2708397, 2691028, 2614771, 2252121, 1675632, 1102510, 685646, 536931, 723165, 1131855, 1501710, 1659950, 1625766, 1504044]
39928A504044p7502R1282J54952k34620r54401j234452n21273O60611J201447
39919E90088P01630k03757q08301j069910j212015j128029o12946R5583M82084
39910c165573M21530L26220N55744R35475J011170O59808K75018L07099P00098
39901B026589R11001N44719j47347n70034n19014l44419l47015l64326j73049
39892A017105M3847M4723R4640N93274J199396J041249J8955q00903n64455J85816
39882B873647L68008p2322l21929j54320j76105n66447o36129j1870O78309Q42208
39872B823050P95269R05908O77447l62719j461298j465712n41185R9030N6448
39863A526238J04628N55464N66660l75649j372311j330104n06886M2236L6197
$$ y = [1504044, 1426542, 1517824, 1672776, 1438156, 483755, -750697, -1271970, -611359, 590088, 1291718, 1087961, 279660, -790250, -2002265, -3130294, -3743240, -3647657, -3165573, -2744043, -2417823, -1862079, -926604, 84566, 744374, 1019392, 1326491, 2026589, 2937590, 3482309, 3334962, 2764928, 2245914, 1901495, 1554480, 1190154, 1017105, 1060952, 1105675, 1200315, 1793589, 2992985, 4034234, 4053189, 3252286, 2687831, 2873647, 3241655, 3169333, 2847404, 2693084, 2516979, 1950532, 1314403, 1302533, 1980842, 2823050, 3618319, 4524227, 5201674, 4838955, 3377657, 1911945, 1370760, 1469790, 1526238, 1630866, 2186330, 2752990, 2377341, 1005030, -325074, -831960, -789724, -753527]
39854g53527N8698L64430N25190K71145r0926k68817l92523n83128n78993j29777
39844a578228M96415P28202L51790k44468m96144k31006K18984M21930K86888
39835d5637P2392M1114K18269M47006N41339M03393J32747j0621Q6959J82890
39825B069851j1711l88892o07215o37709p43864q93781o82787l0828N12176M93009
39815i21751K22459L03974P36458R31787N39560j31998n44725n09705k69175j54382
39805B02502k46293l71226m08435m63027n97878n83226k28861J84311K55909J55667
39795b100557L73263P78931O75734r587l91345Q7564P82968Q58453M73250K11864
39785A740538l4129o38019j142954p45115K65558O85267J30668m53205l00953
$$ y = [-753527, -694829, -330399, 194791, 465936, 375010, 106193, -286330, -869458, -1448451, -1578228, -1081813, -353611, -1821, -246289, -742433, -973439, -754455, -332525, -45637, 26755, 67869, 286138, 733144, 1274483, 1677876, 1810623, 1800002, 1886961, 2069851, 2058140, 1669248, 1062033, 424324, -319540, -1213321, -1896108, -1926936, -1414760, -921751, -699292, -395318, 341140, 1272927, 1812487, 1680489, 1135764, 626059, 356884, 202502, -43791, -415017, -823452, -1286479, -1884357, -2467583, -2696444, -2512133, -2256224, -2100557, -1727294, -948363, -272629, -282216, -673561, -585997, 196971, 1055424, 1528674, 1740538, 1706409, 1068390, -74564, -819679, -554121, 131146, 261814, -191391, -492344]
39776d92344J36288J44936j03148m0719K38371J77322k62196m99877j83958L60431
39766e24894O05357M19110P9002j34541k20961l41443m91375m30135j9226N05892
39756e53214P52624N44188n2285q43588j422894j258169l02683O64189Q13131
39747a658701L09896P7383N35641J119289J123974N20753k13818o30531n23848
39738F60038k6973L67496K48496j67718l07533o2094J38451Q5252L9255J27067
39728A101737J19411k8360q1593j71804p59950j602650j602785l18186J097344
39719b246836J258750L40264l38910j42659L69326N67550M75727L04153K6320
39710F13685l50495o02583n73898l18072P9251M94839O38071L29769j05208j31008
$$ y = [-492344, -356056, -211120, -314268, -354987, -116616, 60706, -201490, -701367, -885325, -524894, 80463, 499573, 578575, 444034, 223073, -118370, -609745, -1039880, -1059106, -553214, 199410, 743598, 691313, -152275, -1575169, -2833338, -3136021, -2471832, -1658701, -1348805, -1271422, -735781, 383508, 1507482, 2028235, 1814417, 1183886, 660038, 633065, 1000561, 1249057, 1081339, 773806, 711712, 850163, 935415, 974670, 1101737, 1221148, 1192788, 1111195, 939391, 179441, -1423209, -3025994, -3344180, -2246836, -988086, -647822, -986732, -1129391, -760065, -192515, 283212, 587365, 613685, 263190, -339393, -913291, -1231363, -1152112, -657273, -19202, 310567, 205359, 74351]
39700G4351K86846O23930M78103k1692n04017p39494p07182n30149l57166j59424
39690a555894K19740O53132O71000J23672m48875n63479n46135r11103j295179
39681c653121q42186M29520J496470J662893J234892P06911J03774n44988q52857
39672b58692o75025m37357l93238j49520N20963R72343N12183m44275q10163k55800
39662a418581M72686O13181J73558l66666o15377m16349J47592P24926R01791
39653B16761N57365n7639n18899m30375K97409J123866J147182J25413r99576
39644A461507j118580l49291J86574o8979m83510l57658M2891N4774k91470l83127
39634a306869j8886L20105K23230j05403k24443n3670J26847R2386j25002l56528
$$ y = [74351, 361197, 985127, 1463230, 1441538, 937521, 198027, -509155, -1039304, -1396470, -1555894, -1336154, -683022, -12022, 111650, -337225, -900704, -1446839, -2357942, -3653121, -4495307, -4065787, -2569317, -906424, 328468, 1035379, 1139153, 594165, -258692, -933717, -1371074, -1764312, -1913832, -1392869, -420526, 91657, -352618, -1162781, -1418581, -945895, -332714, -159156, -525822, -1141199, -1557548, -1409956, -685030, 216761, 774126, 716487, 197588, -232787, 64622, 1188488, 2335670, 2461083, 1461507, 342927, -6364, 180210, 111231, -372279, -729937, -687046, -632272, -923742, -1306869, -1325755, -1005650, -782420, -887823, -1112266, -1165936, -1039089, -946703, -1071705, -1428233]
39624a428233m25075k03737K43942N75824M66841Q7486J3851M40410P72227M16703
39614I60239k42578l07118K29520L71813k68653o48057J74381J379022J364654
39605C013223N4708j004787q70999k67756p6310q647M53752Q14383L25615o15584
39595A817598r43613m97268r9809j92943l47516j79687Q7738J35671m4613l68080
39585f32522o95857o49349k8566O02561M93698j13279k40832K76689M75344j89188
39575g01301r41866q55585p0878P28987J257033J395722Q48136j84538p03767
39566G71943j94076M25388Q7870p69524r23701k47769L26596L96735L66756L04763
39556E44981j64933p99477q30701k76228K8232j17201j4919M94519O48271K29637
$$ y = [-1428233, -1853308, -2057045, -1813103, -1237279, -770438, -682952, -669101, -228691, 543536, 960239, 717661, 410543, 640063, 1011876, 743223, 95166, 269547, 1648569, 3013223, 3067931, 2063144, 1192145, 924389, 848079, 839432, 1293184, 2107567, 2433182, 1817598, 873985, 376717, 276908, 83965, -263551, -443238, -355500, -219829, -264442, -632522, -1328379, -1977728, -2006294, -1403733, -910035, -1023314, -1264146, -987457, -512113, -701301, -1643167, -2498752, -2569630, -1840643, -583610, 812112, 1660248, 1475710, 771943, 577867, 1003255, 1091125, 321601, -602100, -849869, -523273, -126538, 240218, 544981, 380048, -419429, -1250130, -1526358, -1498126, -1615327, -1630246, -1135727, -487456, -257819]
39546b57819Q1969N37879O49610j69226r42428o16099K70981N39883J49332j58694
39536H5388k63403m64366m57946J78154Q70563O97826j06367n12532l43289l23601
39526f39573o14894n84120o6140L81635O10193J051941J553981J267241Q6657
39517C046921r27737j052410p90537p36777n82658M0415O11004M56134j64514
39508a00159m79799k74879Q6114L03885K79227N456k20574O3348P05888Q53637
39498A222144J54736n39959l36747L67279M97575j20605o37357m70346M0979K81515
39488D59214P6614l04225m86815l37059j53648l06576n52384k05958P08958J154856
39478E2977N06194l92185m31238P8408J8171o19884p20580P2664P64059N96456
$$ y = [-257819, -175850, 362029, 1011639, 842413, -100015, -716114, -445133, 94750, 244082, 85388, -178015, -642381, -1100327, -922173, -51610, 646216, 539849, 27317, -315972, -639573, -1254467, -1838587, -1904727, -1523092, -912899, 139042, 1693023, 2960264, 3046921, 2119184, 1066774, 276237, -460540, -1043198, -1002783, -391779, 64355, -100159, -579958, -854837, -768723, -464838, -185611, -180155, -400729, -337381, 368507, 1222144, 1376880, 836921, 500174, 867453, 1365028, 1244423, 607066, 136720, 177699, 459214, 535828, 231603, -255212, -592271, -745919, -1052495, -1604879, -1810837, -1101879, 52977, 559171, 166986, -264252, -185844, -167673, -787557, -1508137, -1435473, -671414, -74958]
39468g4958Q1879n5454M7824K7544J22535N64319Q09527K90794m99320n96546
39458G18144j2354L03038q9027n53083m33110P8332M58824O28043P09836M63922
39448B272565l91419j413213j634321p27203M66174Q91635N19896K50399O71430
39439I05943J320228J295436L37551q79229j410036r04593P1805N50931J46139
39430A434175n03854n20679N2161L22774j52983p45195p24105k66789K4454P7196
39420a002845J16606r0087q41754j563457j277726p1093Q93403J028295R77718
39411a830940J251419J279997N45312k89901l78397j21226m39059j050849q10852
39402a844496K99756Q73775J26681r24383r77226k23484K23412L0841j89111j00863
$$ y = [-74958, 6921, -48533, -709, 26835, 149370, 713689, 1523216, 1814010, 1314690, 718144, 705790, 1008828, 919801, 366718, -66392, 11940, 470764, 1098807, 1808643, 2272565, 1881146, 467933, -1166388, -1893591, -1427417, -535782, -15886, 234513, 905943, 2226171, 3521607, 3859158, 2979929, 1569893, 665300, 737105, 1288036, 1434175, 930321, 409642, 461803, 784577, 631594, -113601, -837706, -1104495, -1080041, -1002845, -886239, -976326, -1818080, -3381537, -4659263, -4730356, -3836953, -2808658, -1830940, -579521, 700476, 1245788, 955887, 577490, 456264, 17205, -1033644, -1844496, -1544740, -670965, -544284, -1468667, -2445893, -2669377, -2445965, -2415124, -2604235, -2705098]
39392b705098n4483k51473l23962N088M38260N95633N51739N41335M72674J47199
39382e83088k26545j89005K79991N86885K15541n93377j060679p31999L3069M81596
39372a787611K75776k12680l68191L2046O60350J002025Q25870L78919J46726
39363I53230L21734N11818J68445o54852j248692j092488m36597J91239O64476
39354f21687J008539Q72275j6584j028635j125211k79939M20253L41179J05512
39345c24298L87542P70985N39117p3221k88123J3024L49716N38695O76713N62913
39335C153063N3195k91091J14319P83142P97365L13462K19867M55142J28347o29328
39325E097483o12390K44200L64563r05108j925909j228523J24492K49863o38936
$$ y = [-2705098, -2759581, -3011054, -3335016, -3329928, -2891668, -2296035, -1744296, -1202961, -730287, -583088, -809633, -998638, -718647, -131762, 83779, -509598, -1570277, -2302276, -2269207, -1787611, -1511835, -1724515, -2092706, -2060660, -1400310, -398285, 427585, 806504, 953230, 1274964, 1786782, 1955227, 1300375, 51683, -1040805, -1477402, -1286163, -621687, 386852, 1259127, 1242543, 213908, -911303, -1191242, -770989, -429810, -324298, 63244, 834229, 1373346, 1300125, 1012002, 1025026, 1374742, 1913437, 2590150, 3153063, 3206258, 2915167, 3029486, 3812628, 4609993, 4923455, 5143322, 5598464, 5726811, 5097483, 4485093, 4729293, 5093856, 4188748, 2262839, 1034316, 1158808, 1408671, 769735]
39316G69735q88245k06178K00400n0394p2664L27962J59488q29554j391137o80144
39306b660731M23076P32644M29645M19958Q29050J040440P28544J04286n41227
39297A505685r91675j075259q52683n78366l07233P7083L92802L09797N5957K32750
39287a231142P38661P26576k8323o21128l92777P1996J6261k32418M3792O42806
39277b65696Q13658N13341L02435K36424j61751q77599j235706q65459j59172
39268a699525L43292M67998K43660k22177n85402m60931O5715M74753M69923L02281
39258f00413L47574N98191O62771J73759p52915j418159j142295j10377P11706
39249a530158P28203L61932K07598O8829n02637j103581q30873K99827J170201
$$ y = [769735, -118510, -324688, -124288, -174682, -247346, 80616, 240104, -589450, -1980587, -2660731, -2237655, -1505011, -1075366, -655408, 173642, 1214082, 1942626, 2046912, 1505685, 514010, -561249, -1413932, -1992298, -2299531, -2222448, -1829646, -1519849, -1463892, -1231142, -492481, 234095, 205772, -415356, -808133, -736137, -719876, -952294, -908502, -265696, 547962, 1061303, 1363738, 1600162, 1438411, 560812, -674894, -1540353, -1699525, -1356233, -888235, -644575, -866752, -1452154, -1913085, -1847370, -1372617, -902694, -600413, -252839, 345352, 1008123, 1181882, 428967, -989192, -2131487, -2241864, -1530158, -801955, -440023, -232425, -163596, -666233, -1769814, -2600687, -2300860, -1130659]
39240a130659J029059M04402J44575J60264k55614j156877j685450j180838p0758
39231c741896O42963N51093J28177p2048n4014l1643R9571M76046P38547L98649
39221h64555l56770q27367p44135m39290j06040L56661P12777N06664K7377J69733
39211a564945R40557J159378K66920o41148m67735J95933J62786m07269m94858
39202h50381n2545J02797j01283M8486N73019O67420J40586k59970j35138Q2215
39192B15206R6667J12425O0440m32906j084508j040495j81320O74442J053028
39183e27021J223700J172489M67764n35552p17786P1108O09774K23357k43224
39174A744609p7258Q9654l29830o36536j65691L71573J97524K3461Q02225J850765
$$ y = [-1130659, -101600, 302802, 447377, 607641, 352027, -804850, -2490300, -3671138, -3741896, -3098933, -2547840, -2419663, -2491711, -2545725, -2577368, -2477797, -2001751, -1263204, -864555, -1221325, -2048692, -2792827, -3232117, -3338157, -2981496, -2268719, -1762055, -1734678, -1564945, -624388, 534990, 801910, 160762, -306973, -111040, 51746, -355523, -850381, -902926, -800129, -901412, -852926, -279907, 387513, 528099, 268129, 132991, 215206, 311873, 424298, 484738, 51832, -1032676, -2073171, -2254491, -1580049, -527021, 696679, 1869168, 2336932, 1801380, 1083594, 1154702, 1764476, 1987833, 1744609, 1667351, 1757005, 1427175, 790639, 624948, 996521, 1194045, 1217506, 2019731, 3870496]
39164C870496J863020J101568Q45674J111458P22673m98532j361014j252735q88472
39155E514136q40502p59315m45665l80428o82594p01130j98819R8924k68027o59481
39145F77099l85600K08932L97895J55143r5091k80167n60082p80447o57591k99217
$$ y = [3870496, 5733516, 6835084, 7680758, 8792216, 9514889, 9016357, 7655343, 6402608, 5514136, 4673634, 3914319, 3468654, 3088226, 2405632, 1704502, 1505683, 1604607, 1336580, 677099, 291499, 500431, 898326, 1053469, 958378, 678211, 118129, -662318, -1319909, -1619126]
$$ [...]
##END NTUPLES=NMR SPECTRUM
##END=
