##TITLE=31Pdec_DE-115rm_3h
, 64 sc
 6.10.2025
##JCAMPDX= 6.0         $$ Bruker NMR JCAMP-DX V2.0
##DATA TYPE= NMR SPECTRUM
##DATA CLASS= NTUPLES
##ORIGIN= UXNMR, Bruker Analytische Messtechnik GmbH
##OWNER= root
$$ XWIN-NMR		Version 3.5
$$ Mon Oct  6 14:41:25 2025 Russian Standard Time (UT+4h)  she@DPX200
##.OBSERVE FREQUENCY= 81.013821
##.OBSERVE NUCLEUS= ^31P
##.ACQUISITION MODE= SIMULTANEOUS
##.ACQUISITION SCHEME= undefined
##.AVERAGES= 64
##.DIGITISER RES= 17
##SPECTROMETER/DATA SYSTEM= spect
##.PULSE SEQUENCE= zgpg30
##.SOLVENT NAME= CDCl3
##.SHIFT REFERENCE= (INTERNAL, CDCl3, 0, 198.062)
##AUDIT TRAIL= $$ (NUMBER, WHEN, WHO, WHERE, WHAT)
$$ ##TITLE= Audit trail, XWIN-NMR		Version 3.5
$$ ##JCAMPDX= 5.01
$$ ##ORIGIN= Bruker BioSpin GmbH
$$ ##OWNER= she
$$ F:/spectra/data/she/nmr/P31/2/pdata/1/auditp.txt
$$ ##AUDIT TRAIL=  $$ (NUMBER, WHEN, WHO, WHERE, WHAT)
(   1,<2025-10-06 14:39:32.56 +0400>,<she>,<DPX200>,
      <created by zg, POWCHK disabled, PULCHK disabled
       configuration hash MD5:
       00 E9 B6 7A A2 85 ED C7 34 08 36 98 17 FE 4E 26
       data hash MD5: 32K
       7F 41 54 CE D7 00 0F E9 55 E0 92 77 19 4B 0F 5C>)
(   2,<2025-10-06 14:39:34.84 +0400>,<she>,<DPX200>,
      <Start of raw data processing
       efp BC_mod = 2 LB = 1.5 FT_mod = 6 PKNL = 1 PHC0 = 1224.332 PHC1 = 580.3002 SI = 64K 
       data hash MD5: 64K
       5C 1F 2F 23 D4 34 8E 65 54 3E 24 C4 91 4E 98 B4>)
(   3,<2025-10-06 14:39:51.89 +0400>,<she>,<DPX200>,
      <pk PHC0 = -3.97689 PHC1 = 0 
       data hash MD5: 64K
       8E 43 C1 1C 07 7E 3A AE 62 59 EF B7 DA FE 7A 58>)
(   4,<2025-10-06 14:40:18.50 +0400>,<she>,<DPX200>,
      <pk PHC0 = 230.3562 PHC1 = -677.1999 
       data hash MD5: 64K
       C9 4B 8D CE E1 DA E8 B4 2B 47 5D 23 E4 C0 74 E0>)
(   5,<2025-10-06 14:40:23.15 +0400>,<she>,<DPX200>,
      <abs ABSG = 5 
       data hash MD5: 64K
       3E E7 9C 69 FC 43 E8 FA 66 CC 16 F4 44 97 70 BF>)
$$ ##END=
$$ 
$$ hash MD5
$$ AD EA DC C3 C1 10 49 A1 3F 7D 27 EC 4A 8A D2 A6
##$RELAX= 
##$RELAX= 
##$RELAX= 
##$RELAX= 
##$RELAX= 
##$RELAX= 
##$RELAX= 
##$RELAX= 
$$ Bruker specific parameters
$$ --------------------------
##$DU= <F:/spectra>
##$EXPNO= 2
##$NAME= <P31>
##$PROCNO= 1
##$TYPE= <nmr>
##$USER= <she>
##$AMP= (0..31)
100 100 100 100 100 100 100 100 100 100 100 100 100 100 100 100 100 100 
100 100 100 100 100 100 100 100 100 100 100 100 100 100 
##$AQSEQ= 0
##$AQ_mod= 1
##$AUNM= <au_zg>
##$AUTOPOS= <>
##$BF1= 81.014009
##$BF2= 200.13
##$BF3= 200.13
##$BF4= 200.13
##$BF5= 200.13
##$BF6= 200.13
##$BF7= 200.13
##$BF8= 200.13
##$BYTORDA= 1
##$CFDGTYP= 0
##$CFRGTYP= 5
##$CHEMSTR= <none>
##$CNST= (0..31)
1 1 145 1 1 1 1 1 1 1 1 1 1 1 1 1 1 1 1 1 1 1 1 1 1 1 1 1 1 1 1 1 
##$CPDPRG= <waltz16>
##$CPDPRG1= <>
##$CPDPRG2= <waltz16>
##$CPDPRG3= <>
##$CPDPRG4= <mlev>
##$CPDPRG5= <mlev>
##$CPDPRG6= <mlev>
##$CPDPRG7= <mlev>
##$CPDPRG8= <mlev>
##$CPDPRGB= <>
##$CPDPRGT= <>
##$D= (0..31)
0 1 0 0 0 0 0 0 0 0.06 0 0.03 2e-05 3e-06 0 0 0.0002 0 0 0 0 0 0 0 0 0 
$$ [...]
##$SUBNAM3= <"">
##$SUBNAM4= <"">
##$SUBNAM5= <"">
##$SUBNAM6= <"">
##$SUBNAM7= <"">
##$SUBNAM8= <"">
##$SUBNAM9= <"">
##$SW= 400.765351723535
##$SWIBOX= (0..15)
0 1 3 0 0 0 0 0 0 0 0 0 0 0 0 0 
##$SW_h= 32467.5324675325
##$TD= 32768
##$TD0= 1
##$TE= 0
##$TE2= 300
##$TE3= 300
##$TEG= 300
##$TL= (0..7)
0 120 53 12 22 120 120 120 
##$TP= (0..7)
150 150 150 150 150 150 150 150 
##$TP07= 0
##$TPNAME0= <>
##$TPNAME1= <>
##$TPNAME2= <>
##$TPNAME3= <>
##$TPNAME4= <>
##$TPNAME5= <>
##$TPNAME6= <>
##$TPNAME7= <>
##$TPOAL= (0..7)
0.5 0.5 0.5 0.5 0.5 0.5 0.5 0.5 
##$TPOFFS= (0..7)
0 0 0 0 0 0 0 0 
##$TUNHIN= 0
##$TUNHOUT= 0
##$TUNXOUT= 0
##$USERA1= <user>
##$USERA2= <user>
##$USERA3= <user>
##$USERA4= <user>
##$USERA5= <user>
##$V9= 5
##$VALIST= <valist>
##$VCLIST= <CCCCCCCCCCCCCCC>
##$VD= 0
##$VDLIST= <DDDDDDDDDDDDDDD>
##$VPLIST= <PPPPPPPPPPPPPPP>
##$VTLIST= <TTTTTTTTTTTTTTT>
##$WBST= 1024
##$WBSW= 4
##$XGAIN= (0..3)
0 0 0 0 
##$XL= 0
##$YL= 0
##$YMAX_a= 43640
##$YMIN_a= -50520
##$ZGOPTNS= <>
##$ZL1= 120
##$ZL2= 120
##$ZL3= 120
##$ZL4= 120
##$ABSF1= 198.0616
##$ABSF2= -202.7028
##$ABSG= 5
##$ABSL= 3
##$ALPHA= 0
##$AQORDER= 0
##$ASSFAC= 0
##$ASSFACI= 0
##$ASSFACX= 0
##$ASSWID= 0
##$AUNMP= <proc_1d>
##$AZFE= 0.1
##$AZFW= 0.5
##$BCFW= 0
##$BC_mod= 2
##$BYTORDP= 0
##$COROFFS= 0
##$CY= -3
##$DATMOD= 1
##$DC= 0
##$DFILT= <>
##$DTYPP= 0
##$F1P= 0
##$F2P= 0
##$FCOR= 1
##$FTSIZE= 65536
##$FT_mod= 6
##$GAMMA= 0
##$GB= 0
##$INTBC= 1
##$INTSCL= 9.790993e-09
##$ISEN= 30
##$LB= 1.5
##$LEV0= 0
##$LPBIN= 0
##$MAXI= 10000
##$MC2= 0
##$MEAN= 0
##$ME_mod= 0
##$MI= 50
##$NCOEF= 0
##$NC_proc= -6
##$NLEV= 6
##$NOISF1= 182.463
##$NOISF2= 159.3651
##$NSP= 0
##$NTH_PI= 0
##$NZP= 0
##$OFFSET= 198.0616
##$PC= 4
##$PHC0= 1450.711
##$PHC1= -96.89972
##$PH_mod= 1
##$PKNL= yes
##$PPARMOD= 0
##$PSCAL= 0
##$PSIGN= 0
##$REVERSE= no
##$SF= 81.0140089999434
##$SI= 65536
##$SIGF1= 159.3651
##$SIGF2= -187.1042
##$SINO= 113.3802
##$SIOLD= 16384
##$SREGLST= <1H.CDCl3>
##$SSB= 0
##$STSI= 65536
##$STSR= 0
##$SW_p= 32467.5324675325
##$SYMM= 0
##$S_DEV= 0
##$TDeff= 32768
##$TDoff= 0
##$TI= <>
##$TILT= no
##$TM1= 0
##$TM2= 0
##$TOPLEV= 0
##$USERP1= <user>
##$USERP2= <user>
##$USERP3= <user>
##$USERP4= <user>
##$USERP5= <user>
##$WDW= 1
##$XDIM= 65536
##$YMAX_p= 298671302
##$YMIN_p= -63519885
$$ End of Bruker specific parameters
$$ ---------------------------------
##NTUPLES= NMR SPECTRUM
##VAR_NAME=  FREQUENCY,     SPECTRUM/REAL,   SPECTRUM/IMAG
##SYMBOL=    X,             R,               I
##VAR_TYPE=  INDEPENDENT,   DEPENDENT,       DEPENDENT
##VAR_FORM=  AFFN,          ASDF,            ASDF
##VAR_DIM=   65536,         65536,           65536
##UNITS=     HZ,            ARBITRARY UNITS, ARBITRARY UNITS
##FACTOR=    0.49542278885378, 1,            1
##FIRST=     16045.7642231865, 0,            0
##LAST=      -16421.768244346, 0,            0
##MIN=       -16421.768244346, -63519885,    0
##MAX=       16045.7642231865, 298671302,    0
$$ Real data points
##PAGE= N=1
##DATA TABLE= (X++(R..R)), XYDATA
$$ [...]
48890 790839 392337 318639 678629 913721 544558 -112536 -427245 -389101 -461817 -652796
48880 -652796 -454186 209314 685045 511149 19683 -338182 -719083 -1460101 -2350821 -2880863
48870 -2880863 -2957278 -2883831 -2818139 -2698626 -2542829 -2386917 -2078964 -1533610 -1000420 -642872
48860 -642872 -94071 988656 2099229 2316880 1572819 789777 619605 700731 415636
48851 415636 -240083 -917438 -1506368 -1993780 -2119274 -1682404 -973354 -477214 -327536 -409592
48841 -409592 -767382 -1434799 -1994600 -1842587 -972334 -90676 202656 58300 31694 326358
48831 326358 619405 552026 163088 -221329 -380384 -332855 -134042 235849 680533 900419
48821 900419 733995 453389 419954 511822 239266 -570167 -1575029 -2458532 -3235622 -3868883
48811 -3868883 -4038139 -3629180 -3124686 -3115256 -3591338 -4017050 -3939207 -3281130 -2277749 -1429308
48801 -1429308 -1271818 -1813397 -2397696 -2508462 -2464357 -2811977 -3251015 -2874797 -1514721
48792 -1514721 -133705 390361 295695 358559 737075 920041 616363 167408 35480 243593
48782 243593 470843 527039 577777 913056 1567398 2232787 2550757 2392717 1813212 932161
48772 932161 67972 -226985 302956 1057071 1018406 -59819 -1288651 -1722419 -1456925
48763 -1456925 -1282696 -1517045 -1698305 -1399800 -847627 -548369 -631826 -825959 -937838 -1116573
48753 -1116573 -1625829 -2469638 -3295304 -3683815 -3567254 -3331546 -3422816 -3846759 -4148694 -3912450
48743 -3912450 -3171796 -2269509 -1444773 -737536 -248100 -209109 -619386 -973277 -668153 267874
48733 267874 1104327 1205192 710722 251028 173905 350821 642624 1155929 1925696 2648960
48723 2648960 2952315 2785456 2407264 2107623 2054001 2250655 2480676 2404415 1894083 1206629
48713 1206629 687102 373447 26647 -529471 -1242190 -1928743 -2395487 -2519075 -2334134
48704 -2334134 -1975998 -1470976 -771368 -130849 -133639 -979559 -1950823 -2099352 -1419422 -810965
48694 -810965 -840114 -1140108 -1223010 -1192806 -1187519 -737850 545290 1973219 2340866 1463699
48684 1463699 370830 -142875 -365531 -782835 -1144529 -1025035 -765544 -1093776 -2016693
48675 -2016693 -2739394 -2604732 -1585270 35828 1844709 3155696 3371822 2736670 2241924
48666 2241924 2522210 3213580 3590548 3388356 2730869 1730585 600948 -196125 -428173
48657 -428173 -496729 -871508 -1287971 -1043166 -28382 1070533 1641221 1699091 1468839 965709
48647 965709 306149 9391 518751 1561056 2340801 2341894 1699637 827005 -61962 -981471
48637 -981471 -1885806 -2497667 -2494909 -1909105 -1256535 -1071807 -1272349 -1226075 -597392 127869
48627 127869 262008 -115527 -260148 142176 490584 181484 -396062 -318439 553086 1324202
48617 1324202 1274870 746158 462660 449168 217050 -225240 -268437 347747 1115319 1477989
48607 1477989 1423688 1119430 526045 -228375 -600057 -287501 229376 345191 173812 119890
48597 119890 -42569 -818111 -1855409 -2125734 -1400586 -663366 -672106 -897656 -459160 505234
48587 505234 1120641 1061007 819436 826005 951677 938153 791821 580765 213312 -340635
48577 -340635 -790472 -721563 -80000 628309 749267 173811 -487632 -590087 -189912 179655
48567 179655 325902 505504 710475 456517 -447582 -1430359 -1829656 -1631132 -1178767 -583438
48557 -583438 121881 629101 704757 611906 670322 694963 435511 252535 642673 1306045
48547 1306045 1484022 1142110 977697 1199092 1166776 487969 -344006 -799500 -1106566 -1695574
48537 -1695574 -2407359 -2820842 -2969525 -3149181 -3249748 -2828149 -1788932 -598376 191330
48528 191330 411980 307409 222298 212798 -24157 -673269 -1361461 -1554172 -1309131 -1106587
48518 -1106587 -933324 -259558 853685 1427662 853836 -171711 -642383 -568661 -547713
48509 -547713 -563689 -227617 109910 -350392 -1429719 -1952312 -1463099 -987699 -1543208 -2652840
48499 -2652840 -3016269 -2165654 -801337 196264 463573 58493 -707709 -1325147 -1424792
48490 -1424792 -1133716 -792328 -355352 525047 1748995 2541987 2292654 1383194 792988
48481 792988 902354 1084137 659569 -94234 -328717 111340 384907 -179858 -1112283 -1425287
48471 -1425287 -898817 -207371 74387 10703 -144819 -338114 -476253 -312763 140869 476288
48461 476288 449873 335484 409004 439330 116408 -292280 -249376 182056 314150 -220047
48451 -220047 -929437 -1103048 -711092 -381293 -559706 -944686 -856403 -85306 783545 987181
48441 987181 440984 -194620 -282752 178177 744800 1037678 904958 373897 -259834 -475899
48431 -475899 -6288 781761 1237061 1102879 636834 203922 50129 312892 814161 917028
48421 917028 117157 -1162197 -1909913 -1818069 -1643378 -1979446 -2316328 -1906732 -1038009 -600999
48411 -600999 -663539 -462169 128769 150601 -954243 -2243183 -2410556 -1527129 -830769 -1012256
48401 -1012256 -1503505 -1451053 -674362 463956 1488956 1888663 1354384 296329 -345237
48392 -345237 -180021 126922 -199140 -987410 -1485735 -1457014 -1346716 -1527955 -1922685 -2286702
48382 -2286702 -2366094 -1845282 -689680 450261 725579 79793 -712690 -1049671 -1010882
48373 -1010882 -797522 -341642 239847 448817 141376 -35069 512793 1394848 1695653
48364 1695653 1100173 60733 -893514 -1459398 -1410422 -804048 -245957 -298057 -625805 -379882
48354 -379882 505315 1078614 658713 -280001 -861585 -905927 -816517 -800341 -748597 -654592
48344 -654592 -620243 -536387 -196819 300583 634659 714965 702719 598821 207742 -410399
48334 -410399 -824954 -743794 -352422 28818 340838 603686 626250 287874 -40890 176601
48324 176601 881701 1453570 1658389 2069771 3145857 4272228 4351881 3250288 1998004
48315 1998004 1415976 1145660 390884 -870106 -1931527 -2333536 -2232199 -1891463 -1323241
48306 -1323241 -505197 413996 1230018 1775279 1910315 1685809 1462945 1538676 1654912 1230474
48296 1230474 121873 -1177854 -2135017 -2622172 -2741280 -2622361 -2515035 -2667319 -2940893
48287 -2940893 -2930202 -2631467 -2554537 -2925101 -3239200 -2979780 -2368866 -1951882 -1765899 -1452928
48277 -1452928 -990519 -752760 -896616 -1142332 -1156997 -808390 -115170 686984 1129159 982360
48267 982360 686332 863611 1436584 1701328 1292724 560480 -109095 -795776 -1627958 -2342209
48257 -2342209 -2617689 -2520993 -2267959 -1801452 -977682 -10278 641097 793126 686155 614152
48247 614152 603006 471672 86548 -464921 -914318 -1056798 -949709 -783875 -610253 -378633
48237 -378633 -197380 -236266 -304902 100121 1103091 2107110 2438931 2095208 1519027 881415
48227 881415 74939 -675307 -798043 -181960 460300 408480 -135629 -346171 98637 639021
48217 639021 686232 426127 429905 722642 745971 250896 -298002 -453653 -468104 -792329
48207 -792329 -1202700 -1048611 -316973 194643 -49928 -629581 -868753 -794079 -936605 -1444468
48197 -1444468 -1874488 -1786551 -1160928 -250915 647200 1261277 1466614 1406291 1305922 1168365
48187 1168365 843956 389963 131235 306288 810681 1324635 1556300 1356281 778247
48178 778247 110747 -264246 -145159 352331 904906 1183078 998370 359185 -576371 -1587996
48168 -1587996 -2412317 -2776315 -2612459 -2234250 -2038302 -1963144 -1549168 -696459 -25477 -171391
48158 -171391 -956230 -1609903 -1648624 -1203452 -654383 -332741 -459823 -949424 -1320127 -1196795
48148 -1196795 -837320 -746601 -856402 -625768 26939 483467 285373 -294243 -773829 -1061948
48138 -1061948 -1216472 -1051513 -416226 401177 931243 1022284 813600 412622 -111308 -551216
48128 -551216 -633741 -224581 577274 1375559 1573785 956252 204612 272562 1076747 1474963
48118 1474963 894418 245577 603655 1654394 2308245 2342853 2368824 2422582 1784746 306022
48108 306022 -1154761 -1924272 -2227767 -2333226 -1896447 -771074 257196 308436 -448240
48099 -448240 -1155727 -1446803 -1629156 -1943781 -2287367 -2580707 -2857932 -3000383 -2824356 -2427309
48089 -2427309 -2080740 -1817967 -1471747 -1050655 -707380 -392157 55880 472683 435669 -144467
48079 -144467 -834218 -1197307 -1247635 -1288237 -1514197 -1849206 -2005555 -1704490 -1040851 -594579
48069 -594579 -895250 -1745591 -2359098 -2241796 -1683353 -1292367 -1290812 -1382850 -1142163 -469353
48059 -469353 167626 119 -1210127 -2592495 -2844022 -1651563 -55988 813113 930859
48050 930859 944268 979666 526072 -611557 -1886095 -2676033 -2909894 -2821274 -2473468 -1827211
48040 -1827211 -1029306 -319678 219027 568881 572163 134949 -415219 -532719 -128339 222726
48030 222726 -78193 -983998 -1949663 -2573257 -2832995 -2802405 -2487403 -2008356 -1636279 -1476166
48020 -1476166 -1318947 -984706 -639251 -565330 -755946 -964353 -1071967 -1180505 -1387193 -1662930
48010 -1662930 -1890360 -1840413 -1254631 -260064 401542 -3100 -1269703 -2335973 -2441140
48001 -2441140 -1871987 -1389030 -1285063 -1308837 -1219827 -1028393 -841091 -824029 -1224829 -2092459
47991 -2092459 -3016379 -3450402 -3282474 -2813180 -2222531 -1426683 -524785 1722 -209471
47982 -209471 -901517 -1447583 -1515355 -1288437 -1081559 -971304 -901130 -988838 -1493679 -2417221
47972 -2417221 -3307397 -3637117 -3317623 -2667381 -1956742 -1273775 -829180 -962099 -1603468
47963 -1603468 -2072191 -1782802 -985332 -444708 -492996 -754840 -756722 -454012 -145341 -163875
47953 -163875 -649431 -1332204 -1571924 -970412 25435 499868 129637 -479997 -615300 -228782
47943 -228782 262362 545069 489064 -11920 -877999 -1658936 -1848554 -1369323 -570251 171800
47933 171800 681091 923083 925332 741245 388732 -125191 -680691 -1089159 -1331850 -1578670
47923 -1578670 -1869479 -1983247 -1787202 -1530094 -1567008 -1886672 -2095003 -1834035 -1141471 -471939
47913 -471939 -363753 -896988 -1460422 -1321762 -502510 221775 306041 55785 72886 485946
47903 485946 1042366 1580586 1979928 1949667 1389439 786069 735150 1142518 1369798 1131382
47893 1131382 784679 714691 866033 967080 870691 604171 371156 517649 1192116 2025819
47883 2025819 2437157 2247698 1735989 1167948 610266 126498 -222710 -514136 -725402
47874 -725402 -497537 374393 1310683 1401826 516157 -615798 -1441861 -2069744 -2641788 -2981431
47864 -2981431 -3099533 -3313362 -3502706 -2968200 -1534531 -167610 107532 -580296 -1378674
47855 -1378674 -1866122 -2141952 -2200834 -1953845 -1607556 -1364510 -995142 -337298 91627 -258942
47845 -258942 -959336 -1090463 -621313 -374231 -610750 -655931 -175178 146114 -301996 -1057542
47835 -1057542 -1295444 -929982 -350348 458965 1741462 3110967 3618142 2777223 1099645
47826 1099645 -429928 -1083418 -674136 426460 1444523 1717736 1247623 607805 272534
47817 272534 221937 217930 187700 179765 129532 -127164 -660704 -1377184 -2072848 -2479706 -2391520
47806 -2391520 -1911033 -1460572 -1304926 -1133421 -462438 511048 915873 336650 -486440
47797 -486440 -574810 -29728 210238 -221668 -755482 -1012363 -1396738 -2142532 -2595310 -2167754
47787 -2167754 -1406315 -1230603 -1498820 -1297144 -485053 70104 -114561 -478461 -446156 -259454
47777 -259454 -326545 -452276 -285642 4931 107170 217376 704269 1384509 1723450 1606482
47767 1606482 1365876 1121138 630934 -157672 -892440 -1320175 -1677498 -2349519 -3285554
47758 -3285554 -3939849 -3801170 -2931226 -1930039 -1320864 -1044280 -713750 -278023 -90783
47749 -90783 -271289 -413755 -193114 69192 -182463 -945524 -1656854 -1912772 -1866565 -1901690
47739 -1901690 -2146604 -2352074 -2139529 -1411520 -565497 -136573 -150240 -97908 281349 545025
47729 545025 209775 -427259 -600730 -58102 744210 1336860 1623646 1570500 1044160 132315
47719 132315 -778167 -1428346 -1873308 -2120650 -1972861 -1438782 -927338 -735588 -654868 -416781
47709 -416781 -226685 -401465 -695147 -578309 -180234 -304126 -1224259 -2015435 -1621445 -293774
47699 -293774 696415 750037 640482 1250125 2228528 2490842 1709512 625603 -43192 -343130
47689 -343130 -634811 -1005014 -1365575 -1641207 -1582484 -868290 253907 883299 478205 -417460
47679 -417460 -962470 -1180887 -1693525 -2518233 -2924129 -2547376 -1959030 -1858135 -2199590 -2439959
47669 -2439959 -2313527 -2057665 -2045878 -2393149 -2810172 -2790918 -2120079 -1212378 -722433 -800993
47659 -800993 -983105 -807071 -253545 401195 775217 405023 -903370 -2525688 -3282633
47650 -3282633 -2635900 -1364520 -727230 -1157913 -2070664 -2710032 -2801866 -2483342 -2003524
47641 -2003524 -1571178 -1276633 -1092979 -1016936 -1110208 -1277816 -1167659 -547870 269426 641724
47631 641724 284045 -424519 -868013 -786995 -383761 34974 369864 674306 914269 931646
47621 931646 674158 334087 161282 220576 414838 615881 642553 284614 -416001 -1046505
47611 -1046505 -1272516 -1285357 -1455954 -1661142 -1431884 -770901 -278771 -302575 -459103 -273446
47601 -273446 135240 323061 116055 -387893 -1078881 -1757913 -2113150 -2121441 -2158956 -2354314
47591 -2354314 -2215332 -1381048 -362261 116434 228116 701901 1479419 1622151 754557
47582 754557 -232006 -347958 270092 828083 1025665 1062223 855636 97836 -910554 -1271293
47572 -1271293 -674226 -38090 -474413 -1875293 -3035680 -3101216 -2389303 -1682619 -1230020
47563 -1230020 -807494 -402427 -284000 -476973 -686478 -821574 -1122792 -1589476 -1724976
47554 -1724976 -1181419 -351950 54575 -128555 -402787 -245042 346714 843731 590892
47545 590892 -568869 -1934763 -2526687 -2231610 -1970073 -2395923 -2924200 -2622160 -1634302
47536 -1634302 -910844 -743818 -515927 57054 406211 160560 -126232 161200 742112
47527 742112 957437 793745 760701 1043813 1378725 1571881 1570190 1146353 135239 -987919
47517 -987919 -1350943 -721564 117288 302155 -101971 -368093 -222271 -255545 -1072247 -2328600
47507 -2328600 -2996714 -2563319 -1571898 -809808 -371366 71830 414407 195038 -535862
47498 -535862 -1116781 -1178350 -1010758 -814152 -266972 741630 1553033 1486770 741146 37744
47488 37744 -237989 -57193 574214 1292665 1241251 144700 -843518 -404719 1011328 1637167
47478 1637167 775364 -468707 -1060711 -1343116 -1881732 -2230137 -1828205 -1238811 -1321734
47469 -1321734 -1707301 -1272277 84047 1201970 1173949 212484 -982252 -1863039 -1982601
47460 -1982601 -1151367 133020 1083314 1595303 2166695 2788863 2782817 1996761 1268972 1211441
47450 1211441 1331051 993947 565764 793709 1544726 2007581 1867682 1492752 1131939
47441 1131939 684644 165144 -327022 -1057604 -2359734 -3846026 -4606632 -4315158 -3538791
47432 -3538791 -2874851 -2441923 -2335647 -2792340 -3548558 -3749466 -3008005 -2016188 -1569274
47423 -1569274 -1442686 -838156 395930 1632750 2370542 2653971 2626651 2189552 1217595
47414 1217595 -174890 -1619862 -2589567 -2668076 -1996170 -1284618 -1085058 -1201325 -1121466
47405 -1121466 -823409 -754189 -1157570 -1831310 -2429600 -2600539 -1989819 -642449 650701
47396 650701 961241 251086 -651904 -1115775 -1235609 -1268746 -1149321 -788638 -351320 34742
47386 34742 411340 598851 157875 -921283 -1934030 -2286265 -2248177 -2439733 -2875873 -3049503
47376 -3049503 -2781184 -2440560 -2347686 -2417861 -2458570 -2432664 -2297541 -1865556 -1014898 42310
47366 42310 779308 669206 -371489 -1733858 -2466198 -2096224 -1075267 -297560 -289787 -967961
47356 -967961 -1930127 -2685914 -2768204 -2038933 -936931 -141255 75611 -45862 -285449 -775573
47346 -775573 -1646387 -2545863 -2777711 -1983319 -626439 286401 64026 -1063142 -2251752
47337 -2251752 -2916758 -3110738 -3043022 -2584555 -1533238 -170392 803611 892165 186821
47328 186821 -772000 -1323003 -1046347 -149155 553190 380917 -454231 -1127116 -1249145 -1287716
47318 -1287716 -1812516 -2658121 -3113648 -2795480 -2073449 -1634584 -1776615 -2194483 -2425957
47309 -2425957 -2402794 -2411483 -2522110 -2368772 -1734308 -1077178 -1018759 -1393002 -1341884 -476916
47299 -476916 557776 963993 806651 724577 904891 890908 390643 -212401 -352364 -3655
47289 -3655 320519 173147 -411097 -1076676 -1567753 -1903353 -2169953 -2265954 -1992033 -1405395
47279 -1405395 -917705 -888479 -1176732 -1260044 -829751 -159228 163756 -205414 -1105394 -2053346
47269 -2053346 -2596930 -2554008 -2059166 -1427225 -896547 -444100 125015 886886 1643960 2084603
47259 2084603 2038873 1552568 818756 131266 -204571 -106979 137444 118932 -275587 -791498
47249 -791498 -1127376 -1165927 -899405 -348015 365451 1017400 1425555 1465732 985934 -21945
47239 -21945 -1123482 -1662253 -1463926 -1043012 -916734 -1021328 -1066944 -1121036 -1401620 -1715144
47229 -1715144 -1624382 -1146345 -835359 -1105463 -1792073 -2411801 -2563520 -2098035 -1246265 -601943
47219 -601943 -620424 -1074977 -1337529 -1230786 -1214455 -1635713 -2201070 -2366806 -1903473 -902625
47209 -902625 396013 1539033 1991838 1696669 1266237 1290194 1623908 1658591 1114735 253149
47199 253149 -522027 -889167 -570840 438358 1527012 1784108 939393 -211111 -573303
47190 -573303 117292 1128191 1665050 1744746 1993899 2718135 3457934 3549038 2875789 1854695
47180 1854695 859823 1993 -591170 -702337 -390185 -127739 -326067 -836293 -1084156
47171 -1084156 -641002 376798 1351883 1609541 1030201 253206 18233 248223 107360
47162 107360 -891349 -2190773 -2864883 -2691159 -2198116 -1859637 -1678862 -1529228 -1492569 -1701477
47152 -1701477 -2043709 -2172802 -1806183 -1043063 -406017 -423379 -1043449 -1575209 -1358501 -418779
47142 -418779 637625 1233866 1187968 646783 -89392 -715713 -1073965 -1152043 -903376 -255166
47132 -255166 576309 1035883 794539 226177 6127 302792 664828 657288 281170 -235663
47122 -235663 -704049 -933245 -761146 -329122 -93514 -328368 -766582 -972674 -963448 -1160432
47112 -1160432 -1719609 -2233445 -2276764 -1989329 -1782692 -1593954 -895406 440990 1741101
47103 1741101 2310330 2272058 2185686 2092023 1543999 538692 -222793 -197869 358143 838922
47093 838922 953053 695999 69977 -794602 -1472842 -1536435 -949860 -84855 502668 347229
47083 347229 -514506 -1371644 -1496241 -1023448 -696259 -722669 -576590 -72183 221041 11798
47073 11798 -150043 70320 50408 -665907 -1317872 -1054635 -459389 -692241 -1517844 -1568504
47063 -1568504 -488595 525223 497040 -218946 -902760 -1426052 -1797593 -1735424 -1269026
47054 -1269026 -1015017 -1323559 -1781113 -1999000 -2241512 -2780240 -3215215 -2983523 -2138453
47045 -2138453 -1235008 -831915 -1327860 -2708481 -4144605 -4481306 -3567790 -2552337 -2434502
47036 -2434502 -2888029 -2974931 -2439363 -1722809 -1184295 -913084 -960484 -1223069 -1377787 -1324387
47026 -1324387 -1339806 -1475177 -1300714 -647051 -44101 66880 8011 213651 467484 403851
47016 403851 226177 243875 205448 -173318 -504603 -337380 7659 78729 298033 1285547
47006 1285547 2493982 2671959 1640828 547749 257623 458059 538460 453165 390417
46997 390417 303525 139023 58127 197573 530315 948994 1130395 548650 -809565 -1998399
46987 -1998399 -2112784 -1538710 -1390710 -1887604 -2260100 -2191138 -2215881 -2525080 -2499648 -1841991
46977 -1841991 -1205497 -1198994 -1554439 -1747065 -1738509 -1709872 -1759370 -2201491 -3369354 -4720160
46967 -4720160 -4987329 -3755197 -2113661 -1222672 -1037521 -1046215 -1353594 -2141675 -2763941
46958 -2763941 -2411008 -1313760 -444980 -310976 -705916 -1276290 -1635838 -1327001 -412720
46949 -412720 250479 54219 -420881 -257944 399742 661351 267532 -275801 -724244 -1286882
46939 -1286882 -1861279 -1992539 -1642313 -1224302 -878573 -471442 -261824 -700967 -1519587
46930 -1519587 -1882037 -1581923 -1250086 -1218644 -1073583 -634180 -498162 -1122122 -2053430 -2593742
46920 -2593742 -2657791 -2465761 -1900051 -774896 549053 1355944 1290941 618806 -71824
46911 -71824 -270934 75101 428523 194805 -482871 -819735 -413344 250120 501661 242582
46901 242582 -279038 -974825 -1780968 -2349926 -2334441 -1828400 -1201481 -636854 -102001 357365
46891 357365 549512 310339 -362533 -1244322 -1935684 -2183084 -2146752 -2101156 -1946383 -1427181
46881 -1427181 -791804 -649757 -1039777 -1240428 -792781 -176053 -109679 -655373 -1401424 -2107734
46871 -2107734 -2734704 -3178074 -3384367 -3453539 -3340786 -2828227 -2062095 -1620021 -1682236 -1687957
46861 -1687957 -1265910 -881283 -937323 -872736 -19225 1121033 1458262 912101 422761 504260
46851 504260 819561 1198264 1985198 3104824 3734656 3360480 2458236 1734910 1296271
46842 1296271 903537 457449 -122098 -931306 -1653840 -1662566 -915326 -194982 -72506 -196925
46832 -196925 -45803 208314 120471 -267653 -685545 -1167048 -1680871 -1701208 -931859 -106496
46822 -106496 -193016 -994956 -1444454 -1210069 -1032890 -1321915 -1424464 -777733 10200 -70429
46812 -70429 -1032348 -1925433 -2031974 -1447776 -599805 244631 926711 1291756 1303547 1032869
46802 1032869 470559 -402456 -1291735 -1627428 -1134797 -215487 422472 411355 -129120 -890268
46792 -890268 -1530685 -1665416 -1138409 -394895 -175196 -608784 -958596 -579244 194286 556147
46782 556147 373168 232856 436161 593650 339664 -153060 -605200 -1027758 -1369676 -1290601
46772 -1290601 -737853 -351960 -790061 -1893442 -2943922 -3471394 -3382286 -2635630 -1401192
46763 -1401192 -337701 -63281 -394382 -661386 -701235 -922792 -1417139 -1712811 -1568409
46754 -1568409 -1358670 -1410554 -1519207 -1434683 -1317829 -1337971 -1261424 -882803 -539700 -740685
46744 -740685 -1470472 -2238915 -2665018 -2685784 -2347197 -1760850 -1230214 -1121615 -1541255 -2220958
46734 -2220958 -2674694 -2467973 -1547039 -396577 327776 395604 19658 -673241 -1726475
46725 -1726475 -2804216 -3162006 -2577663 -1856003 -1880052 -2457634 -2634098 -1928589 -735416
46716 -735416 330489 945141 1045769 841653 824313 1266233 1728104 1546217 764903 41808
46706 41808 -347437 -751634 -1280733 -1413860 -824608 -37550 192391 -227220 -858412 -1391671
46696 -1391671 -1702444 -1543505 -760823 246598 773702 584537 101925 -219224 -371109
46687 -371109 -542329 -717241 -782086 -855792 -1182186 -1635368 -1589176 -527237 1251670 2756773
46677 2756773 3194247 2566762 1370227 29275 -1141553 -1761682 -1662768 -1245950 -1079234
46668 -1079234 -1122626 -824276 -63044 537008 477592 88994 -28219 99182 -37530 -582999
46658 -582999 -1109933 -1218173 -921631 -400397 249151 869141 1137059 855432 248402 -213975
46648 -213975 -281946 -109379 30580 82268 152543 202886 22224 -420307 -816904 -907152
46638 -907152 -863952 -1053278 -1517267 -1944784 -2050879 -1721783 -937409 77268 748928 673549
46628 673549 193446 -35124 -11843 -330722 -1119376 -1762382 -1880688 -1832687 -1890450 -1687223
46618 -1687223 -1019599 -485854 -628868 -1042459 -1105470 -1050735 -1379353 -1667792 -1077147 147705
46608 147705 849870 678191 522564 996264 1533449 1443542 963333 672552 568299 357149
46598 357149 138219 160526 266674 150825 -77425 -62791 246037 576155 673769 412864
46588 412864 -165933 -677396 -599218 37024 513363 316660 -205877 -450493 -395598 -329485
46578 -329485 -110079 634662 1710474 2390532 2276274 1666623 1053077 649947 453264
46569 453264 413480 483302 686438 1049946 1281567 789841 -573361 -2004521 -2489510 -1960813
46559 -1960813 -1235610 -898399 -808874 -697559 -595305 -494543 -169511 350074 559805 70144
46549 70144 -892722 -1845041 -2603824 -3207246 -3554823 -3459073 -2907284 -2049478 -1103192 -444775
46539 -444775 -503749 -1246812 -1979592 -2024425 -1463363 -864029 -423519 130067 789710 989002
46529 989002 363852 -572755 -923533 -427880 363793 851363 916625 662575 98565 -624558
46519 -624558 -1032202 -863442 -638986 -1149154 -2331490 -3189445 -3024613 -2251583 -1667516
46510 -1667516 -1406293 -1143726 -955741 -1231375 -1827771 -2064037 -1722899 -1440070 -1799012
46501 -1799012 -2517434 -2888572 -2672051 -2182904 -1774763 -1606637 -1716125 -1945925 -1916894 -1414972
46491 -1414972 -742781 -406939 -521536 -779643 -925142 -945591 -849156 -606288 -380430 -520635
46481 -520635 -1183030 -2120714 -2904521 -3181977 -2732602 -1597177 -315804 263259 -244129
46472 -244129 -1257508 -1794897 -1545759 -1137528 -1280396 -1898886 -2284499 -1951081 -1115162
46463 -1115162 -374686 -113824 -254043 -448609 -467723 -445863 -696998 -1186496 -1347967 -746300
46453 -746300 126379 186485 -917147 -2238781 -2638814 -2099909 -1487487 -1289780 -1215604 -937991
46443 -937991 -555171 -209528 127027 269801 -190737 -1185440 -1970798 -2058340 -1885289 -2051761
46433 -2051761 -2287749 -1834793 -649425 458448 873722 756121 494869 159973 -269952
46424 -269952 -561350 -406514 261661 1274933 2317371 2926514 2716193 1767248 585473
46415 585473 -401360 -1037726 -1135123 -477080 627569 1282081 954716 207235 13234 578911
46405 578911 1340006 1912170 2354284 2494125 1793901 262252 -1100305 -1332252 -654078
46396 -654078 -34423 135337 283657 666163 898065 719803 564650 860632 1204474 853865
46386 853865 -156042 -1012816 -1208822 -1003457 -690264 -51113 1060374 2046185 2029979
46377 2029979 864283 -715444 -1836639 -2061724 -1399053 -256072 588473 462210 -499021
46368 -499021 -1387604 -1458614 -844985 -224124 -25851 -180945 -441141 -637080 -674366 -546459
46358 -546459 -404356 -437032 -605087 -605620 -193780 512156 1134076 1434464 1520915 1605958 1674223
46347 1674223 1547196 1227136 922621 667486 211498 -507756 -1075069 -1127756 -951951 -1074192
46337 -1074192 -1368783 -1157556 -280315 524160 568251 50349 -395762 -535341 -496864 -305309
46327 -305309 23665 218277 137493 183486 703145 1157989 651390 -691116 -1636622 -1368362
46317 -1368362 -438198 108343 -49356 -558027 -1088579 -1441500 -1380437 -957141 -719778 -1024626
46307 -1024626 -1373649 -1046796 -225845 189913 -146300 -637222 -723371 -575685 -545012 -532614
46297 -532614 -331267 -141828 -264630 -563384 -693837 -662541 -708242 -771245 -575056 -231119
46287 -231119 -283978 -980161 -1812140 -2018653 -1385166 -385988 355272 582048 424722 77125
46277 77125 -415092 -1014174 -1451833 -1356119 -739458 -214659 -480917 -1542462 -2576019 -2681600
46267 -2681600 -1758296 -594923 -70087 -284116 -565604 -348568 164609 406526 293025
46258 293025 246052 429795 518579 377117 371476 615260 463055 -608215 -1972972 -2454249
46248 -2454249 -1792679 -804128 -171842 108848 61146 -542641 -1447047 -1782594 -1242069 -705392
46238 -705392 -1032064 -1803469 -2036585 -1701510 -1622213 -2086375 -2501055 -2464744 -2301699 -2284608
46228 -2284608 -2071692 -1331337 -404819 100910 68386 -135504 -183402 -12449 284267 533851
46218 533851 584384 514535 613377 1011432 1464766 1613628 1330626 775734 290128 240999
46208 240999 696472 1203506 1196585 704334 305779 291380 304114 15692 -319588 -344580
46198 -344580 -208970 -222036 -219556 161288 752117 960881 567306 -53585 -465209 -502954
46188 -502954 -166141 323936 428396 -155190 -836199 -706476 100240 398421 -349788 -1125953
46178 -1125953 -812480 103157 257320 -489184 -835102 -52815 880598 735611 -214925
46169 -214925 -752260 -555607 -478644 -1031582 -1587318 -1478285 -1089050 -1173943 -1580702 -1515662
46159 -1515662 -932051 -722598 -1277827 -1670830 -883589 667754 1578553 1210233 255196
46150 255196 -434028 -801843 -1114340 -1227045 -906214 -505712 -661139 -1337037 -1692742 -1060288
46140 -1060288 226066 1131160 904586 -317065 -1759156 -2725320 -3053393 -2926447 -2417224
46131 -2417224 -1473644 -353943 293931 54666 -757989 -1494069 -1864383 -1937812 -1680315
46122 -1680315 -1016865 -309785 -206265 -829528 -1554813 -1797172 -1622985 -1344155 -951952
46113 -951952 -369203 56132 -178078 -1066778 -2088174 -2747753 -2788540 -2051227 -648938
46104 -648938 737270 1266452 793526 -48356 -693490 -1139674 -1478973 -1460568 -875728 -7879
46094 -7879 707299 1217596 1656201 1838018 1446684 653329 65316 -23649 51487 -95425
46084 -95425 -319771 -160942 521461 1312013 1596772 1101527 156272 -545511 -551530 -55025
46074 -55025 368303 398811 230260 221715 470600 768794 836596 553962 86220 -178584
46064 -178584 60344 714483 1383400 1719339 1630034 1220888 744413 523822 603656 476546
46054 476546 -427333 -1825892 -2598192 -2064383 -917918 -392931 -703337 -924682 -446620
46045 -446620 141158 -28473 -813940 -1310951 -1163648 -937940 -1102846 -1314381 -1117959 -848972
46035 -848972 -1167329 -1915784 -2213711 -1771654 -1356044 -1600042 -2034433 -1892080 -1348447 -1181379
46025 -1181379 -1507899 -1734894 -1663241 -1722397 -2013446 -2041750 -1669485 -1420817 -1414145 -926485
46015 -926485 321491 1344739 1291334 912036 1444846 2536416 2678310 1570260 562988
46006 562988 500123 568428 -48306 -633446 -83988 1266637 2125087 2058850 1732164 1559141
45996 1559141 1231197 669390 465300 984422 1679312 1741973 1077324 287178 -58987 159562
45986 159562 757799 1498530 2167561 2539720 2425253 1887060 1376329 1371839 1736731 1712950
45976 1712950 823672 -460011 -1297875 -1518947 -1657816 -2100927 -2694903 -3162087 -3380177
45967 -3380177 -3185434 -2418616 -1344692 -580824 -387705 -419281 -380244 -493526 -995996 -1573266
45957 -1573266 -1750872 -1596215 -1544756 -1634734 -1394776 -564588 428637 890015 595563 -13354
45947 -13354 -318399 -142380 129572 32781 -459040 -984481 -1238183 -1152773 -751707 -167081
45937 -167081 234272 192327 93075 647200 1826415 2680457 2574531 2045532 1893381 1958583
45927 1958583 1573225 854976 602027 986999 1302971 1141053 939353 1081296 1267943
45918 1267943 1199045 1138629 1294992 1320152 1037728 1022668 1661805 2153168 1426677 -173704
45908 -173704 -1141557 -762873 123676 516891 497779 649766 993917 1158770 1157003 1317454
45898 1317454 1641476 1797109 1687866 1555869 1510151 1345738 898972 273320 -372282 -994201
45888 -994201 -1505062 -1669795 -1355549 -789539 -386282 -307701 -318149 -147297 79079 -81996
45878 -81996 -849287 -1907690 -2750767 -3172926 -3218646 -2816811 -1864831 -677662 101764 238189
45868 238189 185062 380036 627116 554453 356446 521820 951847 952088 192867 -825853
45858 -825853 -1458902 -1648305 -1719155 -1786265 -1686134 -1288999 -588101 361404 1312071 1766604
45848 1766604 1378568 405525 -481988 -865085 -871156 -825089 -840079 -824338 -700543 -472942
45838 -472942 -158577 220279 587518 847067 985350 1063790 1043542 692228 -152492 -1188941
45828 -1188941 -1763236 -1587807 -1168883 -1196541 -1616190 -1725061 -1178956 -385651 237241 801709
45818 801709 1394098 1572582 1055233 501996 799497 1720059 2144512 1675230 1157117 1296362
45808 1296362 1568765 1052550 -246269 -1547926 -2379235 -2832870 -2986706 -2734002 -2147869
45799 -2147869 -1490981 -878351 -344589 -122595 -337036 -499670 80856 1315451 2321989
45790 2321989 2522332 2208937 1860520 1508323 1114029 1007755 1430325 2008252 2220199
45781 2220199 2158989 2322997 2787770 3076711 2827540 2177784 1478900 977298 799599 929456
45771 929456 1127389 1102796 801164 355491 -175445 -783121 -1294188 -1458651 -1232005 -747339
45761 -747339 -111097 488677 639468 139739 -469338 -365106 428031 891855 262111 -1016528
45751 -1016528 -1926557 -2099772 -1966723 -1920825 -1827307 -1356114 -447657 629698 1493070 1884636
45741 1884636 1829844 1571236 1296408 995911 617743 220302 -88272 -208493 -16352 495012
45731 495012 990478 1036475 707817 582145 891891 1071888 521968 -512594 -1270274 -1401399
45721 -1401399 -1052668 -277775 959648 2248869 2899693 2815759 2647080 2855132 3099267
45712 3099267 2798002 1881895 722049 -304647 -872828 -690255 160966 1038955 1258971
45703 1258971 755960 42360 -389116 -447765 -346256 -301874 -300911 -113838 359234 800204
45693 800204 766412 272487 -215994 -393648 -366160 -251135 8028 284856 248148 -15012
45683 -15012 142933 1039876 2054346 2355483 1866615 1059657 251423 -293626 -26965 1241956
45673 1241956 2573719 2694910 1601032 535517 269461 275388 -106047 -546162 -342062
45664 -342062 462248 1219957 1604140 1820383 2089393 2372042 2506344 2310551 1681978 827014
45654 827014 209814 55825 114360 102881 114815 366350 839620 1429972 2125317 2755512
45644 2755512 2924564 2554353 2148538 2108862 2149704 1872391 1538275 1636362 1982427 1999160
45634 1999160 1722061 1707696 1975611 1916296 1394778 1065306 1245511 1295199 659874 -121724
45624 -121724 -115256 745258 1730264 2312495 2447023 2117293 1318501 424810 -75384 -250250
45614 -250250 -568169 -1017632 -994393 -283422 405093 289938 -438748 -884598 -600572 -49240
45604 -49240 127027 -48600 -7195 493333 890455 435536 -755339 -1604637 -1273642 -236211
45594 -236211 260162 -248470 -935896 -920948 -510861 -719012 -1763786 -2637281 -2290615 -839020
45584 -839020 650473 1304155 1089358 498604 -14136 -218868 -55184 362229 786040
45575 786040 1067112 1286834 1508963 1500722 978621 152723 -291913 46014 746228 1023788
45565 1023788 593688 -170304 -831185 -1293781 -1570671 -1494108 -924786 -135867 255289 -163199
45555 -163199 -1134210 -1873195 -1783629 -1091666 -634008 -872737 -1288929 -1051402 -188834 355543
45545 355543 -42052 -837291 -1025505 -394802 355549 608672 473604 385529 479351 593567
45535 593567 655756 773818 1002044 1255043 1506019 1890114 2454671 2883439 2698960 1829948
45525 1829948 794087 133207 -196462 -614432 -1197682 -1545795 -1401366 -1006760 -674890
45516 -674890 -372036 15150 330966 414009 448639 669960 919899 896927 674723 546556
45506 546556 519354 454037 563778 1156102 1893198 1982433 1264737 498639 311915 444721
45496 444721 355255 25191 -257206 -427794 -476072 -177612 450808 799829 405980 -225600
45486 -225600 -222450 389431 751098 478393 141247 259362 524702 425003 151714 387279
45476 387279 1375325 2560976 3125870 2765136 2052047 2070941 3464129 5752728 7806525
45467 7806525 9043748 9931567 11270961 13306673 15623477 17544777 18457892 18128524 16994319
45458 16994319 15877147 15121853 14278626 12938005 11579975 11116525 11697359 12436587 12387560
45449 12387560 11465512 10348156 9767093 10021010 10958177 12255342 13771447 15672455 18118566
45440 18118566 20804594 22926483 23684144 22808881 20642148 17830829 15014203 12705996
45432 12705996 11245162 10620635 10305296 9530588 8033851 6485391 5860107 6310601 6918355
45423 6918355 6658769 5379109 3743295 2509543 2010352 2019255 1875133 999214 -426962
45414 -426962 -1503748 -1582582 -960788 -360741 -44942 158098 260409 115573 -103904 32560
45404 32560 659639 1484031 2091535 2025915 890997 -955461 -2070214 -1261804 663842
45395 663842 1490593 251197 -1636345 -2359759 -1855479 -1196319 -758385 -180401 360466
45386 360466 160407 -750818 -1485943 -1608508 -1610838 -1843488 -1881194 -1354188 -611577 -48945
45376 -48945 549689 1421018 2141711 2193634 1798934 1535655 1422416 1039536 352352 -236784
45366 -236784 -542633 -693959 -667252 -358851 -85379 -317024 -825087 -805891 -78880 536424
45356 536424 416707 58777 256680 884733 1210581 1090112 1051474 1278686 1302529 846625
45346 846625 297230 36277 -130346 -485771 -803382 -735574 -493957 -579687 -966965 -1107245
45336 -1107245 -749840 -227378 192837 704583 1410931 1843300 1541169 868593 667665
45327 667665 1102456 1393676 885530 -78481 -657598 -543067 -70318 467239 1080659 1658805
45317 1658805 1801463 1330156 648458 293919 288644 189430 -308928 -1048921 -1641571 -1817004
45307 -1817004 -1554763 -1059146 -663403 -634619 -981253 -1449346 -1695483 -1477660 -798054 35368
45297 35368 545834 406388 -339677 -1339350 -2119998 -2273834 -1712467 -851852 -318299 -303785
45287 -303785 -419380 -341744 -276508 -461846 -561054 -105142 637402 891480 488365 76064
45277 76064 47117 -66771 -752851 -1640677 -1990892 -1674774 -1140959 -706898 -434513 -477060
45267 -477060 -926178 -1389499 -1311186 -750739 -330068 -342057 -423052 -250006 -64159 -231618
45257 -231618 -647072 -865075 -592500 145536 1079973 1744224 1709073 1019622 219041 -251244
45247 -251244 -476641 -733793 -1017901 -1182335 -1287984 -1428053 -1366182 -792447 80830 599378
45237 599378 445131 15017 -92396 321667 1099291 2042513 2910387 3329086 3083034 2464880
45227 2464880 2036633 2014979 2146056 2213377 2345489 2670194 2979339 3029272 2947076 2957865
45217 2957865 2849509 2194634 1123480 342085 159251 -25962 -876106 -2111805 -2846374
45208 -2846374 -2704015 -2061496 -1266097 -210372 1198341 2658319 3808956 4580652 4980050
45199 4980050 4878617 4327512 3811062 3797173 4131324 4194990 3659154 2869117 2493279 2944753
45189 2944753 4100039 5408012 6278825 6513904 6394809 6307514 6330060 6258064 5948666 5489935
45179 5489935 5027373 4544757 3907969 3136027 2557377 2552729 3079417 3615544 3745409 3632497
45169 3632497 3615237 3468627 2558888 841180 -762852 -1286230 -723372 172235 837629
45160 837629 1295921 1753909 2162204 2194889 1532996 271308 -889836 -1165918 -627714
45151 -627714 -277206 -810617 -1625201 -1594664 -620879 255820 272244 -241158 -648653 -939858
45141 -939858 -1432945 -2009409 -2194820 -1822216 -1177878 -565817 -78724 236190 299086 122677
45131 122677 -194036 -614775 -1145730 -1678399 -2015472 -2049926 -1784946 -1226055 -450736 224073
45121 224073 395666 33881 -348550 -145609 725567 1711552 2104930 1627685 611753
45112 611753 -322532 -778083 -827429 -800940 -906745 -1124910 -1398224 -1732104 -2055200 -2187333
45102 -2187333 -2114940 -2142964 -2513404 -2936786 -2812242 -1967532 -896572 -151986 211463 416805
45092 416805 503539 398251 213591 87533 -140463 -674288 -1243252 -1286509 -690516 73112
45082 73112 595760 857167 808297 203560 -831720 -1565498 -1465500 -901274 -551025 -412032
45072 -412032 -22122 504258 436510 -404300 -1112507 -790528 225915 799119 512288 153722
45062 153722 482891 1025478 660229 -742189 -1955308 -1932068 -1123640 -717567 -969229
45053 -969229 -1080602 -611315 -101419 -65919 -181609 63965 525435 717204 509051 33849
45043 33849 -636427 -1235742 -1217235 -503378 120754 -18570 -554115 -772440 -718875 -772855
45033 -772855 -632762 164201 1011094 790228 -350053 -1047627 -762557 -510143 -1126480
45024 -1126480 -1993502 -2188873 -1900994 -1809866 -1786596 -1170157 54887 1168495 1590418
45015 1590418 1271934 475434 -318841 -551205 -123857 397393 478766 226512 -6234 -187949
45005 -187949 -370547 -332251 25760 305969 164474 -124648 -203721 -373935 -1167629 -2422750
44995 -2422750 -3412725 -3756393 -3652768 -3347930 -2897859 -2381451 -1903231 -1443225 -996535
44986 -996535 -660054 -314893 409623 1484330 2223383 2156594 1721450 1536266 1452104 1004644
44976 1004644 378422 129352 266844 409437 573412 991089 1410382 1434145 1315003 1518521
44966 1518521 1751698 1424218 846878 830232 1212199 1044506 294782 51883 792039 1704348
44956 1704348 2087284 2158446 2044628 1300986 89239 -459389 74194 513574 -124325
44947 -124325 -1024790 -903942 -8325 508769 465448 496619 541429 -21289 -938295 -1213486
44937 -1213486 -709183 -328062 -426687 -258555 648460 1628472 1903132 1627496 1355216 1120928
44927 1120928 645944 12046 -408458 -437811 -118300 538199 1497321 2514318 3216414
44918 3216414 3322099 2748689 1681052 592853 17752 185332 891203 1637217 1863962
44909 1863962 1323696 456370 135949 719942 1580957 1936229 1864694 2008671 2483447 2696839
44899 2696839 2221373 1308148 501193 172160 399273 862208 928935 319910 -427916 -683182
44889 -683182 -701177 -1149312 -1801008 -1699909 -782240 -279350 -994002 -2061609 -2146485 -1208594
44879 -1208594 -260419 185006 533071 1141485 1749423 1968512 1779277 1392611 992234
44870 992234 716197 609831 520341 239172 -222547 -646462 -861518 -861477 -763804 -798431 -1208295
44859 -1208295 -1954051 -2591677 -2636111 -2029285 -1158804 -503062 -336463 -620774 -1014550 -1072371
44849 -1072371 -590072 222875 880754 871167 -51105 -1513576 -2565215 -2494246 -1636485 -947363
44839 -947363 -766431 -579589 -95092 209938 -10315 -269082 -58165 262197 146634 -68606
44829 -68606 307939 1067600 1386149 1223586 1367374 1999023 2310388 1893975 1500758 1808267
44819 1808267 2256194 1897917 868523 179735 342801 940025 1408483 1543601 1244299
44810 1244299 422462 -660922 -1439751 -1634356 -1504988 -1393234 -1293979 -1014467 -505001
44801 -505001 135048 800520 1365239 1634543 1462096 898043 180929 -382544 -550667 -269074
44791 -269074 298831 910632 1408267 1710978 1745378 1541133 1370084 1598436 2312246 3174925
44781 3174925 3720992 3760495 3490491 3248433 3133321 2842548 1995847 742703 -94800
44772 -94800 219734 1414044 2348441 2252089 1598799 1498471 2327657 3253125 3147624 1761399
44762 1761399 -97757 -1361994 -1521228 -776525 330028 1301566 1850117 1939367 1783490
44753 1783490 1694927 1782457 1823724 1577341 1219846 1276782 1998102 2939209 3355079 2975947
44743 2975947 2212186 1579195 1127175 573700 -141379 -679915 -735617 -454872 -240165 -174744
44733 -174744 120965 921060 1857021 2243090 1939725 1556535 1598901 1696340 1079599 -242580
44723 -242580 -1234589 -953825 361986 1578104 1864865 1354208 708820 382129 381909 483761
44713 483761 442710 89456 -539865 -1108154 -1174000 -628358 128816 604789 778921 1027373
44703 1027373 1426678 1450715 659785 -519532 -1160949 -972233 -577237 -521446 -506730 2708
44693 2708 797500 1103517 622261 -117305 -465223 -285638 176130 660838 986459 1093729
44683 1093729 1167371 1471174 1947917 2234071 2164313 1955562 1759078 1389503 741996 151261
44673 151261 3341 232324 541502 889094 1335334 1586674 1220745 365899 -338566 -579146
44663 -579146 -724973 -1141055 -1543435 -1398435 -746342 -231739 -320693 -767577 -948642 -572853
44653 -572853 59907 481759 623934 825786 1248167 1480782 981431 -165079 -1238198
44644 -1238198 -1673022 -1540363 -1132099 -475890 402170 1042723 908216 132080 -559338
44635 -559338 -764253 -824529 -1147885 -1523169 -1474291 -1034926 -701153 -646674 -418424 423346
44625 423346 1630517 2449021 2371853 1576944 695416 254146 282307 365184 116450 -357808
44615 -357808 -545828 -144143 530665 877123 674978 253081 40315 145198 390882 556194
44605 556194 487907 135262 -392618 -892089 -1280576 -1643452 -1972407 -2007341 -1525197 -694537
44595 -694537 63832 506322 637565 452676 -10750 -324502 150024 1438434 2678189
44586 2678189 3090242 2951156 3052676 3379927 3088646 1919588 841441 814719 1513834
44577 1513834 1902392 1627807 1080144 363331 -829159 -2241255 -2852601 -2035926 -350118
44568 -350118 1116956 1686689 1189272 -146949 -1486904 -1771521 -919049 -83566 -110244
44559 -110244 -390453 -76180 265974 -520746 -2066105 -2685578 -1837612 -907091 -1028320
44550 -1028320 -1467524 -1037125 -10157 542341 591987 1037406 2057593 2794384 2706384
44541 2706384 2243893 1980677 1853420 1519697 888795 82109 -677737 -1037577 -848452
44532 -848452 -588205 -911827 -1680594 -2013930 -1481602 -658689 -229937 -121920 73444 301722
44522 301722 186336 -328880 -936624 -1366779 -1460259 -1075655 -344384 162091 -4055 -487845
44512 -487845 -457869 329554 1149738 1124666 186191 -900434 -1327507 -945355 -230275 357183
44502 357183 877245 1644116 2526201 2862077 2264243 1219819 572133 580795 835474 958714
44492 958714 970680 982288 965634 937809 1013768 1127227 1007926 607522 270821 296320 588555
44481 588555 944039 1375703 1842958 1939427 1319856 343143 -191674 -12197 342834 340844
44471 340844 147104 220997 540903 644957 329612 -91917 -266593 -200836 -24036 411435
44461 411435 1412079 2911448 4239710 4608869 3912951 2973886 2810701 3604434 4565528
44452 4565528 4949665 4965979 5354216 6193275 6627838 5953657 4590987 3639824 3656778 4212947
44442 4212947 4572115 4428720 3910174 3209298 2505685 2121310 2408309 3322643 4256504
44433 4256504 4526432 4061981 3439719 3164473 3123161 2922446 2539303 2273142 2143991 1806406
44423 1806406 1177528 722680 854259 1373689 1830324 2167318 2605997 3033071 2945158 2052344
44413 2052344 661104 -569526 -1049282 -507778 846078 2351297 3346180 3726663 3934800
44404 3934800 4369534 4978476 5481346 5826819 6303755 7234506 8604556 10024997 11137727
44395 11137727 12060723 13287556 15104726 17297936 19490395 21482468 23102021 24059412
44387 24059412 24252404 23945967 23334271 22228570 20580581 18975662 18013937 17413115 16399595
44378 16399595 14896906 13585740 12724277 11675814 9884667 7700268 5892342 4841902
44370 4841902 4513769 4731833 5114068 5161564 4803728 4530526 4680792 4965997 5011018 4963196
44360 4963196 5170379 5589424 5907839 5962180 5679175 4910452 3699463 2434313 1427040
44351 1427040 701803 491601 1359550 3225493 4763386 4602156 2955299 1348931 860141
44342 860141 1300502 1981196 2442453 2378005 1686876 890442 835624 1633452 2408552 2439031
44332 2439031 2083409 2183816 2897976 3555161 3515522 2838366 2119159 1817778 1755229 1332459
44322 1332459 366330 -465238 -344987 618154 1485677 1650659 1415172 1315311 1401345 1455699
44312 1455699 1492596 1673029 1972802 2224657 2309790 2132352 1646849 1080081 840837 1009919
44302 1009919 1210944 1189531 1171367 1367304 1503806 1273174 965304 1140603 1818836 2495530
44292 2495530 2906685 3268913 3712846 3973568 3827396 3439144 3032880 2542146 1892086
44283 1892086 1387374 1436412 1959577 2403162 2364324 1943767 1452420 1048763 756256 552032
44273 552032 267017 -324146 -1058763 -1305983 -723844 97895 261736 -232239 -474827 93367
44263 93367 1032936 1733482 2236664 2803379 3250442 3352512 3487974 4145607 4997507 5189014
44253 5189014 4495139 3536205 2833871 2263759 1523858 611509 -262455 -798842 -661682
44244 -661682 114239 839659 880201 588018 835630 1640950 2083477 1710910 1139546 980636
44234 980636 1077420 1227008 1724397 2544771 2820658 1950840 579367 -363236 -979199 -1799193
44224 -1799193 -2390494 -1779532 -115486 1235891 1401985 889982 574795 635309 812799
44215 812799 1055554 1506168 2223218 3097527 3716328 3381961 1865299 170908 -179293
44206 -179293 1120150 2763584 3449191 3239744 2927892 2735558 2326364 1674928 1131396
44197 1131396 744186 229168 -292215 -107876 1233668 3192857 4657042 4999155 4552340
44188 4552340 4092490 4024337 4134177 4025134 3613766 3144318 2864998 2843336 3021817 3275932
44178 3275932 3442731 3465950 3513542 3790386 4230486 4538417 4546725 4365987 4167204 4003057
44168 4003057 3894944 3918456 4110923 4413246 4763406 5128830 5396210 5376101 5035651 4653618
44158 4653618 4616131 5022246 5522523 5609728 5146062 4598943 4642536 5474283 6611106 7379900
44148 7379900 7477746 7043482 6411153 5896094 5601307 5302937 4745429 4148756 4083048 4631650
44138 4631650 5067288 4721886 3852497 3213521 3062367 3096062 3117584 3149580 3029694 2550928
44128 2550928 1984156 1836659 2061639 2114439 1824947 1544593 1345037 843827 80594 -206721
44118 -206721 382675 1260605 1736298 1938532 2235253 2288827 1515413 214994 -571082 -315276
44108 -315276 497636 1125733 1281703 1091056 892172 1155543 2073674 3058983 3119172 2005750
44098 2005750 646975 137340 530715 944780 717604 110206 -177279 95628 517004
44089 517004 657338 630644 847898 1353136 1723055 1697344 1612954 1982833 2822976 3679973
44079 3679973 4251124 4675306 5157941 5563168 5555197 5053809 4396580 4032038 4120137 4454914
44069 4454914 4714151 4713474 4459778 4102946 3881626 3962536 4217911 4295957 4057365 3797120
44059 3797120 3827679 3970318 3721037 2841843 1533244 128966 -1056060 -1674396 -1580742
44050 -1580742 -1150184 -955304 -1045950 -929438 -339036 404880 925109 1229737 1431281 1468078
44040 1468078 1369334 1389767 1574878 1569731 1198325 874566 1046459 1542561 1897945 2072628
44030 2072628 2379754 2862726 3202719 3190912 2925043 2563852 2179744 1838278 1620675 1615079
44020 1615079 1974137 2768782 3651109 3986409 3584992 3001550 2796165 2808009 2551579 2050853
44010 2050853 1798039 2040439 2555663 3041193 3337918 3348842 3091102 2784625 2656749 2793535
44000 2793535 3336622 4464388 5860959 6633025 6276459 5415438 5034067 5262695 5530280
43991 5530280 5634579 5905911 6426563 6850566 7039283 7230456 7519986 7750770 7934564
43982 7934564 8213378 8412282 8235731 7894456 7878676 8089475 7902312 7176032 6472466 6125880
43972 6125880 5828579 5367567 5062519 5165098 5442757 5649297 5832693 5950615 5820631
43963 5820631 5688858 6135540 7112492 7836485 8034081 8482696 9755185 11201140 11912943
43954 11912943 12067879 12456326 13117099 13333782 12785589 11917822 11209022 10666400 10047824
43945 10047824 9168840 8043489 6994476 6439728 6357582 6301587 6162501 6396858 7163525
43936 7163525 7879117 8166743 8568639 9541525 10324239 9787480 8086939 6512840 5891691
43927 5891691 6047584 6660093 7623869 8543847 8864188 8689419 8699344 9165585 9844661 10834063
43917 10834063 12508182 14419406 15379655 15121374 14902922 15834703 17464046 18768088 19772431
43908 19772431 21221565 23166877 24960524 26489061 28443915 31280872 34691839 38316903
43900 38316903 42359599 47204482 52884253 59258988 66417670 74564861 83688447 93693776
43892 93693776 104867999 117926307 133439392 151332626 171101896 192399248 215044622
43885 215044622 238285613 260304613 278782774 291906035 298671302 298532128 291362645
43878 291362645 277911891 259864200 239174124 217481495 196140741 176317953 158688395
43871 158688395 143232571 129607947 117606940 107093840 97739392 89159980 81267529
43864 81267529 74226452 68073890 62598468 57634307 53301506 49833806 47197387 44959942
43856 44959942 42594756 39921357 37206473 34845573 33048615 31826146 31049554 30394819
43848 30394819 29469694 28248065 27200153 26704847 26491636 26003758 25184462 24510340 24315885
43839 24315885 24476915 24688360 24613750 23836526 22235056 20465388 19477217 19348779 19113689
43830 19113689 17972181 16196550 14612298 13703341 13517345 13890865 14328242 14139898 13219200
43821 13219200 12311798 12023537 11952125 11381649 10470353 10004443 10156203 10290405 10053037
43812 10053037 9911623 10356685 11130426 11612073 11622881 11496739 11513768 11529206 11147353 10185997
43802 10185997 8998717 8279947 8409702 9038330 9486018 9488303 9324252 9249751 9102700 8583582
43792 8583582 7743979 7035123 6877839 7220179 7554367 7440003 6988678 6704870 6895375
43783 6895375 7476842 8333049 9446833 10544067 11076952 10893292 10550624 10584470 10814952
43774 10814952 10829234 10798206 11196562 11897218 12176100 11578505 10269315 8625205 7042907
43765 7042907 6041023 5861659 5944680 5480626 4575503 4166311 4638795 5311803 5593928
43756 5593928 5846520 6576036 7473829 7973934 8270101 8973787 10008140 10616511 10449877
43747 10449877 10027368 10042039 10667293 11608164 12443678 12851025 12821452 12720817 12886204 13174549
43737 13174549 13184388 12882648 12666563 12777867 13009963 13108810 13150765 13324610 13547109 13528985
43727 13528985 13159577 12656393 12309183 12159997 12009638 11741344 11510299 11458138 11343461
43718 11343461 10798185 10030395 9872405 10824535 12336301 13434797 13880047 14241303 14929343
43709 14929343 15699471 16203279 16517629 16866471 17216950 17514111 18064630 19279797 21111039
43700 21111039 23077157 24861435 26608337 28583728 30806897 33157246 35655692 38467568
43692 38467568 41768738 45810126 50962563 57329689 64305221 70974745 77254649 84325916
43684 84325916 93548493 105152151 118434923 133030601 149287417 167359768 186687673
43677 186687673 206672079 227115853 247377698 265592772 279474398 287696868 289981064
43670 289981064 286247176 276594229 262078243 244670860 226240895 208102622 191467722
43663 191467722 177393751 165931092 156062863 146943289 138602933 131038936 123373250 114688339
43655 114688339 105255047 96139559 87832616 80005998 72474531 65613460 59752929 54813207
43647 54813207 50693764 47466968 44969142 42659906 40166707 37677959 35596421 34038133
43639 34038133 32808382 31644107 30375641 29066215 28053091 27611028 27531446 27298069 26710728
43630 26710728 26041397 25560594 25283640 25238523 25533353 26001734 26251942 26332720 26894514 28308820
43620 28308820 30022097 31268364 32133285 33354181 35213909 37216489 38883041 40350627
43612 40350627 42018412 43979516 46022491 47970750 49826412 51658038 53405017 54736618
43604 54736618 55179885 54539793 53121250 51376110 49459114 47341971 45151453 42995332
43596 42995332 40587905 37589654 34371775 31886104 30531423 29597721 28161012 26176370
43588 26176370 24323656 23069497 22319574 21816703 21400890 20871747 19981165 18690476 17263333
43579 17263333 16086978 15519973 15778828 16689649 17594198 17812058 17261209 16417649 15679450
43570 15679450 15063959 14561438 14382987 14589090 14734206 14263487 13230796 12323373 12118204
43561 12118204 12559420 13281948 14188557 15397538 16713064 17573217 17733769 17720150 18257813
43552 18257813 19397762 20625564 21822864 23605886 26453922 29882623 32858651 34822003
43544 34822003 35955003 36635069 37028744 37106982 36617859 35083128 32291426 28858792 25857415
43535 25857415 23760604 22159564 20632237 19356330 18561394 17907735 16961522 15965368 15516714
43526 15516714 15625955 15728199 15623577 15737568 16258174 16660584 16526111 16358828 16992742
43517 16992742 18427099 19896951 21092906 22684980 25403661 29083438 32984325 36731844
43509 36731844 40478333 44257469 47608880 49876726 50597966 49624651 47219147 44106007
43501 44106007 41110078 38584297 36361882 34242722 32177884 29978334 27414331 24869116
43493 24869116 23314888 23113964 23292426 22712029 21696747 21650999 23066473 24772004 25438642
43484 25438642 25096050 24711394 24851321 25337709 25853866 26287981 26615768 26880360 27178302
43475 27178302 27359635 26992342 26048690 25407901 26138924 28316966 30967388 33110921 34439739
43466 34439739 35100265 35455719 36169596 37878453 40397501 42626080 43611618 43481294 43029597
43457 43029597 42608794 41796002 40098433 37675204 35258646 33456305 32186326 30827742
43449 30827742 28945558 26740956 24633342 22588124 20276244 17896581 16291524 15917485
43441 15917485 16070931 15602342 14264108 12937712 12547755 13117545 13960966 14470728 14511187
43432 14511187 14224900 13747394 13191656 12762581 12662124 12796517 12769909 12422608 12271513
43423 12271513 13012054 14492728 15612803 15523406 14595047 13825518 13588020 13478167 13214562
43414 13214562 13027931 13077394 13103828 12958344 12998842 13558765 14343421 14795728 14882778 15094763
43404 15094763 15745495 16685541 17730860 19012475 20787863 23158597 26064862 29314620
43396 29314620 32491646 35045403 36638825 37287409 37067130 35870453 33602967 30469866
43388 30469866 26907428 23370294 20326717 18214363 17054973 16225460 15018602 13471928
43380 13471928 12283703 11826648 11644334 11134528 10344337 9706653 9247844 8555583 7498822
43371 7498822 6534029 6178876 6483457 7123703 7729259 7979808 7663133 6892337 6128414
43362 6128414 5778867 5850395 6132777 6585602 7312084 8193751 8806792 8842153 8547779 8620965
43352 8620965 9542707 10992823 12075105 12284545 12125249 12482941 13452050 14230238 14315950
43343 14315950 14335392 15281547 17226391 19274396 20687901 21615876 22728816 24550579 27205035
43334 27205035 30429999 33671530 36382203 38296478 39250197 38882699 36976085 34094270
43326 34094270 31316861 29092870 26814636 23831982 20466558 17641333 15874128 15050690
43318 15050690 14798266 14532662 13506163 11592197 9887503 9685419 10754552 11460740 10860123
43309 10860123 9835685 9654042 10181683 10371891 10012623 9934886 10553902 11196494 11164426
43300 11164426 10709752 10511076 10724591 11066654 11469478 12096162 12874036 13530644 14076925
43291 14076925 14833199 15931246 17168820 18477238 20198453 22670566 25747574 28993429
43283 28993429 32267749 35853393 39927695 44048926 47287360 48850506 48538666 46661320
43275 46661320 43691666 40109908 36442694 33175425 30505790 28281546 26233740 24179162
43267 24179162 22022682 19813594 17899676 16740772 16333026 16048915 15357448 14506231 14092738
43258 14092738 14110740 13952576 13355535 12744160 12431663 12056662 11210928 10172193 9490021
43249 9490021 9148650 8730740 8255557 8221600 8786517 9493177 9994988 10564538 11597498
43240 11597498 12977624 14260668 15237756 15995266 16590266 16991764 17269373 17567946 17910786
43231 17910786 18222342 18523134 18952846 19662451 20839793 22739052 25442397 28626250 31821420
43222 31821420 34935337 38274846 41996280 45823258 49502135 53315643 57851562 63347991
43214 63347991 69569420 76336231 83839069 92251788 101291784 110464766 119614221 128845891
43206 128845891 137849072 145643648 151228552 154299668 155155365 154135000 151461005 147457030
43198 147457030 142454009 136417634 129084016 120694112 112315545 105124600 99439498 94637450
43190 94637450 89920867 84959099 79837495 74643603 69275899 63670700 58150293 53382466
43182 53382466 49798504 47062742 44336047 41119708 37633043 34331244 31400373 28913289
43174 28913289 27102433 26069841 25436968 24727786 24004398 23680743 23740829 23632770 23044741
43165 23044741 22342996 22035708 22157579 22414660 22625679 22755138 22780367 22837390 23301291 24391113
43155 24391113 25793028 26941230 27583470 27829580 27744974 27171523 25918096 23934313 21389761
43146 21389761 18785384 16817971 15800040 15296520 14666661 13864914 13284022 12882418 12078905
43137 12078905 10703065 9486081 9207198 9733842 10342418 10699257 11034610 11530691 12068169
43128 12068169 12533195 12883142 12887772 12304365 11429847 10995904 11274743 11692412 11636231 11304227
43118 11304227 11368336 12036778 12886298 13512151 13914459 14224883 14415547 14401946 14240436 14168978
43108 14168978 14556126 15681399 17321810 18714238 19352322 19790287 21150707 23692990
43100 23692990 26348085 27934522 28406062 28545846 28842801 29204640 29537603 29998223 30688355
43091 30688355 31609789 32962072 34993654 37411985 39353704 40137485 39736621 38386340
43083 38386340 36150173 33178082 30070421 27562096 25892336 24681851 23324405 21386848
43075 21386848 18882896 16394786 14689336 13910074 13358097 12420987 11486270 11405679 12135581
43066 12135581 12565897 11934229 10882642 10660868 11544996 12512182 12423537 11131750 9359605
43057 9359605 7851764 6895599 6463146 6416292 6454103 6154261 5405654 4747911 4914090 5890250
43047 5890250 6736954 6623540 5820472 5303220 5514406 5985695 6187371 6209340 6349353 6467179
43037 6467179 6184839 5524232 4924645 4677343 4677131 4720556 4729151 4625711 4292871 3812465
43027 3812465 3551669 3821742 4518085 5223957 5648193 5884734 6237428 6816072 7325870
43018 7325870 7309749 6636888 5685536 4971686 4675761 4638226 4700473 4819107 4874455 4650519
43008 4650519 4113376 3507968 3063070 2790149 2698353 2962611 3623274 4302976 4574791 4553436
42998 4553436 4747314 5273673 5603509 5286536 4639536 4430388 5028678 6105052 7038582
42989 7038582 7385573 7089325 6533571 6311578 6624443 6955316 6683517 5981305 5658577
42980 5658577 6066924 6683772 6989710 7192922 7661104 8143134 8209640 8156607 8685698 9739362
42970 9739362 10442246 10377818 10216358 10724901 11740027 12596776 13135171 13731382 14608983
42961 14608983 15691805 17039965 18927145 21448114 24390473 27508438 30667826 33781834
42953 33781834 36853357 39927837 42651853 44057374 43342371 40912638 38127287 35837250
42945 35837250 33628845 30750586 27346444 24366397 22497055 21560289 20848474 19750572
42937 19750572 18142432 16448570 15290587 14867599 14728445 14304679 13527994 12706256 11984336
42928 11984336 11313843 10866278 10957317 11402000 11410212 10496461 9214973 8540187 8633588 8724862
42918 8724862 8276038 7724048 7730131 8110834 8109138 7607215 7389593 7972838 8742212 8752653
42908 8752653 8073223 7721325 8289744 9201249 9506445 8994333 8224431 7744541 7617926
42899 7617926 7606413 7525641 7404541 7434584 7743548 8163393 8348983 8226133 8137224 8343290
42889 8343290 8552006 8257342 7496562 6911435 6956121 7352625 7555001 7538638 7796853 8588460
42879 8588460 9527483 10075642 10205282 10302487 10530343 10658084 10589400 10665401 11142013 11642746
42869 11642746 11597346 11151454 11113870 11840274 12636540 12629964 11931596 11480204 11849260 12677776
42859 12677776 13344213 13762762 14232103 14763115 14979948 14726105 14431673 14621798 15186880
42850 15186880 15452216 15026250 14293140 13882191 13897197 13976361 13947889 14022426 14373960 14953125
42840 14953125 15775697 16970503 18389737 19568219 20279282 20776744 21292182 21721225 22085301
42831 22085301 22811593 24103376 25485673 26584789 27986212 30522266 33858513 36650926
42823 36650926 38222574 39330108 41039243 43550904 46517609 49894908 53919671 58620322
42815 58620322 63883147 69792502 76465005 83713330 91288032 99343016 108263491 118045907
42807 118045907 128150405 137962991 147147208 155516056 162749267 168280506 171402548 171597211
42799 171597211 168937542 164129610 158028223 151125242 143547165 135427546 127167245 119382499
42791 119382499 112610610 106940008 101952442 97250395 93018606 89726090 87246294 84764897
42783 84764897 81797772 78836880 76613815 75126519 73849725 72514672 71048946 69006573
42775 69006573 65846010 61815621 57886434 54621708 51651562 48460911 45158305 42137873
42767 42137873 39412305 36715483 34048038 31730989 29957686 28515864 26956367 24982280
42759 24982280 22752280 20799427 19514514 18758283 18177402 17766702 17735803 17896137 17732475
42750 17732475 17199868 16880685 17077910 17286030 16951038 16259125 15656002 15020324 13991020
42741 13991020 12847256 12301565 12463576 12717200 12705870 12758147 13112865 13343993 12949251
42732 12949251 12082846 11293972 10820048 10497060 10152963 9774777 9474579 9555130 10355919
42723 10355919 11682687 12622331 12395440 11318887 10488585 10525771 11073726 11562899 11956269
42714 11956269 12502968 13180582 13775378 14313833 15069681 16227667 17771689 19575103 21359572
42705 21359572 22747050 23733225 25031659 27501168 31149261 35091102 38617956 41869716
42697 41869716 45172829 48123386 49823266 49859604 48579829 46452968 43633868 40240432
42689 40240432 36647594 33305609 30488854 28285258 26555173 24876845 22928063 21022148
42681 21022148 19810373 19282829 18631311 17463732 16548548 16726345 17585538 18084837 18197108
42672 18197108 18897562 20519187 22206865 23300125 24204441 25298205 25893772 25137140 23288337
42663 23288337 21197024 19031267 16571420 14400001 13536178 13827601 13863894 12825824 11452256
42654 11452256 10714119 10398877 9653811 8289772 6851081 5815184 5332634 5411373 5781782
42645 5781782 5866854 5424965 4967637 5059566 5533360 5948164 6444903 7384956 8367034 8483765
42635 8483765 7595225 6565249 6076444 5916352 5663763 5382668 5229182 4923945 4150478
42626 4150478 3193483 2720455 3028573 3795205 4505502 4939684 5263756 5689722 6037395
42617 6037395 5825280 5023545 4454103 4940437 6172481 7018778 6973429 6614333 6485534
42608 6485534 6284661 5553493 4534783 3810873 3543904 3565623 3802453 4097839 4008318 3371574
42598 3371574 2792205 2952440 3608221 3836052 3194506 2159547 1461950 1392083 1693447
42589 1693447 1814539 1374559 635686 283773 484141 554236 -9322 -623698 -342260 864191
42579 864191 2204267 3122544 3522409 3239535 2204705 1018110 454939 417879 269442
42570 269442 158836 918534 2448475 3371306 2836185 1715122 1356708 1941795 2760710
42561 2760710 3391545 3780414 3707192 3071791 2417232 2386567 2839079 3152671 3197944 3348512
42551 3348512 3671192 3777260 3445987 2816295 1984265 987672 226917 316825 1313053 2494295
42541 2494295 3140858 3267946 3401195 3811176 4184758 4075848 3602215 3509892 4317496 5486872
42531 5486872 5865554 5053764 3869985 3233499 3103472 2950201 2791980 3086878 3803433
42522 3803433 4272082 3985926 3076653 1999117 1177469 954616 1426328 2201276 2638829
42513 2638829 2434612 1808137 1175472 860747 1019243 1550058 2137353 2597090 3051280
42504 3051280 3548057 3773519 3493270 3023349 2812577 2781031 2612404 2534003 3146968 4457301
42494 4457301 5680949 6151621 5932595 5401011 4724652 3983811 3424410 3306840 3681764
42485 3681764 4417694 5257594 5835235 5886124 5470883 4812015 4023142 3245795 2825014 2907956
42475 2907956 3022504 2575805 1704612 1115860 1154053 1603259 2356704 3570552 5037019
42466 5037019 6098449 6442082 6424735 6404199 6339546 6295551 6695617 7669053 8676535 9231108
42456 9231108 9575311 10225830 11211175 12153624 12767292 12890388 12353458 11247686 10099952
42447 10099952 9399807 9100713 8854006 8544978 8348332 8423449 8746829 9091879 9100403 8612154
42437 8612154 7941268 7499282 7176079 6554705 5701121 5103611 4773517 4183546 3312562
42428 3312562 2886189 3142778 3197436 2279897 923624 206924 364901 870441 1382921
42419 1382921 1839638 2014181 1780024 1544805 1747371 2196277 2483705 2649678 2805569
42410 2805569 2614532 1952676 1596673 2286317 3464300 3958635 3617952 3188980 2831351
42401 2831351 2024444 929998 532167 1146873 1929740 2224881 2356062 2648391 2669142
42392 2669142 2036541 1182249 701032 567703 521653 660426 1156666 1855553 2538171 3139694
42382 3139694 3472188 3310033 2979686 3170071 3864072 4235616 4002670 4026817 4955533 6033056
42372 6033056 6036596 4856218 3431085 2583376 2580994 3378205 4550822 5340610 5418703 5282069
42362 5282069 5369700 5309740 4712962 4118764 4241515 4748190 4833863 4674838 5111905 5995172
42352 5995172 6138666 5176254 4290632 4552260 5444185 5716496 5066015 4262110 4003653
42343 4003653 4310297 4848189 5286855 5355745 4966961 4371859 3981520 3962578 4094046 4033476
42333 4033476 3692185 3355074 3406078 3912704 4564851 5056053 5340863 5404791 5047647 4187642
42323 4187642 3213452 2693923 2790375 3206687 3623199 3920134 4090193 4214035 4417157 4612919
42313 4612919 4492329 4054940 3827965 4084030 4154069 3212771 1617699 689381 1075919
42304 1075919 2051111 2608853 2544307 2160060 1607426 1025586 820377 1218430 1805558 1961528
42294 1961528 1571614 988589 529653 332174 461844 818027 1123923 1302268 1637645
42285 1637645 2263053 2721123 2392146 1217492 -252078 -1325834 -1497219 -679121 528854
42276 528854 1185662 1076688 1064367 1830593 2711069 2602311 1709875 1284655 1598062 1425279
42266 1425279 32578 -1450895 -1553930 -559751 52527 -155501 -141081 823329 2097283
42257 2097283 2823342 3184227 3818190 4573779 4650298 3783170 2632892 1980242 1989894 2312073
42247 2312073 2534332 2434102 2067540 1749257 1812716 2335788 3168582 4146802 5114475 5811627
42237 5811627 5959038 5477522 4530518 3424719 2546114 2193253 2295798 2517134 2831847
42228 2831847 3646089 4976412 5939615 5740397 4911966 4728846 5433132 5977951 5699367
42219 5699367 5248459 5406867 5885960 5995203 5771855 5620317 5378602 4652979 3746106
42210 3746106 3368997 3600483 3903634 4015473 4060050 3933736 3414492 2841720 2853108 3368664
42200 3368664 3590694 3116030 2348201 1748500 1445785 1675230 2718692 4130775 4850229
42191 4850229 4479182 3755313 3393328 3192726 2737295 2238815 2084815 2133376 2062394 1939685
42181 1939685 1908502 1802037 1615307 1838393 2708497 3630519 4003252 4123736 4511601 4805410
42171 4805410 4258425 3052076 2167104 2064895 2385679 2887134 3738638 4789463 5461134
42162 5461134 5646826 5959555 6751305 7516274 7614625 7068909 6344510 5829900 5809490 6442497
42152 6442497 7423848 8089623 8172123 8037620 7893755 7290005 5889704 4306809 3512042
42143 3512042 3545307 3420545 2400646 954064 252183 896726 2285222 3198923 2968821
42134 2968821 2033501 1352684 1424665 2028330 2714994 3151430 3042241 2245631 1147499
42125 1147499 481269 508759 737785 715880 692594 1078986 1591516 1509380 682653 -242229
42115 -242229 -660932 -673155 -789987 -1269877 -1880418 -2152335 -1798525 -991724 -216600 251085
42105 251085 601924 1065668 1436200 1388959 1152506 1351363 2091919 2714798 2720772 2495411
42095 2495411 2693764 3237537 3476534 3200591 2888707 2901882 3005574 2907729 2742774 2649619
42085 2649619 2315901 1476799 576472 287934 460540 217969 -769417 -1714061 -1692499 -726230
42075 -726230 429773 1155645 1263820 835391 246696 97663 634445 1419116 1974872
42066 1974872 2479931 3271841 3923028 3599225 2376179 1433384 1646880 2566994 3152302
42057 3152302 3064474 2813745 2905322 3251699 3354490 2869304 2055902 1652776 2051370 2649845
42047 2649845 2497263 1653135 1309581 2267388 3858230 4845457 4912489 4654769 4452800
42038 4452800 4092777 3413670 2659897 2101464 1798372 1829465 2323011 3153752 3973891 4634763
42028 4634763 5252460 5811495 6077696 5998824 5829639 5726971 5546185 5163625 4659525 4033054
42018 4033054 3110703 1968834 1085871 743054 559637 17680 -750477 -1143227 -971506
42009 -971506 -688967 -676949 -736554 -515860 -122285 20525 -217892 -529847 -601318 -373710
41999 -373710 200608 1329986 3006534 4609316 5303028 4968095 4437440 4546147 5123686
41990 5123686 5278680 4644509 3921695 3985093 4775186 5438000 5416397 4972557 4601641 4388306
41980 4388306 4208245 4216790 4688359 5484874 6122327 6389336 6503305 6577274 6375537 5815093
41970 5815093 5282603 5081592 4900112 4310650 3587657 3464604 4103361 4824241 4956732
41961 4956732 4537373 4053044 3885511 4150337 4715975 5198039 5231276 4898229 4627416 4608061
41951 4608061 4650361 4657252 4749117 4800152 4428732 3716180 3346560 3636410 4004662 3930374
41941 3930374 3862002 4440018 5260010 5333866 4619342 4150105 4518292 5008022 4529257 2891648
41931 2891648 925231 -263073 -57430 1178895 2262565 2270104 1550438 1233093 1727573
41922 1727573 2301269 2236014 1701637 1200325 828703 558148 679981 1370418 2166175 2444144
41912 2444144 2211869 1956551 1923024 2012286 2217511 2658436 3255677 3817057 4412285 5229645
41902 5229645 6022921 6104925 5068697 3313727 1732401 957876 928600 1095593 1037540
41893 1037540 859752 898066 1107741 1059572 616464 228139 299865 590259 579929 201154
41883 201154 -166288 -242342 -10857 514100 1272380 1968890 2276595 2218533 2051596 1835739
41873 1835739 1446774 957597 644817 622764 798210 1164344 1778687 2439374 2764058 2676400
41863 2676400 2503320 2522922 2713055 2985660 3324242 3606709 3649996 3572165 3774002 4361810
41853 4361810 4864285 4750126 4044788 3264511 2902653 3104667 3660931 4177604 4405990
41844 4405990 4507359 4851989 5527567 6264283 6870110 7435394 8020351 8487107 8805839
41835 8805839 9165415 9516889 9339437 8239780 6597056 5256920 4688789 4717524 4927703
41826 4927703 4986145 4671137 3996386 3377567 3391999 4253844 5636960 6994295 7925837
41817 7925837 8328682 8388603 8361850 8187782 7448130 5966614 4307129 3296457 3082863
41808 3082863 3064417 2788537 2484964 2533246 2803157 2846448 2516865 2095100 1916373 2096348
41798 2096348 2498652 2751521 2419648 1429206 297994 -262920 12108 797563 1559686
41789 1559686 1913767 1717837 1090011 370695 -103439 -235825 -134554 53547 171620
41780 171620 111327 57712 449061 1342934 2039850 1866919 1225920 1174352 1877235 2262484
41770 2262484 1583509 571281 389295 1032935 1587372 1670601 1667326 1717195 1509737 1165770
41760 1165770 1312558 1974940 2307864 1893210 1463498 1712046 2111672 1707693 567901
41751 567901 -388018 -656497 -444070 33223 692851 1153183 991313 452404 186354 278041
41741 278041 267435 120255 304781 742797 610177 -394278 -1369049 -1372766 -667848 -184934
41731 -184934 -198732 -187416 270600 1076669 1964624 2769120 3372124 3742856 4028931 4412030
41721 4412030 4948737 5620971 6285038 6486766 5751092 4289396 2993268 2427535 2265750
41712 2265750 2048081 1954875 2329447 2959203 3482252 4059862 4898746 5517508 5410181 5172637
41702 5172637 5896557 7446386 8412922 8011040 7034175 6531089 6450051 6176475 5655679
41693 5655679 5251714 4997572 4702226 4478925 4516579 4528636 4001539 2880855 1570948
41684 1570948 407141 -445883 -757419 -409519 242249 644944 693513 723806 876859 877926
41674 877926 522123 21487 -284723 -324649 -252736 -173114 -34890 264617 739459 1256835
41664 1256835 1619132 1708455 1507969 1032136 408229 19872 284348 1134822 1939506 2116967
41654 2116967 1679890 1067545 693973 824446 1580645 2741273 3713838 3995633 3558167
41645 3558167 2639749 1457907 375438 -40281 391491 1030721 1055044 402913 -327876
41636 -327876 -714617 -740240 -389035 357970 1183487 1700201 2041796 2594003 3200393 3372172
41626 3372172 3283843 3627870 4245676 3935319 2229025 480603 295257 1455181 2365660
41617 2365660 2215497 1690574 1637074 2000732 2295016 2345518 2224734 1968353 1655378 1390185
41607 1390185 1025717 326099 -409274 -375754 725237 2072252 2557861 2051904 1455661
41598 1455661 1603152 2452883 3331008 3640940 3255752 2469015 1748516 1463897 1696021
41589 1696021 2230732 2733751 2981209 2999358 3017834 3256881 3719820 4173202 4319838 4026220
41579 4026220 3466904 3064108 3170998 3725390 4278574 4425944 4123550 3534258 2732484
41570 2732484 1714764 579242 -479823 -1268829 -1559333 -1141384 -152594 811752 1251790
41561 1251790 1342997 1612143 2092334 2240408 1768125 1110295 843143 980809 1134769 1121034
41551 1121034 1069773 1034109 808648 220318 -522724 -881073 -476406 422220 1054804 979166
41541 979166 563390 422112 582469 650686 618243 816315 1050093 613939 -492130 -1157420
41531 -1157420 -592541 454778 703837 130714 -157311 349058 913363 747578 27418
41522 27418 -595910 -865238 -886504 -637803 65481 1240570 2561905 3453217 3432086 2608318
41512 2608318 1725624 1353668 1181701 599573 -181221 -316350 329409 872519 735802
41503 735802 464453 691391 997891 550867 -579464 -1514985 -1728234 -1394491 -763333
41494 -763333 82429 852987 1118713 893988 644166 575159 360518 -269892 -1048230 -1449056
41484 -1449056 -1181557 -313366 809823 1676508 1922602 1667563 1363564 1270730 1269183 1177637
41474 1177637 1020012 961706 1170285 1673789 2146596 2015877 1157521 340060 468844 1426426
41464 1426426 2222815 2336976 2261216 2513109 2794456 2586293 2047166 1733023 1748570 1758987
41454 1758987 1654424 1639958 1745268 1780117 1802942 2137289 2767427 3103998 2600615 1412856
41444 1412856 260149 -266758 -159011 146254 242689 115017 63888 288982 617746 711067
41434 711067 470998 143453 48730 299835 767180 1238804 1599508 1869923 2067546 2085179
41424 2085179 1808786 1333583 929493 786514 915487 1257700 1690776 1939701 1734716
41415 1734716 1104408 295353 -576611 -1472870 -2049515 -1823086 -892294 -14140 327746
41406 327746 489968 972740 1639867 2103007 2408646 2689560 2509534 1399388 -80795
41397 -80795 -689716 -42919 934605 1299977 1148156 1068292 1188869 1247490 1169522 1063702
41387 1063702 895865 607130 398428 517842 838548 947059 652788 247055 246905 887860
41377 887860 1783967 2177284 1748514 1069016 886295 1069408 818661 -62406 -812174 -871399
41367 -871399 -671560 -786368 -940922 -546048 238776 735093 757175 649224 494891 52843
41357 52843 -586131 -1028900 -1294714 -1771387 -2360456 -2414233 -1755552 -1054641 -840991 -766927
41347 -766927 -293261 427548 858465 844025 555725 36956 -642975 -1079058 -992135 -815297
41337 -815297 -1175475 -1860291 -1973127 -1209425 -345224 -207688 -695627 -1177769 -1419073 -1620658
41327 -1620658 -1797492 -1666377 -1142517 -513155 -15896 429514 919618 1258230 1171797 707217
41317 707217 224141 56712 332496 1038213 2022904 2892282 3121425 2472999 1290267
41308 1290267 262206 -150467 -48025 137450 169999 263751 766493 1627933 2336679 2476843
41298 2476843 2196599 1923445 1723472 1272604 510697 -33432 182195 1005902 1717776
41289 1717776 1767149 1186482 381629 -245725 -515030 -545823 -639698 -930794 -1187592 -1123341
41279 -1123341 -829805 -668553 -758886 -842949 -711663 -515869 -520160 -693376 -669792 -78600
41269 -78600 1086306 2344127 3032623 2894127 2332454 1944069 1870102 1810020 1561068 1210649
41259 1210649 814700 267661 -406726 -956211 -1206773 -1172777 -786358 80807 1146230
41250 1146230 1714314 1506857 1163677 1481861 2372320 3017562 2926056 2359991 1763281 1258789
41240 1258789 821676 527693 385197 184055 -208487 -505190 -207372 778035 1856040
41231 1856040 2230974 1715319 917418 502436 454492 382266 383214 986553 2110120 2791870
41221 2791870 2453864 1838115 1926607 2330357 1743288 -44210 -1604479 -1659452 -576326
41212 -576326 397474 688828 549544 198484 -358101 -848099 -851169 -460560 -242265 -395109
41202 -395109 -442604 16103 647091 798734 349613 -204471 -440298 -456724 -533585 -585733
41192 -585733 -239260 555801 1272630 1361557 894323 389832 82917 -286180 -911334 -1525163
41182 -1525163 -1772401 -1705572 -1635835 -1654700 -1574832 -1264411 -806606 -348946 47319 421459
41172 421459 847613 1279774 1444420 1082576 368641 -170255 -283248 -238415 -240889 254
41162 254 727920 1480238 1541723 945200 490276 751084 1528381 2321503 2873116 3131252
41152 3131252 3097849 2900969 2720397 2539968 2257447 2037873 2150040 2427763 2399893 2059088
41142 2059088 1922260 2110420 2007551 1243879 435230 374129 936362 1429810 1669298 1971182
41132 1971182 2294372 2184846 1588371 1033508 904633 1106654 1521632 2180722 2825364
41123 2825364 2909196 2317893 1601722 1243678 1177369 1265979 1669423 2319310 2573012 1987561
41113 1987561 1090290 772531 1140224 1551352 1621380 1551075 1506593 1341189 1062730 990388
41103 990388 1183112 1163764 533926 -447064 -1204008 -1550524 -1774395 -2159939 -2651330 -2899966
41093 -2899966 -2513569 -1414397 -97236 669075 626271 361315 604544 1330612 1886194
41084 1886194 1943954 1906488 2240748 2812134 3206307 3448077 3901332 4451938 4334535 3129656
41074 3129656 1604955 1014272 1578375 2204946 1932518 1164225 1008245 1702943 2338845
41065 2338845 2149821 1467124 1124517 1375000 1821044 2159301 2486723 2853772 2926995 2328190
41055 2328190 1172279 81941 -357752 -111562 361009 655562 834249 1201925 1759357
41046 1759357 2113343 1989556 1594416 1287868 1078211 704984 145985 -246787 -162874 337035
41036 337035 995501 1673828 2338741 2851599 2994509 2760653 2478934 2508598 2826642 3054120
41026 3054120 2946702 2723810 2766880 3080729 3270148 3057686 2619530 2348801 2460178 2886937
41016 2886937 3379153 3622989 3463054 3115173 2969404 3097526 3211401 3222399 3483181 4213465
41006 4213465 5036947 5477556 5623285 5829766 6037921 6004358 6033645 6688023 7689405 7926762
40996 7926762 6904770 5498692 4776498 4647370 4308029 3586383 3054460 2970748 2872675
40987 2872675 2296419 1311509 216302 -785214 -1442715 -1473117 -956188 -354046 68093
40978 68093 480214 951701 1132846 846848 610590 1027272 1866729 2333525 2208691 2131109
40968 2131109 2602035 3251677 3423730 3107423 2879138 3132143 3759033 4467144 4992701
40959 4992701 5036958 4440600 3565406 3147117 3517608 4180671 4405559 4110917 3901853 4253193
40949 4253193 4873918 4975229 4112207 2706842 1705549 1703169 2477649 3435723 4296916
40940 4296916 5041631 5358454 4729577 3245966 1830379 1294332 1539953 2028459 2573439
40931 2573439 3132578 3241206 2453516 1204464 448229 441930 643350 838060 1459384 2528162
40921 2528162 3190446 2841895 1985758 1389968 1065244 757348 789330 1496852 2272905 2195535
40911 2195535 1417650 966540 1230674 1615023 1749781 2009724 2530312 2668496 2009633
40902 2009633 1209309 1190872 1949965 2699212 2836173 2280884 1218930 75776 -490912
40893 -490912 -147877 620637 978365 620487 -123561 -888826 -1549736 -1992902 -2061818 -1759692
40883 -1759692 -1186284 -293369 956965 2200700 2834178 2693135 2277953 2151429 2317754
40874 2317754 2328013 1836238 927807 11579 -520372 -611502 -583269 -796810 -1256684 -1622465
40864 -1622465 -1585382 -1109713 -328372 598832 1440251 1877113 1734634 1243654 941702 1184998
40854 1184998 1733457 1929005 1407985 566871 116711 193186 224624 -178890 -554665 -164515
40844 -164515 950671 1939269 2151454 1777024 1385525 1213160 1119632 982303 870835 944463
40834 944463 1308847 1821157 1968475 1258011 -46248 -917132 -705565 -37963 -18194 -658733
40824 -658733 -838187 19478 1006671 1001268 265003 -32850 420766 746533 355841 -156998
40814 -156998 -18518 534200 675336 186471 -366584 -436239 9149 616850 886901 515293
40804 515293 -96704 -1778 1099687 2177478 2085725 1160086 705933 1063581 1303628 974024
40794 974024 916549 1793680 2877138 3141573 2755725 2536960 2530793 2174822 1495665 1079312
40784 1079312 1002553 780413 363387 279549 708656 1250966 1729467 2389987 3122789 3349312
40774 3349312 3039206 3066180 4064572 5542659 6627633 7155728 7487122 7702552 7610904
40765 7610904 7284618 7007171 6809122 6507841 6122744 5886332 5916116 6158313 6545689 6950102
40755 6950102 7110197 6872911 6406834 5974680 5646589 5443996 5579753 6296304 7580306
40746 7580306 9207694 10896148 12266259 12928179 12857549 12468161 12099698 11676366 11032527
40737 11032527 10195225 9117169 7639973 6114508 5477142 6058835 6802175 6496413 5450332
40728 5450332 4968048 5351979 5557440 4912509 3996302 3430131 2939794 2287982 2107633
40719 2107633 2833226 3575090 3232289 2273017 2137710 2990745 3362497 2306377 779538
40710 779538 292362 1029392 2022050 2569674 2678378 2458915 1958630 1555619 1807950 2762658
40700 2762658 3886036 4761150 5401884 5811442 5787264 5414395 5244153 5557634 5805428
40691 5805428 5290720 4228837 3596192 3930017 4747603 5264420 5278550 5124920 5062278 5022233
40681 5022233 4860343 4610021 4463914 4580929 4899190 5167772 5288594 5583585 6450474
40672 6450474 7667108 8354206 7907121 6788236 6073331 6260425 6817414 6928281 6396539
40663 6396539 5649774 5023594 4306966 3097769 1506908 285519 87227 694625 1216673
40654 1216673 1058947 441631 -76395 -223944 3451 586406 1326430 1740161 1593490
40645 1593490 1385557 1783692 2631964 3071318 2707100 2101426 1914276 2077347 2145893 2047263
40635 2047263 2057200 2283777 2556346 2681552 2548264 2171767 1865086 2089574 2841760 3507056
40625 3507056 3697935 3864588 4516230 5174698 4908387 3809199 3032381 3171509 3438429
40616 3438429 2872812 1642869 588018 79513 13155 431534 1312507 2016780 1842568
40607 1842568 1094655 777085 1138534 1344426 849060 303018 594867 1557119 2210558
40598 2210558 1972411 1123760 308101 6566 329252 911947 1122346 683346 -24315
40589 -24315 -504842 -749238 -1000442 -1207585 -1137374 -835371 -559386 -409486 -394645 -631767
40579 -631767 -1025705 -1011296 -203418 866976 1305436 1037722 767639 822077 810339 493336
40569 493336 187595 107108 66304 91704 547518 1298367 1523406 838458 -95527 -567898
40559 -567898 -686404 -695512 -265577 704763 1308659 734628 -293366 -295632 947570 2196492
40549 2196492 2472659 1976722 1291729 684035 367547 543848 877491 667719 -180338
40540 -180338 -977429 -1207079 -1008799 -597493 29781 617177 694130 382552 354062 653763
40530 653763 453876 -532167 -1301930 -963259 -117638 47239 -504372 -777745 -270146 560930
40520 560930 1202162 1592666 1710601 1385088 666035 -119004 -757764 -1229627 -1447203 -1332994
40510 -1332994 -1077268 -903481 -677795 -191614 288030 264831 -231006 -624180 -523952 -20220
40500 -20220 705269 1539841 2173435 2193235 1600018 861889 381059 255448 544050 1286936
40490 1286936 2186318 2736964 2807702 2696324 2545336 2186936 1673630 1399462 1443212 1312262
40480 1312262 691590 8464 -157471 115978 287809 86392 -347068 -794633 -1016312
40471 -1016312 -689502 201814 1002496 914219 -30075 -881174 -775286 213741 1250240
40462 1250240 1501878 700013 -743697 -2009702 -2449836 -2065934 -1352920 -671524 19768
40453 19768 775911 1346041 1513844 1548747 1939202 2701894 3308671 3372691 3065600 2689781
40443 2689781 2190187 1415550 583089 9969 -479388 -1301322 -2211636 -2276372 -1076978
40434 -1076978 514070 1220609 760848 -61305 -432689 -221506 255936 601819 434496
40425 434496 -381490 -1418375 -1926557 -1566391 -686640 186292 855673 1355741 1649096
40416 1649096 1635632 1322590 862127 516359 576857 1094106 1636136 1570141 729922 -345344
40406 -345344 -928911 -742679 -71013 560763 790521 725391 899806 1702154 2781941 3283421
40396 3283421 2787384 1804065 1211993 1404528 2085863 2671368 2736659 2282475 1749379 1642249
40386 1642249 2002154 2365963 2327856 1962873 1581979 1264606 833939 220187 -300701 -257698
40376 -257698 576703 1809713 2600348 2424896 1597322 780212 116073 -730384 -1721329
40367 -1721329 -2221837 -1828149 -945336 -264815 -56408 -233802 -680892 -1141359 -1178694 -723249
40357 -723249 -397020 -818299 -1750600 -2375271 -2276375 -1740680 -1195444 -789161 -500475 -265465
40347 -265465 34798 404577 543986 122143 -727650 -1425077 -1497795 -973441 -253668 267426
40337 267426 537579 912048 1742422 2803243 3391058 3174334 2624920 2330964 2237316 1968752
40327 1968752 1565766 1349455 1276903 1039006 702476 653304 909545 1068751 1006726 1099343
40317 1099343 1634160 2449469 3224665 3668847 3398781 2223094 723217 -10532 480890
40308 480890 1554764 2341978 2643165 2727353 2757019 2803506 3031463 3419572 3547403 3043540
40298 3043540 2072263 1099108 383365 -53878 -224704 -224838 -237144 -203013 226741 1086527
40288 1086527 1745392 1596930 888540 410288 517598 951454 1526163 2405666 3563016
40279 3563016 4442813 4459459 3623719 2495235 1674218 1461157 1819011 2431852 2830176
40270 2830176 2661007 1973313 1230725 939910 1187956 1590796 1755524 1684836 1603705 1567244
40260 1567244 1536258 1716889 2371853 3240717 3613683 3178742 2405077 1868157 1596134 1354683
40250 1354683 1140814 989654 666657 46418 -469441 -410769 86630 526594 740717 822958
40240 822958 643848 99201 -307586 105047 1151645 1881094 1838678 1527616 1437967 1366527
40230 1366527 1048002 768253 854939 1105255 1235592 1422352 1858975 2234466 2270404 2354537
40220 2354537 2887342 3310588 2697928 1259854 330671 632278 1363243 1434554 935752
40211 935752 746094 1102511 1298313 780829 -49930 -389857 -89438 137567 -430696 -1626987
40201 -1626987 -2505960 -2364696 -1489470 -765193 -707510 -1106482 -1476161 -1500372 -1091736 -432852
40191 -432852 2798 -79653 -223774 329486 1412933 1825090 942029 -194585 -189003 746286
40181 746286 1143045 428183 -424170 -586592 -555989 -1017177 -1505870 -1174177 -284011 165333
40171 165333 63401 355757 1495157 2665407 2859120 2006140 699449 -514723 -1127926
40162 -1127926 -615969 884841 2204428 2202488 1139044 358608 582188 1126536 1015687
40153 1015687 301007 -168925 34390 489601 689140 726752 978487 1419351 1658248 1581525
40143 1581525 1560060 1894238 2379233 2653202 2713801 2758544 2694826 2232450 1423149 684192
40133 684192 224179 -161434 -614031 -933086 -960473 -864014 -784472 -551270 -66995 340097
40123 340097 329198 59614 -116691 -244770 -569335 -920607 -872967 -492845 -341864 -612325
40113 -612325 -795448 -436084 257817 862540 1358657 1872912 2123221 1674665 664403
40104 664403 -221178 -535392 -413397 -32457 788211 2105321 3300428 3545788 2809551
40095 2809551 1926061 1505605 1201614 408562 -649929 -1099522 -604704 244004 908682
40086 908682 1669334 2947965 4272147 4573656 3492189 1866459 809342 651443 931137
40077 931137 1124628 1159189 1305404 1694221 1988111 1671823 763107 -16974 -68713 319243
40067 319243 456025 315547 499099 1139000 1568607 1349229 954399 961122 1109254 796737
40057 796737 147050 -128337 213539 691818 878516 808900 556956 28711 -606785 -823304
40047 -823304 -401005 214894 535846 649060 857581 1031119 777848 82867 -663910 -1165324
40037 -1165324 -1327114 -992885 -101418 869147 1182508 777445 431397 693004 1115969
40028 1115969 1004710 523082 399219 689366 587344 -391818 -1689244 -2488829 -2693040
40019 -2693040 -2645840 -2307043 -1383441 -168220 458504 114952 -449807 -174371 1064608
40010 1064608 2343094 2765832 2368011 1889132 1890512 2315033 2833161 3290335 3616365 3530401
40000 3530401 2749615 1520500 574195 402405 861898 1600860 2450556 3134424 3088396
39991 3088396 2120609 935100 362690 260771 -126766 -834760 -1056393 -455637 311885
39982 311885 735680 1205112 2004369 2361212 1456672 -82048 -763345 -187636 572902
39973 572902 648605 469341 820410 1608798 2183955 2380373 2548893 2745266 2512237 1551807
39963 1551807 230769 -742066 -983175 -697876 -363535 -222464 -127171 108334 366528
39954 366528 451424 547733 1069809 1976628 2643434 2654556 2385134 2463689 2930934 3343156
39944 3343156 3507204 3598244 3601157 3204306 2425329 1880571 2096944 2800261 3191752 2813103
39934 2813103 1928548 1172919 1022758 1506855 2224159 2689227 2793410 2832234 2961485 2830373
39924 2830373 2023860 734551 -348378 -789483 -714746 -373527 197928 929931 1519162
39915 1519162 1772936 1910290 2185426 2354990 1902691 822195 -147267 -254144 422661
39906 422661 1036421 876024 72457 -697241 -1098786 -1422935 -1868780 -1968429 -1241493 -220521
39896 -220521 -63914 -970164 -1722520 -1292247 -270293 15482 -633333 -1220894 -1196690 -1129501
39886 -1129501 -1514320 -1840764 -1448040 -705484 -597111 -1338175 -2039127 -1796938 -702699
39877 -702699 382969 824960 789634 841901 1120566 1152485 586359 -174228 -415254 -14605
39867 -14605 554298 1016339 1488194 1818659 1455609 349910 -583337 -471864 363109 796642
39857 796642 271065 -684022 -1210220 -991235 -369797 101314 160127 -4376 -90871 -86862
39847 -86862 -81959 180069 986715 1826000 1628027 232169 -1093697 -1218259 -641717 -668298
39837 -668298 -1551466 -2335860 -2246271 -1335741 57439 1561067 2540730 2556584 2121565 2176211
39827 2176211 2783042 3222556 3366227 3821476 4502604 4328181 2939910 1597425 1514930
39818 1514930 2211483 2462691 2118808 1870919 1783554 1323644 626609 507973 1119838 1624889
39808 1624889 1462090 1096729 1169957 1561475 1678766 1224550 382582 -412101 -717187 -459272
39798 -459272 -180369 -502409 -1233340 -1460958 -700851 507999 1351825 1604940 1482051
39789 1482051 1143142 774205 757545 1237996 1745035 1710733 1189927 639450 192766 -307779
39779 -307779 -686557 -494779 218483 793398 840518 712450 797614 865183 594309 337242
39769 337242 686363 1454655 1799014 1424401 1011540 1195874 1668663 1675260 992473 -37154
39759 -37154 -1128211 -2170555 -2866265 -2800934 -1964399 -848335 48882 562462 728515
39750 728515 636878 467193 389543 353922 184475 -110264 -330048 -328009 -15816 732839
39740 732839 1778236 2417515 1955278 648830 -468508 -864532 -1015928 -1359979 -1393101
39731 -1393101 -410113 1258473 2443761 2493991 1914156 1639434 2055382 2779149 3131337
39722 3131337 2774110 2027527 1516062 1428737 1311551 712569 -233308 -1063464 -1541202 -1680602
39712 -1680602 -1506177 -1124670 -793308 -576001 -178964 519208 1066284 996599 511985 122747
39702 122747 -85847 -240705 -54320 780112 1703941 1718095 801659 40435 81081 286793
39692 286793 -146877 -993177 -1493888 -1445142 -1104922 -489427 459042 1276080 1369471 982665
39682 982665 1027043 1802748 2503021 2264548 1228011 211840 -285418 -326418 -54219 453124
39672 453124 852245 633430 -174259 -811075 -710069 -312615 -410355 -851498 -669941 359206
39662 359206 1119744 630845 -514455 -922052 -192522 886846 1698510 2387458 3063105
39653 3063105 3343864 3020263 2470754 2069431 1763529 1542206 1695648 2190401 2351297
39644 2351297 1668147 496377 -475524 -1011232 -1144385 -736246 171084 964785 1104852
39635 1104852 895251 982106 1330163 1376851 1028390 783747 916872 1193744 1396884 1522502
39625 1522502 1476404 1198216 1058762 1438206 1904622 1619690 688270 209816 660827 1133817
39615 1133817 746517 -27677 -233469 35591 -9487 -367519 -255000 429601 742563 111007
39605 111007 -769787 -966149 -575354 -332170 -362554 -27705 1094143 2627596 3842597
39596 3842597 4281692 3903018 2981764 2042870 1652569 2049208 2972985 3856806 4157404
39587 4157404 3670940 2770508 2245244 2562831 3251851 3344474 2529238 1529609 1186091 1522989
39577 1522989 1976677 2200257 2274357 2383044 2680501 3254963 3804195 3617722 2469119
39568 2469119 1329309 1427580 2592038 3350061 2894625 2097665 2107193 2750983 3103039 3042812
39558 3042812 3259482 3924387 4329660 3937022 3001855 1971269 967310 155592 -32795
39549 -32795 466471 950666 746556 189009 276186 1381217 2745516 3361045 3044506 2439355
39539 2439355 2128414 2026675 1718994 1195320 982397 1505611 2556715 3564256 4216185
39530 4216185 4567735 4650317 4315480 3528058 2569753 1839384 1561137 1683687 1906806 1833493
39520 1833493 1306212 595182 53581 -365650 -954015 -1625868 -1865946 -1455304 -874776
39511 -874776 -702008 -878115 -906676 -603855 -284039 -247105 -397970 -418812 -110856 454103
39501 454103 936177 872866 40364 -1229585 -2215087 -2376955 -1729727 -671258 403479
39492 403479 1263630 1779774 1886388 1623733 1129746 560560 59535 -192169 17386 757970
39482 757970 1751392 2420869 2297415 1476950 627630 390864 686715 717122 -164591 -1605354
39472 -1605354 -2501090 -2193746 -1199835 -555727 -666708 -1145551 -1616109 -2122484 -2643727
39463 -2643727 -2765061 -2224745 -1470041 -1231233 -1649730 -2145599 -2081223 -1328984 -301060
39454 -301060 344329 150743 -720319 -1583861 -1893410 -1655676 -1092113 -274921 593931 965788
39444 965788 549342 -132060 -357941 -179313 -170549 -432691 -588450 -641947 -962910 -1362763
39434 -1362763 -1117579 -156124 676837 922489 1179120 1925760 2540015 2284592 1612403
39425 1612403 1565488 2276313 2954657 3111388 2942277 2635881 2137853 1617580 1430170 1498649
39415 1498649 1326544 741357 135916 -104051 24183 354800 712572 871922 790380 835556
39405 835556 1330092 1965552 2183972 2023809 1963156 2006681 1678920 971456 498086 522251
39395 522251 617698 575973 828124 1499030 1811259 1104942 -100087 -768125 -684653 -452962
39385 -452962 -465059 -585137 -682033 -772571 -656492 -38634 879749 1425240 1219477 565032
39375 565032 -56283 -563535 -1200017 -2063672 -2842817 -2981310 -2159470 -711038 523467
39366 523467 884698 388076 -453924 -1054861 -962462 -89755 953244 1133843 81479
39357 81479 -1285349 -1671012 -855176 153437 337134 -327592 -1030373 -950367 34599 1184039
39347 1184039 1543340 997194 433529 534277 782616 250948 -942227 -1764818 -1759501 -1535868
39337 -1535868 -1663770 -1900231 -1787526 -1283382 -454248 763492 2066613 2682905 2282735
39328 2282735 1494551 1051811 943007 878839 987429 1368714 1482232 807308 -215017
39319 -215017 -720226 -669417 -732071 -1083687 -1219792 -965397 -770275 -836301 -784253 -483102
39309 -483102 -479157 -1200710 -2287300 -3058767 -3180572 -2621810 -1518671 -385071 123584
39300 123584 22641 -2033 223902 -96089 -1397830 -2672712 -2629393 -1492553 -632553
39291 -632553 -629417 -771347 -467896 -40490 193975 594126 1356201 1801810 1262577 173687
39281 173687 -464984 -390685 -110684 133406 618626 1362586 1884861 1971372 2009926 2198718
39271 2198718 1992579 883696 -640264 -1569098 -1674918 -1701857 -2163756 -2543130 -2013797
39262 -2013797 -571268 969780 1909427 2199273 2128130 1871968 1454945 906528 320063
39253 320063 -152557 -353805 -283134 -166714 -202559 -293281 -252211 -211142 -489679 -1022537
39243 -1022537 -1302774 -1085806 -825376 -1113465 -1883519 -2465578 -2331507 -1558496 -661304
39234 -661304 -190796 -398097 -1044406 -1567247 -1608281 -1335021 -1134633 -1146791 -1277189 -1465163
39224 -1465163 -1623588 -1450648 -708699 282003 787413 452905 -245383 -471375 141232
39215 141232 1165194 1801133 1634378 1039142 757298 1023038 1292190 967468 130688
39206 130688 -693330 -1221631 -1476875 -1394378 -868406 -99525 591048 1228707 1946527 2348308
39196 2348308 1800662 500425 -446188 -352130 227494 437572 374155 800822 1917574
39187 1917574 3038815 3444330 3072979 2335665 1607504 1026422 601317 390578 533064
39178 533064 1016118 1467471 1434213 927829 426984 259626 285056 288795 326942 502348
39168 502348 762257 1123880 1713771 2332705 2397381 1654250 595617 -146680 -423710 -286063
39158 -286063 349847 1224892 1487846 697941 -278466 -205223 893348 1870732 2092140 2011085
39148 2011085 2075745 2015208 1517225 824620 239784 -352193 -1054132 -1568315 -1644931 -1478964
39138 -1478964 -1277293 -852841 -70918 673090 902857 741020 679941 819502 761389 236879
39128 236879 -489885 -902634 -739847 -169777 477849 1093336 1763983 2307955 2156155 1095332
39118 1095332 -101329 -406365 114955 362328 -257325 -1056498 -1143499 -557890 180288
39109 180288 1014834 2115154 3104320 3331827 2775208 1997125 1304617 618866 138400
39100 138400 375609 1316676 2149347 2170863 1570989 1008850 746182 537568 136872 -455733
39090 -455733 -1132003 -1714931 -1883710 -1389436 -450816 310435 502957 361130 292505 200233
39080 200233 -355222 -1331004 -2042561 -2076359 -1897991 -2092765 -2373175 -1997783 -982914 -123075
39070 -123075 201224 408522 718731 652799 -2455 -535306 -338786 14222 -388495 -1269364
39060 -1269364 -1464067 -661491 126407 26757 -570557 -731622 -230790 382140 613710 478485
39050 478485 260840 157196 155557 126001 23243 -5724 207816 622227 1045032 1346906
39040 1346906 1456369 1264544 792339 362426 283377 387693 229958 -217503 -431158 -39718
39030 -39718 645578 1015521 865886 492443 227407 139023 177277 375042 729073 937417
$$ [...]
##END NTUPLES=NMR SPECTRUM
##END=
