##TITLE=31Pdec_DE-114rm_3h
, 64 sc
 2.10.2025
##JCAMPDX= 6.0         $$ Bruker NMR JCAMP-DX V2.0
##DATA TYPE= NMR SPECTRUM
##DATA CLASS= NTUPLES
##ORIGIN= UXNMR, Bruker Analytische Messtechnik GmbH
##OWNER= root
$$ XWIN-NMR		Version 3.5
$$ Thu Oct  2 14:28:12 2025 Russian Standard Time (UT+4h)  she@DPX200
##.OBSERVE FREQUENCY= 81.013821
##.OBSERVE NUCLEUS= ^31P
##.ACQUISITION MODE= SIMULTANEOUS
##.ACQUISITION SCHEME= undefined
##.AVERAGES= 64
##.DIGITISER RES= 17
##SPECTROMETER/DATA SYSTEM= spect
##.PULSE SEQUENCE= zgpg30
##.SOLVENT NAME= CDCl3
##.SHIFT REFERENCE= (INTERNAL, CDCl3, 0, 198.062)
##AUDIT TRAIL= $$ (NUMBER, WHEN, WHO, WHERE, WHAT)
$$ ##TITLE= Audit trail, XWIN-NMR		Version 3.5
$$ ##JCAMPDX= 5.01
$$ ##ORIGIN= Bruker BioSpin GmbH
$$ ##OWNER= she
$$ F:/spectra/data/she/nmr/P31/2/pdata/1/auditp.txt
$$ ##AUDIT TRAIL=  $$ (NUMBER, WHEN, WHO, WHERE, WHAT)
(   1,<2025-10-02 14:27:01.46 +0400>,<she>,<DPX200>,
      <created by zg, POWCHK disabled, PULCHK disabled
       configuration hash MD5:
       00 E9 B6 7A A2 85 ED C7 34 08 36 98 17 FE 4E 26
       data hash MD5: 32K
       2D 56 D9 99 30 D0 B5 A4 5B CD 12 46 98 F3 07 88>)
(   2,<2025-10-02 14:27:06.50 +0400>,<she>,<DPX200>,
      <Start of raw data processing
       efp BC_mod = 2 LB = 1.5 FT_mod = 6 PKNL = 1 PHC0 = 1694.362 PHC1 = 239.2999 SI = 64K 
       data hash MD5: 64K
       A9 BC E0 2B 53 8A 2A 9F CF 32 07 30 A0 8D 35 C1>)
(   3,<2025-10-02 14:27:28.20 +0400>,<she>,<DPX200>,
      <pk PHC0 = -470.0301 PHC1 = 341.0002 
       data hash MD5: 64K
       EC 88 6E DC 29 D8 3B 3E D9 B3 A1 97 2F F2 00 CE>)
(   4,<2025-10-02 14:27:35.25 +0400>,<she>,<DPX200>,
      <abs ABSG = 5 
       data hash MD5: 64K
       BF BD 0B 8E 73 AA EE 40 79 54 C0 D4 20 96 25 EC>)
$$ ##END=
$$ 
$$ hash MD5
$$ A2 32 26 B2 69 3E 96 0C 60 D4 A5 80 14 4A 06 DE
##$RELAX= 
##$RELAX= 
##$RELAX= 
##$RELAX= 
##$RELAX= 
##$RELAX= 
##$RELAX= 
##$RELAX= 
$$ Bruker specific parameters
$$ --------------------------
##$DU= <F:/spectra>
##$EXPNO= 2
##$NAME= <P31>
##$PROCNO= 1
##$TYPE= <nmr>
##$USER= <she>
##$AMP= (0..31)
100 100 100 100 100 100 100 100 100 100 100 100 100 100 100 100 100 100 
100 100 100 100 100 100 100 100 100 100 100 100 100 100 
##$AQSEQ= 0
##$AQ_mod= 1
##$AUNM= <au_zg>
##$AUTOPOS= <>
##$BF1= 81.014009
##$BF2= 200.13
##$BF3= 200.13
##$BF4= 200.13
##$BF5= 200.13
##$BF6= 200.13
##$BF7= 200.13
##$BF8= 200.13
##$BYTORDA= 1
##$CFDGTYP= 0
##$CFRGTYP= 5
##$CHEMSTR= <none>
##$CNST= (0..31)
1 1 145 1 1 1 1 1 1 1 1 1 1 1 1 1 1 1 1 1 1 1 1 1 1 1 1 1 1 1 1 1 
##$CPDPRG= <waltz16>
##$CPDPRG1= <>
##$CPDPRG2= <waltz16>
##$CPDPRG3= <>
##$CPDPRG4= <mlev>
##$CPDPRG5= <mlev>
##$CPDPRG6= <mlev>
##$CPDPRG7= <mlev>
##$CPDPRG8= <mlev>
##$CPDPRGB= <>
##$CPDPRGT= <>
##$D= (0..31)
0 1 0 0 0 0 0 0 0 0.06 0 0.03 2e-05 3e-06 0 0 0.0002 0 0 0 0 0 0 0 0 0 
0 0 0 0 0 0 
##$DATE= 1759400820
##$DBL= (0..7)
120 120 120 11 120 120 24 19 
##$DBP= (0..7)
150 150 150 150 150 150 150 150 
##$DBP07= 0
##$DBPNAM0= <>
##$DBPNAM1= <>
$$ [...]
##$SUBNAM3= <"">
##$SUBNAM4= <"">
##$SUBNAM5= <"">
##$SUBNAM6= <"">
##$SUBNAM7= <"">
##$SUBNAM8= <"">
##$SUBNAM9= <"">
##$SW= 400.765351723535
##$SWIBOX= (0..15)
0 1 3 0 0 0 0 0 0 0 0 0 0 0 0 0 
##$SW_h= 32467.5324675325
##$TD= 32768
##$TD0= 1
##$TE= 0
##$TE2= 300
##$TE3= 300
##$TEG= 300
##$TL= (0..7)
0 120 53 12 22 120 120 120 
##$TP= (0..7)
150 150 150 150 150 150 150 150 
##$TP07= 0
##$TPNAME0= <>
##$TPNAME1= <>
##$TPNAME2= <>
##$TPNAME3= <>
##$TPNAME4= <>
##$TPNAME5= <>
##$TPNAME6= <>
##$TPNAME7= <>
##$TPOAL= (0..7)
0.5 0.5 0.5 0.5 0.5 0.5 0.5 0.5 
##$TPOFFS= (0..7)
0 0 0 0 0 0 0 0 
##$TUNHIN= 0
##$TUNHOUT= 0
##$TUNXOUT= 0
##$USERA1= <user>
##$USERA2= <user>
##$USERA3= <user>
##$USERA4= <user>
##$USERA5= <user>
##$V9= 5
##$VALIST= <valist>
##$VCLIST= <CCCCCCCCCCCCCCC>
##$VD= 0
##$VDLIST= <DDDDDDDDDDDDDDD>
##$VPLIST= <PPPPPPPPPPPPPPP>
##$VTLIST= <TTTTTTTTTTTTTTT>
##$WBST= 1024
##$WBSW= 4
##$XGAIN= (0..3)
0 0 0 0 
##$XL= 0
##$YL= 0
##$YMAX_a= 47290
##$YMIN_a= -57610
##$ZGOPTNS= <>
##$ZL1= 120
##$ZL2= 120
##$ZL3= 120
##$ZL4= 120
##$ABSF1= 198.0616
##$ABSF2= -202.7028
##$ABSG= 5
##$ABSL= 3
##$ALPHA= 0
##$AQORDER= 0
##$ASSFAC= 0
##$ASSFACI= 0
##$ASSFACX= 0
##$ASSWID= 0
##$AUNMP= <proc_1d>
##$AZFE= 0.1
##$AZFW= 0.5
##$BCFW= 0
##$BC_mod= 2
##$BYTORDP= 0
##$COROFFS= 0
##$CY= -3
##$DATMOD= 1
##$DC= 0
##$DFILT= <>
##$DTYPP= 0
##$F1P= 0
##$F2P= 0
##$FCOR= 1
##$FTSIZE= 65536
##$FT_mod= 6
##$GAMMA= 0
##$GB= 0
##$INTBC= 1
##$INTSCL= 9.790993e-09
##$ISEN= 30
##$LB= 1.5
##$LEV0= 0
##$LPBIN= 0
##$MAXI= 10000
##$MC2= 0
##$MEAN= 0
##$ME_mod= 0
##$MI= 50
##$NCOEF= 0
##$NC_proc= -8
##$NLEV= 6
##$NOISF1= 182.463
##$NOISF2= 159.3651
##$NSP= 0
##$NTH_PI= 0
##$NZP= 0
##$OFFSET= 198.0616
##$PC= 4
##$PHC0= 1224.332
##$PHC1= 580.3001
##$PH_mod= 1
##$PKNL= yes
##$PPARMOD= 0
##$PSCAL= 0
##$PSIGN= 0
##$REVERSE= no
##$SF= 81.0140089999434
##$SI= 65536
##$SIGF1= 159.3651
##$SIGF2= -187.1042
##$SINO= 113.3802
##$SIOLD= 16384
##$SREGLST= <1H.CDCl3>
##$SSB= 0
##$STSI= 65536
##$STSR= 0
##$SW_p= 32467.5324675325
##$SYMM= 0
##$S_DEV= 0
##$TDeff= 32768
##$TDoff= 0
##$TI= <>
##$TILT= no
##$TM1= 0
##$TM2= 0
##$TOPLEV= 0
##$USERP1= <user>
##$USERP2= <user>
##$USERP3= <user>
##$USERP4= <user>
##$USERP5= <user>
##$WDW= 1
##$XDIM= 65536
##$YMAX_p= 283936453
##$YMIN_p= -21668844
$$ End of Bruker specific parameters
$$ ---------------------------------
##NTUPLES= NMR SPECTRUM
##VAR_NAME=  FREQUENCY,     SPECTRUM/REAL,   SPECTRUM/IMAG
##SYMBOL=    X,             R,               I
##VAR_TYPE=  INDEPENDENT,   DEPENDENT,       DEPENDENT
##VAR_FORM=  AFFN,          ASDF,            ASDF
##VAR_DIM=   65536,         65536,           65536
##UNITS=     HZ,            ARBITRARY UNITS, ARBITRARY UNITS
##FACTOR=    0.49542278885378, 1,            1
##FIRST=     16045.7642231865, 0,            0
##LAST=      -16421.768244346, 0,            0
##MIN=       -16421.768244346, -21668844,    0
##MAX=       16045.7642231865, 283936453,    0
$$ Real data points
##PAGE= N=1
##DATA TABLE= (X++(R..R)), XYDATA
$$ [...]
45775a414959r16569q06530o11096R3997O85573P43641M80283m5027p52610p50745
45765c294042O75838K285042J904806l26205j565259p6725K141908K037981k70591
45756C512753j853901j205496N015K2835j41751J302334L273395K678671r07656
45747F686199l870789l082477Q6101K004608J540431L99471k07547o00273p42240
45738B213484q2342N50301m02384k156567j967706M02953J487607q49930l768709
45729d573293l333554j25459J915966J158161j67205J87402J737623K815035K822693
45720B437369K125385J019282k92118j316978j551143j094927p43229j126835
45712e43194j562449m80237K044802L044429l0575m980395o492678k777558K124566
$$ plain form
45775 -1414959 -2331528 -3138058 -3749154 -3655157 -2969584 -2225943 -1745660 -1790687 -2543297 -3294042
45765 -3294042 -2618204 -333162 1571644 1245439 -319820 -396545 1745363 3783344 3512753
45756 3512753 1658852 453356 458371 481206 339455 1641789 4915184 7593855 6686199
45747 6686199 2815410 -267067 -180966 1823642 3364073 3763544 3555997 2955724 2213484
45738 2213484 2131142 2681443 2279059 122492 -1845214 -1442261 45346 -804584 -4573293
45729 -4573293 -7906847 -8032306 -6116340 -4958179 -5125384 -4937982 -3200359 -385324 2437369
45720 2437369 4562754 5582036 5289918 3972940 2421797 1326870 583641 -543194
45712 -543194 -2105643 -2585880 -541078 2503351 2472776 -2507619 -9000297 -11777855 -9653289
45703i653289L913524L102026K509883K389236J105010j035090j953387j166243
45695g88330k46438k22286o67880r89007p95688L52212J926007K230673R43902
45686A743165K64393J341819J537430j622097n453795n036849l09007L794059
45678c740882M114539K295798Q59983J12515l86258p12590j633237l580238m244876
45669f915246q65849M502839O100769K125800k646582l621395j933713j017908
45661d271285j214660p34226O22446J583120J535044N57404r29898j305702R76655
45652c181102M001526L492385q65396l761842j571092K160592K024574j435391
45644H64254l369057j978234J35397Q57686P21963N22006J60566r9443K13239
$$ plain form
45703 -9653289 -5739765 -2637739 -127856 2261380 3366390 2331300 377913 -788330
45695 -788330 -1034768 -1257054 -1924934 -2913941 -3709629 -3357417 -1431410 799263 1743165
45686 1743165 2007558 3349377 4886807 3264710 -2189085 -7225934 -7534941 -3740882
45678 -3740882 373657 2669455 3529438 3641953 3255695 2543105 909868 -2670370 -6915246
45669 -6915246 -7781095 -3278256 2822513 4948313 2301731 -1319664 -3253377 -4271285
45661 -4271285 -5485945 -6220171 -5597725 -4014605 -2479561 -1922157 -2852055 -4157757 -3181102
45652 -3181102 820424 4312809 3447413 -314429 -1885521 275071 2299645 864254
45644 864254 -2504803 -4483037 -4347640 -3489954 -2767991 -2245985 -2085419 -2184862 -1971623
45635a971623N94916N55226J008693K634791L953258L272114J385200P3517o82319
45626A0823773j566611j690352m13178K37099j579779l541862j913450K401470
45618B757110M477038K055827j888280l603004k526854m34054P53998L3904j642313
45609a6628j666110Q39735K958805J884119n55789o86642J058297J221009m75457
45600D561339q27692R24747J785911L93582r24245p15950o55931j689775k040647
45591H11339q28141J08621k79052o12632n34553j757815l798055l000282J565541
45582h325029N353834M608623J643734M83372Q08098J69266q83751l37016Q44028
45573D365159J74086j910764k951202k562002k109973j624913n45989j66566j556118
$$ plain form
45635 -1971623 -1376707 -821481 187212 2822003 6775261 10047375 11432575 11506092 10823773
45626 10823773 9257162 7566810 7153632 7390731 5810952 2269090 355640 2757110
45618 2757110 7234148 9289975 7401695 3798691 1271837 837783 1591781 1625685 -16628
45609 -16628 -1682738 -843003 2115802 3999921 3444132 2757490 3815787 5036796 4561339
45600 4561339 3733647 4658394 6444305 6837887 5913642 5197692 4541761 2851986 811339
45591 811339 -16802 91819 -187233 -799865 -1334418 -3092233 -6890288 -9890570 -8325029
45582 -8325029 -2971195 1637428 3281162 3764534 4572632 4741898 3858147 3521131 4365159
45573 4365159 4539245 2628481 -322721 -2884723 -4994696 -6619609 -7165598 -7332164 -8888282
45564h888282k271869O64736N175410N892317J676235k711887l182663q45929
45556d491932J240957K458093L711773M453403L011280p62029m567325n424335
45548c70115k300897K589917N421842M349981J077210j624503k870225l230633
45540C042577k780734j318317L09488Q35376J82482o43436o69962O56170K891777
45531B505421L795008J205871l211969m804790k214631L13416n24483j743761
45523d679918P90537M989497N514602K125539o63359j212069j981131l262432
45515A621266k081919J404677K472646q52987m241909l650981q93832M89075P29785
45506e004179J630196K484311K120498K080957L730485M581788J704932k910004
$$ plain form
45564 -8888282 -11160151 -10495415 -5320005 572312 2248547 -463340 -3646003 -4491932
45556 -4491932 -3250975 -792882 2918891 7372294 10383574 9621545 5054220 -370115
45548 -370115 -2671012 -81095 5340747 9690728 10767938 9143435 6273210 3042577
45540 3042577 261843 -1056474 -746986 88390 270872 -372564 -1042526 -386356 2505421
45531 2505421 6300429 7506300 4294331 -510459 -2725090 -2411674 -2936157 -4679918
45523 -4679918 -3889381 1100116 6614718 8740257 8076898 6864829 4883698 1621266
45515 1621266 -460653 944024 3416670 2563683 -1678226 -5329207 -6223039 -5733964 -5004179
45506 -5004179 -3373983 -889672 1230826 3311783 7042268 11624056 13328988 10418984
45498A0418984m604168k661834o82905p80571j220907j86571J364596J589311
45490C235935L11448j227478j831685j147352R2730P30966P75695J532794L253807
45481E726860M005413K385059q0574j272603j792650l245437m283761j872388
45473d30081L381634O603425M607879j29008l073485l171111k801113l525969
45465A462171m182999l091717m06736K340909M099142M847850M583963K764097
45457A2416680n81215l703967m320954k217303L60326J434175J363920J369231
45449F120893J153405m13996k704945l198205m47916L785349N968164M105536
45441A4368285m02404l928038l880076j241144M29785j003602l680752l922970
$$ plain form
45498 10418984 5814816 3152982 2470077 1689506 468599 282028 1646624 3235935
45490 3235935 3547383 2319905 488220 -659132 -566402 164564 940259 2473053 5726860
45481 5726860 9732273 12117332 12036758 10764155 8971505 5726068 1442307 -430081
45473 -430081 2951553 9554978 14162857 14033849 10960364 7789253 4988140 1462171
45465 1462171 -2720828 -5812545 -6219281 -3878372 220770 5068620 9652583 12416680
45457 12416680 11835465 8131498 3810544 1593241 1953567 3387742 4751662 6120893
45449 6120893 7274298 6860302 4155357 957152 509236 4294585 10262749 14368285
45441 14368285 13965881 10037843 6157767 4916623 5346408 4342806 662054 -3260916
45433c260916p26669K905676L409060P30334j741889j291195Q60454J316350o65189
45424A536016j821979N00892M015162M218534P99372j762854n01354K173870K358909
45415A1516568k00465k824673l654331k531790N8621K666490L138081J504581
45407I673082Q33767K635139L575978L60458m073403m100408l00670Q79010k873801
45398F609152n887493l223721J875112L334009J254829N54675K679753L939276
45390A1135592J870847j256871k294404j271247k57024l95524j259210j693501
45382D578658p04664J219256J756019m86450l119012k470937Q93363K384639J28438
45373D179310k119724j014186J013977J31286k016947q84748K905353L933387
$$ plain form
45433 -3260916 -3987585 -1081909 2327151 3057485 1315596 24401 884855 2201205 1536016
45424 1536016 -285963 214929 4230091 8448625 9247997 7485143 6983789 9157659 11516568
45415 11516568 11316103 8491430 4837099 2305309 2363930 5030420 8168501 9673082
45407 9673082 10506849 13141988 16717966 17078424 13005021 8904613 8603943 9482953 6609152
45398 6609152 721659 -2502062 -626950 2707059 3961888 4516563 7196316 11135592
45390 11135592 13006439 11749568 9455164 8183917 7926893 7531369 6272159 4578658
45382 4578658 3873994 5093250 6849269 6362819 3243807 772870 1666233 4050872 4179310
45373 4179310 2059586 1045400 2059377 2190663 173716 -711032 2194321 6127708
45365F127708Q19976j256746R90151L541675J854669j621717j845962K73349j40427
45356H742676l153683l796157o29448J778247M20004j757758j484756k25464l96578
45347e02917p70980M98604J651798L04481j857569j573492O66670J865546J573439
45338A855580J574898J701489K92404j746070j653775M15441J379706K51182p60552
45329C310303o77463j267398l065413l707617j865342M37818J179242J061080
45321d594790J131906N55764j170639k258740j109182J185528K710733L248938
45313c00482L274308K485723J133243P28387J516939J369116p13050k237888r59324
45304F296972J112554N47253k219634l792331l001849j734819j022708J97432
$$ plain form
45365 6127708 6947684 5690938 6681089 10222764 12077433 10455716 8609754 8883103 8742676
45356 8742676 5588993 1792836 1163388 2941635 3361639 1603881 119125 -106339 -502917
45347 -502917 -1273897 -775293 876505 1180986 -676583 -2250075 -1583405 282141 1855580
45338 1855580 3430478 5131967 5424371 3678301 2024526 2439967 3819673 4070855 3310303
45329 3310303 2632840 1365442 -1699971 -5407588 -7272930 -6835112 -5655870 -4594790
45321 -4594790 -3462884 -2907120 -4077759 -6336499 -7445681 -6260153 -3549420 -300482
45313 -300482 2973826 5459549 6592792 7321179 8838118 10207234 9494184 7256296 6296972
45304 6296972 7409526 7956779 5737145 1944814 -1057035 -2791854 -3814562 -3617130
45296c617130K088466K837669J578527j1274k09722L89345J34594j248203k434850
45287d92578k136914n28673P31225K51837r89785m27192K289363L885036J804823
45278D387142j502733j584385J433026K768194r2074l881377m440392k140789
45270e053388j52328N04053J288856K560441K589186M74615j990721k303162j74339
45261b256787K207207K482464L74774k166741k925060j555369K63980P64703j07794
45252b918623r17484m56692J014881K144541J897918N31883p89163j145836m59944
45243a098519P42821J609834J236673l97524j729188j020472J172147K266126
45235B781898J070531n36712m62702O04257P54613R6144J80619R93648J021881
$$ plain form
45296 -3617130 -1528664 1309005 2887532 2876258 2666536 3055881 3190475 1942272 -492578
45287 -492578 -2629492 -3158165 -2426940 -2175103 -3164888 -3592080 -1302717 2582319 4387142
45278 4387142 2884409 1300024 2733050 5501244 5409170 1527793 -2912599 -5053388
45270 -5053388 -5205716 -4701663 -3412807 -852366 1736820 2211435 220714 -2082448 -2256787
45261 -2256787 -49580 2432884 2807658 640917 -2284143 -3839512 -3575532 -2810829 -2918623
45252 -2918623 -3836107 -4292799 -3277918 -1133377 764541 1296424 507261 -638575 -1098519
45243 -1098519 -355698 1254136 2490809 2093285 364097 -656375 515772 2781898
45235 2781898 3852429 3315717 2853015 3457272 4211885 4308029 4488648 5482296 6504177
45226F504177O3211n47808o07307j314809k358640j468284J843821M482455L579189
45217A0176005L89541j629508j433316r50559j635746k575086k238706n95058
45209d92433J122202J952020J922389J453390M86023j368040l642694m631638
45201c198781l063355J31425K734655L694146L503535K512887O73278r28822m15210
45192E643758K148989M140373L555621J293852o85515j792301k226516j786163
45184A0292098q57977r93357k659466l779303k391128N24860K756068L887212
45176F779007M383223L311333J8115l110102l082298r36851l04361j600824j763463
45167C693779j25704J28146k067606k946026n2340L079519K414245J81355J062407
$$ plain form
45226 6504177 6567388 6019580 5412273 4097464 1738824 270540 2114361 6596816 10176005
45217 10176005 10565546 8936038 7502722 6552163 4916417 2341331 102625 -492433
45209 -492433 629769 2581789 4504178 5957568 6443591 5075551 1432857 -3198781
45201 -3198781 -6262136 -6130711 -3396056 298090 3801625 6314512 6987790 6058968 5643758
45192 5643758 7792747 11933120 15488741 16782593 16097078 14304777 12078261 10292098
45184 10292098 9434121 8440764 5781298 2001995 -389133 135727 2891795 6779007
45176 6779007 11162230 14473563 14491678 11381576 8299278 7362427 7058066 5457242 3693779
45167 3693779 3568075 3696221 1628615 -1317411 -1369751 1709768 4124013 4305368 5367775
45158E367775L833462K886292k184515m709433n43800N581552O609108K428473
45150A9268914j328060j526837l51704n86568j904613k442956j386006P91339
45142A0533509K697457K239186j395225n383047n298275p51343L244845K417200
45134H304307j223951k557510o32711O31188j166044l430971k784987J55392K400491
45125c04796L027603L352998L658992K590832L0173j746859q02739J908229L737367
45116A5451800L348897J668304K23816o01110j423206k378648k543691j418199
45108A2327963m26836j456878l682623l765709m28998L023921K880096K64026
45100H734962o65282J038944K201989J068415o0990Q40630K031981J225942m69932
$$ plain form
45158 5367775 9201237 12087529 9903014 5193581 4649781 10231333 16840441 19268914
45150 19268914 17940854 16414017 16062313 15475745 13571132 11128176 9742170 10533509
45142 10533509 13230966 15470152 14074927 8691880 3393605 2642262 5887107 8304307
45134 8304307 7080356 4522846 3890135 4521323 3355279 -75692 -2860679 -2705287 -304796
45125 -304796 2722807 6075805 9734797 12325629 12355802 10608943 9806204 11714433 15451800
45116 15451800 18800697 20469001 20692817 20091707 18668501 16289853 13746162 12327963
45108 12327963 11901127 10444249 6761626 2995917 2566919 5590840 8470936 8734962
45100 8734962 8069680 9108624 11310613 12379028 12318038 13158668 15190649 16416591 15946659
45091A5946659p34779m4777l16204j057613k55732J775864K736795K053316J091133
45082B1194662O6033j830576l359339k147685P75305J350191j328891l139895
45074A1579805j233114J599095J668796Q3295L1446J085955N54224j123066r07219
45065A3339217J405779K590829J177554n70679p09214l14722r30454k118453k886180
45056A0983677l175997k718636p08662K071864L066336J426334l75847j13667
45048A0455402R41405L14425j758469k957242k317233q52028N36570J685705K105348
45039H153883J244940j54114n05816O64944K262738L038929K581911J191537k84982
45030A8193970p78295n1241Q29313P47760k00388j268226k029900k029773n84327
$$ plain form
45091 15946659 15211880 15167103 14850899 13793286 13537554 15313418 18050213 20103529 21194662
45082 21194662 21260695 19430119 16070780 13923095 14698400 16048591 14719700 11579805
45074 11579805 10346691 11945786 13614582 13697877 13729323 14815278 15369502 14246436 13339217
45065 13339217 14744996 17335825 18513379 17942700 17233486 16918764 15988310 13869857 10983677
45056 10983677 7807680 5089044 4380382 6452246 9518582 10944916 10569069 10455402
45048 10455402 11396807 11711232 9952763 6995521 4678288 3826260 4362830 6048535 8153883
45039 8153883 9398823 9244709 8738893 9403837 11666575 14705504 17287415 18478952 18193970
45030 18193970 17415675 17364434 18193747 18941507 18741119 17472893 15442993 13413220 12828893
45021A2828893J846308L113359J728043r92686k614796k626855k128689j339552
45013I814025L65724K228243K272700J88058j741859j312556J050822K774315
45005A5639472J520281k553298o115470n227442k5531M329544L500810l50679
44997A0717687j606052R09691K847385J360429r85169r51132M12499J90049j674189
44988A1221198k992419k927049k228281j084808P39990K404402K796502K287785
44980A0217320J948805J735333J049823K10433k76666r15951k010356k423227
44972I535514j463741p12367j625313k538371r36338K101153K996481J061339
44964H418357n57474J96742J635543J664951Q61415O21053O23288k0501q84121
$$ plain form
45021 12828893 14675201 17788560 19516603 18523917 15909121 13282266 11153577 9814025
45013 9814025 10179749 12407992 14680692 14868750 13126891 11814335 12865157 15639472
45005 15639472 17159753 14606455 8490985 3263543 3238012 7567556 11068366 10717687
44997 10717687 9111635 10021326 12868711 14229140 13243971 12292839 12705338 12895387 11221198
44988 11221198 8228779 5301730 3073449 1988641 2728631 5133033 7929535 10217320
44980 10217320 12166125 13901458 14951281 15161714 14885048 13969097 11958741 9535514
44972 9535514 8071773 7359406 5734093 3195722 2259384 4360537 7357018 8418357
44964 8418357 7860883 8057625 9693168 11358119 12219534 12840587 13463875 13443374 12559253
44955A2559253j206047j248040j171488j63900J633694J985654m84261l508465
44947H396400l847982j860946n73203n78622P18241L926094N211309J608587l492824
44938I507054l847840J133254N125320L294710j331757k541243L27896K202622
44930A3870016K08069k531623k309649k90159J97286q13413o42232J094119J914872
44921A0697286P07572p01602p01020J21437Q40052J486501J582659p0329k760692
44912A1201864l384242n43656K667040K255803j322720l627969j720775K578326
44904H103671N027357L429858l73335k424479p10883K499352L018155l78962m459811
44895A3730923n314502k420193J586974L761144K699288q36260l957277l767934
$$ plain form
44955 12559253 11353206 10105166 8933678 8769778 10403472 12389126 11904865 8396400
44947 8396400 4548418 2687472 2114269 1535647 2253888 6179982 11391291 12999878 9507054
44938 9507054 5659214 6792468 11917788 15212498 13880741 11339498 11667394 13870016
44930 13870016 14078085 11546462 9236813 8946654 9143940 8330527 7688295 8782414 10697286
44921 10697286 11404858 10703256 10002236 10123673 10963725 12450226 14032885 13962556 11201864
44912 11201864 7817622 7273966 9941006 12196809 10874089 7246120 5525345 8103671
44904 8103671 13131028 16560886 16187551 13763072 13052189 15551541 18569696 18190734 13730923
44895 13730923 8416421 5996228 7583202 11344346 14043634 13207374 9250097 5482163
44887E482163p36324J497343R50254K0617J494069L905777L815953J281235m84809
44878A7226278m01622p60529k713795l990714k497480M62842K231780K129291
44870A1686051J210383K41655n63983q63562m94729J70759P71899J074316M95038
44861A3727827j127809k315882j429703M52634N63515j073982j147408J558031
44853I207223L415846J179859k611098k869319Q81551M107457L456067J63100
44845A6930686k634915l129006j209976J766395L193484J485230j496509k373522
44837A2531867p18173P54462N52006J08864N08822N61514m92440j161986m51660
44828A2193276K4809j114732k184780j015592J254263J784275L90016n49515m4481
$$ plain form
44887 5482163 4745839 6243182 7193436 7214053 8708122 12613899 16429852 17711087 17226278
44878 17226278 16824656 16064127 13350332 9359618 6862138 7324980 9556760 11686051
44870 11686051 12896434 13138089 12574106 11710544 11215815 11386574 12158473 13232789 13727827
44861 13727827 12600018 10284136 8854433 9307067 9870582 8796600 7649192 9207223
44853 9207223 12623069 13802928 11191830 8322511 9204062 13311519 16767586 16930686
44845 16930686 14295771 11166765 9956789 11723184 14916668 16401898 14905389 12531867
44837 12531867 11813694 12568156 13120162 13229026 13737848 14299362 13806922 12644936 12193276
44828 12193276 12218085 11103353 8918573 7902981 9157244 10941519 11331535 10782020 10737539
44819A0737539M02155l01706j265070j383623p37247K24379J208670J419403K4748
44810A0329248k211290l279645k491707j319692j050178r43246L60805K571782
44802A966077L876382K961647M24754j605830j323422P75953K099618R63089j146345
44793H991923j612635m63873j40918j508300k407509j001741J450197K431025
44785E738169J275187p89815k422643k825282j862396o69877q77350k092547j690397
44776f216951J409308M395079M075223J413643K6547R48373J711388N62599j184434
44767G140775j677554j075079m58732M3083P50960J213132P17082n70173j799677
44758D283817k386232k269053j594289m93876R07679K140109K050841k07564l219726
$$ plain form
44819 10737539 11139694 10837988 9572918 8189295 7452048 7676427 8885097 10304500 10329248
44810 10329248 8117958 4838313 2346606 1026914 -23264 -966510 -605705 1966077
44802 1966077 5842459 8804106 9228860 7623030 6299608 7075561 9175179 10138268 8991923
44793 8991923 7379288 6915415 6774497 5266197 2858688 1856947 3307144 5738169
44785 5738169 7013356 6223541 3800898 975616 -886780 -1556657 -2434007 -4526554 -6216951
44776 -6216951 -4807643 -412564 3662659 5076302 5102849 6051222 7762610 8325209 7140775
44767 7140775 5463221 4388142 3929410 3972493 4723453 5936585 6653667 6083494 4283817
44758 4283817 1897585 -371468 -1965757 -2459633 -1551954 588155 2638996 2431432 -788294
44749g88294l744972p35350K296004J383542k065948k674561J371095N493427
44741E34943M865424N44467k689671k484997l98806J305495J682796O33139j159660
44732B833130j943763m63029K193206L746812L456923K261870P22918j324498
44724A1483569l262563l790957k788214j458665m32939O48910J488463R95762
44716B883366n73799j226488j5494J408029J316670N09330P07619J471798Q48943
44707G329974j270584k627071j837121l10622M2651m54902l13341K43017n11202
44698B90799k593562l346938r14636K663371L670556J502388q00345r28080J9545
44689d36902J87028P2302R43933J750502N04328j743064j508984J792204M051696
$$ plain form
44749 -788294 -4533266 -5268616 -2972612 -1589070 -3655018 -6329579 -4958484 534943
44741 534943 5400367 5944834 3255163 770166 371360 1676855 3359651 3992790 2833130
44732 2833130 889367 426338 2619544 6366356 9823279 12085149 12808067 11483569
44724 11483569 8221006 4430049 1641835 183170 -249769 399141 1887604 2883366
44716 2883366 2309567 1083079 1067585 2475614 3792284 4301614 5009233 6481031 7329974
44707 7329974 6059390 3432319 1595198 1284576 1327227 872325 558984 802001 290799
44698 290799 -2302763 -5649701 -6564337 -3900966 -230410 1271978 471633 -456447 -436902
44689 -436902 -249874 -177572 766361 2516863 3021191 1278127 -230857 1561347 5613043
44680E613043J824444k678208m437293k222749M38393O01359n85927m86799J179252
44671g54485K631037K791575K067121J002719k80149j407324j762638j364051
44663B923805q83326o68446m35872P6961Q87236K074317L361037L502846J449785
44654A2288343j618934k982271j871142p21902j656130l156585k216549J078482
44646h56688L447658K782473M52143j074953r38535L46332J921959K487412Q60726
44637I428527k190866m005953l029323o24815J002565J318564Q63102k23469j517962
44628A020370j593273J06469J729504J310136l11752r32111m94976p22362j687406
44619a575401j458353N90876K560199K783237J814496R59793N77325N32618P65841
$$ plain form
44680 5613043 7437487 4759279 321986 -1900763 -1462370 -861011 -1446938 -1933737 -754485
44671 -754485 1876552 4668127 6735248 7737967 7457818 6050494 4287856 2923805
44663 2923805 2040479 1372033 936161 1013122 1900358 3974675 7335712 10838558 12288343
44654 12288343 10669409 7687138 5815996 5094094 3437964 281379 -1935170 -856688
44646 -856688 2590970 5373443 5825586 4750633 3812098 4158430 6080389 8567801 9428527
44637 9428527 7237661 3231708 202385 -422430 580135 1898699 2761801 2538332 1020370
44628 1020370 -572903 -466434 1263070 2573206 2261454 1329343 834367 112005 -1575401
44619 -1575401 -3033754 -2442878 117321 2900558 4715054 5674847 6252172 6784790 7550631
44610G550631P94442J06913n86245j35601P84698K49114j662980k585834j648017
44601B867121q65514j388657j185356J297569L664909K753591m65715k402464
44593D275484k100127j569251j500217l47110K006497L193892K137868R50436
44585G047472J467612K271140J071588j739764l946125m632815m420769l413635
44577f295296j057001K043060L946386L502742J627013P3695m03440m19501r49135
44568B068523k126157k833339j602828J734067N385283O942980N455551K101777
44560A7125857r91537k435214k325036j647257j085020n64140o28P6439p13745
44551G439719j648936j730932j295907j519864k200739j576230J020694L818548
$$ plain form
44610 7550631 8345073 8451986 7865741 7730140 8514838 8763952 7100972 4515138 2867121
44601 2867121 2001607 612950 -572406 725163 4390072 7143663 6677948 4275484
44593 4275484 2175357 606106 -894111 -1241221 765276 3959168 6097036 7047472
44585 7047472 8515084 10786224 11857812 10118048 6171923 1539108 -2881661 -6295296
44577 -6295296 -7352297 -5309237 -1362851 2139891 3766904 3840599 3437159 3017658 2068523
44568 2068523 -57634 -2890973 -4493801 -2759734 2625549 9568529 15024080 17125857
44560 17125857 16134320 13699106 11374070 9726813 8641793 8077653 8077025 8153464 7439719
44551 7439719 5790783 4059851 2763944 1244080 -956659 -2532889 -1512195 2306353
44543B306353M875345M226134K552184n45035m807405p265649n036136K9452K661421
44534a003336Q87865j477486m86698K528873L544330J801558J08932N2654P9290
44525F035982j296800k946710k892375j034773R73025J682366R53197k33211o02123
44516F38578K49940J370964J671366J380617J371471J385821L62709j510223k703686
44507D217557k552817j885992j112682L31906J938784J818887j39340j003761
44499A612542J202224M032282L749834O26951j850296k294924k566433l538793
44491I73387l247852n19803K433138K971159J574578M54645J74786j65361m13507
44482D235170N28553K199209K328252j98303l447342m422511k371211N69568J818517
$$ plain form
44543 2306353 7181698 11407832 13960016 13414981 8607576 1341927 -3694209 -3664757 -1003336
44534 -1003336 -115471 -1592957 -2079655 449218 3993548 5795106 5904038 5956692 6035982
44525 6035982 4739182 1792472 -1099903 -2134676 -1161651 520715 1473912 1240701 638578
44516 638578 888518 2259482 3930848 5311465 6682936 8068757 8431466 6921243 4217557
44507 4217557 1664740 -221252 -1333934 -1002028 936756 2755643 2616303 1612542
44499 1612542 2814766 6847048 10596882 11223833 9373537 7078613 4512180 973387
44491 973387 -2274465 -2794268 -361130 2610029 4184607 4639252 4814038 4648677 4235170
44482 4235170 4763723 6962932 9291184 9092881 5645539 1223028 -1148183 -578615 1239902
44473A239902R07834m98751p69368k7084L46339n21344k026378k590016r65229
44464d904095K347935M704404L384146j023948m311962l127291J022187L882433
44456A973809L776330K582462J907825J225120K12397j23309J00332j106685m062778
44447F485503n663856l583584j53775P63033p54338j415268M0144J581402J653076
44438a047663J114995J011576J043598R64124J282856J838317J630334P73863
44430H612000P08794J707369K104893R65260l96509p85703j191424k803283m425139
44421D496258l946170j671506j48665p03790j826001j455777K95831J515827J111051
44412b332942K15269N94266K022071K248888J11202k344092k226168K26569J886290
$$ plain form
44473 1239902 2147736 1648985 879617 852533 1198872 677528 -1348850 -3938866 -4904095
44464 -4904095 -2556160 2148244 5532390 4508442 196480 -2930811 -1908624 1973809
44456 1973809 5750139 8332601 10240426 11465546 11677943 11554634 11654966 10548281 6485503
44447 6485503 821647 -2761937 -2915712 -2152679 -2907017 -4322285 -4282141 -2700739 -1047663
44438 -1047663 67332 1078908 2122506 3086630 4369486 6207803 7838137 8612000
44430 8612000 9320794 11028163 13133056 14098316 13701807 12916104 11724680 8921397 4496258
44421 4496258 550088 -1121418 -1270083 -1973873 -3799874 -5255651 -4959820 -3443993 -2332942
44412 -2332942 -2117673 -1523407 498664 2747552 2858754 514662 -1711506 -1484937 401353
44403D01353J060696m41535l57031Q35786J216967M74471j78480l12854o53287
44394B046086j411270j856763j587068r42425j00430J094283K308435K798066
44386B348914K437235J701474O15427j088543k571060k092005N56976K939162
44378D847580K525799j45970k096348j639650l66888r32329l619350n918346n382896
44369a2728398k214592J233629L031038L204743K866528K533576J785742L35428
44361D7694j153367j611428p87867M01287R57336J057213J730681L100722L582462
44352G324733J637120j860379m012182l056396m43429Q13840n54441k941163l692934
44343f785231j562817K310750N211965M859846J419898k390532l810754k749189
$$ plain form
44403 401353 1462049 1020514 663483 1499269 2716236 3190707 3012227 2699373 2046086
44394 2046086 634816 -1221947 -2809015 -3751440 -3851870 -2757587 -449152 2348914
44386 2348914 4786149 6487623 7103050 6014507 3443447 1351442 1908418 4847580
44378 4847580 7373379 7227409 5131061 3491411 3124523 2192194 -1427156 -7345502 -12728398
44369 -12728398 -14942990 -13709361 -10678323 -7473580 -4607052 -2073476 -287734 47694
44361 47694 -1105673 -2717101 -3504968 -3103681 -2146345 -1089132 641549 3742271 7324733
44352 7324733 8961853 7101474 3089292 32896 -410533 403307 -151134 -3092297 -6785231
44343 -6785231 -8348048 -6037298 -825333 4034513 5454411 3063879 -746875 -3496064
44335c496064j402906j156942q81394J032177L822128M911771L298801J053866
44327G181437P00696J982002K386894O06147j834216k752862k040010j314521
44319D915567j453899j605834p00099J015775K416022K884359K635283J885093
44311A1992267M34170j619843l216810l113860j507440k20678n91872j526112
44303F29822o86302K226523M529056L658161M07031k020494j807769k43281L47417
44294G040164o44007j736590j075018J730231M975556O011961L632840n65711
44286A9369426l766817m827781m783901m513277l325741p21787J652870J527642
44278F10634o54854j607978P62859M269588M753315J233079k716151l232818n36372
$$ plain form
44335 -3496064 -4898970 -6055912 -6937306 -5905129 -2083001 2828770 6127571 7181437
44327 7181437 7882133 9864135 12251029 12857176 11022960 8270098 6230088 4915567
44319 4915567 3461668 1855834 1155735 2171510 4587532 7471891 10107174 11992267
44311 11992267 12426437 10806594 7589784 4475924 2968484 2747806 2155934 629822
44303 629822 -56480 2170043 6699099 10357260 10764291 8743797 6936028 6692747 7040164
44294 7040164 6396157 4659567 3584549 5314780 10290336 16302297 19935137 19369426
44286 19369426 15602609 10774828 5990927 1477650 -1848091 -2569878 -917008 610634
44278 610634 -44220 -1652198 -889339 3380249 8133564 9366643 6650492 3417674 2881302
44269B881302K065884K470541J263487n50390k766000m332299l134526P21249
44261a380752L398664J697082k240469l479992j063832R76490k10974k359591
44253d663374j890467Q94816K746815K128876O06351J55649J025563K219399K705745
44244E929373K058372Q02093N5000J77232J64861q34113j914842j446544M75368
44235E466800J786605R47030j169282k381807j746906l71499L58215P30896K055850
44226E675902M062505M284472J144701l282967n327354m183533k394875j871947
44218a893096j694080n29619J050903K008434K640836L307365K988260R94291
44210H873294j205237j810116j225667q21347l56193R67749J835956J35445l186092
$$ plain form
44269 2881302 4947186 7417727 8681214 8130824 5364824 1032525 -2102001 -1380752
44261 -1380752 2017912 3714994 1474525 -2005467 -3069299 -2092809 -2303783 -4663374
44253 -4663374 -6553841 -5659025 -2912210 -783334 -176983 -21334 1004229 3223628 5929373
44244 5929373 7987745 8789838 8844838 9022070 9186931 8352818 6437976 4991432 5466800
44235 5466800 7253405 8200435 7031153 4649346 2902440 2530941 2889156 3620052 5675902
44226 5675902 9738407 14022879 15167580 11884613 6557259 2373726 -21149 -1893096
44218 -1893096 -3587176 -4116795 -3065892 -1057458 1583378 4890743 7879003 8873294
44210 8873294 7668057 5857941 4632274 3810927 3454734 4422483 6258439 6393884 3207792
44201C207792m431292j949466J657728K925804J254109j473460l162469k500914
44193d472168O04835M305948N657994L391827p31045l877731m664917l404084
44185c189341j065926J204933K437237K487531J863461P33042r60145k312574
44177A198218j875331J31907J457970O41197r95419j233670J91134J736641K101288
44168C353935R95740j153288k961881k527103K36692K428431J254912k073344
44160d45906l649489k079012J2029L71902M75420K603153N475498N649277K713391
44151A1126263J49578L76819J513676O40613j713842k690354j588962m87806m91696
44142F834289j82737J312530K266303J136534m86436l7862K036539K956487J816027
$$ plain form
44201 3207792 -1223500 -3172966 -1515238 1410566 2664675 1191215 -1971254 -4472168
44193 -4472168 -3867333 438615 6096609 9488436 8757391 4879660 214743 -3189341
44185 -3189341 -4255267 -3050334 -613097 1874434 3737895 4470937 3510792 1198218
44177 1198218 -677113 -545206 912764 1553961 558542 -675128 -483994 1252647 3353935
44168 3353935 4349675 3196387 234506 -2292597 -2055905 372526 1627438 -445906
44160 -445906 -4095395 -6174407 -6162378 -5790476 -5315056 -2711903 2763595 8412872 11126263
44151 11126263 11275841 11652660 13166336 13806949 12093107 9402753 7813791 7325985 6834289
44142 6834289 6651552 7964082 10230385 11366919 10880483 10842621 12879160 15835647 17651674
44133A7651674N47094M43826K13581j472759l451376l630768j938355k31107J35480
44124H267290n47683j270335j385671r28631n26130p72038j219333m82203J974967
44115C110233M604601N218759L474599J079093m01985j017368j529979j955396
44107A2582557j652459m65277Q70420J443601R54433j33200q95783n30733Q46131
44098A3019690J904827J203769j048937k852579k586081r00927K66268J90680
44090I196710j43580P9098L65220K4573o00606o33880K59059J692499K810944
44081A3050037K516352L79945k332185l559481k777080j349735k81244Q32876
44073F479485K035341K187022J190494J051778K802901M091822K307305j177042
$$ plain form
44133 17651674 18198768 18642594 18856175 17383416 13932040 10301272 8362917 8131810 8267290
44124 8267290 7719607 6449272 5063601 4134970 3608840 2836802 1617469 1135266 3110233
44115 3110233 7714834 12933593 16408192 17487285 17085300 16067932 14537953 12582557
44107 12582557 10930098 10464821 11335241 12778842 13733275 13600075 12704292 12173559 13019690
44098 13019690 14924517 16128286 15079349 12226770 9640689 8739762 9006030 9196710
44090 9196710 9053130 9132228 9497448 9522021 8921415 8287535 8546594 10239093 13050037
44081 13050037 15566389 15946334 13614149 10054668 7277588 5927853 5646609 6479485
44073 6479485 8514826 10701848 11892342 12944120 15747021 19838843 22146148 20969106
44065B0969106k726144j671656p66895j558300k428358j841215o81487j80814
44057I114237J59364J109979J932864J556451L30272o52877j088756j332181j496338
44048I633015j454750j124046l02206J073339K275982K284073J157211L8050l26826
44039A3253842j17406M43971J269540J624253N18270j759016l546432l522743
44031H164279j763279O91765K402849K193114M76772o67522o6426Q20834L51589
44022A2603975m72264N6O26916o65840k425599j023422L410255O239181M292833
44013B2586091o67626n017357o548591m419219L58094L819020K489620j373973
44005A1226059k275321K89645J403593m70903q11706K258991L520505o04073n071115
$$ plain form
44065 20969106 18242962 16571306 15804411 14246111 11817753 9976538 9295051 9114237
44057 9114237 9273601 10383580 12316444 13872895 14203167 13550290 12461534 11129353 9633015
44048 9633015 8178265 7054219 6752013 7825352 10101334 12385407 13542618 13580668 13253842
44039 13253842 13136436 13580407 14849947 16474200 16992470 15233454 11687022 8164279
44031 8164279 6401000 7092765 9495614 11688728 12165500 11497978 11431552 12252386 12603975
44022 12603975 12131711 12131767 12758683 12092843 9667244 8643822 12054077 18293258 22586091
44013 22586091 21918465 16901108 10352517 5933298 6291392 10110412 12600032 11226059
44005 11226059 8950738 9240383 10643976 10173073 9361367 11620358 15140863 14536790 9465675
43996I465675l795120Q77928K664285J110029R6959O2570j100480j971024K36909
43987G647731L211681K418597r03372j732032n8452k07630k201738j879364M45669
43978F741090L374k886437k236189K513967L951967r79681m821283j236494M752364
43969E802678M964158N64693j143236J600427M024149L261465J080620p57207
43961A9397747k261199k849242j783990m78534o19905r43437M97809K121861R00873
43952A3981983k268353l428633j476105O48956P83871Q6326K80024J216662J825717
43943A1650448J451247l951j665777j737112M29333K889434L322501J884251L67948
43934A8588322k57650J42588J675772L208597K171923j916714n470880n161519
$$ plain form
43996 9465675 5670555 6548483 9212768 10322797 10419756 10482326 9381846 7410822 7647731
43987 7647731 10859412 13278009 12374637 10642605 10584153 10376523 8174785 6295421 6741090
43978 6741090 6744464 3858027 1621838 4135805 8087772 7108091 2286808 1050314 5802678
43969 5802678 10766836 11331529 10188293 11788720 15812869 19074334 20154954 19397747
43961 19397747 17136548 14287306 12503316 12024782 11404877 10461440 10959249 13081110 13981983
43952 13981983 11713630 8284997 6808892 7457848 8241719 8328045 8608069 9824731 11650448
43943 11650448 13101695 13097744 11431967 9694855 10124188 13013622 16336123 18220374 18588322
43934 18588322 18330672 18473260 20149032 23357629 25529552 23612838 18141958 12980439
43926A2980439k475657q08805J01776K731730N967059N543048N69856m493402
43918B0116044n331704k116655K205069M897357M170608J11789m121864m701596
43910A5229048j653026J261649J597681O00785J31807J44610J32135M20290R49256
43901A8814235J009631Q65891J279564J135217j352905m499463m047039K44539
43893A3449670K847114j8940m528607m448162L37537M495137M898138L400654
43885B0432541K359627J418396l70203k257343l068037k863837k173881r88259
43877A2489004M78016J206499O42114k35957r7547R41663J574285J130524L31737
43868A8460338J00607K83788M8389p14715j018968m3521J608407K303229R86725
$$ plain form
43926 12980439 10504782 9695977 9797753 12529483 18496542 24039590 24609446 20116044
43918 20116044 14784340 12667685 14872754 19770111 23940719 24052508 19930644 15229048
43910 15229048 13576022 14837671 16435352 17036137 17167944 17312554 17444689 17864979 18814235
43901 18814235 19823866 20689757 21969321 23104538 21751633 17252170 13205131 13449670
43893 13449670 16296784 16277844 11749237 7301075 7638612 12133749 17031887 20432541
43885 20432541 22792168 24210564 23840361 21583018 18514981 15651144 13477263 12489004
43877 12489004 12967020 14173519 14815633 14579676 14482129 15423792 16998077 18128601 18460338
43868 18460338 18560945 18844733 18893122 18178407 17159439 17115918 18724325 21027554 22014279
43859B2014279j700088l730662l161275J11985L747950M704486K156896j666927
43851B2476644l908980l746155k250501o03864N29090O39832j90489p34858K55719
43842A2466438K366177L866912L599175J711244j006642l386646l932671k082880
43834A3601107O00041J781533R29585n73171j658454k452290k953212k508281
43826F766858j113052Q9899K52480j73235l25753j9586L94446N50348K60701k13351
43816F469755j79639N16883Q86879J24936p84446J4802K776217N565488O069112
43807B1459987L398565j189272m518957l638890P60440M176211L291535r4230
43799B3645389k193409k593650l317129l917912j924687J889631L299096Q62386
$$ plain form
43859 22014279 20314191 16583529 13422254 13534239 17282189 21986675 24143571 22476644
43851 22476644 18567664 14821509 12571008 11967144 12496234 13136066 12945577 12210719 12466438
43842 12466438 14832615 18699527 22298702 24009946 23003304 19616658 15683987 13601107
43834 13601107 14201148 15982681 16912266 16339095 14680641 12228351 9275139 6766858
43826 6766858 5653806 5743705 5996185 5822950 5497197 5477611 5872057 6422405 6683106 6469755
43816 6469755 6290116 6806999 7693878 7818814 7034368 7049170 9825387 15390875 21459987
43807 21459987 24858552 23669280 19150323 15511433 16271873 20448084 23739619 23645389
43799 23645389 21451980 18858330 15541201 11623289 9698602 11588233 14887329 15749715
43791A5749715j707890j131978J136191K190462J799876R19786o64964k491000
43783A5800198k200560P44007K773119J012444j930155j697362J129631K139384
43775A7770706j55979k688533k678726n67611J952759L710289L669863J604725
43767B2617493o19978r55165l27401j227626l271912l354134o73516J688501J402646
43758A5278908J61818O02483K359636L261310K739699J881132J079971l14741
43750B7050216k281155l601734l289622j752366k85624L69962Q13655K009291
43742A9032623L413906K997518N1126k919239k760859K08034K496072J934278
43734B4453459l8463j079596j029038j197243j962150k401735j644665L05689
$$ plain form
43791 15749715 14041825 12909847 14046038 16236500 18036376 18956162 18291198 15800198
43783 15800198 13599638 14343645 17116764 18129208 16199053 14501691 15631322 17770706
43775 17770706 17614727 14926194 12247468 11679857 13632616 17342905 21012768 22617493
43767 22617493 21997515 21042350 20714949 19487323 16215411 12861277 12187761 13876262 15278908
43758 15278908 15440726 16043209 18402845 21664155 24403854 26284986 27364957 27050216
43750 27050216 24769061 21167327 17877705 16125339 15839715 16209677 17023332 19032623
43742 19032623 22446529 25444047 25495173 22575934 19815075 20023109 22519181 24453459
43734 24453459 24414996 23335400 22306362 21109119 19146969 16745234 15100569 15406258
43726A5406258K573105L748394K981565J172929J64738K93834p8356j846496l281125
43717B1134846k217442P77479L089135L532514L344166L456692K636979l60231
43709C5394138l839825m259678n50408M032517N252974K338351j815633m199008
43701C2353428m130633k486865k54160J599333K198578J627585Q88048M26692
43693C2222006k89117j221557j226240m0381O69981l18116j669829j505397m21480
43684B6199870m12158j529500j919871q70751M69576J391070K352208L144165
43676B8824609K604567Q25929l94928j61200L28663J22162J80014J403575K620626
43667C6354017K213889P28186K03234J389496K922465L027942J161501j735847
$$ plain form
43726 15406258 17979363 21727757 24709322 25882251 26046989 26340823 26262467 24415971 21134846
43717 21134846 18917404 19694883 22784018 26316532 29660698 33117390 35754369 35394138
43709 35394138 31554313 27294635 26744227 30776744 36029718 38368069 36552436 32353428
43701 32353428 28222795 25735930 25481770 27081103 29279681 30907266 31795314 32222006
43693 32222006 31932889 30711332 29485092 29444711 30114692 29796576 28126747 26621350 26199870
43684 26199870 25787712 24258212 22338341 21467590 21937166 23328236 25680444 28824609
43676 28824609 31429176 32255105 31860177 31698977 32027640 32149802 32329816 33733391 36354017
43667 36354017 38567906 39296092 39499326 40888822 43811287 46839229 48000730 46264883
43659D6264883l880369l873918j923529L87878J772664K102695J516402j03680
43651D2263026k034333k369999k52465K200001J891209j243182l733611k727755
43643C3992891N17366K427115J745943P78863J749776L657919M193624L561612
43635E2625109L939600N242849M400192K21940l629850l109594M20542J958797
43627F2069585k59946k881679k639196l54311J353118J822954K113711K617534
43619F3841770K672527J887947P36406J15830O14065J635770J450057p67078l161324
43610F9025970l026627l53773K226951L084747L042866K899365J995419K21427
43602G9116345r09653o49991n32122j907703l575095l456566j413220Q80309J722907
$$ plain form
43659 46264883 42384514 38510596 36587067 36974945 38747609 40850304 42366706 42263026
43651 42263026 40228693 37858694 37606229 39806230 41697439 40454257 36720646 33992891
43643 33992891 34510257 36937372 38683315 39462178 41211954 44869873 49063497 52625109
43635 52625109 56564709 61807558 66207750 66429690 62799840 59690246 60110788 62069585
43627 62069585 61809639 58927960 56288764 55934453 57287571 59110525 61224236 63841770
43619 63841770 66514297 68402244 69138650 69254480 69868545 71504315 72954372 72187294 69025970
43610 69025970 65999343 65645570 67872521 70957268 74000134 76899499 78894918 79116345
43602 79116345 78206692 77556701 77024579 75116876 71541781 68085215 66671995 67552304 69275211
43593F9275211K79434k673066m192094j632035L219058N094673K028159j645103
43585F9754237j439675J011196J242148q22187j247998J345311L896828L641981
43577G7381841J143102j794147m065388m597684k661106L26811J680353P75357
43569F8189139n59126j139651j480706j524332j40879K300456L477464K363924
43561G1486289P41312M23061J024837J447162J458705P77089j247141l766553
43553G2344761m299844j899969J235721K537345J765228J4445j830025k450439
43545F7417223l86535L233609M605935K126477p86302l24878K231798K796052
43537H0913379O99707r81970o44836M5118k18588m10700J93007K72290j202508
$$ plain form
43593 69275211 69554645 66881579 62689485 61057450 64276508 69371181 71399340 69754237
43585 69754237 68314562 69325758 70567906 69745719 68497721 69843032 73739860 77381841
43577 77381841 78524943 76730796 72665408 68067724 65406618 65733429 67413782 68189139
43569 68189139 67630013 66490362 65009656 63485324 63344445 65644901 69122365 71486289
43561 71486289 72227601 72650662 73675499 75122661 76581366 77358455 76111314 72344761
43553 72344761 68044917 66144948 67380669 69918014 71683242 71697687 69867662 67417223
43545 67417223 67030688 70264297 74870232 76996709 76210407 75885529 78117327 80913379
43537 80913379 81613086 80631116 79986280 80031398 79812810 79402110 79595117 79867407 78664899
43528G8664899k955616l146213j676320K70340J640576J641642j9323k010717
43520G2409268j950160O53654L257709L402842J879772J269308K206336K929103
43512H6057832K247584J124580R19782J442810J493516N42481q64167k004981
43504I0959437k638257k708729j797175O37647M106518O488729N603934J885724
43496A02537828j428493j791363l57652j06595j420586j642260N36637K617247
43488I8944763J870040m84076j188286k586K77376j151627j503537Q02324K866384
43479A00430775J436876j878400k868734j065275r8441j632361k683773m45399
43471I1195268L207680M353958K301541j91973r02055l1832J331311K387331K167265
$$ plain form
43528 78664899 75709283 72563070 70886750 71157090 72797666 74439308 74419985 72409268
43520 72409268 70459108 71112762 74370471 77773313 79653085 80922393 83128729 86057832
43512 86057832 88305416 89429996 90349778 91792588 93286104 93828585 92964418 90959437
43504 90959437 88321180 85612451 83815276 84452923 88559441 95048170 100652104 102537828
43496 102537828 101109335 99317972 98960320 98853725 97433139 95790879 96327516 98944763
43488 98944763 100814803 100330727 99142441 99139855 99417231 98265604 96762067 97564391 100430775
43479 100430775 101867651 99989251 97120517 96055242 95956801 94324440 91640667 91195268
43471 91195268 94402948 98756906 101058447 100866474 99964419 99932587 101263898 103651229 105818494
43462A05818494o9018l223251m485591k103417K410053N429447M541860P08817
43454A09027394k697292l117687j197709L34505J26614m00810M55719K046305
43446A04577039K454540J347389J30753l14702l13684J12942J536362L393443
43438A12924082L711348J620241j021501j644527Q8634K272350L112743K436078
43430A23499448J257296O10324O17509L37056j067996k781906k773930l61659
43422A19336142K501940L402948K300699J177993J336908K221269K789674K892293
43414A37959866K993529L266606L302833K479221P38558p93508o07973J137571
43406A50476703K172562Q80894j175100j177256Q51919K046848J099034J83815
$$ plain form
43462 105818494 105749476 102526225 98040634 95937217 98347270 103776717 108318577 109027394
43454 109027394 106330102 103212415 102014706 102349211 102475825 102075015 102530734 104577039
43446 104577039 107031579 108378968 108509721 108195019 107881335 107994277 109530639 112924082
43438 112924082 116635430 118255671 117234170 115589643 115678277 117950627 121063370 123499448
43430 123499448 124756744 125367068 125984577 126321633 125253637 122471731 119697801 119336142
43422 119336142 121838082 125241030 127541729 128719722 130056630 132277899 135067573 137959866
43414 137959866 140953395 144220001 147522834 150002055 150740613 149947105 149339132 150476703
43406 150476703 152649265 153530159 152355059 151177803 152029722 154076570 155175604 155359419
43398A55359419J192394K350393J013579j605106j636568J614520M116016K540630
43390A64945277j159259k605321r31730O25307k54453j892197j519493N21136
43382A57729267J366264r4023j527598n05146J841064K119859o23139l255288
43374A57051260k431584J072681L349231K258222k69302j175898q9703Q61618
43366A60626525K39025j049964j268418J2435J706580K581253K346301J530083
43358A66723820O18901m66381j894494l048435k702191n06495K110175L216255
43350A64051155K377816O54647j179020l167407m620949l585405O90321N490180
43342A60711338O662252L217993j404748l218531j764010L88421J191670R25738
$$ plain form
43398 155359419 156551813 158902206 159915785 158310679 156674111 158288631 162404647 164945277
43390 164945277 163786018 161180697 160248967 160874274 160619821 158727624 157208131 157729267
43382 157729267 159095531 159001508 157473910 156968764 158809828 160929687 160306548 157051260
43374 157051260 154619676 155692357 159041588 161299810 161030508 159854610 159764907 160626525
43366 160626525 160865550 159815586 158547168 158559603 160266183 162847436 165193737 166723820
43358 166723820 167342721 166876340 164981846 161933411 159231220 158724725 160834900 164051155
43350 164051155 166428971 167083618 165904598 162737191 158116242 154530837 155221158 160711338
43342 160711338 167373590 170591583 169186835 165968304 164204294 164592715 165784385 166710123
43334A66710123Q00604J058170R51942R4426p05787j71956J769982L355882K726450
43325A76589836L55962j223092n73019P94969N65184j286499k678511k056685
43317A70488145L11230L054932M505330L498572Q06403r90085o48206k26518j727454
43308A79072349l084012r12670L366837M538527J311078j613111q83215Q29713
43300A82625496L80520k53221J808199M356758L575129P48909j20020O50434j67153
43291A93605051j730838l50014K753902K232547j971526l466366J70658L264530
43283A94507944J843941K85714K966471N770102K821016l073969m397569m37949
43275B00285701K740433K261334J027620Q39950J1991j469270q06394K095544
$$ plain form
43334 166710123 167510727 168568897 169520839 169615265 168909478 168737522 170507504 173863386 176589836
43325 176589836 176945798 175722706 175149687 175944656 176509840 175223341 172544830 170488145
43317 170488145 170799375 173854307 178359637 181858209 182664612 181674527 181026321 180799803 179072349
43308 179072349 175988337 175075667 178442504 182981031 184292109 182678998 181795783 182625496
43300 182625496 183006016 182752795 184560994 188917752 192492881 193241790 193121770 193772204 193605051
43291 193605051 191874213 191524199 194278101 196510648 194539122 191072756 191243414 194507944
43283 194507944 196351885 196637599 199604070 205374172 208195188 205121219 200723650 200285701
43275 200285701 203026134 205287468 206315088 207155038 207167029 205697759 204891365 206986909
43267B06986909L421216J393953j362006k822918m074461n216438l839570L9693
43259A94526378K283735P97411r54099R0662J240687j164777m957164m987719
43251A86875114q97872K563396K191432o37461l284533m718362m791032l453705
43243A73846977j397880K59635J276767K106822K608701K070700K95267k073610
43235A78993379l772428l198157J25160L816302M317166J317731j616389k065618
43227A77917146j832477l195850m983946n110419m328429l996067k509991J759894
43219A53719861N757472M910459K63598k573795j544733m5259j38227M94578K852125
43210A63696079L310902m42709m462901l887003k53177J096430j007261k857657
$$ plain form
43267 206986909 210408125 211802078 210440072 207617154 203542693 198326255 194486685 194526378
43259 194526378 196810113 197607524 196653425 196744087 197984774 196819997 191862833 186875114
43251 186875114 185977242 188540638 190732070 190094609 186810076 182091714 177300682 173846977
43243 173846977 172449097 172708732 173985499 176092321 178701022 180771722 181066989 178993379
43235 178993379 175220951 172022794 172147954 175964256 180281422 181599153 179982764 177917146
43227 177917146 176084669 172888819 167904873 162794454 158466025 154469958 151959967 153719861
43219 153719861 159477333 164387792 164651390 162077595 160532862 160487603 160349376 160843954 163696079
43210 163696079 167006981 166564272 162101371 158214368 157961191 159057621 158050360 155192703
43202A55192703k258346j016391q01189n81910O21365J577987R88525m45221j447810
43193A51829713j854233j730719o13022J097301J657845M10752p66675j06528
43185A49924434J194993O69978j755669l752689l649209j614353J523125M341288
43177A46881898M285857J30964m732744m808106M03667M897006L748543o82988
43169A50124097k846249j614606j13986J46101M57208Q93105k52852k519905l013428
43160A41259485j233776k87858j710176k791081j188308J199674J573946N32544
43152A37354450K03494N99284P54389J237735K522999K972597J564539M92596
43144A47702083J612528K483571Q0918l389776l241997J80440J975145N28615
$$ plain form
43202 155192703 152934357 151917966 151116777 150534867 151156232 152734219 153722744 153277523 151829713
43193 151829713 149975480 148244761 147631739 148729040 150386885 150797637 150030962 149924434
43185 149924434 151119427 151789405 150033736 146281047 142631838 141017485 142540610 146881898
43177 146881898 151167755 151298719 146565975 141757869 142161536 147058542 150807085 150124097
43169 150124097 147277848 145663242 145549256 145695357 146152565 147045670 146792818 144272913 141259485
43160 141259485 140025709 139737851 138027675 135236594 134048286 135247960 136821906 137354450
43152 137354450 137557944 138157228 138911617 140149352 142672351 145644948 147209487 147702083
43144 147702083 149314611 151798182 151879100 148489324 145247327 145427767 147402912 147931527
43136A47931527m57895J336419L223113K360622j66712k279589l974548n052830
43128A42920107l462000J110698M913532M474967J089479j618390k329484j611182
43120A45487727O49627M068182N891988L916577K29946j188930J99637J639216
43112A60893970J743459J591731J419135j70493k950983m110150j961250J437026
43104A57892445K715024R54235j806978k724085l86818L837788O345437M507867
43096A71334915k08844l535301l104059n76400J124955J030319l1585j077395
43088A64956605j323894j96759J767009K940058K568411J772769J598681J302610
43080A75385490J7596j158776q93396n32615k402904n212417m518314Q13103N644064
$$ plain form
43136 147931527 147473632 148810051 152033164 154393786 154227074 151947485 147972937 142920107
43128 142920107 139458107 140568805 145482337 149957304 151046783 149428393 147098909 145487727
43120 145487727 146137354 150205536 156097524 160014101 160244047 159055117 159254754 160893970
43112 160893970 162637429 164229160 165648295 165477802 162526819 158416669 156455419 157892445
43104 157892445 160607469 161561704 159754726 157030641 156643823 160481611 166827048 171334915
43096 171334915 171126071 167590770 164486711 163910311 165035266 166065585 166034000 164956605
43088 164956605 163632711 163435952 165202961 168143019 170711430 172484199 174082880 175385490
43080 175385490 175403086 174244310 173350914 172818299 170415395 165202978 160684664 161497767 167141831
43071A67141831M694201m37320l592756k192466N82579J458160R76736Q01240
43063A69432205P52382M77065J157527L185259M407404L109044P68923n23720
43055A82766089j275340k489734k641867k93471K121495J247583j734510l001622
43047A74698623k454086l168474m875758l730551N82713L358117K390879J303548
43039A68105011K516937K519948j658541o168742n865983k473092j418921l041706
43031A52514911l032731l31102J520047Q39050K7109M67705J87242j756476k751241
43022A47684514p88051J873108J573779j996894n684553o355459l489542P12982
43014A33529884L248497L082192J909914J441499R72673q40354l102082l876592
$$ plain form
43071 167141831 171836032 171398712 167805956 165613490 166196069 167654229 168630965 169432205
43063 169432205 170184587 170661652 171819179 175004438 179411842 182520886 183289809 182766089
43055 182766089 181490749 179001015 176359148 176065677 178187172 179434755 177700245 174698623
43047 174698623 172244537 169076063 164200305 160469754 161052467 164410584 166801463 168105011
43039 168105011 170621948 173141896 171483355 165314613 159448630 156975538 155556617 152514911
43031 152514911 149482180 149151078 150671125 151510175 151537284 152004989 152192231 150435755 147684514
43022 147684514 146896463 148769571 150343350 148346456 142661903 136306444 132816902 133529884
43014 133529884 136778381 139860573 141770487 143211986 144184659 143344305 140242223 136365631
43006A36365631l252641k632221j888723j72139J249969L49134j840422k285745
42998A25892843p74252n8860j073247j822843j449422j371232j602659j54232
42990A17586096K635127L414228J205781o59167l8442P78967k00582j015957j6297
42981A23689754L76510j816149l538895j364772K167634K073341j225362k877432
42973A17484629j255904O38965R94172J214638J696202L66347l195901n949682
42965A11993466n258182j887369J717706L654089K774403l95899k609780r17285
42957A09071149K779500L554492N15956j743954q8887K701645K710881O36838
42949A20137620l31207K11940J79259r86563j767452j266141P9583J798741L239670
$$ plain form
43006 136365631 133112990 130480769 128592046 128419907 129669876 130019010 128178588 125892843
42998 125892843 125118591 125059731 123986484 122163641 120714219 119342987 117740328 117586096
42990 117586096 120221223 123635451 124841232 124182065 124143623 124922590 124722008 123706051 123689754
42981 123689754 124066264 122250115 118711220 117346448 119514082 121587423 120362061 117484629
42973 117484629 116228725 116867690 117861862 119076500 120772702 121139049 117943148 111993466
42965 111993466 106735284 104847915 106565621 110219710 112994113 112598214 109988434 109071149
42957 109071149 111850649 115405141 115921097 114177143 114088256 116789901 119500782 120137620
42949 120137620 119806413 120018353 120197612 119211049 117443597 116177456 116257039 118055780 121295450
42940A21295450K941672L91398k270605k531052r44546o4204m65742m09818O27413
42931A18569966Q85734n16546j819754j305140J67970Q54424Q91942J519193K373890
42922A21621679J675373p94388k726184k227754n66222n52676k549185l725333
42914A10155310j919594J119088J818504m93600k762839k297600O1951J692116
42906A07373336J631308R68772P79027J147198J742341K030887J265302n17145
42898A16421026j859954j564070o06575q06606j859296j717134j23496N57765
42890A08441660r59457k549111j812159J78067O59753l59402l34237J220489J491876
42881A05977479j045998l442404k049579J957436L675610R46567k873955l474901
$$ plain form
42940 121295450 124237122 124628520 122357915 119826863 118882317 118818113 118352371 117942553 118569966
42931 118569966 119455700 118939154 117119400 115814260 115982230 116836654 117728596 119247789 121621679
42922 121621679 123297052 122502664 119776480 117548726 116982504 116429828 113880643 110155310
42914 110155310 108235716 109354804 111173308 110679708 107916869 105619269 105681220 107373336
42906 107373336 109004644 109973416 110752443 111899641 113641982 115672869 116938171 116421026
42898 116421026 114561072 112997002 112390427 111583821 109724525 108007391 107883895 108441660
42890 108441660 107482203 104933092 103120933 103299000 103958753 103599351 103265114 104485603 105977479
42881 105977479 104931481 101489077 99439498 101396934 105072544 106019111 103145156 99670255
42873I9670255q36921J660801K000159J265586R84063Q85036M1877j242808j900258
42864A02527790j719069j360726j060781l82915O95729J387071J138086M69291
42856A01694476L24040Q74140J312044P20708r85057k859897l667847l045082
42848I4367525j884255j246151r91254n1643J883262L687805M182448L513153
42840A03460890K516383J296320n70752k613317l418283k437211j017606q96883
42832I6319541k009392k511425j033665J608820L231535K578921M92802j185618
42824I7491519j476494p13159N07141J983953L293787L422868J933392N3966n39898
42815A05957075j5473k10324j769983k795277j473682Q92415J240368r43177k517925
$$ plain form
42873 99670255 98833334 100494135 102494294 103759880 104743943 105628979 105670856 104428048 102527790
42864 102527790 100808721 99447995 98387214 98004299 98700028 100087099 101225185 101694476
42856 101694476 102018516 102892656 104204700 104925408 103940351 101080454 97412607 94367525
42848 94367525 92483270 91237119 90245865 90194222 92077484 95765289 99947737 103460890
42840 103460890 105977273 107273593 106702841 104089524 100671241 98234030 97216424 96319541
42832 96319541 94310149 91798724 90765059 92373879 95605414 98184335 98677137 97491519
42824 97491519 96015025 95301866 95809007 97792960 101086747 104509615 106443007 106496973 105957075
42815 105957075 105941602 105731278 103961295 101166018 99692336 100584751 101825119 100881942 98364017
42806I8364017p98792K621309L800180J658637p05625m21131J252860J019970
42798A06791425j445500k869441j097584J668569J879855l56483j423341O93506
42790A03841006L463240L043873p37427m172645m244994k001510p20534j626045
42782I6844964k702367j790938M65787J706415J044115k21913q01082o94368q5906
42773I3764707J270374K800913K968834J557754M49030O01022M6911k829192n627011
42764I5003342m718862r04408J347614M05800n63430Q43104K501117J709621j78256
42755I5445642l9610K031137L006025J233674j969551m416282m791697k948670
42747H7550668j77331J486568J654700K272757M407927N767332L602503r58303
$$ plain form
42806 98364017 97565225 100186534 103986714 105645351 104939726 104518595 105771455 106791425
42798 106791425 105345925 102476484 101378900 103047469 104927324 104570841 103147500 103841006
42790 103841006 107304246 110348119 109610692 105438047 101193053 99191543 98471009 96844964
42782 96844964 94142597 92351659 92817446 94523861 95567976 95346063 94544981 93850613 93764707
42773 93764707 95035081 97835994 100804828 102362582 102811612 103412634 103459545 100630353 95003342
42764 95003342 90284480 89380072 90727686 91133486 90570056 91413160 93914277 95623898 95445642
42755 95445642 95406032 97437169 100443194 101676868 99707317 95291035 90499338 87550668
42747 87550668 87373337 88859905 90514605 92787362 97195289 102962621 106565124 105606821
42739A05606821l907796l161614k12543K499741L689659L050059J145317n27238
42731A08182406r98729j037468j536546j725306q49349l17471j580537k953925
42723I7183075j686424J390480K629082Q67009j394630k314026k746096l282626
42715I0645844k660567l99476J810252K648552K636510K097422L47592j891742
42707I5234387k017563Q84802M192224M929519K916522k41816l095166m280857
42699I8522052k906815k05087J319455J184274R88292Q14949j033790l794384
42691I4888946l717124K78569M132365M233781K064809P10640K31282n06452p88101
42682A01528715k54525r55428l511444m339869q76441L302477L204803j95209
$$ plain form
42739 105606821 101699025 98537411 98324868 100824609 104514268 107564327 108709644 108182406
42731 108182406 107183677 106146209 104609663 102884357 102035008 101717537 100137000 97183075
42723 97183075 95496651 96887131 99516213 100383222 98988592 96674566 93928470 90645844
42715 90645844 87985277 87585801 89396053 92044605 94681115 96778537 97126129 95234387
42707 95234387 93216824 94101626 98293850 103223369 106139891 105898075 102802909 98522052
42699 98522052 95615237 95410150 96729605 97913879 98902171 99717120 98683330 94888946
42691 94888946 91171822 91450391 95582756 99816537 101881346 102591986 102823268 102316816 101528715
42682 101528715 101274190 100318762 96807318 92467449 91591008 94893485 98098288 97903079
42674I7903079k217033j925069j904800k267054q17186J517301J402300o76803
42666I1014735o90481J739111K115694j440314m758970l935328n61579J903159
42658H5386027L072530M099275M410714L019060R45965j68221l18432k95217k47330
42649I9904371m04204j401484k687742k516691o45845R10095Q29887J28857p0197
42640I4047047j15426j67836M88640J176587m11220m293088o548981m036754J081207
42631H1220176M046616L409757J703553J103597J143371Q80123R63863K254996
42623I6726052L488966K125482j905866m681865k480503K770482M975912J746414
42615A02765074k280306k120214P55455J834102R72850J446297L211286K817798
$$ plain form
42674 97903079 95686046 93760977 91856177 89589123 88771937 90289238 91691538 91014735
42666 91014735 90324254 92063365 94179059 92738745 87979775 84044447 83482868 85386027
42658 85386027 88458557 92557832 96968546 99987606 100933571 100765350 100446918 100151701 99904371
42649 99904371 99500167 98098683 95410941 92894250 92248405 93158500 93988387 94117244 94047047
42640 94047047 93931621 93763785 94252425 95429012 95017792 90724704 84175723 80138969 81220176
42631 81220176 85266792 88676549 90380102 91483699 92627070 93507193 94471056 96726052
42623 96726052 100215018 102340500 100434634 95752769 93272266 96042748 101018660 102765074
42615 102765074 100484768 98364554 99120009 100954111 101926961 103373258 106584544 109402342
42607A09402342j27756j988940j386538j230429l044021m154669k534934j44190
42599I4790865O77443L86395N0247k64554M76908L619678O737370N078406q76721
42590A10676037m456926k073022J774162J999082Q6520l51568j1196q85073j274176
42581A05483840P51799K639611J538302k06871P58516K452230J269465j091769
42573A13595123q33659M90723j318532m869058m886506j166108J319231R25517
42565A03256731R13858K202946J508436j989270m387891l313837j123807j73218
42557I6893948K88832R90105R50513L03522N92084J329411N42099q28281M1081
42548A01103314K029989R55790k808564l826798m85852K063227O47815o16240
$$ plain form
42607 109402342 109274586 107285646 105899108 104668679 101624658 97469989 94935055 94790865
42599 94790865 95468308 95854703 95904950 95640396 96117304 99736982 106474352 111552758 110676037
42590 110676037 106219111 104146089 105920251 107919333 108005853 107654285 107643089 106758016 105483840
42581 105483840 106235639 108875250 110413552 110206681 110965197 113417427 114686892 113595123
42573 113595123 112761464 113252187 111933655 107064597 102178091 101011983 102331214 103256731
42565 103256731 104170589 106373535 107881971 105892701 101504810 98190973 97067166 96893948
42557 96893948 97182780 98172885 99123398 99426920 100019004 101348415 101890514 101062233 101103314
42548 101103314 103133303 104089093 101280529 97453731 96967879 99031106 99678921 99062681
42540I9062681K206035N746331M774828N01451j918596j300829q21752k182575
42532A06067574l619200k993353j13253L210469M020791R35129l077417l460433
42524A00970307m87538R00043j127015k551978p77405Q35832o91848k368504p78413
42515I3923481J488993O32758j138561L91160L288094K293381k046728m114460
42507I4718118k342247q21514j640694k053271l42617J268399J213211J095571
42499I1094956J754969J213634j407498l651932l384383j564419J62791J546582
42491H5764700K010739J12292l523574n607529m319597j581409K00649J011500
42483G4067771J427674Q34576o58856j112607L69727J897948J838306J295328
$$ plain form
42540 99062681 101268716 107015047 111789875 112291326 110372730 109071901 108250149 106067574
42532 106067574 102448374 99455021 99341768 102552237 106573028 107508157 104430740 100970307
42524 100970307 100482769 101382812 100255797 97703819 96926414 97762246 97070398 94701894 93923481
42515 93923481 95412474 96045232 94906671 95297831 98585925 100879306 98832578 94718118
42507 94718118 92375871 91554357 89913663 87860392 87517775 88786174 89999385 91094956
42499 91094956 92849925 94063559 92656061 89004129 85619746 84055327 84218118 85764700
42491 85764700 87775439 87887731 84364157 78756628 74437031 72855622 73056271 74067771
42483 74067771 75495445 76330021 75671165 74558558 74928285 76826233 78664539 79959867
42475G9959867J538655J420191j19500j270906j78842J243761j64875l537589
42467G8890762m867655k862199k93250Q71109K056880M433258N906192M220676
42459H8355773R14712p31642n79370j388385l820366m837271k282705J467668
42451G7098414K588860J016186K3727J184421K445169J652111l66536j398132
42443H4244220q36235K39876P35506M1308k014208m348432m735951k290732Q33764
42434G1869116J821878Q58500P55443K930365N323314M871000J146390l023722
42426H6552284m262712j846000J615880K824478J165385j002561j359637L1657
42418H3718774J622795K375570K152656J204443J88703j12623J35542j54848j308878
$$ plain form
42475 79959867 81498522 82918713 82799213 81528307 81349465 82593226 82428351 78890762
42467 78890762 74023107 71160908 70867658 71738767 73795647 78228905 84135097 88355773
42459 88355773 89270485 88538843 87959473 86571088 82750722 77913451 75630746 77098414
42451 77098414 79687274 80703460 80727187 81911608 84356777 86008888 85642352 84244220
42443 84244220 83407985 83647861 84383367 84424675 82410467 78062035 73326084 71035352 71869116
42434 71869116 73690994 74549494 75304937 78235302 83558616 88429616 89576006 86552284
42426 86552284 82289572 80443572 82059452 84883930 86049315 85046754 83687117 83718774
42418 83718774 85341569 87717139 89869795 91074238 91262941 91150318 91285860 91131012 89822134
42409H9822134k252509k153413j477674p74622J63271J206358J593782J536673
42401H7664000K185996L062656J928938j335220l424629k291570m38232p86037
42393H6565902j847351m95229K566053M032928L183244J831180L64949j954344
42385I4247332l698337k753449n56579l23779j430927m18973K486294L239334
42377I0790916R78371m29645P69220J458227j24058r67139R10870K474004J154272
42368I7015038n01024Q5905L13964k671811n742004m290056j31558J207533p91819
42359H4494168j806796m40111M90235K37565J362768L768081L513986m05787l400184
42350H7813925k078628Q42627J568925J125608K365720M215609L400269K15624
$$ plain form
42409 89822134 87569625 85416212 83938538 83163916 83327187 84533545 86127327 87664000
42401 87664000 89849996 92912652 94841590 93506370 90081741 87790171 87351939 86565902
42393 86565902 84718551 84223322 86789375 90822303 94005547 95836727 96201676 94247332
42385 94247332 90548995 87795546 87238967 86915188 85484261 85065288 87551582 90790916
42377 90790916 91769287 91339642 92108862 93567089 93443031 92475892 93386762 95860766 97015038
42368 97015038 96514014 96599919 96913883 94242072 88500068 84210012 84078454 85285987 84494168
42359 84494168 82687372 82247261 82737496 82975061 84337829 88105910 91619896 91214109 87813925
42350 87813925 85735297 86577924 88146849 89272457 91638177 95853786 99254055 99469679
42342I9469679j747727j070899J06126K13039K54796R19882Q01044r20783k362573
42333I5662584j553156L61237P76952l00111l10989J597870K772216P42678k950155
42324I6799126m455064k391897Q60958K437352J801164J26597j409915k035976
42316I1732345j460682m11000n6429k21662O21272K731119L861917K084715j174410
42307I7707185k673830j491883P5915k37626k028645l228927k672625j069001
42299H4380563M6571r7252q16863p96739L98112J921432K769557K684752J787758
42290I2277891K47368j182157j322955j40034P69262L15737l47709L65546J681578
42281I2664527J375212o57249j779944k56560K166264K594237Q76156m42408J63097
$$ plain form
42342 99469679 97721952 96651053 96757179 96970218 97225014 98144896 98945940 98025157 95662584
42333 95662584 94109428 94470665 95247617 94947506 94636517 96234387 99006603 99749281 96799126
42324 96799126 92344062 89952165 90813123 93250475 95051639 95178236 93768321 91732345
42316 91732345 90271663 89860663 89804234 89582572 90203844 92934963 96796880 98881595 97707185
42307 97707185 95033355 93541472 93617387 93379761 91351116 88122189 85449564 84380563
42299 84380563 84427134 84329882 83513019 82716280 83114392 85035824 87805381 90490133 92277891
42290 92277891 92525259 91343102 90020147 89880113 90649375 90965112 90617403 90982949 92664527
42281 92664527 94039739 93382490 91602546 91345986 93512250 96106487 96982643 96540235 96703332
42272I6703332J141368K44843k142838l446225k405022n79530J49952Q1538M82631
42263I0230049J115140Q04051j87041m59234j4931l04346j475473j820916o51244
42254H7236055M77001M55464M47014J597451K822722K652225J789836J933583
42246I9411351L043881L475401K141571o27908l501626m574546k777285K27806
42238I6818645J348569K76446J643J654846J981973j278762m596272l366288P61432
42229I3602232K246444L03719k14665L073134O318972N495216J896242p97101
42221A11924193j659596k137496k859138l222445k694365r74912J661247L288074
42213A03325562J729328j849717l211714n18750K838424K869543K48433j450345
$$ plain form
42272 96703332 97844700 98089543 95946705 92500480 90095458 89515928 89665880 89747418 90230049
42263 90230049 91345189 92149240 91962199 91502965 91488034 91183688 89708215 87887299 87236055
42254 87236055 87713056 88168520 88615534 90212985 93035707 95687932 97477768 99411351
42246 99411351 102455232 105930633 108072204 107444296 103942670 99368124 96590839 96818645
42238 96818645 98167214 98443660 98445303 100100149 102082122 100803360 96207088 92840800 93602232
42229 93602232 95848676 96152395 95937730 99010864 105329836 110825052 112721294 111924193
42221 111924193 110264597 108127101 105267963 102045518 99351153 98376241 100037488 103325562
42213 103325562 105054890 103205173 99993459 99474709 102313133 105182676 105431109 103980764
42205A03980764r62256J2322L03619O45303J722127K910451L123448J769099p95662
42196A12709215k911526k647599l22410J126647k34630k463672k360955r8221
42188A02796849J072040l96832k119372j124124K063996L884443J907620k258949
42180A05825671m554176k830809R23473L140431K659286J045755k76678j185928
42172A04747025j366694k18006J151525M21570k312816l965294l029149j996944
42164I3431217k991168l712718j044198L304384M726928K402068M9906M5243O26153
42155I6837815k27815j614854j981332j862478k416879l089433k642791j325650
42147H1676583l52246o386K60217K71854r15216l250546m798581l501561O072
$$ plain form
42205 103980764 103018508 103030830 103334449 103979752 105701879 108612330 111735778 113504877 112709215
42196 112709215 109797689 107150090 106827680 107954327 107719697 105256025 102895070 102796849
42188 102796849 103868889 103472057 101352685 100228561 102292557 106177000 108084620 105825671
42180 105825671 101271495 98440686 99364159 102504590 105163876 106209631 105932953 104747025
42172 104747025 103380331 103162325 104313850 104735420 102422604 98457310 95428161 93431217
42164 93431217 90440049 86727331 85683133 88987517 93714445 96116513 96166419 96211662 96837815
42155 96837815 96610000 94995146 93013814 91151336 88734457 85645024 83002233 81676583
42147 81676583 81324337 81317951 81578168 81850022 80934806 77684260 72885679 69384118 69390190
42138F9390190K224474O44388k585404k857902N99624L237894J545092j877596
42130G0320760k476165o49447m41898k652089l958910k819116j447789j062666
42122E4812680J59297K695311L707749J865853M4066L17984K09316k515839n028577
42113E6267840l872732j123132r54194k370979j114145K532566L990115K200493
42105E5555832R83160J801275J373779j598260l279468j294313Q73550r1391j701326
42096E2622838p07837M20680k211890o139021n410323J04052M423325M149280
42088D7251104J695624m01760k560972m373722l409952q26J732001J97787r41628
42079C9187656P47994K056424N0262k154740o59162J906614N23514l187443k976075
$$ plain form
42138 69390190 71614664 72259052 69673648 66815746 67415370 70653264 72198356 70320760
42130 70320760 67844595 67195148 66753250 64101161 60142251 57323135 55875346 54812680
42122 54812680 54971977 57667288 61375037 63240890 63284956 63602940 63812256 61296417 56267840
42113 56267840 52395108 51271976 50317782 47946803 46832658 49365224 53355339 55555832
42105 55555832 56538992 58340267 59714046 58115786 54836318 53542005 54415555 54324164 52622838
42096 52622838 51915001 52335681 50123791 43984770 38574447 38678499 43101824 47251104
42088 47251104 48946728 48544968 45983996 41610274 38200322 38199496 39931497 40129284 39187656
42079 39187656 39935650 41992074 42042336 39887596 39228434 41135048 41658562 38471119 35495044
42070C5495044J753993M622371K101830j720134k280749p96449l99993q22072
42062C7953841o05601q69132k911794m830763m249201k139955n06940J291749
42054B3132204M042280M943288J270197l736118m131938j75842J622548j619945
42046B5346674m689637k243263L299373N593128L079749k67236j311633q23782
42038B7983373m62764k34973J38778j93031j763578l158560k281201R15805L857272
42029B4801121L967763J644412j46064L63184J369912J99942k447864l254201
42021B6498205j304056M79042O4771m20920J450720L671512K406596j832407m500684
42012B6512779l511471j638420j524917j965409j133947k86111j181135k086005
$$ plain form
42070 35495044 37249037 41871408 43973238 42253104 39972355 39175906 38775913 37953841
42062 37953841 37348240 36479108 33567314 28736551 24487350 22347395 21840455 23132204
42054 23132204 27174484 32117772 33387969 29651851 25519913 25344071 26966619 25346674
42046 25346674 20657037 18413774 21713147 27306275 30386024 30118788 28807155 27983373
42038 27983373 27520609 27285636 27424414 27231383 25467805 22309245 20028044 20943849 24801121
42029 24801121 28768884 30413296 30267232 30630416 32000328 32200270 29752406 26498205
42021 26498205 25194149 25673191 25737962 25317042 26767762 30439274 32845870 31013463 26512779
42012 26512779 23001308 21362888 19837971 17872562 16738615 16452504 15271369 13185364
42004A3185364j47706L257484L610830M0228k813656j331654J907891K188307
41996A9897088l79078j561096J31130J269484p69167l291212k072378K243779
41988A5468550M669218K432081j819710l972330l176826j309671L04038J545512
41980A4140862J981578J031769m93181r87473l58975o91k81300r3219N52844j44993
41970A5347221k500226l703498j743297Q84977M43189k176990k535504M04894
41962D420766K383477K96191k994828k872429N74857L432858L744608L091431
41954A2076931K969240K747155J578709j30338j790941l300269m183802l743060
41946F223625k387789j190866P862K106836M155852L702296N95673j922467j362654
$$ plain form
42004 13185364 13037658 16295142 19905972 19946200 17132544 15800890 17708781 19897088
41996 19897088 19518010 17956914 18088044 19357528 18588361 15297149 13224771 15468550
41988 15468550 20137768 22569849 20750139 16777809 13600983 12291312 12595350 14140862
41980 14140862 16122440 17154209 16661028 15673555 15314580 15313889 15032589 14939370 15492214 15347221
41970 15347221 12846995 9143497 7400200 8285177 8728366 6551376 4015872 4420766
41962 4420766 6804243 7100434 4105606 1233177 1808034 5240892 8985500 12076931
41954 12076931 15046171 17793326 19372035 19241697 17450756 14150487 9966685 6223625
41946 6223625 3835836 2644970 2652832 4759668 8915520 12617816 13213489 11291022 9928368
41937I928368P87855J629967Q16772J1422o5301J58507O78304J420938J148944
41928A6515776o92629j810232L86010M257709N072749J310133l069454l959132
41920A8010930k112355q73743j087220j012079j40409K0403q85995q59926J311394
41911A2371000L580505K996503l50533l355957l658453k010743o96827p09247
41903H166248j095691m75357J378162L185885L154490P45606k379852l802847
41895H876644k932765j337864k97163N97570J655980J661680j5923j302747P1199
41886F976611K713023L131580R96965m28480L27493P13274j067714k505605q45577
41877A0011570J977443K087213k41679j138180P14741K250030Q54279k135140
$$ plain form
41937 9928368 10716223 12346190 13162962 13174384 13109083 13267590 13945894 15366832 16515776
41928 16515776 15823147 14012915 14398925 18656634 23729383 25039516 21970062 18010930
41920 18010930 15898575 15024832 13937612 12925533 12785124 12805527 11919532 11059606 12371000
41911 12371000 15951505 18948008 18597475 15241518 11583065 9572322 8875495 8166248
41903 8166248 7070557 6595200 7973362 11159247 14313737 15059343 12679491 8876644
41895 8876644 5943879 4606015 4308852 4906422 6562402 8224082 8208159 6905412 6976611
41886 6976611 9689634 12821214 13818179 13389699 13717192 14430466 13362752 10857147 10011570
41877 10011570 11989013 14076226 13834547 12696367 13411108 15661138 16515417 14380277
41869A4380277l873664l477290j750887N69131K780714L738196K862210J006058
41861A6234745n62948j483452k015466k097635j387630N2404J559529K347783
41853A2647330K227238J873233J914048J644900l19825l528754n165984l327641
41845G964545K87413K550308K759558K452650K327320J760814R18570P37357P81206
41836B2539741l88324k429768l242157k208823j002987n66615J87061J726497
41828A4614625K453798J255467o23733j648347j966221j918273o31095K086744
41820A3622965M149878L535901J104847o57331p89974k75001k15141r55767k191568
41811A7328809k819750j629495Q59978K374409J708713L31745J42330J021118
$$ plain form
41869 14380277 10506613 7029323 5278436 5847567 8628281 12366477 15228687 16234745
41861 16234745 15671797 14188345 12172879 10075244 8687614 8740018 10299547 12647330
41853 12647330 14874568 16747801 18661849 20306749 19986924 16458170 11292186 7964545
41845 7964545 8251958 10802266 13561824 16014474 18341794 20102608 21021178 21758535 22539741
41836 22539741 22151417 19721649 16479492 14270669 13267682 12701067 12888128 14614625
41828 14614625 17068423 18323890 17700157 16051810 14085589 12167316 11536221 13622965
41820 13622965 17772843 21308744 22413591 21756260 20966286 20691285 20476144 19520377 17328809
41811 17328809 14509059 12879564 13739542 16113951 17822664 18154409 18296739 19317857
41803A9317857J732377J720456P63400j433693l765170l657415m39910K782361
41795A7020263K766383K77239j600822j934490k154367k798262k816749j779104
41787F980091m04538Q90421J956361J855961n8922k377320k966559j729888j67222
41778C978385J112681K241967K259452K37709k015484j352319K200648M890497
41770A3553536L851775J45270l301503m701452l843025j590346K90131M21888
41762D826274n23281p56621J16409J086842J781228K404798K180770N28807n92808
41753A1052418J147026L884077L080449j464439m298175k006378J729508J787604
41745A4912090j002056k021469j86737J217544J43920j774795k510301k078121
$$ plain form
41803 19317857 21050234 22770690 23534090 22100397 18335227 14677812 14237902 17020263
41795 17020263 19786646 20063885 18463063 16528573 14374206 11575944 8759195 6980091
41787 6980091 6575553 7465974 9422335 11278296 11219374 8842054 5875495 4145607 3978385
41778 3978385 5091066 7333033 9592485 9830194 7814710 6462391 8663039 13553536
41770 13553536 17405311 17550581 14249078 9547626 5704601 4114255 4404386 4826274
41762 4826274 4302993 3546372 3662781 4749623 6530851 8935649 11116419 11645226 11052418
41753 11052418 12199444 16083521 19163970 17699531 13401356 11394978 13124486 14912090
41745 14912090 13910034 11888565 11701828 12919372 13063292 11288497 8778196 6700075
41737F700075j102763L62428J705241J590997k1184j274152q26879L15497L56876
41728G806136p51724j328196j76241J987318L387358L069033J650303K90050n67296
41719A5366741r73158n67946R52987K505707K190905j57016k195716j843699N7595
41710A5336400J003465J61417q66746n31978O52365J124143N59951J77631O50255
41701A8266903P55114p61392k541121j921435O73551J311735j636299l947064
41693A0199992j254688L591471L698632j719575n784509l848678L91651J506336
41685F780632J81005J66910J251537P51788l08600J436620M754928M168224j661045
41676A7521999o922810o203909j196674K660469L199372K222099J300654K34812
$$ plain form
41737 6700075 5597312 5959740 7664981 9255978 9234794 7960642 7133763 7449260 7806136
41728 7806136 7054412 5726216 5549975 7537293 10924651 13993684 15643987 15934037 15366741
41719 15366741 14393583 13825637 14778624 17284331 19475236 19318220 17122504 15278805 15336400
41710 15336400 16339865 16501282 15634536 15102558 15754923 16879066 17439017 17616648 18266903
41701 18266903 19022017 18260625 15719504 13798069 14471620 15783355 14147056 10199992
41693 10199992 8945304 12536775 16235407 14515832 8731323 4882645 5274296 6780632
41685 6780632 6961637 7128547 8380084 9131872 8823272 10259892 15014820 19183044 17521999
41676 17521999 10599189 4395280 3198606 5859075 9058447 11280546 12581200 12816012
41668A2816012r05737j028839J67438J323417J131208N4119m15930R9934K71532
41659A3513154j052100k976266l493564k043305N6277J664805K658830K530214
41651A0858045M84498k112985k112941P09643K154511l05888k745472l77780M247934
41642A0799565M346813m84872l271185n25407K462970N17324l066359k217649
41634H561200K024415L567420J005300j146027n07795J06629j081517j157934
41626A1371691K023467M940758K929511k703933o076663m464376j131607j01944
41618F786904j100802j221971K81977J177720n4202j763277j456026N15805J317070
41609D483198l24144k208685j764304L74634J570516J142051R49255K013452K840614
$$ plain form
41668 12816012 11910275 10881436 11048874 12372291 13503499 13557618 13141688 13241622 13513154
41659 13513154 12461054 9484788 5991224 3947919 4004196 5669001 8327831 10858045
41651 10858045 11342543 9229558 7116617 7826260 9980771 9674883 6929411 6551631 10799565
41642 10799565 15146378 14661506 11390321 10864914 13327884 13845208 10778849 8561200
41634 8561200 10585615 14153035 15158335 14012308 13504513 13611142 12529625 11371691
41626 11371691 13395158 18335916 21265427 18561494 12484831 8020455 6888848 6786904
41618 6786904 5686102 4464131 4746108 5923828 5869626 4106349 2650323 3166128 4483198
41609 4483198 4159054 1950369 186065 560699 2131215 3273266 4222521 6235973 9076587
41600I076587K030487O06732J68237J34621j127377l155052l597816j635712P90187
41591C290894J663028J070638m671j293728k405545j984332M55601K857611K841742
41582F491238J100262M44412J562299K056919L06270j892641j820558N43948K802325
41573A1594474L040897J284279j090542k317797j406487P01696J923569J708542
41565A5438631J714512K883087L466474J625930j429840l046554k828332k397813
41557A5426095k267704j653158j027139j854967l448911l028651R9195L013465
41549E258225L213753J974834J958892L187825L315468R67512k713629n278222
41541A1884658m837305j579407J867130K692622J203945M80717J987663L387245
$$ plain form
41600 9076587 11107074 11713806 11882043 12016664 10889287 7734235 4136419 2500707 3290894
41591 3290894 4953922 6024560 6019889 4726161 2320616 336284 791885 3649496 6491238
41582 6491238 7591500 8035912 9598211 11655130 11961400 10068759 8248201 8792149 11594474
41573 11594474 14635371 15919650 14829108 12511311 11104824 11806520 13730089 15438631
41565 15438631 17153143 20036230 23502704 25128634 23698794 20652240 17823908 15426095
41557 15426095 13158391 11505233 10478094 8623127 5174216 2145565 2244760 5258225
41549 5258225 8471978 10446812 12405704 15593529 18908997 19876509 17162880 11884658
41541 11884658 7047353 5467946 7335076 10027698 11231643 11712360 13700023 17087268
41533A7087268K109034p63113k258421j792990j192472j190181n84402R89411
41525A2404134J829478N82491j665583k690405j663582L21665J694078J764361
41517A2576637Q48952m66998j794963k551793j800272M53787K120634Q71773k486685
41508G771072m282931k534341N13387J667135Q28317K7532J20507P09266J950514
41499F770458L724207L987208J071075k733540l134041L32550L526238L424139
41491A6968294J458104n0193j486369l685718m749220k329248K149058M568869
41483A2843577L138692m7804k364200l253753l115358j810751M81381K298785
41475H170569K302526J183859Q91456J914812K437132P58520k218894l943299
$$ plain form
41533 17087268 19196302 18433189 16174768 14381778 13189306 11999125 11414723 12404134
41525 12404134 14233612 14816103 13150520 10460115 8796533 9118198 10812276 12576637
41517 12576637 13425589 12958591 11163628 8611835 6811563 7265350 9385984 10257757 7771072
41508 7771072 3488141 953800 1467187 3134322 3962639 3990171 4110678 4819944 6770458
41499 6770458 10494665 14481873 15552948 12819408 9685367 10017917 13544155 16968294
41491 16968294 18426398 18376205 16889836 13204118 8454898 6125650 8274708 12843577
41483 12843577 15982269 15934465 13570265 10316512 7201154 5390403 5871784 8170569
41475 8170569 10473095 11656954 12548410 14463222 16900354 17658874 15439980 11496681
41467A1496681l355071j800989o36557M96172K018457K580880Q08311j912214
41459I695670k671408j046310L25898l57356j681543j436000L94413K237046L044498
41450H504908K590252J017087o06517n53987J273997K436701Q85117k109935l521680
41441I915943k240481L51008K564636L396914K196272n20464k407199j660856
41433A1595773J51443j34109k723944m478394l347369p09843J357087K593346
41425D303990L206763K481696M80326q38611j38919J228503J532972J374350J863936
41416A5495006J729003p67718l940326m127332j106623J194227K42400j789968
41408F928669j756768r2266M96428p32553j901047j357034O72604K880428L855106
$$ plain form
41467 11496681 8141610 6340621 5704064 6200236 8218693 10799573 11607884 9695670
41459 9695670 7024262 5977952 6303850 5946494 4264951 2828951 3223364 5460410 8504908
41450 8504908 11095160 12112247 11505730 10951743 12225740 14662441 15547558 13437623 9915943
41441 9915943 7675462 8026470 10591106 13988020 16184292 15663828 13256629 11595773
41433 11595773 11747216 11613107 8889163 4410769 1063400 353557 1710644 4303990
41425 4303990 7510753 9992449 10472775 9634164 9495245 10723748 12256720 13631070 15495006
41416 15495006 17224009 16456291 12515965 8388633 7282010 8476237 8718637 6928669
41408 6928669 5171901 5079635 5576063 4843510 2942463 1585429 2258033 5138461 8993567
41399H993567K640433k39513k484532k075648K85309J796855P17510j843872l301841
41390D488268k189959M73791K006254O79315k073292k873566m56246K604313L273181
41381E932059J840419O10749L0295j304915l199837l328999p85394K217279L208591
41372E220247K201639O62750n59291j341180j824055k578649l733670l635424
41364e587633n69785L674462M853667K117778l56126M25113J814580L83638j968223
41355D787471j218637J644307J996129o96758k003096P0033J999830P83470j463927
41346E898822j465858K47097J161911Q65478N60704O11053R90177K257460L868428
41337A4995272L523099N33055k157525j838032P032L31225p85578j232187r65737
$$ plain form
41399 8993567 11634000 11394487 8909955 6834307 7119616 8916471 9633981 7790109 4488268
41390 4488268 2298309 2772100 4778354 5457669 3384377 510811 54565 2658878 5932059
41381 5932059 7772478 8383227 8413522 7108607 3908770 579771 -205623 2011656 5220247
41372 5220247 7421886 8084636 7525345 6184165 4360110 1781461 -1952209 -5587633
41364 -5587633 -6157418 -2482956 2370711 4488489 4132363 4557476 6372056 6755694 4787471
41355 4787471 3568834 5213141 7209270 6512512 4509416 4579449 6579279 7362749 5898822
41346 5898822 4432964 4680061 5841972 6707450 7268154 7879207 8869384 11126844 14995272
41337 14995272 18518371 19051426 16893901 15055869 15062901 15394126 14608548 13376361 12410624
41328A2410624j386079j778051k91476K051374K237511J16002j438897j429985
41320A0491023j803013k931305k306137O58088K559387J185763p47887j8418J950396
41311I037897J890466L33453M36679K497206L687138K793931J392330J92656k000590
41302B0261166m861957n635521l278049n67134l0961k67852J169408L215943K746043
41293A2751086l90579k952811k860530j292713J84501J726559L270792L126893
41285A3563198N96770j847858j490006O61607J427761K80373l77093K58023o8191
41276A3004584k417622m054339k355404R45607K225990J197256N67751J237939
41268A0351762J183471o07641k196811j821162n35275k63743j012013j509403
$$ plain form
41328 12410624 11024545 9246494 8955018 11006392 13243903 13359905 11921008 10491023
41320 10491023 8688010 5756705 3450568 4108656 6668043 7853806 7105919 7087501 9037897
41311 9037897 10928363 11261816 11698495 14195701 17882839 20676770 22069100 22261756 20261166
41302 20261166 15399209 9763688 6485639 5918505 5887544 5619692 6789100 10005043 12751086
41293 12751086 12360507 9407696 6547166 5254453 5438954 7165513 10436305 13563198
41285 13563198 14159968 12312110 10822104 11483711 12911472 13191845 12814752 13072775 13004584
41276 13004584 10586962 6532623 4177219 5122826 7348816 8546072 9113823 10351762
41268 10351762 11535233 10927592 8730781 6909619 6374344 6110601 5098588 3589185
41260C589185j253741m92294P16892K044358K368087J023241r84494j958336j178029
41251C874869Q75812K952165L261154Q46957k459185l290436j133759O31998k49374
41242E310201j383987L5094J924505M39949l022351l134963Q63733L320466O04332
41233D956979l430606l457443j90883J992210J936944J721646J705867L81757
41225E616471j519910j375670O79665J621472O66926M09509J646792J325672k063558
41216G007369m819270l063145J293348L348527K204839J253736K300819L315116
41208A2841339K276018q2790k189377l574103l931360k651971m79796M44783m84317
41199B168426j182067l9587J487001J193859l54282o61701J089498L146025L579406
$$ plain form
41260 3589185 2335444 1843150 2560042 4604400 6972487 7995728 7011234 5052898 3874869
41251 3874869 4750681 7702846 10964000 11810957 9351772 6061336 4927577 5559575 5310201
41242 5310201 3926214 3961308 5885813 6325762 3303411 168448 1032181 4352647 4956979
41233 4956979 1526373 -1931070 -2121953 -129743 1807201 3528847 5234714 5616471
41225 5616471 4096561 2720891 3400556 5022028 5688954 6098463 7745255 9070927 7007369
41216 7007369 2188099 -875046 418302 3766829 5971668 7225404 9526223 12841339
41208 12841339 15117357 15034567 12845190 9271087 5339727 2687756 2207960 2652743 2168426
41199 2168426 986359 946772 2433773 3627632 3273350 2611649 3701147 6847172 10426578
41190A0426578K039842o29586l095620l962200k801083q36823K94861K73448k22000
41181A487417q84835j543556j218579P49478K858943K778433P41892m81310L55708
41172D843591J110063l01765k525066k757536q50184P70219P64073L75776J123009
41163B552180K650950L421713K531037M85228j141865q67541J024940K128034
41155A2784676L67803l185814n263921m323772k063216o10154J4209N49987L96400
41146a333802j146838k597777j714123R23101K109373L44439k156603k759025
41138h331255j724188p01604L22491K292509M322500M295043K143584K01792p3338
41129B747534L82955N09721O73941J006385M03060j296088k078565o18943J280484
$$ plain form
41190 10426578 12466420 11836834 8741214 4779014 1977931 1141108 1435969 1709417 1487417
41181 1487417 602582 -940974 -2159553 -1410075 1448868 4227301 4969193 4487883 4843591
41172 4843591 5953654 5651889 3126823 369287 -480897 289322 1053395 1429171 2552180
41163 2552180 5203130 8624843 11155880 11641108 10499243 9631702 10656642 12784676
41155 12784676 13152479 9966665 4702744 378972 -1684244 -2294398 -2280189 -1730202 -1333802
41146 -1333802 -2480640 -5078417 -6792540 -5869439 -3760066 -3415627 -5572230 -8331255
41138 -8331255 -10055443 -10757047 -10434556 -8142047 -3819547 475496 2619080 2820872 2747534
41129 2747534 3130489 3640210 4314151 5320536 5723596 4427508 2348943 1730000 3010484
41120C010484J310820K87295N41250J760641J528818l92350j604794j195118j052165
41111D194881k103158k336767k62859K248676K661721J280260o4704j055037k227653
41102B335360k665514j009103J854946L458782K837864J054411r27600k859053
41094D080093l933343l041348o28585J337935J653326R56668M43800O17594J305673
41085B791813J894767J647842N88244l94212j033497k187527l735736l577276
41077d005582o93101K334103K546052J101447J261834K791947K415483j89841
41069G562342j349822N15941K060524M08412k307885k577022p20975N24755L30280
41060D446550l19371j138967j998442j422880J406840M323694M561736K454705
$$ plain form
41120 3010484 4321304 4608599 5149849 6910490 8439308 8046958 6442164 5247046 4194881
41111 4194881 2091723 -245044 -507903 1740773 4402494 5682754 5618050 4563013 2335360
41102 2335360 -330154 -1339257 515689 3974471 6812335 7866746 6939146 4080093
41094 4080093 146750 -2894598 -3523183 -2185248 -531922 424746 868546 1486140 2791813
41085 2791813 4686580 6334422 6922666 6528454 5494957 3307430 -428306 -4005582
41077 -4005582 -4698683 -2364580 181472 1282919 2544753 5336700 7752183 7562342
41069 7562342 6212520 6728461 8788985 9197397 6889512 4312490 3591515 4116270 4446550
41060 4446550 4127179 2988212 989770 -433110 973730 5297424 9859160 12313865
41052A2313865L43352q87204j567884j058519R83825K271609L90674k862447l192334
41043F734937J12329L093446K489810p18478l536388m062179k057068J022099
41035C078508K354583O26430j562167r72543J060401M42065k722781l635213l64178
41026a694895K928068K640373J115093J931882L528478J873850k773120o115353
41018C434376n728386l054880k09748J875575K485080J347952p3966R0009J481154
41009A647166K093625J138966n29737k215492l503975l264319r22671J659888
41001c896549K031681O82026K46822J225063J235562q72481k796305k011352O12960
40992c542573J992359O84637j670644k451642r05682J141379J436238Q2605n46905
$$ plain form
41052 12313865 12657217 11770013 10202129 9143610 10127435 12399044 12789718 9927271 6734937
41043 6734937 6847266 9940712 12430522 11712044 8175656 4113477 2056409 3078508
41035 3078508 5433091 6059521 4497354 3524811 4585212 5027277 2304496 -1330717 -1694895
41026 -1694895 1233173 3873546 4988639 6920521 10448999 12322849 9549729 3434376
41018 3434376 -2294010 -5348890 -5558638 -3683063 -1197983 149969 76003 166012 1647166
41009 1647166 3740791 4879757 4350020 2134528 -1369447 -4633766 -5556437 -3896549
41001 -3896549 -1864868 -1182842 -936020 289043 1524605 652124 -2144181 -4155533 -3542573
40992 -3542573 -1550214 -865577 -2536221 -4987863 -5893545 -4752166 -3315928 -3233323 -3780228
40983c780228J019699L369927M115325K602565j62179k831635l786231j706252
40975a159009K109770L780506J500964j491171j271549J151405J891427L64454
40967F876797o82793m81866r46640j996875r80632K144587L529361J147507k071447
40958F537999k852111j792620q28090R8056J313643J488010K01600k63878J494563
40949E397172L125133K073739l59392j495381j538074k114933k589407j377266
40941A121591N72907J124895O33126R54326J827005J561898M47400Q9237N2551
40932H384936j396682l590884l877133j685935Q25196K100688K340638J666553
40924D767377J50983o44355O24430K036474M48431l428422n510408m105247j566040
$$ plain form
40983 -3780228 -2760529 609398 4724723 7327288 7165109 4333474 547243 -1159009
40975 -1159009 950761 4731267 6232231 4741060 3469511 4620916 6512343 6876797
40967 6876797 6194004 5712138 4765498 2768623 1787991 3932578 7461939 8609446 6537999
40958 6537999 3685888 1893268 1065178 1163234 2476877 3964887 4166487 3902609 5397172
40949 5397172 8522305 10596044 10236652 8741271 7203197 5088264 2498857 1121591
40941 1121591 1694498 2819393 3452519 4406845 6233850 7795748 8243148 8332385 8384936
40932 8384936 6988254 3397370 -479763 -2165698 -1340502 760186 3100824 4767377
40924 4767377 4918360 4274005 4898435 6934909 7383340 3954918 -1555490 -5660737 -7226777
40915g226777J98671J917438L691834L518872Q44008j707882k038660j268968
40907b071464j166135j606533k028819k569073k334312L45720M294784N427382
40899a708450K402221q84614q35479J029158J506991P49015N71724O54838J20203
40890C605607L53281K290132L223414O93789k474643j984486O07784J7373l829618
40881B502633n112575j395900K298714J266160j981977k304333J69538J136651
40873c421089p39992k165182n74151K325228L438900K484730J656264J992608
40865D997316J873594l19683l265691m035842k164857l56879m34242q27799K76921
40856d257162J553942R70923j99147O67995K631797K312111k57366j348663Q2569
$$ plain form
40915 -7226777 -7028106 -5110668 -1418834 2100038 2944046 1236164 -802496 -2071464
40907 -2071464 -3237599 -4844132 -6872951 -9442024 -11776336 -11430616 -7135832 -1708450
40899 -1708450 693771 -190843 -1026322 2836 1509827 2258842 2830566 3485404 3605607
40890 3605607 3958888 6249020 9472434 10166223 7691580 5707094 6314878 6332251 2502633
40881 2502633 -2609942 -4005842 -1707128 -440968 -2422945 -4727278 -4557740 -3421089
40873 -3421089 -4161081 -6326263 -6900414 -4575186 -1136286 1348444 3004708 4997316
40865 4997316 6870910 6551227 3285536 -750306 -2915163 -3272042 -3706284 -4534083 -4257162
40856 -4257162 -2703220 -1732297 -1931444 -1263449 1368348 3680459 3423093 2074430 2156999
40847B156999L56309k531552m751213k246537K699281M551903K255683k40498
40839B250375l16776M59216M9162r25234r76135l57748l95401j354004k079021
40830c645566j413644L95910J648238R36076q42243j202154N86072K239594J750477
40821D52760M37823P40943K130068J860701n57217k430124j860691j63893O59560
40812A269930P40383J239233K017026K035706J196688L34014j97076p76730j513937
40803F345237j826019j147452K44161J175677N58445j261426k546781k239537
40795f97695j421423j565629j965554p93128J486670K218099O31748p97672l38015
40786c242599L48078l59939n75622J869498M668765L733106p4156j557520Q52173
$$ plain form
40847 2156999 2513308 -18244 -4769457 -7015994 -4316713 235190 2490873 2250375
40839 2250375 1933599 2392815 2441977 1516743 540608 182860 -212541 -1566545 -3645566
40830 -3645566 -5059210 -4663300 -3015062 -2078986 -2921229 -4123383 -3537311 -1297717 452760
40821 452760 890583 1631526 3761594 5622295 5065078 2634954 774263 610370 1269930
40812 1269930 2010313 3249546 5266572 7302278 8498966 8832980 8635904 7859174 6345237
40803 6345237 4519218 3371766 3615927 4791604 5350049 4088623 1541842 -697695
40795 -697695 -2119118 -3684747 -5650301 -6443429 -4956759 -2738660 -2106912 -2904584 -3242599
40786 -3242599 -2894521 -3254460 -3830082 -1960584 2708181 6441287 6367131 4809611 5661784
40777E661784K497538j03652l605789l104742K07643J206690j114392k669937
40769a024857j131925R04486O69975q18557j430090j406619j848715k092344j103800
$$ plain form
40777 5661784 8159322 8055670 4449881 1345139 1552782 2759472 1645080 -1024857
40769 -1024857 -2156782 -1252296 -582321 -1400878 -2830968 -4237587 -6086302 -8178646 -9282446
$$ [...]
##END NTUPLES=NMR SPECTRUM
##END=
