##TITLE=31Pdec_DE-1131_rm_3h
, 64 sc
 29.9.2025
##JCAMPDX= 6.0         $$ Bruker NMR JCAMP-DX V2.0
##DATA TYPE= NMR SPECTRUM
##DATA CLASS= NTUPLES
##ORIGIN= UXNMR, Bruker Analytische Messtechnik GmbH
##OWNER= root
$$ XWIN-NMR		Version 3.5
$$ Mon Sep 29 14:39:50 2025 Russian Standard Time (UT+4h)  she@DPX200
##.OBSERVE FREQUENCY= 81.013821
##.OBSERVE NUCLEUS= ^31P
##.ACQUISITION MODE= SIMULTANEOUS
##.ACQUISITION SCHEME= undefined
##.AVERAGES= 64
##.DIGITISER RES= 17
##SPECTROMETER/DATA SYSTEM= spect
##.PULSE SEQUENCE= zgpg30
##.SOLVENT NAME= CDCl3
##.SHIFT REFERENCE= (INTERNAL, CDCl3, 0, 198.062)
##AUDIT TRAIL= $$ (NUMBER, WHEN, WHO, WHERE, WHAT)
$$ ##TITLE= Audit trail, XWIN-NMR		Version 3.5
$$ ##JCAMPDX= 5.01
$$ ##ORIGIN= Bruker BioSpin GmbH
$$ ##OWNER= she
$$ F:/spectra/data/she/nmr/P31/2/pdata/1/auditp.txt
$$ ##AUDIT TRAIL=  $$ (NUMBER, WHEN, WHO, WHERE, WHAT)
(   1,<2025-09-29 14:38:32.78 +0400>,<she>,<DPX200>,
      <created by zg, POWCHK disabled, PULCHK disabled
       configuration hash MD5:
       00 E9 B6 7A A2 85 ED C7 34 08 36 98 17 FE 4E 26
       data hash MD5: 32K
       C5 A3 28 83 3F F9 CA 5C B6 6A 10 79 FE 41 F4 51>)
(   2,<2025-09-29 14:38:38.18 +0400>,<she>,<DPX200>,
      <Start of raw data processing
       efp BC_mod = 2 LB = 1.5 FT_mod = 6 PKNL = 1 PHC0 = 1667.951 PHC1 = 239.2999 SI = 64K 
       data hash MD5: 64K
       8D 75 5E 66 01 88 6A 0F 77 A3 CA 32 85 07 EE 8E>)
(   3,<2025-09-29 14:38:53.90 +0400>,<she>,<DPX200>,
      <pk PHC0 = 26.41063 PHC1 = 0 
       data hash MD5: 64K
       93 59 2A E2 2C C6 41 38 CD 7F 3C 07 EF 7A CC 6E>)
(   4,<2025-09-29 14:38:57.95 +0400>,<she>,<DPX200>,
      <abs ABSG = 5 
       data hash MD5: 64K
       72 AC 16 81 55 2C BF AB 1F EA 84 BE 1B C7 46 79>)
$$ ##END=
$$ 
$$ hash MD5
$$ 2E 7A 05 CE C1 2E A7 87 4A 4B CE 34 DB 94 D7 5F
##$RELAX= 
##$RELAX= 
##$RELAX= 
##$RELAX= 
##$RELAX= 
##$RELAX= 
##$RELAX= 
##$RELAX= 
$$ Bruker specific parameters
$$ --------------------------
##$DU= <F:/spectra>
##$EXPNO= 2
##$NAME= <P31>
##$PROCNO= 1
##$TYPE= <nmr>
##$USER= <she>
##$AMP= (0..31)
100 100 100 100 100 100 100 100 100 100 100 100 100 100 100 100 100 100 
100 100 100 100 100 100 100 100 100 100 100 100 100 100 
##$AQSEQ= 0
##$AQ_mod= 1
##$AUNM= <au_zg>
##$AUTOPOS= <>
##$BF1= 81.014009
##$BF2= 200.13
##$BF3= 200.13
##$BF4= 200.13
##$BF5= 200.13
##$BF6= 200.13
##$BF7= 200.13
##$BF8= 200.13
##$BYTORDA= 1
##$CFDGTYP= 0
##$CFRGTYP= 5
##$CHEMSTR= <none>
##$CNST= (0..31)
1 1 145 1 1 1 1 1 1 1 1 1 1 1 1 1 1 1 1 1 1 1 1 1 1 1 1 1 1 1 1 1 
##$CPDPRG= <waltz16>
##$CPDPRG1= <>
##$CPDPRG2= <waltz16>
##$CPDPRG3= <>
##$CPDPRG4= <mlev>
##$CPDPRG5= <mlev>
##$CPDPRG6= <mlev>
##$CPDPRG7= <mlev>
##$CPDPRG8= <mlev>
##$CPDPRGB= <>
##$CPDPRGT= <>
##$D= (0..31)
0 1 0 0 0 0 0 0 0 0.06 0 0.03 2e-05 3e-06 0 0 0.0002 0 0 0 0 0 0 0 0 0 
0 0 0 0 0 0 
##$DATE= 1759142312
##$DBL= (0..7)
120 120 120 11 120 120 24 19 
##$DBP= (0..7)
150 150 150 150 150 150 150 150 
##$DBP07= 0
##$DBPNAM0= <>
##$DBPNAM1= <>
##$DBPNAM2= <>
$$ [...]
##$SUBNAM3= <"">
##$SUBNAM4= <"">
##$SUBNAM5= <"">
##$SUBNAM6= <"">
##$SUBNAM7= <"">
##$SUBNAM8= <"">
##$SUBNAM9= <"">
##$SW= 400.765351723535
##$SWIBOX= (0..15)
0 1 3 0 0 0 0 0 0 0 0 0 0 0 0 0 
##$SW_h= 32467.5324675325
##$TD= 32768
##$TD0= 1
##$TE= 0
##$TE2= 300
##$TE3= 300
##$TEG= 300
##$TL= (0..7)
0 120 53 12 22 120 120 120 
##$TP= (0..7)
150 150 150 150 150 150 150 150 
##$TP07= 0
##$TPNAME0= <>
##$TPNAME1= <>
##$TPNAME2= <>
##$TPNAME3= <>
##$TPNAME4= <>
##$TPNAME5= <>
##$TPNAME6= <>
##$TPNAME7= <>
##$TPOAL= (0..7)
0.5 0.5 0.5 0.5 0.5 0.5 0.5 0.5 
##$TPOFFS= (0..7)
0 0 0 0 0 0 0 0 
##$TUNHIN= 0
##$TUNHOUT= 0
##$TUNXOUT= 0
##$USERA1= <user>
##$USERA2= <user>
##$USERA3= <user>
##$USERA4= <user>
##$USERA5= <user>
##$V9= 5
##$VALIST= <valist>
##$VCLIST= <CCCCCCCCCCCCCCC>
##$VD= 0
##$VDLIST= <DDDDDDDDDDDDDDD>
##$VPLIST= <PPPPPPPPPPPPPPP>
##$VTLIST= <TTTTTTTTTTTTTTT>
##$WBST= 1024
##$WBSW= 4
##$XGAIN= (0..3)
0 0 0 0 
##$XL= 0
##$YL= 0
##$YMAX_a= 33286
##$YMIN_a= -45302
##$ZGOPTNS= <>
##$ZL1= 120
##$ZL2= 120
##$ZL3= 120
##$ZL4= 120
##$ABSF1= 198.0616
##$ABSF2= -202.7028
##$ABSG= 5
##$ABSL= 3
##$ALPHA= 0
##$AQORDER= 0
##$ASSFAC= 0
##$ASSFACI= 0
##$ASSFACX= 0
##$ASSWID= 0
##$AUNMP= <proc_1d>
##$AZFE= 0.1
##$AZFW= 0.5
##$BCFW= 0
##$BC_mod= 2
##$BYTORDP= 0
##$COROFFS= 0
##$CY= -3
##$DATMOD= 1
##$DC= 0
##$DFILT= <>
##$DTYPP= 0
##$F1P= 0
##$F2P= 0
##$FCOR= 1
##$FTSIZE= 65536
##$FT_mod= 6
##$GAMMA= 0
##$GB= 0
##$INTBC= 1
##$INTSCL= 9.790993e-09
##$ISEN= 30
##$LB= 1.5
##$LEV0= 0
##$LPBIN= 0
##$MAXI= 10000
##$MC2= 0
##$MEAN= 0
##$ME_mod= 0
##$MI= 50
##$NCOEF= 0
##$NC_proc= -8
##$NLEV= 6
##$NOISF1= 182.463
##$NOISF2= 159.3651
##$NSP= 0
##$NTH_PI= 0
##$NZP= 0
##$OFFSET= 198.0616
##$PC= 4
##$PHC0= 1694.362
##$PHC1= 239.2999
##$PH_mod= 1
##$PKNL= yes
##$PPARMOD= 0
##$PSCAL= 0
##$PSIGN= 0
##$REVERSE= no
##$SF= 81.0140089999434
##$SI= 65536
##$SIGF1= 159.3651
##$SIGF2= -187.1042
##$SINO= 113.3802
##$SIOLD= 16384
##$SREGLST= <1H.CDCl3>
##$SSB= 0
##$STSI= 65536
##$STSR= 0
##$SW_p= 32467.5324675325
##$SYMM= 0
##$S_DEV= 0
##$TDeff= 32768
##$TDoff= 0
##$TI= <>
##$TILT= no
##$TM1= 0
##$TM2= 0
##$TOPLEV= 0
##$USERP1= <user>
##$USERP2= <user>
##$USERP3= <user>
##$USERP4= <user>
##$USERP5= <user>
##$WDW= 1
##$XDIM= 65536
##$YMAX_p= 401493688
##$YMIN_p= -36992042
$$ End of Bruker specific parameters
$$ ---------------------------------
##NTUPLES= NMR SPECTRUM
##VAR_NAME=  FREQUENCY,     SPECTRUM/REAL,   SPECTRUM/IMAG
##SYMBOL=    X,             R,               I
##VAR_TYPE=  INDEPENDENT,   DEPENDENT,       DEPENDENT
##VAR_FORM=  AFFN,          ASDF,            ASDF
##VAR_DIM=   65536,         65536,           65536
##UNITS=     HZ,            ARBITRARY UNITS, ARBITRARY UNITS
##FACTOR=    0.49542278885378, 1,            1
##FIRST=     16045.7642231865, 0,            0
##LAST=      -16421.768244346, 0,            0
##MIN=       -16421.768244346, -36992042,    0
##MAX=       16045.7642231865, 401493688,    0
$$ Real data points
##PAGE= N=1
##DATA TABLE= (X++(R..R)), XYDATA
$$ [...]
45317A5129575o76546k412748l464534l350849j714125P40025J783159R8897j962943
$$ 15129575 14453029 12040281 8575747 5224898 3510773 4250798 6033957 6132854 4169911
45308D169911p12020L257828M860275J450335l075231l566877m79836J640008
$$ 4169911 3457891 6715719 11575994 13026329 9951098 6384221 5904385 7544393
45300G544393P30503j093276j499209m80981P71977J130947k4635j749309j778475
$$ 7544393 8274896 7181620 5682411 5201430 5973407 7104354 7079719 5330410 3551935
45291C551935L53974J953425J167345K82625J802111L392700J278980k772006
$$ 3551935 3905909 5859334 7026679 7309304 9111415 12504115 13783095 11011089
45283A1011089l366351r3083J754396l1683j321970M60467J356172k168224o486264
$$ 11011089 7644738 7551655 9306051 9274368 7952398 8412865 9769037 7600813 1114549
45274A114549o316875l017665j399633j093392K046974P025120P466415J553445
$$ 1114549 -5202326 -8219991 -9619624 -10713016 -8666042 -1640922 5825493 7378938
45266G378938m101218l394188J224734L207407Q76029k132249l167185k944160
$$ 7378938 3277720 -116468 1108266 4315673 5191702 3059453 -107732 -3051892
45258c051892k237657j85501L207370N632036N067109K384049J36344m25493j55803
$$ -3051892 -5289549 -5475050 -2267680 3364356 8431465 10815514 10951858 10526365 10370562
45249A0370562l67642j302673k149237k019376q79222K58563K43236q42955j496173
$$ 10370562 10002920 8700247 6551010 4531634 3652412 3910975 4154211 3311256 1815083
45240A815083m64355J509709K233115N22601k356106l969500l081568n44747J708677
$$ 1815083 1350728 2860437 5093552 5616153 3260047 -709453 -3791021 -4335768 -2627091
45231b627091K236273J092115l17709p47657p41238k027432m738419o204714l805982
$$ -2627091 -390818 701297 383588 -364069 -1105307 -3132739 -7871158 -14075872 -17881854
45222a7881854J456460N668094O206578L957002J417894J33449K53623J043697
$$ -17881854 -16425394 -10757300 -4550722 -593720 824174 957623 1211246 2254943
45214B254943J138420m29565k713854l451415j786116P37063K402995L095933
$$ 2254943 3393363 2963798 249944 -3201471 -4987587 -4250524 -1847529 1248404
45206A248404L114402J965462l24965k190120k405327j770666j359067n07496
$$ 1248404 4362806 6328268 6003303 3813183 1407856 -362810 -1721877 -2229373
45198b229373J435918K738100J347583j409777k108031p3408J844860J583153
$$ -2229373 -793455 1944645 3292228 1882451 -225580 -298988 1545872 3129025
45190C129025J71310q01372j236516j147674J6840J465577J239719k04402M04215
$$ 3129025 3300335 2498963 1262447 114773 131613 1597190 2836909 2632507 3036722
45181C036722L781751N440944J745232l919499n276311j905335R03356M58083
$$ 3036722 6818473 12259417 14004649 10085150 4808839 2903504 3806860 4264943
45173D264943m53341K17785J07980k423342m077443j498169K743418L482551M80591
$$ 4264943 3811602 4029387 4137367 1714025 -2363418 -3861587 -1118169 2364382 2844973
45164B844973j808911j159649R8218k06661j060440q78621J91589J693184L584036
$$ 2844973 1036062 -123587 -25369 -232030 -1292470 -2171091 -1979502 -286318 3297718
45155C297718M446566K187204j887477k989313P91486N021961M793854J408420
$$ 3297718 7744284 9931488 8044011 5054698 5846184 10868145 15661999 17070419
45147A7070419m76332k06132j015124l530272m454942k321169M0708L81900M16743
$$ 17070419 16594087 16387955 15372831 11842559 7387617 5066448 5107156 5489056 5905799
45138E905799K003090L259667J531498j997930l767804k601112k84755J616429
$$ 5905799 7908889 11168556 12700054 10702124 6934320 4333208 4048453 5664882
45130E664882K875339L142543J976246K77111m90859o22364j795944m185707n744110
$$ 5664882 8540221 11682764 13659010 13936121 13445262 12822898 11026954 6841247 1097137
45121A097137m810933k030205O95731J960721J392589k64598j326752o19423R78943
$$ 1097137 -3713796 -5744001 -5048270 -3087549 -1694960 -1959558 -3286310 -3905733 -2926790
45112b926790J547676P83024K78759Q35890J040304n79105l101889m082490k429501
$$ -2926790 -1379114 -596090 -317331 518559 1558863 979758 -2122131 -6204621 -8634122
45103h634122L93324J936179J193913m28765o01065J319581L579721M321544L666982
$$ -8634122 -8240798 -6304619 -5110706 -5539471 -6140536 -4820955 -1241234 3080310 6747292
45094F747292K481923K41966l682633p133819o511127j763874K674778L462372
$$ 6747292 9229215 9471181 5788548 -1345271 -7856398 -9620272 -6945494 -3483122
45086c483122K459366L112845M796718L859017n62982m977029o026713l962393
$$ -3483122 -1023756 2089089 6885807 10744824 10181842 5204813 -821900 -4784293
45078d784293j044464J180785K038132J288648O4116O54603L561237N785580L991365
$$ -4784293 -5828757 -4647972 -2609840 -1321192 -1257076 -602473 2958764 8744344 12735709
45069A2735709j068281n113728n287567k824340n71071K78118J46340m37816p51159
$$ 12735709 11667428 6553700 1266133 -1558207 -2129278 -1851160 -1704820 -2142636 -2893795
45060b893795M31195K993071M067456J007880m146478n958087k455678J875990
$$ -2893795 -2462600 530471 4597927 5605807 1459329 -4498758 -6954436 -5078446
45052e078446J972946j172209k684219j083016M20196l49249j545249j113215
$$ -5078446 -3105500 -4277709 -6961928 -8044944 -7624748 -7973997 -9519246 -10632461
45044a0632461P9525R10996K570685N629137P151109M349206m50182k315711m57930
$$ -10632461 -10552936 -9641940 -7071255 -1442118 5708991 10058197 9608015 7292304 6834374
45035F834374J340831Q55978r8623n983k91219j779588k202036k2759K152511
$$ 6834374 8175205 9031183 8932560 8926577 8635358 6855770 4653734 4630975 6783486
45026F783486J335635q44951p00276J344191J393770j355753l111381j590029
$$ 6783486 8119121 7274170 6573894 7918085 9311855 7956102 4844721 3254692
45018C254692M08655j94157j646394m02149K672245L038231p63058m567171l966968
$$ 3254692 3663347 3469190 1822796 1420647 4092892 7131123 6368065 1800894 -2166074
45009b166074J30555L071781K284423l26077j497743n01081P14221M53638o31987
$$ -2166074 -2035519 1036262 3320685 2994608 1496865 995784 1710005 2163643 1531656
45000A531656o51200Q18925J910259P11587k176859m141201l578866j555318m5769
$$ 1531656 880456 1699381 3609640 4321227 2144368 -1996833 -5575699 -7131017 -7176786
44991g176786O36729J663785L282960L960611K543106K87162m84379N27766J196755
$$ -7176786 -6540057 -4876272 -1593312 2367299 4910405 5197567 4713188 5240954 6437709
44982F437709k8618k023679k777788k161839j416815n93040J373143L819698L893838
$$ 6437709 6409091 4385412 1607624 -554215 -1971030 -2564070 -1190927 2628771 6522609
44973F522609L24263l913618m648201j563322J614340J764765m90191k414730
$$ 6522609 6846872 2933254 -1714947 -3278269 -1663929 100836 -389355 -2804085
44965b804085k292633m06037J801425K794904K068742P84242N54659J262409J083002
$$ -2804085 -5096718 -5502755 -3701330 -906426 1162316 1946558 2501217 3763626 4846628
44956D846628q23290k780166k645754n25398J585680K266404J764322J047470
$$ 4846628 4023338 1243172 -1402582 -1927980 -342300 1924104 3688426 4735896
44948D735896P62713R58142J036881J33324j766083l249051k774859n85508J251178
$$ 4735896 5498609 6456751 7493632 7626956 5860873 2611822 -163037 -748545 502633
44939E02633R10168j240577k812085j707208J429680L486299K453156K80555N61239
$$ 502633 1412801 172224 -2639861 -4347069 -2917389 568910 3022066 3302621 3863860
44930C863860L340673M493376J310850l498870n314001l360139n27568J295498
$$ 3863860 7204533 11697909 13008759 9509889 4195888 835749 308181 1603679
44922A603679K712792M055844M227337K877957J282317K46076q18094j972473
$$ 1603679 4316471 8372315 12599652 15477609 16759926 17006002 16187908 14215435
44914A4215435j937035k28630J590632J915045R81644j25467r73047j436939j253011
$$ 14215435 12278400 12049770 13640402 15555447 16537091 16411624 15438577 14001638 12748627
44905A2748627p46245o51135n49341Q32196K970898L227217N15884k588438l096507
$$ 12748627 12002382 11351247 10801906 11634102 14605000 17832217 18348101 15759663 12663156
44896A2663156j344973K51869O53813N07641M24612Q76325K362391L704247K031200
$$ 12663156 11318183 11570052 12223865 12731506 13156118 14032443 16394834 20099081 22130281
44887B2130281k862101o072228l255799K446800L633168j299627o060590n538690
$$ 22130281 19268180 13195952 9940153 12386953 16020121 14720494 8659904 3121214
44879C121214k244667j121075j954402r50390K447761M647111L316171K50444
$$ 3121214 876547 -244528 -2198930 -3149320 -701559 3945552 7261723 7512167
44871G512167j546054j161705L91338J758619J970431Q44471p82797j902318k377302
$$ 7512167 5966113 4804408 5195746 6954365 8924796 9769267 8986470 7084152 4706850
44862D706850k477269j926230n82409M91758K47216l54825N39189K498129K933608
$$ 4706850 2229581 303351 -279058 212700 459916 105091 644280 3142409 6076017
44853F076017J082117l96044P32934K778109K673772P04697o5136J314622K275656
$$ 6076017 7158134 6762090 7495024 10273133 12946905 13651602 13586466 14901088 17176744
44844A7176744Q16967j646880k882556l052688l348404l137604j113530J525542
$$ 17176744 17993711 16346831 13464275 10411587 7063183 3925579 2812049 4337591
44836D337591J885203m49801k501968j884030L38160J721192J571941P34814k60989
$$ 4337591 6222794 5772993 3271025 1386995 1725155 3446347 5018288 5753102 5492113
44827E492113j300764j861411j518712p86985m87487q24137j711224l047591l893105
$$ 5492113 4191349 2329938 811226 24241 -463246 -1287383 -2998607 -6046198 -9939303
44818i939303k619082R23236M421238N502516M160083J798684o47948k258226
$$ -9939303 -12558385 -11635149 -7213911 -1711395 2448688 4247372 3599424 1341198
44810A341198j619418R99755K511870P51684j847067j410371J427310K384474
$$ 1341198 -278220 721535 3233405 3985089 2138022 727651 2154961 4539435
44802D539435J75686j645062k91936K447094L496814K475629O52697j313076k637970
$$ 4539435 4715121 3070059 2778123 5225217 8722031 11197660 11850357 10537281 7899311
44793G899311j836359R84653L156383K663711N95734j125226k299132l017957
$$ 7899311 6062952 7047605 10203988 12867699 13463433 12338207 10039075 7021118
44785G021118k193575J07920J176190o58068k810342k027533M90267J026638p67700
$$ 7021118 4827543 4935463 6111653 5453585 2643243 615710 1105977 2132615 1364915
44776A364915j641273M3343K351839L120391K238635M12853j644658k654805j888894
$$ 1364915 -276358 -233015 2118824 5239215 7477850 7890703 6246045 3591240 1702346
44767A702346p66572r00005j072640Q50489L598415L847378J803264J123438K582683
$$ 1702346 935774 35769 -1036871 -186382 3412033 7259411 9062675 10186113 12768796
44758A2768796K444083j101088m289002l298319K80744K555486K686445J848137
$$ 12768796 15212879 14111791 9822789 6524470 6805214 9360700 12047145 13895282
44750A3895282r5419k947824l752861n38773L142047K134097k628019n031039
$$ 13895282 13799863 10852039 7099178 6560405 9702452 11836549 9208530 4177491
44742D177491k393172J396950K133305L88554j214897k013324k247703r90628
$$ 4177491 1784319 3181269 5314574 5703128 4488231 2474907 227204 -763424
44734g63424K046154M478862L709474N11897j893933j787203l78795K89131l83190
$$ -763424 1282730 5761592 9471066 9982963 8089030 6301827 5923032 6212163 5828973
44725E828973j228460o76131J208558K135741K60905k592296k495904J040530
$$ 5828973 4600513 3924382 5132940 7268681 7529586 4937290 2441386 3481916
44717C481916L533400J322656l158667m452024j122392L022219M188053K387624
$$ 3481916 7015316 8337972 5179305 727281 -395111 2627108 6815161 9202785
44709I202785k1267j140287m16719J310117K117543Q98818q47596p69070P83735
$$ 9202785 9181518 8041231 7624512 8934629 11052172 11950990 11103394 10334324 11118059
44700A1118059J022018j129260l414890l567178k050650m17889R19968J838733
$$ 11118059 12140077 11010817 7595927 4028749 1978099 1560210 2480178 4318911
44692D318911J438881l11957j481492o38917R04865J140093K82037k57033l54861
$$ 4318911 5757792 5445835 3964343 3325426 4230291 5370384 5652421 5395388 5040527
44683E040527m21538L62070K370362L415525J496218j270375j107225J422845
$$ 5040527 4618989 4981059 7351421 10766946 12263164 10992789 9885564 11308409
44675A1308409J911614r89717l330144j925443J102304J960819K95986j633420
$$ 11308409 13220023 12230306 8900162 6974719 8077023 10037842 10333828 8700408
44667H700408k352444j523568P90491L084684K901108M39284p85111R10264K452130
$$ 8700408 6347964 4824396 5614887 8699571 11600679 12039963 11254852 12165116 14617246
44658A4617246J046869r88958k58206J695550J240294n70842K12844K797386J995274
$$ 14617246 15664115 14675157 14416951 16112501 17352795 16781953 16994797 19792183 21787457
44649B1787457l109849o726598m612685J33596K184931Q68358r70652j655780
$$ 21787457 18677608 11951010 7338325 7471921 9656852 10525210 9554558 7898778
44641G898778j112803Q13552L379301M088844J540511k165095l889185k962487
$$ 7898778 6785975 7599527 10978828 15067672 16608183 14443088 10553903 7591416
44633G591416o89446J753254L156401K074674j060226l311360k689846n87998
$$ 7591416 6901970 8655224 11811625 13886299 12826073 9514713 6824867 6236869
44625F236869Q62278J630284K049076R07509j992567l836352k574467n35009p65104
$$ 6236869 7099147 8729431 10778507 11686016 9693449 5857097 3282630 2747621 1982517
44616A982517j877965o75716J830580J868179m60292j067965J391359L486557
$$ 1982517 104552 -571164 1259416 3127595 2667303 1599338 2990697 6477254
44608F477254K621042L70318j073660j829030k118339q17540J838025L220502
$$ 6477254 9098296 9468614 8394954 6565924 4447585 3630045 5468070 8688572
44600H688572J920895l07024j761039k968169l984822k877908O74232L316649
$$ 8688572 10609467 10302443 8541404 5573235 1588413 -1289495 -615263 2701386
44592B701386K493848M82957Q47105L010009L744633K427719J227805R73616K75317
$$ 2701386 5195234 5678191 6525296 9535305 13279938 15707657 16935462 17909078 18184395
44583A8184395j472807l133787l928375m154713l860357k842236j752473j280783
$$ 18184395 16711588 13577801 9649426 5494713 1634356 -1207880 -2960353 -4241136
44575d241136o60103J020335K610708K315822Q37004N33551J623531J926802O17324
$$ -4241136 -4901239 -3880904 -1270196 1045626 1882630 2416181 4039712 5966514 6583838
44566F583838m64930P5355J182813J395318Q51504K82766k42635o76866o48540
$$ 6583838 6118908 6194263 7377076 8772394 9623898 9906664 9664029 8987163 8338623
44557H338623m11055n36187k95706J530888L639216K680627j704922m858010k585157
$$ 8338623 7927568 7391381 7095675 8626563 12265779 14946406 13241484 8383474 5798317
44548E798317K925848N414601K150027l165999n069210k042008K698448M808922
$$ 5798317 8724165 14138766 16288793 13122794 8053584 6011576 8710024 13518946
44540A3518946K916541k21872p79263J614950L367375J677892j668051k960023
$$ 13518946 16435487 16213615 15434352 17049302 20416677 22094569 20426518 17466495
44532A7466495j808469j183060k452422l175316r11940K740150L712747N09996
$$ 17466495 15658026 14474966 12022544 8847228 7935288 10675438 14388185 14898181
44524A4898181l664245m226622l86565L565204K929317j603387m546733k807576
$$ 14898181 11233936 7007314 6620749 10185953 13115270 11511883 6965150 4157574
44516D157574M2762r25367m395766m533943J36819M282294L543438M13969m43846
$$ 4157574 4200336 3274969 -1120797 -5654740 -5517921 -1235627 2307811 2721780 2277934
44507B277934Q46734J009398k31204j97393J461513J936654j0475k133556k266799
$$ 2277934 3124668 4134066 3902862 3705469 5166982 7103636 7093161 4959605 2692806
44498B692806q42078P99707J801192R90191k142090m834852k983161K683676N849442
$$ 2692806 1850728 2650435 4451627 5441818 3299728 -1535124 -4518285 -1834609 4014833
44489D014833K568403l040773m218580k80574L700644M202024K245800r7883k138840
$$ 4014833 6583236 3542463 -676117 -956691 2743953 6945977 9191777 9093894 6955054
44480F955054l233077k499302p20715J24099q4219N51266K495077L774601L303627
$$ 6955054 3721977 1222675 501960 626059 541840 1093106 3588183 7362784 10666411
44471A0666411K663726L254373L881690K801643M63456j395746k141517k353514
$$ 10666411 13330137 16584510 20466200 23267843 23731299 22335553 20194036 17840522
44463A7840522k549162k855637l038543k223542J50621K549248K219918j183839
$$ 17840522 15291360 12435723 9397180 7173638 7324259 9873507 12093425 10909586
44455A0909586m501751m723834k243901N34006K036357J755388k91700k570580
$$ 10909586 6407835 1684001 -559900 -25894 2010463 3765851 3474151 903571
44447I03571k357876Q71596L967840M059697K265733J137437L75831j679328l820679
$$ 903571 -1454305 -582709 3385131 7444828 9710561 10847998 11223829 9544501 5723822
44438E723822l240144n46803N28696j182499k693756j848447k29567M12913J135167
$$ 5723822 2483678 1936875 2465571 1283072 -1410684 -3259131 -3488698 -3075785 -1940618
44429a940618K892816L641557J419144j644410j763461R17955K371514M27644
$$ -1940618 952198 4593755 6012899 4368489 2605028 3522983 5894497 6322141
44421F322141k267925k054514Q33973K718672J236736j748936k521927j53106
$$ 6322141 4054216 1999702 2833675 5552347 6789083 5040147 2518220 2365114
44413B365114K370329K012527n25202k169727j736814p60711k71304O78929K435000
$$ 2365114 4735443 6747970 6222768 4053041 2316227 1555516 1284212 1963141 4398141
44404D398141L178681J745338J28747Q43568K930027L146505P41459j534727j534310
$$ 4398141 7576822 9322160 9450907 10294475 13224502 16371007 17112466 15577739 14043429
44395A4043429m90605n89478j534356j258429O94484K242315J433417j125783
$$ 14043429 13552824 12963346 11428990 10170561 10865045 13107360 14540777 13414994
44387A3414994l165304l458385k799010k407517k278942j570928k2542J717258
$$ 13414994 10249690 6791305 3992295 1584778 -694164 -2265092 -2287634 -570376
44379e70376K913659L269570K805831J825115Q84412L17685j7234j91032q914
$$ -570376 2343283 5612853 8418684 10243799 11128211 11445896 11428662 11237630 11228716
44370A1228716J55178o05404j886349j564586R71297K599781L49133l311183k851290
$$ 11228716 11383894 10778490 8892141 7327555 8298852 10898633 11247766 7936583 5085293
44361E085293K275748O090118M315641L62339J95190M172074P528631P029267
$$ 5085293 7361041 13451159 17766800 18129139 18324329 22496403 30025034 37054301
44353C7054301L497873r76178m654286n637782l369223o45055r80800l841596
$$ 37054301 40552174 39575996 34921710 29283928 25914705 25269650 24288850 20447254
44345B0447254n405640m089136k136213j408030r95750M6390Q02205P04242Q03927
$$ 20447254 15041614 10952478 8816265 7408235 6412485 6458875 7261080 7965322 8769249
44336H769249J304437M83019k174592m198127l424661r48105J059675K287679
$$ 8769249 10073686 10556705 8382113 4183986 759325 -188780 870895 3158574
44328C158574L030943K307492j74438k082852j378761L04240J26474j387179j453678
$$ 3158574 6189517 8497009 8322571 6239719 4860958 5165198 5291672 3904493 2450815
44319B450815J63946R26137j09667j034283n43363L94879R68774J849050L224605
$$ 2450815 2614761 3540898 3431231 2396948 1853585 2248464 3217238 5066288 8290893
44310H290893L944731L454026K350399N10091k636017n266330l963989R86856
$$ 8290893 12235624 15689650 18040049 18550140 15914123 10647793 6683804 7670660
44302G670660M366404K614149j169313j940976N9101Q04621n06306q22353N68591
$$ 7670660 12037064 14651213 13481900 11540924 11600025 12404646 11898340 11075987 11644578
44293A1644578K69753l213232n918974l762075J365170M039565K320146o90878
$$ 11644578 11914331 8701099 2782125 -979950 385220 4424785 6744931 6054053
44285F054053j519066K59928L071732N135502M742632J153807l607913n611267
$$ 6054053 4534987 4794915 7866647 13002149 17744781 18898588 15290675 9679408
44277I679408l166056R35364K727596J774540Q90000J634296K296781J056496
$$ 9679408 6513352 7448716 10176312 11950852 12840852 14475148 16771929 17828425
44269A7828425p94540o08593J508761K529153P10979j930844k430533p47420P21636
$$ 17828425 17033885 16425292 17934053 20463206 21174185 19243341 16812808 16065388 16787024
44260A6787024O74784P7345l8246k849j75295J92384J684971L374863L822829
$$ 16787024 17461808 17539153 17500907 17498058 17322763 17515147 19200118 22574981 26397810
44251B6397810K737621Q15141j237366k567431k053273K46088K147735J484843
$$ 26397810 29135431 29950572 28713206 26145775 24092502 24338590 26486325 27971168
44243B7971168j030557k616672j970784l73978P55529J462620J896660J359874
$$ 27971168 26940611 24323939 22353155 21979177 22734706 24197326 26093986 27453860
44235B7453860j40384j060078n29588l9417j171833k772558k565109r68825p45082
$$ 27453860 27313476 26253398 25723810 25684393 24512560 21740002 19174893 18206068 17460986
44226A7460986k577578l532032j174400K648685L965581J661794j465342k299801
$$ 17460986 14883408 11351376 10176976 12825661 16791242 18453036 16987694 14687893
44218A4687893n08836J957384L073682K106587q3760j575178j064735N28889R84869
$$ 14687893 14179057 16136441 19210123 21316710 21232950 19657772 18593037 19121926 20106795
44209B0106795k95170j414904p86149M86753L62316j116203k369336k956274l359977
$$ 20106795 19811625 18396721 17610572 18097325 18459641 17343438 14974102 12017828 8657851
44200H657851k698883K29477L390093K653018k042197n256953l315176L50355
$$ 8657851 5958968 6188445 9578538 12231556 10189359 4932406 1617230 1967585
44192A967585O59514j337912j031125J487980J818660n17661q12853K465712M400696
$$ 1967585 2627099 1289187 258062 1746042 3564702 3047041 2234188 4699900 9100596
44183I100596J728041j449899l94972K498315K058620r11259j279585J828123
$$ 9100596 10828637 9378738 8983766 11482081 13540701 12629442 11349857 13177980
44175A3177980M051749K876311K68149j912986m064808n666675m711772j715827
$$ 13177980 17229729 20106040 20374189 18461203 14396395 8729720 4017948 2302121
44167B302121j65192j296295k055636j3950L028542M248452L595655K415528R98772
$$ 2302121 2136929 840634 -1215002 -1228952 1799590 6048042 9643697 12059225 13057997
44158A3057997n02018j137707r89181j603024k962878k610689L49005L030573
$$ 13057997 12555979 11418272 10429091 8826067 5863189 3252500 3601505 6632078
44150F632078K757211Q07087j53753q516n7898j80579K29546M79161K35566Q51975
$$ 6632078 9389289 10196376 10042623 10034107 9976209 9795630 10025176 10504337 10739903 11591878
44140A1591878K504971K507372m71996l105313k044375N45872M54909j647492
$$ 11591878 14096849 16604221 16132225 13026912 10982537 11528409 11983318 10335826
44132A0335826j860875k41117n42881k951565l004488R91383M692091L944126
$$ 10335826 8474951 8233834 7690953 4739388 1734900 2726283 7418374 11362500
44124A1362500R7260l000323l706701k352483K43385K048580R22046j582933r27814
$$ 11362500 11459760 8459437 4752736 2400253 2643638 4692218 5614264 4031331 3103517
44115C103517L707684P037199M838268J01997j552693K56489J580077R06709M20122
$$ 3103517 6811201 13848400 18686668 18788665 17235972 17492461 19072538 19979247 20399369
44106B0399369J123319R59663j515691m527112n158741k557707J208122K659420
$$ 20399369 21522688 22482351 20966660 16439548 11280807 8723100 9931222 12590642
44098A2590642J9221m192846n059274j109166L555105M820310M010631M946403
$$ 12590642 12609863 8417017 3357743 2248577 5803682 10623992 14634623 19581026
44090A9581026P636930Q810612P588377O248904N388536K692072k375403o399652
$$ 19581026 27217956 36028568 43616945 49865849 55254385 57946457 55571054 49171402
44082D9171402o425774l912724k471806l509684n505993o087788l857384L46183
$$ 49171402 42745628 38832904 36361098 32851414 27345421 21257633 17400249 17746432
44074A7746432L393881K731969l26906k126651j648850j358486k622212l582879
$$ 17746432 21140313 23872282 23545376 21418725 19769875 18411389 15789177 12206298
44066A2206298k956879k492386l262785k679097J368936N667810N074304j65619
$$ 12206298 9249419 6757033 3494248 815151 2184087 7851897 12926201 12760582
44058A2760582m372834l727629k01400K342822K810068K253808J025080j364613
$$ 12760582 8387748 4660119 4458719 6801541 9611609 11865417 12890497 11525884
44050A1525884m395845o068946m447862L82748N599465P438597M816607Q46538
$$ 11525884 7130039 1061093 -3386769 -3004021 2595444 10034041 14850648 15697186
44042A5697186n30143Q93533K004710J113467L214N96020J866541J756952O28734
$$ 15697186 15167043 16060576 18065286 19178753 19181967 19777987 21644528 23401480 24030214
44033B4030214O29074K155119L084812J949516K47803M67014K534322L597331
$$ 24030214 24659288 26814407 29899219 31848735 32096538 32563552 35097874 38695205
44025C8695205J581322k092198m263484l927538k934952k780864k589734j348629
$$ 38695205 40276527 38184329 33920845 29993307 27058355 24277491 21687757 20339128
44017B0339128l19669j099502k398576j505860J247110K398276L43452k359728
$$ 20339128 20019459 18919957 16521381 15015521 16262631 18660907 19004359 16644631
44009A6644631k888792j742182p03823K20344J363879J167838j280608l027787
$$ 16644631 13755839 12013657 11309834 11530178 12894057 14061895 12781287 9753500
44001I753500n87427L985743M667583j52811m993007m778965j304188N95962K30502
$$ 9753500 9166073 13151816 17819399 17666588 12673581 7894616 6590428 7186390 7416892
43992G416892N82264K465151L418963K179431N22726O9690L16844O76582J615924
$$ 7416892 7999156 10464307 13883270 16062701 16585427 16655117 16971961 17648543 19264467
43983A9264467K556512J376170k155003m675484l202660P93084L502774L610671
$$ 19264467 21820979 23197149 21042146 16366662 13164002 13957086 17459860 21070531
43975B1070531K604950J428728k22530j662515j332764M66647J698581K080709
$$ 21070531 23675481 25104209 24881679 23219164 21886400 22353047 24051628 26132337
43967B6132337L643617O634193P783026M820710L54516j582055j169846j693368
$$ 26132337 29775954 36410147 44193173 49013883 49368399 47786344 46616498 44923130
43959D4923130l700451m090552j490399J012447J76350k949226m968533m659702
$$ 44923130 41222679 37132127 35641728 36654175 36830525 33881299 28912766 24253064
43951B4253064l231622j340962J471325M587358N908832M239278O55219k841620
$$ 24253064 21021442 19680480 21151805 25739163 31647995 35887273 36542492 33700872
43943C3700872m783914m222958r86543L189928N237398L855790J256694M08462
$$ 33700872 28916958 24694000 23707457 26897385 32134783 35990573 37247267 37655729
43935C7655729J054837K05136l244718o237808n173670p13223K857310K962868
$$ 37655729 38710566 38915702 35670984 29433176 24259506 23546283 26403593 29366461
43927B9366461J556085J766537L374200L488432J066333j502763j765536k24928
$$ 29366461 30922546 32689083 36063283 39551715 40618048 39115285 37349749 37124821
43919C7124821J079324J441168J384399Q38703n73889j873613j398492O90016
$$ 37124821 38204145 39645313 41029712 41868415 41294526 39420913 38022421 38712437
43911C8712437K414980K955863L788414N923188P695718O913779M185016K259024
$$ 38712437 41127417 44083280 47871694 53794882 61490600 68404379 72589395 74848419
43903G4848419K327507K673830J316429j338994l176539k827427o16270K460017
$$ 74848419 77175926 79849756 81166185 79827191 76650652 73823225 73206955 75666972
43895G5666972N686307Q422265R751866R016375O498332L009348j111782n902703
$$ 75666972 81353279 89775544 99527410 108543785 115042117 118051465 116939683 111036980
43887A11036980j0641919j3779051j4502092j3506998j1574088q486190m480677
$$ 111036980 100395061 86616010 72113918 58606920 47032832 38546642 34065965
43880C4065965j543281j265033k089150j141512J256504J685000j002967l238444
$$ 34065965 32522684 31257651 29168501 28026989 29283493 30968493 29965526 26727082
43872B6727082j475543K805835N189064M045244J744909Q46539J341557J607231
$$ 26727082 25251539 28057374 33246438 37291682 39036591 39883130 41224687 42831918
43864D2831918L69156k371392n198862o227032n044512l200306k055673j269154
$$ 42831918 43201074 40829682 35630820 29403788 24359276 21158970 19103297 17834143
43856A7834143l52365n9230o31149m81363J130712J929413O9395j890054k51542
$$ 17834143 17481778 17422548 16791399 16310036 17440748 19370161 19439556 17549502 17297960
43847A7297960L592956M621023J770564n59383O24728L143779M282992M707616
$$ 17297960 20890916 25511939 27282503 26723120 27347848 30491627 34774619 39482235
43839C9482235N406217M857251K270847J15620J10752q9494k613137m830111l314758
$$ 39482235 44888452 49745703 52016550 52132170 52242922 52153428 49540291 44710180 41395422
43830D1395422J59838J244047k21804r24009k28447m50317j621047j368632j93473
$$ 41395422 41555260 42799307 42577503 41653494 41425047 40974730 39353683 37985051 37791578
43821C7791578j452177n047854o370005l379066R3342N62265j69358N20921Q68078
$$ 37791578 36339401 31291547 24921542 21542476 21635818 22198083 22028725 22549646 23417724
43812B3417724j738655n054401m651716p26759K284202K241780J302251J367413
$$ 23417724 21679069 16624668 11972952 11246193 13530395 15772175 17074426 18441839
43804A8441839J504657Q86464R63974K867619M806673M106977Q51111k140367
$$ 18441839 19946496 20832960 21796934 24664553 29471226 33578203 34429314 32288947
43796C2288947k650035j227290R7935M45027O99194J516063J734407l4411k637039
$$ 32288947 29638912 28411622 28509557 28954584 29653778 31169841 32904248 32869837 30232798
43787C0232798l045969l49799K715076L386932K393483K147016K836727K694326
$$ 30232798 27186829 26837030 29552106 32939038 35332521 37479537 40316264 43010590
43779D3010590J494183J163584K638974M391853M938302N092327O654374J0097446
$$ 43010590 44504773 45668357 48307331 52699184 57637486 62729813 69384187 79481633
43771G9481633J4569411J9034761K2010601K0903413J3581458J335491j0760144
$$ 79481633 94051044 113085805 135096406 155999819 169581277 170916768 160156624
43764A60156624j7633297j8427502j6358702j4554681j3205510j1221989q997382
$$ 160156624 142523327 124095825 107737123 93182442 79976932 68754943 59757561
43757E9757561p676782o666584m474441j984958j995662m614903o036867l651123
$$ 59757561 52080779 45414195 40939754 38954796 36959134 32344231 26307364 22656241
43749B2656241K46390K152222K282615K771741L143578J542892q77608j270286
$$ 22656241 22902631 25054853 27337468 30109209 33252787 34795679 33918071 32647785
43741C2647785k79680j134556l268251k089903L269234P186186N569542K127861
$$ 32647785 32368105 31233549 27965298 25875395 29144629 36330815 41900357 44028218
43733D4028218K479401N670432O750602N436935O282890J0696633J4482141J4532405
$$ 44028218 46507619 52178051 58928653 64365588 70648478 81345111 95827252 110359657
43725A10359657J3278022J4190170J6176602J5103250R068030J77098p733541
$$ 110359657 123637679 137827849 154004451 169107701 178175731 178352829 170619288
43718A70619288j1912661j2465760j2258212j3920824j6572285j7075111j4611276
$$ 170619288 158706627 146240867 133982655 120061831 103489546 86414435 71803159
43711G1803159j1560329r326673o451619k408197J5193j094618k815108j217351
$$ 71803159 60242830 50916157 44464538 42056341 42071534 40976916 38161808 36944457
43703C6944457K424195L132463n82489m715724n266169k610831K84100J296202
$$ 36944457 39368652 42501115 41918626 37202902 31936733 29325902 29610002 30906204
43695C0906204p2288k902610m781373l603627n43206O45240j636106m566803m541180
$$ 30906204 30833916 27931306 23149933 19546306 19003100 19648340 18012234 13445431 8904251
43686H904251j418704K090660L787545L398348J870097N27572L5106n27986k325716
$$ 8904251 7485547 9576207 13363752 16762100 18632197 19159769 19194875 18666889 16341173
43677A6341173m068962k747387J840491N591893N012926J665537m87589l40788
$$ 16341173 12272211 9524824 11365315 16957208 21970134 23635671 23148082 22807294
43669B2807294M26346J083619K159369K799969J403865r65963j134894J432031
$$ 22807294 23233640 24317259 26476628 29276597 30680462 29714499 28579605 30011636
43661C0011636L394374K322456J41466J2193J743058K524234J259543K5972J097264
$$ 30011636 33406010 35728466 35869932 35882125 37625183 40149417 41408960 41434932 42532196
43652D2532196L846300N298027L565965K39541j308022p5174J237850j12231l151985
$$ 42532196 46378496 51676523 55242488 55482029 54174007 54098833 55336683 55224452 52072467
43643E2072467m719217l912077k914831l601188n386877o638509o341693m082391
$$ 52072467 47353250 43441173 40526342 36925154 31538277 24899768 18558075 14475684
43635A4475684j93619L601966N266046M585790K974053J280833m89377j595730
$$ 14475684 14282065 17884031 23150077 27735867 30709920 31990753 31501376 29905646
43627B9905646j076115M3176l44614j824726j505007J442643M055739L787885
$$ 29905646 28829531 28872707 28528093 26703367 25198360 26641003 30696742 34484627
43619C4484627J931220J156174J804052K404031K076168Q51723p25649j140408
$$ 34484627 36415847 37572021 39376073 41780104 43856272 44707995 43982346 42841938
43611D2841938R18840L814816L915570O83510k066138j773009p29078j577321
$$ 42841938 43760778 47575594 51491164 52174674 50108536 48335527 47606449 46029128
43603D6029128k675323j513893K51004m39881k496006k662749j535250k473612
$$ 46029128 43353805 41839912 42090916 41651035 39155029 36492280 34957030 32483418
43595C2483418n130118n258607j461176K521419L372721K133769J310236J459676
$$ 32483418 27353300 22094693 20633517 23154936 26527657 28661426 29971662 31431338
43587C1431338J977133K354671J582707r41464l129726j856698K175385M371592
$$ 31431338 33408471 35763142 37345849 36404385 33274659 31417961 33593346 37964938
43579C7964938K267237j435599l231253l112954k760382k396919j720151j586390
$$ 37964938 40232175 38796576 35565323 32452369 29691987 27295068 25574917 23988527
43571B3988527k417032k722410j261354Q77883K032188K153538J742631N27738
$$ 23988527 21571495 18849085 17587731 18465614 20497802 22651340 24393971 24921709
43563B4921709j050992j031233J266916L318455K568838J85403o70263P45747
$$ 24921709 23870717 22839484 24106400 27424855 29993693 30179096 29508833 30254580
43555C0254580K398021K801201K425135K007134J440920N58679k91944o56485
$$ 30254580 32652601 35453802 37878937 39886071 41326991 41885670 41593726 40937241
43547D0937241k63489Q87805K188787K604055J668045j34986k057914l334255
$$ 40937241 40673752 41561557 43750344 46354399 48022444 47887458 45829544 42495289
43539D2495289k905296m22904K269265K439273q0311k325698j801752Q33230L290323
$$ 42495289 39589993 39167089 41436354 43875627 43795316 41469618 39667866 40501096 43791419
43530D3791419M309641M220946M359679O247622R721815J2024393J0997631Q720651
$$ 43791419 48101060 52322006 56681685 62929307 72651122 84675515 95673146 104393797
43522A04393797Q572459Q813861L893975o421538j4368238j3816078q295627n367857
$$ 104393797 112966256 121780117 125674092 119252554 104884316 91068238 82772611 77404754
43514G7404754o525490p458092n818797l498065k248176j661751j244626r16388
$$ 77404754 70879264 63421172 57602375 54104310 51856134 50194383 48949757 48033369
43506D8033369J64624K276998L521747K490354J237853K289550M131249L472750
$$ 48033369 48197993 50474991 53996738 56487092 57724945 60014495 64145744 67618494
43498F7618494P61710o47525J63945J427406K940321O024215R751394J1976594
$$ 67618494 68380204 67732679 67896624 69324030 72264351 78288566 88039960 100016554
43490A00016554J3968269J9014082K5964149K8936957K4188119J3011128j988006
$$ 100016554 113984823 132998905 158963054 187900011 212088130 225099258 223111252
43483B23111252j7855947k8196805k6268184j4082595k545003R67123K1194Q15364
$$ 223111252 205255305 177058500 150790316 136707721 134162718 135129841 135151035 135966399
43475A35966399K416458N54446l819220o472833p414519r724953j2408305j1007760
$$ 135966399 138382857 138937303 135118083 128645250 121230731 111505778 99097473 88089713
43467H8089713n262783j89487J446495K559422N922465R400627R755274Q159149
$$ 88089713 82826930 82637443 84083938 86643360 92565825 101966452 111721726 119880875
43459A19880875Q749536J2992165J8051177K0563681K0251490J9164279J8074734
$$ 119880875 128630411 141622576 159673753 180237434 200488924 219653203 237727937
43452B37727937J4736949O530202n500591j6557695k2436872k2875296k0369862
$$ 237727937 252464886 258995088 253494497 236936802 214499930 191624634 171254772
43445A71254772j7401529j5596819j5640182j6377813j5363271j1840158q006299
$$ 171254772 153853243 138256424 122616242 106238429 90875158 79035000 71028701
43438G1028701o053656n556445n289313n559674o404573n477121j080740L795852
$$ 71028701 64975045 59418600 54129287 48569613 42165040 36687919 35607179 39403031
43430C9403031M208439j4090l730979l315619q66521l44303k229209l953526l826077
$$ 39403031 43611470 43597380 39866401 36550782 35684261 35339958 33110749 29157223 25331146
43421B5331146k408954q57505L00328R20559J034751R91782J099102J067726L35568
$$ 25331146 22922192 22064687 22365015 23285574 24320325 25312107 26411209 27478935 27814503
43412B7814503r24043j535329n01542J570090K796970K206920J080902J330563
$$ 27814503 26890460 25355131 24853589 26423679 29220649 31427569 32508471 33839034
43404C3839034L006668M619189N594756O689306P816089P440258M867160J357462
$$ 33839034 36845702 41464891 47059647 53748953 61565042 69005300 73872460 75229922
43396G5229922j860985m790869o916381o593581l881743j748504k170744l023496
$$ 75229922 73368937 68578068 61661687 55068106 51186363 49437859 47267115 44243619
43388D4243619j616194M58128m58274m020170n965648m330217j831274j215021
$$ 44243619 42627425 43085553 42627279 38607109 32641461 28311244 26479970 25264949
43380B5264949j685544j548265j394245k258455k681594m67175L396830N186501
$$ 25264949 23579405 22031140 20636895 18378440 15696846 15229671 18626501 23813002
43372B3813002L208018L25518O60948M561542Q162814Q158296N726375M429523
$$ 23813002 27021020 27346538 28007486 32569028 40731842 48890138 54616513 59046036
43364E9046036M984162M424183R07143l192112m677809l982738l813636m763035
$$ 59046036 64030198 68454381 69361524 66169412 61491603 57508865 53695229 48932194
43356D8932194n105669m250669l420706k965894j905394n84723r78389l271599
$$ 48932194 43826525 39575856 36155150 33189256 31283862 30699139 29720750 26449151
43348B6449151m541008k435666J443972L431451K103550n65892j802762q51490
$$ 26449151 21908143 19472477 20916449 24347900 26451450 25885558 24082796 23231306
43340B3231306O02208M50932j327824k545728j588613N43701J949153K427247
$$ 23231306 23833514 24284446 22956622 20410894 18822281 19365982 21315135 23742382
43332B3742382K674780J998939n99459l538571l819780j369736O43343M83913
$$ 23742382 26417162 28416101 27816642 24278071 20458291 19088555 19731898 20215811
43324B0215811j31468J75620j65577k268551l438557m50395N102355P938699N509871
$$ 20215811 20084343 20259963 20094386 17825835 14387278 13936883 19039238 26977937 32487808
43315C2487808Q00993j747160j194793o4832n67203k139195k681323j377156M70589
$$ 32487808 33288801 31541641 30346848 30282016 29714813 27575618 24894295 23517139 23987728
43306B3987728J415128J738683K550480L642499L484646J280031j977770m390169
$$ 23987728 25402856 27141539 29692019 33334518 36819164 38099195 36121425 31731256
43298C1731256m234669p43071M729445Q687726Q462692N247433K551345J785230
$$ 31731256 27496587 26753516 31482961 40170687 48633379 53880812 56432157 58217387
43290E8217387J394224K97227m63862k04493j09837r31886j409348o05683J32336
$$ 58217387 59611611 59908838 59444976 59240483 59130646 58198760 56789412 56183729 56316065
43281E6316065n48730j389586l71272J821198K433808N21686j591009j076060
$$ 56316065 55767335 54377749 54006477 55827675 58261483 58783169 57192160 56116100
43273E6116100K099161N002178M729138J527869j550708k539044k901771m549483
$$ 56116100 58215261 63217439 67946577 69474446 67923738 65384694 62482923 57933440
43265E7933440n993431m465865j151972k79301k462455l390355r71069P16703
$$ 57933440 51940009 47474144 46322172 46042871 43580416 40190061 39218992 39935695
43257C9935695k030277n869680n010033j38721K474931O2324l441704l831876
$$ 39935695 37905418 32035738 27025705 26886984 29361915 29424239 25982535 22150659
43249B2150659j928259q39374j204118j367790m36579Q30946J437923J267019
$$ 22150659 20222400 19383026 18178908 16811118 16374539 17205485 18643408 19910427
43241A9910427J066594J688519L004003L699045K669889L42322j831173k575027
$$ 19910427 20977021 22665540 25669543 29368588 32038477 32380799 30549626 27974599
43233B7974599j175130K002197M582104L544456r08279m480656l810129q48073
$$ 27974599 26799469 28801666 33383770 36928226 36019947 31539291 27729162 26881089
43225B6881089K48548q15994p52773J629296L581714K677419j17122k501516l514195
$$ 26881089 27129637 26313643 25560870 27190166 30771880 33449299 33332177 30830661 27316466
43216B7316466l219966j843582k04720O41154Q90902J641253K812769L248393
$$ 27316466 24096500 22252918 22048198 22689352 23580254 25221507 28034276 31282669
43208C1282669L059812L641616M865473M698304K545726N82234M30707P98037
$$ 31282669 34342481 37984097 42849570 47547874 50093600 50675834 51106541 51904578
43200E1904578J79818j36278J842860M991211N893693L252264n39582k401051
$$ 51904578 52084396 51948118 53790978 58782189 64675882 67928146 67388564 64987513
43192F4987513j676250N1814J084576R61737L23767O9787O53981J902892L221311
$$ 64987513 63311263 63363077 64447653 65409390 65733157 65802944 66456925 68359817 71581128
43183G1581128L941248L845729L594964M251013O081319Q315449J0374326J2539292
$$ 71581128 75522376 79368105 82963069 87214082 93295401 101610850 111985176 124524468
43175A24524468J4903369J6778083J8122197K0403056K4559604K8966915L0973544
$$ 124524468 139427837 156205920 174328117 194731173 219290777 248257692 279231236
43168B79231236K9574804K4829531J5854915K248413j2773921k3705473k8017384
$$ 279231236 308806040 333635571 349490486 351738899 338964978 315259505 287242121
43161B87242121k7972049k6730630k5042618k2562527j9847343j7373399j4393930
$$ 287242121 259270072 232539442 207496824 184934297 165086954 147713555 133319625
43154A33319625j0562665p475112o907265q202413q784763p007467l669119r28273
$$ 133319625 122756960 115281848 108374583 100172170 91387407 84379940 80710821 79782548
43146G9782548j65043p62251j035948n63015q21660k710383m538040m136763k105468
$$ 79782548 79617505 78855254 77819306 77256291 76434631 73724248 69186208 65049445 62943977
43137F2943977q08571p49770m99157K834r90069l674966n632843n021059k614691
$$ 62943977 62135406 61385636 60886479 60889313 59899244 56224278 50591435 45570376 42955685
43128D2955685q703J944523K380980P12486j512703j585415O42649K504283K628856
$$ 42955685 42946982 44891505 47272485 47984971 46472268 44886853 45529502 48033785 50662641
43119E0662641K371949K399224J391967m70812n27265J742273K719796N616l408349
$$ 50662641 53034590 55433814 56825781 56354969 55827704 57569977 60289773 60295389 56887040
43110E6887040l275797M12979M946512Q922866J1526589J0726863O036427P86682
$$ 56887040 53611243 54024222 58970734 67893600 79420189 90147052 96183479 96970161
43102I6970161j918718l163911m683578m460074l80148M576979O226850O016603
$$ 96970161 95051443 91887532 87203954 82743880 82363732 86940711 93167561 99184164
43094I9184164Q053749J1093379J0245191N940721M069207O811336J0539373J4045094
$$ 99184164 107237913 118331292 128576483 134517204 138586411 145397747 155937120 169982214
43086A69982214K1017599L1010994L5051327K5637752O607695j1811371k4060731
$$ 169982214 190999813 222010807 257062134 282699886 289307581 277496210 253435479
43079B53435479l0662542l2179320k7901921j9642303j1950061q033343p922171
$$ 253435479 222772937 190593617 162691696 143049393 131099332 123065989 115143818
43072A15143818r953357j1721931j0685483o418656j553155J380266K702716L396390
$$ 115143818 105190461 93468530 82783047 76364391 74811236 76191502 78894218 82290608
43064H2290608K388766j113132m501853m590853k498683k115006m187110n439673
$$ 82290608 84679374 83566242 79064389 74473536 71974853 69859847 65672737 60233064
43056F0233064l559564K96062M328620Q185195J1319629J2224848J0847889R595554
$$ 60233064 56673500 56969562 61298182 69483377 80803006 93027854 103875743 113471297
43048A13471297J0206566J1034253R035553L639925k701902p426660j0145418
$$ 113471297 123677863 134712116 143747669 147387594 144685692 137259032 127113614
43041A27113614j1816713j2420630j0545515n883070j210725n8829k312852m249275
$$ 127113614 115296901 102876271 92330756 86447686 85236961 85178132 82865280 78616005
43033G8616005l665636k544084l153910m243863l790192l163135m763529o915519
$$ 78616005 74950369 72406285 69252375 65008512 61218320 58055185 53291656 46376137
43025D6376137n533621p07777K775595K322827Q59234J666740L594197L825294
$$ 46376137 40842516 40134739 42910334 45233161 46092395 47759135 51353332 55178626
43017E5178626K542131K068767L329121N619512Q209034R765609P818781J608183
$$ 55178626 57720757 59789524 63118645 68738157 76947191 86712800 94531581 96139764
43009I6139764n460121q830923p795135n291559l433330j831426j73355L06508
$$ 96139764 90679643 81848720 74053585 68762026 65328696 63497270 63323915 63630423
43001F3630423j230050l641383n070842m790412l458368k416654k651221l533557
$$ 63630423 62400373 58758990 53688148 48897736 45439368 43022714 40371493 36837936
42993C6837936l093391p58454J063330J07029j819950q65220K918643M921052
$$ 36837936 33744545 32986091 34049421 34156450 32336500 31471280 34389923 39310975
42985C9310975K338187j878971l353689j954273n85502l14831J93370J403503
$$ 39310975 41649162 39770191 36416502 34462229 33876727 33561896 33755266 35158769
42977C5158769K149573J961578J593530J249051O21060O34748K516312M793394
$$ 35158769 37308342 39269920 40863450 42112501 42733561 43368309 45884621 50678015
42969E0678015M091214L0150l275516k347276J106727K837300J664856Q8609K23428
$$ 50678015 54769229 54799379 51523863 49176587 50283314 53120614 54785470 54874079 55097507
42960E5097507J558110K621845K887500K703775K609477K850106K805345J500924
$$ 55097507 56655617 59277462 62164962 64868737 67478214 70328320 73133665 74634589
42952G4634589k32510O95673N747006J1152840J1242165N786426R75899J654933
$$ 74634589 74402079 75097752 80844758 91997598 103239763 109026189 110002088 111657021
42944A11657021N250034N643729J066845m650393p539526p270294n812671n093985
$$ 111657021 116907055 122550784 123617629 118967236 111427710 104157416 98344745 93250760
42936I3250760o266936q898475j0360578q286768m293051k795331m975120o547926
$$ 93250760 86983824 78085349 67724771 59438003 55144952 52349621 47374501 40826575
42928D0826575l597030J672473L964339K190586K42221R22052K763707L507430
$$ 40826575 37229545 38902018 42866357 45056943 45299164 46221216 48984923 52492353
42920E2492353L315064K994548J909574k12768j637591j162482n06755j621563
$$ 52492353 55807417 58801965 60711539 60498771 58861180 57698698 57191943 55570380
42912E5570380l179073k703264j019940j073610k715249k492212P42634L676910
$$ 55570380 52391307 49688043 48668103 47594493 44879244 42387032 43129666 46806576
42904D6806576L512631J884591J615282K257665J769181P93205J917799N188993
$$ 46806576 50319207 52203798 53819080 56076745 57845926 58639131 60556930 65745923
42896F5745923P282796N539155Q88040l599742n632908m985496l163833k075018
$$ 65745923 73028719 78567874 79455914 75856172 70223264 65237768 62073935 59998917
42888E9998917k206527k229904j085098K46592K32669p28319j026601n43045n35186
$$ 59998917 57792390 55562486 54477388 54723980 54956649 54228330 53201729 52658684 52123498
42879E2123498q28660N39015M036739O980248O607568L627366J238545J267369
$$ 52123498 51294838 51833853 55870592 62850840 69458408 73085774 74324319 75591688
42871G5591688K676161L763263M547356O299781R158984J1149294J0323532P732786
$$ 75591688 78267849 82031112 86578468 92878249 102037233 113186527 123510059 131242845
42863A31242845P120621J0925738J7431450K2931263K5928266K7606150K8624024
$$ 131242845 138363466 149289204 166720654 189651917 215580183 243186333 271810357
42856B71810357K7724420K4230319K0036273J7559649J6490217J3890184P305759
$$ 271810357 299534777 323765096 343801369 361361018 377851235 391741419 399047178
42849C99047178l029378j4722782k4914227l1387168l3101972l0694545k6562666
$$ 399047178 396017800 381295018 356380791 324993623 291891651 261197106 234634440
42842B34634440k3624678k3000698k2819274k0146104j4525023q896591o377511
$$ 234634440 211009762 188009064 165189790 145043686 130518663 121622072 115244561
42835A15244561o755066p021310m991087j492913R10403O51602j423790k972202
$$ 115244561 108489495 101468185 96477098 94984185 95894588 96546190 95122400 92150198
42827I2150198k477818n77300J357810L469693O822024J0673328J2624396J2478978
$$ 92150198 89672380 89095080 90452890 93922583 100744607 111417935 124042331 136521309
42819A36521309J3699573J9072020K6419682L0519545K7990508J8717722M557932
$$ 136521309 150220882 169292902 195712584 226232129 254222637 272940359 277498291
42812B77498291j0662188k1595832k5320777k4304015k2789732k1342090j7997687
$$ 277498291 266836103 245240271 219919494 195615479 172825747 151483657 133485970
42805A33485970j3346314j0235533r011608p493467n639954n635964o932349o131858
$$ 133485970 120139656 109904123 100892515 93399048 87759094 82123130 75190781 69058923
42797F9058923k985058j608382l911045o492817o313657m818754l753036j629689
$$ 69058923 66073865 64465483 60554438 54061621 47747964 42929210 39176174 37546485
42789C7546485K085457L709506O73604l452274l890118j628432p46925j431878
$$ 37546485 39631942 43341448 44015052 40562778 36672660 35044228 34297303 32865425
42781C2865425q04595J217289K120468J634167J407018P86908k095990n557097
$$ 32865425 32060830 33278119 35398587 37032754 38439772 39226680 37130690 31573593
42773C1573593n683896k526061k66498p71426j402890K674K178138L520278M343806
$$ 31573593 25889697 23363636 23097138 22325712 20922822 20925496 23103634 26623912 30967718
42764C0967718M785481L788322J430894n91763j718300k974484m090213l240555
$$ 30967718 35753199 39541521 40972415 40380652 38662352 35687868 31597655 28357100
42756B8357100m77450J564872J329726M4131q21200j019202q8548K438407M976503
$$ 28357100 27879650 29444522 30774248 30818379 29997179 28977977 28889429 31327836 36304339
42747C6304339N386248M945309O996999J0858572J1290521N575932k781008r077578
$$ 36304339 41690587 46635896 53632895 64491467 75781988 81357920 78576912 69499334
42739F9499334j2130522j2155397q500313k537452J152809J83240k050619j549848
$$ 69499334 57368812 45213415 36713102 34175650 35328459 35511699 33461080 31911232
42731C1911232N05735P44883n85267j039542q50393j787321k762901j308861J373383
$$ 31911232 32416967 33161850 32576583 31537041 30686648 28899327 26136426 24827565 26200948
42722B6200948J457913j406504l191216j233334K661150N639553P236510Q390773
$$ 26200948 27658861 26252357 23061141 21827807 24488957 30128510 37365020 45755793
42714D5755793R556300J0763289J1534501J0121696M915657k647660q543236j0413559
$$ 45755793 55312093 66075382 77609883 87731579 92647236 89999576 81456340 71042781
42706G1042781r737195q949767q132499n929416k614279m74465r97523k751558
$$ 71042781 61305586 52355819 44223320 38293904 35679625 35205160 34207637 31456079
42698C1456079k936274r64471N70675o16498l013429l189830q01627Q78137l5435
$$ 31456079 28519805 27555334 28126009 27509511 24496082 21306252 20504625 21382762 21347327
42689B1347327j355972o23067J087493J359248K45305o37194r64506r69441M00455
$$ 21347327 19991355 19368288 20455781 21815029 22060334 21423140 20458634 19489193 19889648
42680A9889648L477024N442658L438535o29310j858784J324048N782096Q374833
$$ 19889648 23366672 28809330 32247865 31618555 29759771 31083819 36865915 45240748
42672D5240748Q764943P550825N081570K666334J767988J290952j314982n593502
$$ 45240748 54005691 61556516 66638086 69304420 71072408 72363360 71048378 65454876
42664F5454876p942305o869084n033453m631177m094284j471818J841436L292423
$$ 65454876 57512571 50643487 45610034 40978857 36884573 35412755 37254191 40546614
42656D0546614K812917J791853L94505j517721k509231j413979R4102n45894k964057
$$ 40546614 43359531 45151384 45545889 44028168 41518937 40104958 40199060 39653166 36689109
42647C6689109m354095l261803q36390J119245J468304p1459k045681j596918
$$ 36689109 32335014 29073211 28236821 29356066 30824370 30752911 28707230 27110312
42639B7110312J868918M382461J927939l318382n075809j619604J801526P56609
$$ 27110312 28979230 33361691 35289630 31971248 26895439 25275835 27077361 27833970
42631B7833970k211595k150551Q60661K862071K575893K202579K264026L79995
$$ 27833970 25622375 23471824 24332485 27194556 29770449 31973028 34237054 34617049
42623C4617049l886654p065901o571169m216256k696906j448409J095967L466726
$$ 34617049 30730395 23664494 17093325 12877069 10180163 8731754 9827721 13294447
42615A3294447L009158N08737p21796Q1894N75969o0000L61924K835431M791935
$$ 13294447 16303605 16812342 16090546 16172440 16748409 16688409 17050333 19885764 24677699
42606B4677699L787861J089102m41887k13781K54076n5173r61438j915175k099060
$$ 24677699 28465560 29554662 29112775 28898994 29153070 29097897 28136459 26221284 24122224
42597B4122224p87302J228395J872277N82962o63526l75863K54882j81821o42468
$$ 24122224 23334922 24563317 26435594 27018556 26355030 25979167 26234049 26052228 25409760
42588B5409760L44597J717750J611900P15454J006752K093800J895987M66199
$$ 25409760 25754357 27472107 29084007 29799461 30806213 32900013 34796000 35262199
42580C5262199m9284P38395P98470n90026j376107q6582J796379K193784J320179
$$ 35262199 35212915 35951310 36749780 36159754 34783647 34697065 36493444 38687228 40007407
42571D0007407P67221R78885J005436J34421j134285j500721j07755K220195L363092
$$ 40007407 40774628 41753513 42758949 42893370 41759085 40258364 40150609 42370804 45733896
42562D5733896K410763J301289K643293O126696Q536601P497244M160464K105127
$$ 45733896 48144659 49445948 52089241 58215937 66752538 74249782 78410246 80515373
42554H0515373M240547J0379363J7143303K1022508K2281365K4511248K9159607
$$ 80515373 84755920 95135283 112278586 133301094 155582459 180093707 209253314
42547B09253314L2325421K9007602J8923706N765058p497912j9347802k7345480
$$ 209253314 241578735 270586337 289510043 295275101 287777189 268429387 241083907
42540B41083907k9319689k6783959k3416720k0091943j5071686r049464n576866
$$ 241083907 211764218 184980259 161563539 141471596 126399910 117350446 111773580
42533A11773580n587896n807844m191307k967766m243834o257599o561411n846070
$$ 111773580 106185684 100377840 96186533 93218767 88974933 82717334 76155923 70309853
42525G0309853n835753n853646m264066j578164J79822j45338k499330n818484
$$ 70309853 64474100 58620454 54356388 52778224 52958046 52812708 50313378 44494894
42517D4494894p478886n072894j35319K680199J721773M98875J838879L597070
$$ 44494894 37016008 31943114 31807795 34487994 36209767 36708642 38547521 42144591
42509D2144591L094666K144283L541533N386404L709723q34949l605706k610604
$$ 42144591 45239257 47383540 50925073 56311477 60021200 59186251 55580545 52969941
42501E2969941k41856J412895K904132M550698M808673K814909K92665k51969
$$ 52969941 52728085 54140980 57045112 61595810 66404483 69219392 69512057 69260088
42493F9260088J834226M753643N714832L837173K238394N288326J2495383J7883589
$$ 69260088 71094314 75847957 81562789 85399962 87638356 92926682 105422065 123305654
42485A23305654J7909620J6983735K1188014K8870701L2455977K8342435J9659407
$$ 123305654 141215274 158199009 179387023 208257724 240713701 269056136 288715543
42478B88715543R678912j351368j1516290j5438197j0738377k380610L131567
$$ 288715543 298394455 297043087 285526797 270088600 259350223 256969613 260101180
42471B60101180N223767P502529J0984493J3518582J5144930J9101299K5515372
$$ 260101180 265324947 272827476 283811969 297330551 312475481 331576780 357092152
42464C57092152K7407185J6994351l913363k3041268k9382922k4337667j8610520
$$ 357092152 384499337 401493688 397580325 374539057 345156135 320818468 302207948
42457C02207948j9070810k2535650k2989136k0174342j7978455j7793611j7726902
$$ 302207948 283137138 260601488 237612352 217438010 199459555 181665944 163939042
42450A63939042j6595337j4713691j1825888p959638n417014o207686q268692
$$ 163939042 147343705 132630014 120804126 112844488 107427474 101219788 92951096
42443I2951096q007283n828862m975043n491773m227747j016962K93327j822061
$$ 92951096 84943813 79114951 74139908 68648135 64420388 63403426 63696753 61874692
42435F1874692m037150l794717k962056l531843l799522j769485R90634J961332
$$ 61874692 57837542 54042825 51080769 47548926 43749404 41979919 42970553 44931885
42427D4931885J460417J032992M72497q86752k100105k314909k410912k672044
$$ 44931885 46392302 47425294 47897791 47011039 44910934 42596025 40185113 37513069
42419C7513069j229344K645532O110026O404075M662153L268737K011430L67133
$$ 37513069 36283725 38929257 45039283 51443358 56105511 59374248 61385678 61752811
42411F1752811J034224O485230J3379578J5366501J1292983O170766L744492K666800
$$ 61752811 62787035 69272265 82651843 98018344 109311327 115482093 119226585 121893385
42403A21893385J184104J070588M131319P807987P530797K219380m924693j0343040
$$ 121893385 123077489 124148077 128279396 136087383 143618180 145837560 140912867 130569827
42395A30569827j2901935j3262615j2386633j0985220r365472p424908n256553
$$ 130569827 117667892 104405277 92018644 81033424 71667952 64243044 58986491
42388E8986491l736281l866435n340238o368820n514661l434889k054982j991092
$$ 58986491 55250210 51383775 46043537 39674717 34160056 30725167 28670185 26679093
42380B6679093j813540m20188R92660O30589r92315j669004q74464n12311j751531
$$ 26679093 24865553 24445365 25438025 26068614 25076299 23407295 22532831 22020520 20268989
42371B0268989k973945k049325N71416K334171J609648o19177j848920o00881
$$ 20268989 17295044 15245719 15817135 18151306 19760954 19141777 17292857 16691976
42363A6691976J720932J857743j391630m795345m078727L51455L393032J663800
$$ 16691976 18412908 20270651 18879021 14083676 10004949 10356404 13749436 15413236
42355A5413236k339382l810121j430902K106174L954320L600808K211826J082835
$$ 15413236 13073854 9263733 7832831 9939005 13893325 17494133 19705959 20788794
42347B0788794O84055N95579N24461J041403K226883K172570r88909n555173p380207
$$ 20788794 21472849 22068428 22592889 23634292 25861175 28033745 27044836 21489663 14109456
42338A4109456n138066j806213q4544O54289J556370J742715O80409R0377J015369
$$ 14109456 8971390 7165177 7080633 7734922 9291292 11034007 11714416 11804793 12820162
42329A2820162J779921J457275K247920N094503O149570K163124l051549k972339
$$ 12820162 14600083 16057358 18305278 23399781 29549351 31712475 28660926 25688587
42321B5688587J935849M483614Q96500m502967n881387k595177K437652P050886
$$ 25688587 27624436 32108050 33004550 28501583 22620196 20025019 22462671 29513557
42313B9513557J0047896J0155262P719767N963799Q159216J3832470J8697051
$$ 29513557 39561453 49716715 57436482 63400281 71559497 85391967 104089018
42306A04089018J7998433J0146898j614524j1150665j4480475j2953355j0429857
$$ 104089018 122087451 132234349 130619825 119469160 104988685 92035330 81605473
42299H1605473q427188o135610l952333l528968m428479m271838k810573k537224
$$ 81605473 73178285 67042675 63090342 59561374 55132895 50861057 48050484 45513260
42291D5513260m309381n623810m582360k519189j119406Q6268J491546J632746
$$ 45513260 41203879 35580069 30997709 28478520 27359114 27445382 28936928 30569674
42283C0569674k7892j206021l88062N9795k459387n906837o001895k416391J080562
$$ 30569674 30541782 29335761 28947699 29007494 26548107 20641270 14639375 12222984 13303546
42274A3303546K294509K720312L522894L055364J60995k727443k360489O74012
$$ 13303546 15598055 18318367 21841261 24896625 25057620 22330177 19969688 20643700
42266B0643700K498722R91291j693334k196843r6392K133007K497883J413522
$$ 20643700 23142422 24133713 22440379 20243536 20147144 22280151 24778034 26191556
42258B6191556L01001l15237o04860l62607O81580J846929J904645O36294p01333
$$ 26191556 26492557 26177320 25572460 25209853 25891433 27738362 29643007 30279301 29577968
42249B9577968p42867L83119R61264n57915l394377m576761k327253J137429K047065
$$ 29577968 28835101 29218220 30179484 29621569 26227192 21650431 19323178 20460607 22507672
42240B2507672K99843l57214J806905L563175J765078j538974k317563p92038
$$ 22507672 22807515 22450301 24257206 27820381 29585459 28046485 25728922 24936884
42232B4936884m84629k150269k908964j346600N34388J065431J006314R32257
$$ 24936884 24452255 22301986 19393022 18046422 18580810 19646241 20652555 21584812
42224B1584812j36097k132700k880296j256215Q14612R46171r37411l302834m569711
$$ 21584812 21448715 19316015 16435719 15179504 15994116 16940287 16002876 12700042 8130331
42215H130331l408416K42856L792715M040644J371010n15402K93268J817784J971222
$$ 8130331 4721915 4964771 8757486 12798130 14169140 13653738 13947006 15764790 17736012
42206A7736012J384928J211909J073867O87563P81188J012048j27181j961662
$$ 17736012 19120940 20332849 21406716 22094279 22875467 23887515 23760334 21798672
42198B1798672j466158J857854M368277L599096J707696J329255J735964J857733
$$ 21798672 20332514 22190368 26558645 30157741 31865437 33194692 34930656 36788389
42190C6788389L043467N207869M332839j458882o863023o010183j454004l93103
$$ 36788389 39831856 45039725 49372564 47913682 41050659 35040476 33586472 33193369
42182C3193369l673660n293187k475633O15723M52057p29527J51210J889244J907298
$$ 33193369 29519709 24226522 21750889 22366612 22818669 22089142 22240352 24129596 26036894
42173B6036894P16628K96267M38171l95818j999624k536062j129630R72227J528992
$$ 26036894 26753522 27049789 27487960 27092142 25092518 22556456 21426826 22399053 23928045
42164B3928045n80258l676229m296331j322132J786989J094306k278822l653274
$$ 23928045 23347787 19671558 15375227 14053095 15840084 16934390 14655568 11002294
42156A1002294j476205R60049R11247k53714j45726J104685K166058K862772L308770
$$ 11002294 9526089 10486138 11397385 11143671 10997945 12102630 14268688 17131460 20440230
42147B0440230K628533M02954j989124k980783k698450k191470j837215j280632
$$ 20440230 23068763 23471717 21482593 18501810 15803360 13611890 11774675 10494043
42139A0494043l3043K102079M110519L700566L3022l950118m495669k113230o06708
$$ 10494043 10461000 12563079 16673598 20374164 20407186 16457068 11961399 9848169 9241461
42130I241461j064003p12610J428488K192609k71942k695432j433441K199506
$$ 9241461 8177458 7464848 8893336 11085945 10814003 8118571 6685130 8884636
42122H884636M680702N482157N757758M406164M4141m604297n142524j974778
$$ 8884636 13565338 19047495 24805253 29211417 29255558 24651261 19508737 17533959
42114A7533959J19033q57908j697102K72587L065970L604760K161524Q08247j73798
$$ 17533959 17652992 16795084 15097982 15370569 18436539 22041299 24202823 25011070 24837272
42105B4837272j623363k756389j865341P26466K649736K472243J069110m5501
$$ 24837272 23213909 20457520 18592179 19318645 21968381 24440624 25509734 25464233
42097B5464233k68779M12137J778500K772493J858055r12456l166709k997956
$$ 25464233 25195454 25607591 27386091 30158584 32016639 31104183 27937474 24939518
42089B4939518j832661k535280m684656m350690Q3736M350097L386474j340271
$$ 24939518 23106857 20571577 15886921 11536231 11619967 15970064 19356538 18016267
42081A8016267l298252J57067M128238L216619j052806k996107j008202Q94939
$$ 18016267 14718015 14875082 19003320 22219939 21167133 18171026 17162824 18057763
42073A8057763l77152k638346k208013M79502J603467n19528l095471k657521
$$ 18057763 17680611 15042265 12834252 13313754 14917221 14397693 11302222 8644701
42065H644701M20342K632536J967601J75406M0448J845701L666545M169455L543933
$$ 8644701 9065043 11697579 13665180 13840586 13881034 15726735 19393280 23562735 27106668
42056B7106668K175088K71001j101970n14388J656516L207828L149643L168602
$$ 27106668 29281756 29552757 28450787 27936399 29592915 32800743 35950386 39118988
42048C9118988M758856O298779M865907L11312m340751o481973o275871n177348
$$ 39118988 43877844 50176623 55042530 55353842 51013091 44531118 38255247 33077899
42040C3077899l706338j720544J3617K2523j802528l332482k415608K38976J603836
$$ 33077899 29371561 27651017 27664634 27687157 25884629 22552147 20136539 20375515 21979351
42031B1979351K23903j680161j187044J221320K370712Q92076j070220j063786
$$ 21979351 22203254 20523093 19336049 20557369 22928081 23820157 22749937 21686151
42023B1686151N97423J792502J185881r61134l263804l747874j340755K262055
$$ 21686151 22283574 24076076 25261957 24300823 21037019 17289145 15948390 18210445
42015A8210445L693553J954404j81673q4072J168210J052735j68865k05870J073014
$$ 18210445 21903998 23858402 23676729 23592657 24760867 25813602 25644737 25438867 26511881
42006B6511881J218632q34241l070503l456884k426486j190611L68682K476399
$$ 26511881 27730513 26896272 23825769 20368885 17942399 16751788 17120470 19596869
41998A9596869L719659K636532L17097o06258O02497K170261K719331K864302
$$ 19596869 23316528 25953060 26270157 25663899 26266396 28436657 31155988 34020290
41990C4020290L335552L480402K935264L095494M962083O722566N909350L321637
$$ 34020290 37355842 40836244 43771508 46867002 51829085 58551651 64461001 67782638
41982F7782638J993206K343997J597548j266253l531396l493758l711819o596238
$$ 67782638 69775844 72119841 73717389 72451136 68919740 65425982 61714163 55117925
41974E5117925r681560r103878n690102l285027k356949L9091M349537P304462
$$ 55117925 45436365 36332487 30642385 27357358 25000409 25039500 29389037 36693499
41966C6693499P080010N486840M399584M033122N287437R469424J5094941J9754164
$$ 36693499 43773509 49260349 53659933 57693055 62980492 72449916 87544857 107299021
41958A07299021K5506758L5757057M4791592L8628004J2249190j9883560l7783808
$$ 107299021 132805779 168562836 213354428 251982432 264231622 244348062 206564254
41951B06564254l6799113k7841083k0631639j5634914j1295663r355428j0211831
$$ 206564254 169765141 141924058 121292419 105657505 94361842 85006414 74794583
41944G4794583j0190620p172366l980304l060354k330542K56708K055472k27186
$$ 74794583 64603963 57431597 53451293 50390939 48060397 48317105 50372577 50145391
41936E0145391m622921o319918m454496k539660k684693k999268j332447J146629
$$ 50145391 45522470 39202552 34748056 32208396 29523703 26524435 25191988 26338617
41928B6338617J585037o14543k986266l097997j449955m97601j182360j846343
$$ 26338617 27923654 27309111 24322845 21224848 19774893 19277292 18094932 16248589
41920A6248589j053537J52981J73202l67788K23260J623224J822371K41645j544967
$$ 16248589 15195052 15348033 15521235 15153447 15376707 16999931 18822302 19063947 17518980
41911A7518980k106735j369636J84059J650694J458623q67838l030562k351058
$$ 17518980 15412245 14042609 14226668 15877362 17335985 16468147 13437585 11086527
41903A1086527M15241K119178J823578J526945K209882K270538N93007j680489
$$ 11086527 11501768 13620946 15444524 16971469 19181351 21451889 22044896 20364407
41895B0364407l344347m437407m453992k052495K117584M841682M181172J839826
$$ 20364407 17020060 12582653 8128661 6076166 8193750 13035432 17216604 19056430
41887A9056430L70346O9698l8231k07982m43827j147345j915096j359975O72843
$$ 19056430 19426776 19496474 19458243 19250261 18806434 17659089 15743993 14384018 15056861
41878A5056861K377468K504722J876237J518370J214465P44306M58788j40721
$$ 15056861 17434329 19939051 21815288 23333658 24548123 25292429 25751217 25610496
41870B5610496j971994l733808k616819J123897L444515K094239j94916k19015
$$ 25610496 23638502 19904694 17287875 18411772 21856287 23950526 23755610 23536595
41862B3536595J120925J385389Q01294P32670L89955j486610l463474l247229
$$ 23536595 24657520 26042909 26844203 27576873 27966828 26480218 23016744 19769515
41854A9769515j303958K64478J010237J506490J082140p28991j976261p57981
$$ 19769515 18465557 18730035 19740272 21246762 22328902 21599911 19623650 18865669
41846A8865669J342125J411409m02439j722416j819215j447849k90728J853839
$$ 18865669 20207794 21619203 21216764 19494348 17675133 16227284 15936556 17790395
41838A7790395K750418N78534k108889j609641P75142O99245j675819j636580
$$ 17790395 20540813 21119347 19010458 17400817 18175959 18875204 17199385 15562805
41830A5562805K007922M414877K108491j984445l426612k187025r00947m81876
$$ 15562805 17570727 21985604 24094095 22109650 18683038 16496013 15595066 15113190
41822A5113190k88848j95697q5097O46195J314359Q1734k482118k819759M81715
$$ 15113190 14824342 14628645 14543548 15189743 16504102 16585836 14103718 11283959 11765674
41813A1765674L787518L302715M07822q73880K60092J281655P44372l20030p25633
$$ 11765674 15553192 18855907 19263729 18389849 18649941 19931596 20675968 20355938 19630305
41804A9630305k64557R46009K128185J623441r18742l028736k271654L13375J983441
$$ 19630305 19365748 20311757 22439942 24063383 23144641 20115905 17844251 18157626 20141067
41795B0141067K518248L746360N298326M187520o26607n969869q047164o448163
$$ 20141067 22659315 26405675 31704001 35891521 35264914 29295045 21247881 14799718
41787A4799718l393032o14552J499618K673338K374796P86234q10881j133949
$$ 14799718 11406686 10792134 12291752 14965090 17339886 18126120 17315239 16181290
41779A6181290k83748K99655m30719j691692j900991j041708o99297j328114j183518
$$ 16181290 15897542 16197197 15766478 14074786 12173795 11132087 10432790 9104676 7921158
41770G921158P26609K244924Q65528j986168k284505Q98311L872289L529463J459631
$$ 7921158 8647767 10892691 11758219 9772051 7487546 8385857 12258146 15787609 17247240
41761A7247240R10672J655585P97211k062507l683787j986535O71790Q77423q76592
$$ 17247240 18157912 19813497 20610708 18548201 14864414 12877879 13549669 14427092 13550500
41752A3550500j102469J355356L570854K798263K60791r12965j09181M92255m12615
$$ 13550500 12448031 13803387 17374241 20172504 20433295 19520330 19411149 19903404 19490789
41743A9490789j370991m24374K175509M251615L936320J128762k625089n226120
$$ 19490789 18119798 17695424 19870933 24122548 28058868 29187630 26562541 21336421
41735B1336421n483495l993021k476156k154081k820069l192825j915588J210579
$$ 21336421 15852926 11859905 9383749 7229668 4409599 1216774 -698814 511765
41727E11765M392484M953920K277812r63363j733820k00467J122292J141481R46091
$$ 511765 4904249 9858169 12135981 11172618 9438798 9238331 10360623 11502104 12448195
41718A2448195J006372K77852j243358j701178m74762L04480p23736j251373J334230
$$ 12448195 13454567 13732419 12489061 10787883 10313121 10617601 9893865 8642492 9976722
41709I976722N097756N418204J545106j981685j491935R53732Q82631k175497
$$ 9976722 15074478 20492682 22037788 20056103 18564168 19517900 20400531 18225034
41701A8225034m372844l334907j356152j444834k418587q36838K853784L763524
$$ 18225034 13852190 10517283 9161131 7716297 5297710 4460872 7314656 11078180
41693A1078180m69177n358253n200851q86438J842478R07209P485J758124L560003
$$ 11078180 10609003 5250750 49899 -836539 1005939 1913148 1920633 3678757 7238760
41684G238760K477302J27985m66721K80706M54987P78434K649534M003319J908011
$$ 7238760 9716062 9844047 9377326 9658032 10113019 10891453 13540987 17544306 19452317
41675A9452317j650008j633138K227629M451177J829049k243935l547852k867058
$$ 19452317 17802309 16169171 18396800 22847977 24677026 22433091 18885239 16018181
41667A6018181k997085l490579k303567k93034J24807n01411M25245K652172L145936
$$ 16018181 13021096 9530517 7226950 6933916 7058723 6557312 6982557 9634729 12780665
41658A2780665J292059Q3078J047923J705988M9922j682018o36240J593348J127196
$$ 12780665 14072724 14155802 15203725 16909713 16959635 15277617 14641377 16234725 17361921
41649A7361921k038129l689081j350653K596003M569052L839484J696394r57358
$$ 17361921 15323792 11634711 10284058 12880061 17449113 21288597 22984991 22027633
41641B2027633l305952l827814k072188p4786J43081m02457O36064K881615L449424
$$ 22027633 18721681 14893867 12821679 12746893 12889974 12487517 13123581 16005196 19454620
41632A9454620J199001j694514k877809k320987j023378O15604K078499K283528
$$ 19454620 20653621 18959107 16081298 13760311 12736933 13352537 15431036 17714564
41624A7714564J181616L34920P39322J556142K224777M139244Q364275J2810362
$$ 17714564 18896180 19231100 19970422 21526564 23751341 27890585 36254860 49065222
41616D9065222J3670012R309276J557083o108417j0565888j0502986p564470n196885
$$ 49065222 62735234 72044510 73601593 67493176 56927288 46424302 38859832 33662947
41608C3662947m857246m483560k323934m94935j897047m910256n009846j563072
$$ 33662947 28805701 24322141 21998207 21503272 19606225 14695969 9686123 8123051
41600H123051J063618K47619r94668Q12096L783929L471330m13096l764791l976536
$$ 8123051 9186669 9434288 8439620 9251716 13035645 16506975 16093879 12329088 8352552
41591H352552k595398j758433j125849K88515J624999J555528Q29662J303867
$$ 8352552 5757154 3998721 2872872 3161387 4786386 6341914 7171576 8475443
41583H475443K855672L239157J313291j213853k094003j387817p56653n93055
$$ 8475443 11331115 14570272 15883563 14669710 12575707 11187890 10431237 9838182
41575I838182M81106K969402M792018L429173o37626l853122l429870n90471R09115
$$ 9838182 10319288 13288690 18080708 21509881 20872255 17019133 13589263 12998792 13907907
41566A3907907n68841k504518j643458J509640L399119K436125R50396J243850
$$ 13907907 13339066 10834548 9191090 10700730 14099849 16535974 17486370 18730220
41558A8730220K181105J724854O49282O65375M97364k123127n257774m402128
$$ 18730220 20911325 22636179 23285461 23950836 24448200 22325073 17067299 12665171
41550A2665171K190J831747j712175n219412k937459K457334L878068J023m006297
$$ 12665171 12667361 14499108 12786933 7567521 4630062 7087396 10965464 10966487 6960190
41541F960190m634302l367078j927514L98457L355034M204835J844117q94366
$$ 6960190 2325888 -1041190 -2968704 -2570247 784787 4989622 6833739 5939373
41533E939373j265043l38352n91404j890936k077221k50789K266235L520533K626291
$$ 5939373 4674330 4335978 3744574 1853638 -223583 -474372 1791863 5312396 7938687
41524G938687P17168L49941K584623M833937L673245l29468l243840l358550k871255
$$ 7938687 8655855 9005796 11590419 16424356 20097601 19768133 16524293 13165743 10294488
41515A0294488l320462l096452j197228J95913n49128j338590J65353K638286
$$ 10294488 6974026 3877574 2680346 2876259 2327131 988541 1153894 3792180
41507C792180L810148M413852N743578N754619K171435k153349k124423J785735
$$ 3792180 7602328 12016180 17759758 23514377 25685812 23532463 21408040 23193775
41499B3193775L666940O24407l698949n318975m992757m837677l993861j040797
$$ 23193775 26860715 27485122 23786173 18467198 13474441 8636764 4642903 3602106
41491C602106K109141K479016O54014k47656N87286R71632l73822k074297k631677
$$ 3602106 5711247 8190263 8844277 8596621 9183907 10155539 9781717 7707420 5075743
41482E075743k298088j674972m15015J609260L255876L347545K043358J79784
$$ 5075743 2777655 1102683 687668 2296928 5552804 8900349 10943707 11123491
41474A1123491j765862l167979k814964l94459K213002K674749J069162l97210
$$ 11123491 9357629 6189650 3374686 2980227 5193229 7867978 8937140 8539930
41466H539930m55677K2718J12862L66112J439876K646906K901273J957330j16356
$$ 8539930 8084253 8106971 8219833 8585945 10025821 12672727 15574000 17531330 17414974
41457A7414974l171394n558393m416390N14439M913189M433855L57499k163634
$$ 17414974 14243580 8685187 4268797 4783236 9696425 14130280 14487779 12324145
41449A2324145r31556J452582K477483K781247L388382L350460J950255N26162
$$ 12324145 11392589 12845171 15322654 18103901 21492283 24842743 26792998 27319160
41441B7319160R0715o11271k638304m476107m289741k847667k022717j819437
$$ 27319160 27409875 26798604 24160300 19684193 15394452 12546785 10524068 8704631
41433H704631j052194J96053Q39785O23859J00459k09773M90876K714494M591687
$$ 8704631 7652437 7848490 8688275 9312134 9412593 9202820 9693696 12408190 16999877
41424A6999877K834336k215125n309311l035353Q29351N86889k942113m044067
$$ 16999877 19834213 17619088 12309777 9274424 10103775 10690664 7748551 3704484
41416C704484r87010K019670J862221M34350K86598P76125M88248L0261L72253
$$ 3704484 2717474 4737144 6599365 7033715 7320313 8096438 8584686 8614947 8987200
41407H987200J042540J548875K147763K055325k81491l818033m888606k351227
$$ 8987200 10029740 11578615 13726378 15781703 15500212 11682179 6793573 4442346
41399D442346J93336m50970k422956k000572P22514K372548J216577j162264k426330
$$ 4442346 4635682 4184712 1761756 -238816 483698 2856246 4072823 2910559 484229
41390D84229j649518N01095K213491J886560J37441p09039o7517j87270k417275
$$ 484229 -1165289 -664194 1549297 3435857 3573298 2864259 2796742 2609472 192197
41381A92197m516343l759129q24532J818896L664621N477699O272025M320203
$$ 192197 -4324146 -8083275 -8907807 -7088911 -3424290 2053409 8325434 12645637
41373A2645637O78367j416158p88308N58576O80642k92775j557543k773275l348403
$$ 12645637 13324004 11907846 11119538 11678114 12358756 12065981 10508438 7735163 4386760
41364D386760k499575n72684J067788J613007J122671j94307j425702n79881K854437
$$ 4386760 1887185 1314501 2382289 3995296 5117967 4923660 3497958 2918077 5772514
41355E772514N615067L948019q31455l341523j324389J588498J672974K17118
$$ 5772514 11387581 15335600 14504145 11162622 9838233 11426731 13099705 13316823
41347A3316823L68776J739436J563407l58897j440065o10267K67331m06124j851478
$$ 13316823 13685599 15425035 16988442 16629545 15189480 14579213 14846544 14440420 12588942
41338A2588942k607612k340497j296922K86971J503963J154051l41478j005971
$$ 12588942 9981330 7640833 6343911 6630882 8134845 9288896 8947418 7941447
41330G941447k93537k41260k076048l427756j430893K463040L914559J845849
$$ 7941447 7647910 7406650 5330602 1902846 471953 2934993 6849552 8695401
41322H695401k55216r4949j0649k299318m338557k272505K290705L895021J207542
$$ 8695401 8440185 8345236 8334587 6035269 1696712 -575793 1714912 5609933 6817475
41313F817475j277059l64772J510841J137191l44396k82766O78922M35803j61107
$$ 6817475 5540416 5175644 6686485 7823676 7479280 7196514 7875436 8311239 8150132
41304H150132J158511L426890L501962J313525J3798P59278J249156J75546o22097
$$ 8150132 9308643 12735533 16237495 17551020 17564818 18324096 19573252 19748798 19126701
41295A9126701K17781J182189Q94064N47145J245352J560383J84354j247341p71062
$$ 19126701 19344482 20526671 21420735 21967880 23213232 24773615 24957969 23710628 22939566
41286B2939566K65762o87039k770273k580033N55588L304335K925268N13001j429531
$$ 22939566 23205328 22518289 19748016 17167983 17723571 21027906 23953174 24466175 23036644
41277B3036644k486134l720227m917258m454278j832688J139786K332288J744803
$$ 23036644 20550510 16830283 11913025 7458747 5626059 6765845 9098133 10842936
41269A0842936J136323J380666J309527j89844j959392j899965m3354J561643
$$ 10842936 11979259 13359925 14669452 14479608 12520216 10620251 10576897 12138540
41261A2138540K071846K721766L763756L101769j79249l154033k742373o05531
$$ 12138540 14210386 16932152 20695908 23797677 23618428 20464395 17722022 17116491
41253A7116491r30417l817256m713255j251902K982621L584389J352759K68976
$$ 17116491 16186074 12368818 7655563 6403661 9386282 12970671 14323430 14592406
41245A4592406J307229J810015N62184j34292J453964L162103J888308j616527
$$ 14592406 15899635 17709650 18271834 18137542 19591506 22753609 24641917 23025390
41237B3025390l469568j962705J91803k05656k440627l149852j171849R83510
$$ 23025390 19555822 17593117 17784920 17579264 15138637 11988785 10816936 11800446
41229A1800446Q22699q47443j473444l15638J102370J448665Q66415J9846n84157
$$ 11800446 12623145 11775702 10302258 9986620 11088990 12537655 13404070 13423916 12839759
41220A2839759l07926R99349J915175P58085j488857j600383J326031L664372
$$ 12839759 12531833 13531182 15446357 16204442 14715585 13115202 14441233 18105605
41212A8105605J630067l484441o823966n944299k704426M16953K819856M071675
$$ 18105605 19735672 16251231 9427265 3482966 778540 1195493 4015349 8087024
41204H087024K941937k8066j525668M02816K884732J742972k459645n001559l493349
$$ 8087024 11028961 11000895 9475227 9878043 12762775 14505747 12046102 7044543 3551194
41195C551194o14729L71335k11369m59577m70694j284534j899789n12755J787495
$$ 3551194 2936465 3307800 3096431 2636854 2166160 881626 -1018163 -1530918 256577
41186B56577J843934m46444r56291K843130P229050O397384M65740l903356j671924
$$ 256577 2100511 1654067 697776 3540906 10769956 17167340 17633080 13729724 12057800
41177A2057800M283257O861175L264493k426066m854369l277572j029049p32984
$$ 12057800 16341057 23202232 26466725 24040659 19186290 15908718 14879669 14146685
41169A4146685j683983j616281L09390K754591L837130K989111J228695j03571
$$ 14146685 12462702 10846421 11155811 13910402 17747532 20736643 21965338 21861767
41161B1861767n65783n44001m62377n65108j094890j858702j846256m00973J271152
$$ 21861767 21295984 20751983 20289606 19724498 18629608 16770906 14924650 14523677 15794829
41152A5794829J238149k00208n09500J224621K460925R56355j507515j748279
$$ 15794829 17032978 16832770 16323270 17547891 20008816 20965171 19457656 17709377
41144A7709377k10428o8159j780774k299662l62267J156689j7185j673900o63831
$$ 17709377 17498949 17430790 15650016 13350354 12988087 14144776 14127591 12453691 11789860
41135A1789860J994499K744863R77953l25881P79241K660702K686572M56030k212578
$$ 11789860 13784359 16529222 17507175 17181294 17960535 20621237 23307809 23763839 21551261
41126B1551261l395827k728811j542502j367842k107360k335891j570360q41856
$$ 21551261 18155434 15426623 13884121 12516279 10408919 8073028 6502668 5660812
41118E660812m86614O04134K280418K045297j080541l751817k438618J225413
$$ 5660812 5174198 5778332 8058750 10104047 9023506 5271689 2833071 4058484
41110D058484K815167J728726J305805K675500K987126N72260k288190l222152
$$ 4058484 6873651 8602377 9908182 12583682 15570808 16143068 13854878 10632726
41102A0632726k720533j588491Q86154M032757M589425J321527k010609j510112
$$ 10632726 7912193 6323702 7209856 11242613 15832038 17153565 15142956 13632844
41094A3632844J319240K191707K78186j699872k235818k253860k249257j613987
$$ 13632844 14952084 17143791 17421977 15722105 13486287 11232427 8983170 7369183
41086G369183o37535k67586k3131J160625K275788J314930j043161j824069k13611
$$ 7369183 6731648 6464062 6440931 7601556 9877344 11192274 10149113 8325044 8111433
41077H111433J256502O98281o49593r59680m07471Q6922O58684J548161J906574
$$ 8111433 9367935 10066216 9416623 8456943 8049472 8136394 8795078 10343239 12249813
41068A2249813J015792l22172p14765K45765J893602L082643K653165N46404j389114
$$ 12249813 13265605 12943433 12228668 12474433 14368035 17450678 20103843 20650247 19261133
41059A9261133j234779J94705K99244j209784j566319O68212K945104K296636
$$ 19261133 18026354 18221059 18520303 17310519 15744200 16412412 19357516 21654152
41051B1654152l73243j795750q10737R28124J818474J612301L63094j675879l114311
$$ 21654152 21280909 19485159 18674422 19602546 21421020 23033321 23396415 21720536 18606225
41042A8606225k387752j9812J637546J304614O3003o19951p38204q54135n13996
$$ 18606225 16218473 16198661 17836207 19140821 19203824 18583873 17845669 16991534 16477538
41033A6477538J185052L739371N071309L745515R74775l54133R89452K868545
$$ 16477538 17662590 21401961 26473270 30218785 31193560 30839427 31828879 34697424
41025C4697424K333876m59835k378839j618663j13169m99998k252704k817049
$$ 34697424 37031300 36571465 34192626 32573963 32460794 31960796 29708092 26891043
41017B6891043j766700j399811k947313m350770k980869O89187L444799K911150
$$ 26891043 25124343 23724532 20777219 16426449 13445580 14134767 17579566 20490716
41009B0490716j69481l065315l727915k271953l08402P97186R31732P47117O79142
$$ 20490716 20321235 17255920 13528005 11256052 10947650 11744836 12676568 13423685 14102827
41000A4102827P44764R25117J180892J193642O36450k53865q35058q99813r65489
$$ 14102827 14847591 15772708 16953600 18147242 18783692 18529827 17694769 16794956 15829467
40991A5829467j541753k394867k780108k279064j165151J02467J476811L007215
$$ 15829467 14287714 11892847 9112739 6833675 5668524 5770991 7247802 10255017
40983A0255017L975272L185407P99603q41942L85499L269379M103687J163488
$$ 10255017 14230289 17415696 18215299 17373357 17758856 21028235 25131922 26295410
40975B6295410l098484n171653m448035k867656j836332j162662l43772Q14239
$$ 26295410 23196926 18025273 13577238 10709582 8873250 7710588 7366816 8181055
40967H181055K502712M244424M249017J248604k984027m783563k764068N92472
$$ 8181055 10683767 14928191 19177208 20425812 17441785 12658222 9894154 10486626
40959A0486626K033523R61500p18452r76791O32135K622012K648720M0387k718784
$$ 10486626 12520149 13481649 12763197 11786406 12418541 15040553 17689273 17729660 15010876
40950A5010876k605926k63011N79979j478741l253035j719362J411804K413835
$$ 15010876 12404950 12141939 12721918 11243177 7990142 6270780 7682584 10096419
40942A0096419J031859R2337O00621P87361J44116Q28009L690490N811301M244956
$$ 10096419 11128278 11220615 11821236 12608597 12752713 13580722 17271212 23082513 27327469
40933B7327469M78927j271291N01933L020731L095956Q57656j004694p25631O70194
$$ 27327469 27806396 26535105 27037038 30057769 33153725 34011381 33006687 32281056 32951250
40924C2951250Q39526j065114l407661l899138j965512J052976L479399M241899
$$ 32951250 33790776 32725662 29318001 25418863 23453351 24506327 27985726 32227625
40916C2227625K798529l43169k976370k843698o49222K78607j493839l069514
$$ 32227625 35026154 34682985 31706615 28862917 28213695 28492302 26998463 23928949
40908B3928949j257194K381709L385388Q40488j348478m63094J028375k81332
$$ 23928949 22671755 25053464 28438852 29279340 27930862 27467768 28496143 28214811
40900B8214811l021135l053752j56919J297647r66421l458689k200511J093668
$$ 28214811 25193676 22139924 21983005 23280652 22314231 18855542 16655031 17748699
40892A7748699J581001j305105l115158j379626P61672j8478j621436M4837L993088
$$ 17748699 19329700 18024595 14909437 13529811 14291483 14273005 12651569 12696406 16689494
40883A6689494M986324J283526k798970l321078j798740j457486j754130k67288
$$ 16689494 21675818 22959344 20160374 16839296 15040556 13583070 11828940 11561652
40875A1561652K066944J940679o66769j973968j22060K288751K728632K460790
$$ 11561652 13628596 15569275 14902506 12928538 12806478 15095229 17823861 20284651
40867B0284651L502218M454185K339034k629995o822453p422853m933016j639385
$$ 20284651 23786869 28241054 30580088 27950093 21127640 13704787 8771771 7132386
40859G132386P65445J985551K704012L437292L459827J728811o94030r67597J427504
$$ 7132386 7897831 9883382 12587394 16024686 19484513 21213324 20519294 19551697 20979201
40850B0979201L011975J141624j410483k60154L385177L879685k85043l915151
$$ 20979201 23991176 25132800 23722317 23462163 26847340 30727025 30441982 26526831
40842B6526831k899388o1869r1687k285285k584738m86503Q24959K17308k18497
$$ 26526831 23627443 23565574 23473887 21188602 18603864 18117361 18942320 19159628 18941131
40833A8941131K25171l80415k231817k398179J91592K016355J26430k758542j941370
$$ 18941131 19166302 18785887 16554070 14155891 14347483 16363838 16490268 13731726 11790356
40824A1790356K089529M135584J647460k092758l038950j554642p04694j493774
$$ 11790356 13879885 18015469 19662929 17570171 14531221 12976579 12271885 10778111
40816A0778111k184427j486725j71377O28433J041074J719967K496065K533713
$$ 10778111 8593684 7106959 6935582 7564015 8605089 10325056 12821121 15354834
40808A5354834J366619p04041k780868l508851j769318J788368M366067L606349
$$ 15354834 16721453 16017412 13236544 9727693 7958375 9746743 14112810 17719159
40800A7719159P15814n81768J017465K186657n69535n455977p040139l303123
$$ 17719159 18434973 17853205 18870670 21057327 20487792 15031815 7991676 4688553
40792D688553J778094L692888K790085K205942K603756K090940L86671m57939
$$ 4688553 6466647 10159535 12949620 15155562 17759318 19850258 20236929 19778990
40784A9778990J40203j7893k139273m020626l309073j096983J7339j43325K4907
$$ 19778990 19919193 19901300 17762027 13741401 10432328 9335345 9352684 9209359 9234266
40775I234266M59939l07096j765767j512615O99845J962003M89182j689616k004749
$$ 9234266 9694205 9387109 7621342 6108727 6808572 8770575 9259757 7570141 5565392
40766E565392j008014o16318o31831L34923J783848K045878J379185J463654K093746
$$ 5565392 4557378 3941060 3309229 3644152 5428000 7473878 8853063 10316717 12410463
40757A2410463J344332p83716j883183r68459J52712L85203J189717L214354M043808
$$ 12410463 13754795 12971079 11087896 10119437 10272149 10657352 11847069 15061423 19105231
40748A9105231J896535q13540p77493J000892Q01177j874068l605129k341855
$$ 19105231 21001766 20188226 19410733 20411625 21212802 19338734 15733605 13391750
40740A3391750Q329J013810P97308M88782J8659j062443k256295k836679k620283
$$ 13391750 13400079 14413889 15211197 15699979 15718638 14656195 12399900 9563221 6942938
40731F942938j421480O60979K064207J102160q90729n29651K284685L211388r2298
$$ 6942938 5521458 6182437 8246644 9348804 8458075 7928424 10213109 13424497 13332199
40722A3332199l609949k600559R86416J438290j705608k966053L75989M146137
$$ 13332199 9722250 7121691 8108107 9546397 7840789 4874736 5250725 9396862
40714I396862L768171M62334j890345k459439k481230j374497J812142M549125
$$ 9396862 13165033 13627367 11737022 9277583 6796353 5421856 7233998 11783123
40706A1783123K993522k039337n342637m331830k104340j989605k505280m89360
$$ 11783123 14776645 12737308 7394671 3062841 958501 -1031104 -3536384 -4025744
40698d025744L150051M426273K314255L71057J567157M109871M146671J192058
$$ -4025744 -875693 3550580 5864835 6235892 7803049 11912920 16059591 17251649
40690A7251649j283735n99366J624189J718743j171249m028073l949454j746023
$$ 17251649 15967914 15368548 16992737 18711480 17540231 13512158 9562704 7816681
40682G816681l96543q11950j019356L25313J630256Q11927j324482j993603k80835
$$ 7816681 7420138 6608188 5588832 5914145 7544401 8356328 7031846 5038243 4757408
40673D757408J707858J782502K74269r63086j106623r90366j565261k404463j851653
$$ 4757408 6465266 8247768 8522037 7558951 6452328 5461962 3896701 1492238 -359415
40664c59415J196165N359907P164572M460318o51554l712185l014786j239328
$$ -359415 836750 6196657 13361229 17821547 17169993 13457808 10443022 9203694
40656I203694j272312k278552j661314M92359J481297K00636j242984p28783J131061
$$ 9203694 7931382 5652830 3991516 4483875 5965172 6165808 4922824 4194041 5325102
40647E325102K519823L038345L296461K981225J192909j425719k481811m61749
$$ 5325102 7844925 10883270 14179731 17160956 18353865 16928146 14446335 13984586
40639A3984586L076295M672414K430294j976282n047413n068534l370360j901523
$$ 13984586 17060881 21733295 24163589 22187307 17139894 12071360 8701000 6799477
40631F799477p47517Q87366K308691J951323J47428r36411n57711l43345j033835
$$ 6799477 6051960 6939326 9248017 11199340 11346768 10410357 9852646 9509301 8475466
40622H475466p29948J681588L442897J202419l585771n735213l039512Q32135
$$ 8475466 7745518 9427106 12870003 14072422 10486651 4751438 1711926 2544061
40614B544061J157638k159262n091411m383767o05295L056652L993512K299204
$$ 2544061 3701699 1542437 -3548974 -7932741 -8538036 -5481384 -1487872 811332
40606H11332K11648m61172o7762J7198n25660j010260j161940r64035L91945L379453
$$ 811332 1022980 561808 494046 511244 -14416 -1024676 -2186616 -3150651 -2758706 620747
40596F20747O027374N285903J131460k841288l835356k777952j761023r07318
$$ 620747 6648121 11934024 13065484 10224196 6388840 3610888 1849865 942547
40588I42547M10715J308824P49532k46063j12004P09551J101240J854466L934228
$$ 942547 1353262 2662086 3411618 3165555 3053551 3763102 4864342 6718808 10653036
40579A0653036N137681K245648l381065o167453l403417J407609L864746M023168
$$ 10653036 15790717 18036365 14655300 8487847 5084430 6492039 10356785 14379953
40571A4379953L995123L260737J78373l456877l683884l16991K137186P00939
$$ 14379953 18375076 21635813 21814186 18357309 14673425 14356434 16493620 17194559
40563A7194559j987447j812997Q42886K031826J52263k028011j645212M70946
$$ 17194559 15207112 13394115 14237001 16268827 16421090 14393079 12747867 13218813
40555A3218813J701080J585048J695737K276833J559770r92935l017934k394705
$$ 13218813 14919893 16504941 18200678 20477511 22037281 21044346 18026412 15631707
40547A5631707n05013k40908j638173k034895n44389L99242r59755k578811j593521
$$ 15631707 15126694 14885786 13247613 11212718 10668329 11067571 10107816 7529005 5935484
40538E935484J069296J646465j171683m247475l920576k98659L286782M038797
$$ 5935484 7004780 8651245 7479562 3232087 -688489 -987148 2299634 6338431
40530F338431J948970r84238k723617k597979j584816j212920j650026j115002
$$ 6338431 8287401 7303163 4579546 1981567 396751 -816169 -2466195 -3581197
40522c581197J889743N744950O507679K554395k575682l724177l12974K936112
$$ -3581197 -1691454 4053496 10561175 13115570 10539888 6815711 6502737 9438849
40514I438849J999394j724308l983333l152421j013629P17673J910976K347651
$$ 9438849 11438243 9713935 5730602 2578181 1564552 2282225 4193201 6540852
40506F540852J325454m73116j051186O0293J005761N45933k06746p4734K22250
$$ 6540852 7866306 7393190 6342004 6402297 7408058 7953991 7747245 7672511 7894761
40497G894761j84561n68939l14544m71252j591680j824981L64236L082538L391697
$$ 7894761 7710200 7141261 6826717 6355465 4763785 2938804 3303040 6385578 9777275
40488I777275J633077L87962J13665p11357j622472l90693K339354K751668k77270
$$ 9777275 11410352 11798314 11911979 11200622 9578150 9187457 11526811 14278479 14001209
40479A4001209k738753j281538J714599J990500J9744j6913L101627N781286M851694
$$ 14001209 11262456 9980918 11695517 13686017 13705761 13688848 16790475 22571761 27423455
40470B7423455J635607m85393m72026J35790K38269M16371J040033Q18444j495227
$$ 27423455 29059062 28573669 28101643 28237433 28475702 28892073 29932106 30750550 29255323
40461B9255323m639460n804287m323494k627485k517698k400263k28753K460205
$$ 29255323 24615863 18811576 14488082 11860597 9342899 6942636 6713883 9174088
40453I174088K529668M43691k29605J264405J430503j646697m848660m736848
$$ 9174088 11703756 12147447 11917842 13182247 14612750 12966053 8117393 3380545
40445C380545k432956q57531m726J403487J928920m84450l707913l417240K32747
$$ 3380545 947589 90058 85332 1488819 3417739 2933289 -774624 -4191864 -3959117
40436c959117K352787M60177k197072j905574N04933K008083J884014J423742
$$ -3959117 -1606330 -1146153 -3343225 -5248799 -4743866 -2735783 -851769 571973
40428E71973J151799P99548P47719J309459J462751K29702j314528j203680N57493
$$ 571973 1723772 2523320 3271039 4580498 6043249 6272951 4958423 3754743 4312236
40419D312236J838703J075491j018248k453120j875564M46121K883580L754192
$$ 4312236 6150939 7226430 6208182 3755062 1879498 2325619 5209199 8963391
40411H963391K771752J038599m70242j715428k606540k278615l38130J812531
$$ 8963391 11735143 12773742 12303500 10588072 7981532 5702917 5364787 7177318
40403G177318K123760L69611j401190j110659J141849L325178L658411K305837
$$ 7177318 9301078 9670689 8269499 7158840 8300689 11625867 15284278 17590115
40395A7590115Q56551L20882J59399m54589j123218q67702Q3654L18678q54325
$$ 17590115 18446666 18767548 18926947 18472358 17349140 16481438 16565092 16883770 16029445
40386A6029445k536440l450834l054613j309493J404148L671459L675187J452943
$$ 16029445 13493005 10042171 6987558 5678065 7082213 10753672 14428859 15881802
40378A5881802m37786K41336K442223L035376Q96667j557824j476036Q19749K498398
$$ 15881802 15444016 15685352 18127575 21162951 22059618 20501794 19025758 19845507 22343905
40369B2343905K143529J387427J889469K286327K36253l205599m184634j636037
$$ 22343905 24487434 25874861 27764330 30050657 30286910 27081311 22896677 21260640
$$ [...]
##END NTUPLES=NMR SPECTRUM
##END=
