##TITLE=31Pdec_DE-111_rm_3h
, 24 sc
 10.9.2025
##JCAMPDX= 6.0         $$ Bruker NMR JCAMP-DX V2.0
##DATA TYPE= NMR SPECTRUM
##DATA CLASS= NTUPLES
##ORIGIN= UXNMR, Bruker Analytische Messtechnik GmbH
##OWNER= root
$$ XWIN-NMR		Version 3.5
$$ Wed Sep 10 14:53:05 2025 Russian Standard Time (UT+4h)  she@DPX200
##.OBSERVE FREQUENCY= 81.013821
##.OBSERVE NUCLEUS= ^31P
##.ACQUISITION MODE= SIMULTANEOUS
##.ACQUISITION SCHEME= undefined
##.AVERAGES= 64
##.DIGITISER RES= 17
##SPECTROMETER/DATA SYSTEM= spect
##.PULSE SEQUENCE= zgpg30
##.SOLVENT NAME= CDCl3
##.SHIFT REFERENCE= (INTERNAL, CDCl3, 0, 198.062)
##AUDIT TRAIL= $$ (NUMBER, WHEN, WHO, WHERE, WHAT)
$$ ##TITLE= Audit trail, XWIN-NMR		Version 3.5
$$ ##JCAMPDX= 5.01
$$ ##ORIGIN= Bruker BioSpin GmbH
$$ ##OWNER= she
$$ F:/spectra/data/she/nmr/P31/2/pdata/1/auditp.txt
$$ ##AUDIT TRAIL=  $$ (NUMBER, WHEN, WHO, WHERE, WHAT)
(   1,<2025-09-10 14:50:48.40 +0400>,<she>,<DPX200>,
      <created by zg, POWCHK disabled, PULCHK disabled
       configuration hash MD5:
       00 E9 B6 7A A2 85 ED C7 34 08 36 98 17 FE 4E 26
       data hash MD5: 32K
       5B A1 40 92 EB 63 B1 71 56 D3 A9 19 AA 67 4E 49>)
(   2,<2025-09-10 14:50:58.37 +0400>,<she>,<DPX200>,
      <Start of raw data processing
       efp BC_mod = 2 LB = 1.5 FT_mod = 6 PKNL = 1 PHC0 = 1383.228 PHC1 = 111.8999 SI = 64K 
       data hash MD5: 64K
       EF 53 8C BF ED 4B 2C C3 11 83 16 47 DD A7 27 62>)
(   3,<2025-09-10 14:51:27.93 +0400>,<she>,<DPX200>,
      <pk PHC0 = -134.1683 PHC1 = 347.4 
       data hash MD5: 64K
       2C E0 43 2E 28 4B AE AA 99 2A D8 F3 D8 6A 57 9F>)
(   4,<2025-09-10 14:51:47.34 +0400>,<she>,<DPX200>,
      <pk PHC0 = 7.318854e-05 PHC1 = 0 
       data hash MD5: 64K
       81 2B 7D E3 6C E5 1A 75 EF E8 E8 C9 92 52 37 A5>)
(   5,<2025-09-10 14:52:10.01 +0400>,<she>,<DPX200>,
      <pk PHC0 = -2.742977 PHC1 = 0 
       data hash MD5: 64K
       BD 53 1B F2 FE 65 71 04 9C 0D DA 60 FD 6A FA 2C>)
(   6,<2025-09-10 14:52:25.00 +0400>,<she>,<DPX200>,
      <pk PHC0 = -3.400005 PHC1 = 0 
       data hash MD5: 64K
       31 8B 75 17 26 0D 84 84 50 BF A7 8B B6 11 EC 9A>)
$$ ##END=
$$ 
$$ hash MD5
$$ 66 AB 33 38 CC DF AD 81 53 F9 33 C7 BF 82 EA AF
##$RELAX= 
##$RELAX= 
##$RELAX= 
##$RELAX= 
##$RELAX= 
##$RELAX= 
##$RELAX= 
##$RELAX= 
$$ Bruker specific parameters
$$ --------------------------
##$DU= <F:/spectra>
##$EXPNO= 2
##$NAME= <P31>
##$PROCNO= 1
##$TYPE= <nmr>
##$USER= <she>
##$AMP= (0..31)
100 100 100 100 100 100 100 100 100 100 100 100 100 100 100 100 100 100 
100 100 100 100 100 100 100 100 100 100 100 100 100 100 
##$AQSEQ= 0
##$AQ_mod= 1
##$AUNM= <au_zg>
##$AUTOPOS= <>
##$BF1= 81.014009
##$BF2= 200.13
##$BF3= 200.13
##$BF4= 200.13
##$BF5= 200.13
##$BF6= 200.13
##$BF7= 200.13
##$BF8= 200.13
##$BYTORDA= 1
##$CFDGTYP= 0
##$CFRGTYP= 5
##$CHEMSTR= <none>
##$CNST= (0..31)
1 1 145 1 1 1 1 1 1 1 1 1 1 1 1 1 1 1 1 1 1 1 1 1 1 1 1 1 1 1 1 1 
##$CPDPRG= <waltz16>
##$CPDPRG1= <>
##$CPDPRG2= <waltz16>
##$CPDPRG3= <>
##$CPDPRG4= <mlev>
$$ [...]
##$SUBNAM3= <"">
##$SUBNAM4= <"">
##$SUBNAM5= <"">
##$SUBNAM6= <"">
##$SUBNAM7= <"">
##$SUBNAM8= <"">
##$SUBNAM9= <"">
##$SW= 400.765351723535
##$SWIBOX= (0..15)
0 1 3 0 0 0 0 0 0 0 0 0 0 0 0 0 
##$SW_h= 32467.5324675325
##$TD= 32768
##$TD0= 1
##$TE= 0
##$TE2= 300
##$TE3= 300
##$TEG= 300
##$TL= (0..7)
0 120 53 12 22 120 120 120 
##$TP= (0..7)
150 150 150 150 150 150 150 150 
##$TP07= 0
##$TPNAME0= <>
##$TPNAME1= <>
##$TPNAME2= <>
##$TPNAME3= <>
##$TPNAME4= <>
##$TPNAME5= <>
##$TPNAME6= <>
##$TPNAME7= <>
##$TPOAL= (0..7)
0.5 0.5 0.5 0.5 0.5 0.5 0.5 0.5 
##$TPOFFS= (0..7)
0 0 0 0 0 0 0 0 
##$TUNHIN= 0
##$TUNHOUT= 0
##$TUNXOUT= 0
##$USERA1= <user>
##$USERA2= <user>
##$USERA3= <user>
##$USERA4= <user>
##$USERA5= <user>
##$V9= 5
##$VALIST= <valist>
##$VCLIST= <CCCCCCCCCCCCCCC>
##$VD= 0
##$VDLIST= <DDDDDDDDDDDDDDD>
##$VPLIST= <PPPPPPPPPPPPPPP>
##$VTLIST= <TTTTTTTTTTTTTTT>
##$WBST= 1024
##$WBSW= 4
##$XGAIN= (0..3)
0 0 0 0 
##$XL= 0
##$YL= 0
##$YMAX_a= 29519
##$YMIN_a= -36428
##$ZGOPTNS= <>
##$ZL1= 120
##$ZL2= 120
##$ZL3= 120
##$ZL4= 120
##$ABSF1= 0
##$ABSF2= 0
##$ABSG= 0
##$ABSL= 0
##$ALPHA= 0
##$AQORDER= 0
##$ASSFAC= 0
##$ASSFACI= 0
##$ASSFACX= 0
##$ASSWID= 0
##$AUNMP= <proc_1d>
##$AZFE= 0.1
##$AZFW= 0.5
##$BCFW= 0
##$BC_mod= 2
##$BYTORDP= 0
##$COROFFS= 0
##$CY= -3
##$DATMOD= 1
##$DC= 0
##$DFILT= <>
##$DTYPP= 0
##$F1P= 0
##$F2P= 0
##$FCOR= 1
##$FTSIZE= 65536
##$FT_mod= 6
##$GAMMA= 0
##$GB= 0
##$INTBC= 1
##$INTSCL= 9.790993e-09
##$ISEN= 30
##$LB= 1.5
##$LEV0= 0
##$LPBIN= 0
##$MAXI= 10000
##$MC2= 0
##$MEAN= 0
##$ME_mod= 0
##$MI= 50
##$NCOEF= 0
##$NC_proc= -9
##$NLEV= 6
##$NOISF1= 182.463
##$NOISF2= 159.3651
##$NSP= 0
##$NTH_PI= 0
##$NZP= 0
##$OFFSET= 198.0616
##$PC= 4
##$PHC0= 1242.917
##$PHC1= 459.2999
##$PH_mod= 1
##$PKNL= yes
##$PPARMOD= 0
##$PSCAL= 0
##$PSIGN= 0
##$REVERSE= no
##$SF= 81.0140089999434
##$SI= 65536
##$SIGF1= 159.3651
##$SIGF2= -187.1042
##$SINO= 113.3802
##$SIOLD= 16384
##$SREGLST= <1H.CDCl3>
##$SSB= 0
##$STSI= 65536
##$STSR= 0
##$SW_p= 32467.5324675325
##$SYMM= 0
##$S_DEV= 0
##$TDeff= 32768
##$TDoff= 0
##$TI= <>
##$TILT= no
##$TM1= 0
##$TM2= 0
##$TOPLEV= 0
##$USERP1= <user>
##$USERP2= <user>
##$USERP3= <user>
##$USERP4= <user>
##$USERP5= <user>
##$WDW= 1
##$XDIM= 65536
##$YMAX_p= 513092853
##$YMIN_p= -129264894
$$ End of Bruker specific parameters
$$ ---------------------------------
##NTUPLES= NMR SPECTRUM
##VAR_NAME=  FREQUENCY,     SPECTRUM/REAL,   SPECTRUM/IMAG
##SYMBOL=    X,             R,               I
##VAR_TYPE=  INDEPENDENT,   DEPENDENT,       DEPENDENT
##VAR_FORM=  AFFN,          ASDF,            ASDF
##VAR_DIM=   65536,         65536,           65536
##UNITS=     HZ,            ARBITRARY UNITS, ARBITRARY UNITS
##FACTOR=    0.49542278885378, 1,            1
##FIRST=     16045.7642231865, 0,            0
##LAST=      -16421.768244346, 0,            0
##MIN=       -16421.768244346, -129264894,   0
##MAX=       16045.7642231865, 513092853,    0
$$ Real data points
##PAGE= N=1
##DATA TABLE= (X++(R..R)), XYDATA
$$ [...]
47544 13289565 18610240 19074143 15828745 11573708 8786816 8859026 11434786 14803697
47536 14803697 17770354 20343906 21825402 20080601 14846148 10244798 10864386 15752704
47528 15752704 19517733 19643294 19374987 22154538 26171979 26515941 20890876 11448664
47520 11448664 2464103 -2292120 -1425685 3090875 7751908 11200057 14406256 16596587
47512 16596587 14378408 7494312 2321018 5286501 14222059 20697413 20413206 16697956
47504 16697956 13547712 10470322 6300886 3538952 5117823 9303142 11277487 8657914
47496 8657914 3102018 -2153244 -4106218 -1050839 5327942 10098648 10212786 8507249
47488 8507249 9484575 12073564 10733697 4020487 -2435144 -3433825 -977669 -465732 -2697177
47479 -2697177 -3490303 -240771 4977598 9296718 12883712 17457522 23077732 28150354
47471 28150354 31419587 32371760 30592679 26578493 22817711 22053545 24026225 25523536
47463 25523536 24276947 21213902 17958563 14072351 8790021 4030709 2789291 4945275
47455 4945275 7661630 10069752 14076293 19368532 21339432 16683729 8304223 1572384
47447 1572384 -1770718 -2263648 1951552 12437969 23731605 26233972 18166556 9053432
47439 9053432 7777250 11914537 13480660 10968929 8994025 7985374 2101813 -10927332
47431 -10927332 -24065873 -28765543 -25004613 -20076285 -19467206 -21961443 -22503201 -17341144
47423 -17341144 -7141319 2999709 7530662 6308510 5455549 10348865 18974776 24835995
47415 24835995 25235947 22923470 19817580 14074465 5579333 -49636 2425717 9595656
47407 9595656 12252348 6962890 691637 2120495 11351402 20584710 22972072 18238183
47399 18238183 11052116 6950652 9343088 17130919 24294719 24355611 16925379 8563191
47391 8563191 6025394 9788910 14972993 16951926 14713308 10370258 7464435 8712165
47383 8712165 13107376 15682350 12347706 4908279 -700411 -1038340 2151096 5786156
47375 5786156 9138099 12809657 16676649 20397056 23897301 25883227 24163517 19414735
47367 19414735 16205601 17404851 19580876 17626739 12579559 10327994 12768198 15278192
47359 15278192 14348700 12802473 14298323 16549261 14530626 8500756 4340850 6308364
47351 6308364 12938982 19860132 23337087 21275708 14617411 8512847 8440841 13631925
47343 13631925 17396285 15482131 10833028 8049931 6811805 4248766 891370 -237141
47335 -237141 1260087 3648220 7658391 15278365 23728326 26290553 21157928 14633502
47327 14633502 12611841 13072743 10710107 5241028 152206 -4313509 -11037145 -19336709
47319 -19336709 -23848806 -21248164 -13978452 -6019894 1223411 7039452 9119257 6288744
47311 6288744 1636203 73573 3233574 8065326 9690239 5118803 -4164381 -12427037
47303 -12427037 -14343888 -10452811 -6092189 -4180888 -1854530 4270748 12752442 19804053
47295 19804053 24158870 26165729 24711480 19280914 13368978 11383514 13061451 15064736
47287 15064736 16945540 20637401 24781403 25407425 22797448 21752671 23565526 23765820
47279 23765820 20329291 17877034 19638814 21055516 17195676 12041335 13259589 20169057
47271 20169057 24310894 21535246 16640364 14953299 15402727 14360572 11625145 9389499
47263 9389499 8207069 6915104 5054027 3422373 3117604 4900942 8626428 13204673
47255 13204673 18105462 23943843 29765175 31422093 26136257 17751998 13177481 13601524
47247 13601524 13686908 9970272 5169348 2820788 2732849 4103670 8244873 14873999 19921876
47238 19921876 20763094 19922887 19778714 17473232 9906529 583562 -3914248 -2072434
47230 -2072434 3067327 10218963 19620424 28023943 30706676 28636774 27473532 28629386
47222 28629386 27213832 20281058 11431103 5043716 1151551 -1346679 -1416889 714374
47214 714374 1318368 -1476243 -3472893 -48962 6473735 9892385 9261198 10064487 15780359
47205 15780359 22243775 22524581 15690049 8463423 7668121 12188040 14422085 10098769
47197 10098769 3598389 939100 754841 -2331546 -7158886 -6431456 1300885 7970115
47189 7970115 7821581 5664476 8046986 12861750 14945929 16530510 22884997 30652797
47181 30652797 30601605 21665226 12884173 10125270 9676114 7538714 6408539 8778892
47173 8778892 10412054 6939567 1972765 2199149 7549388 12169687 13080963 12289313 11470966
47164 11470966 9826290 7087324 4253277 1022610 -3848749 -9245488 -11980665 -10818002
47156 -10818002 -7302032 -2370645 4413772 11222077 13117008 7594700 -822393 -4351884
47148 -4351884 -27843 7902529 13607682 15715392 16794825 18382792 18855747 16559489
47140 16559489 12933096 10762678 10367449 9693635 8040420 7494739 10024968 14829494
47132 14829494 19383592 21851660 21863554 20182098 18212987 16744426 14921593 11782396
47124 11782396 8727924 8467138 11239025 14275640 15434339 14970065 13335853 10292178
47116 10292178 7065624 5914002 6121036 4246660 358681 -468565 3771734 7031431
47108 7031431 3519094 -2415827 -1133298 9174044 20631640 26542153 27757483 27519198
47100 27519198 26176269 23338842 20347130 17649020 13152906 5748981 -2017811 -6453857
47092 -6453857 -5607186 887358 11374759 20589828 22500038 16736395 8957186 3297191
47084 3297191 -1745932 -8085566 -13208103 -13786316 -10504567 -5808115 -1000 6844371
47076 6844371 12116057 13837762 14198920 15959146 17595015 16208191 13249170 12758335
47068 12758335 15174520 17268697 17413998 16974848 17282730 18848074 22277646 26125285
47060 26125285 25665221 18686293 10991639 10391572 15954640 19339320 16609035 11914943
47052 11914943 8607576 4116659 -3588516 -11081689 -14789951 -15599025 -14279842 -8042693
47044 -8042693 3208959 12077867 11388189 3751607 -2109209 -2069280 1574436 6115489
47036 6115489 9926053 9717149 3271357 -4951214 -6851441 -219397 9277681 15558771
47028 15558771 16708818 12666162 4820397 -1117499 1306777 10053670 14875978 10379075
47020 10379075 3338161 2674377 7381793 10225599 9175614 7792030 6528354 1980563
47012 1980563 -4645903 -6197657 -18443 6220515 4113759 -3545863 -5882802 2153456
47004 2153456 14019417 20433570 19777688 17273302 16749658 17270889 17520125 19214475 23648882
46995 23648882 27381873 25339209 18075815 12173611 11904541 13577292 10857340 3640743
46987 3640743 -1841005 -1147238 3447297 6547726 5364996 894543 -4267582 -7771911
46979 -7771911 -8680596 -8158132 -8066169 -8192900 -6362998 -2222126 969860 110193 -3615791
46970 -3615791 -6561326 -7525948 -8157397 -8872846 -7617551 -3608774 621652 2983436 5452008
46961 5452008 10980521 17754776 19969242 15049927 7290036 2607678 1824500 1597697
46953 1597697 539170 798365 3205549 4466941 1554665 -3364941 -5561125 -4354311
46945 -4354311 -3562484 -4924419 -4701603 978956 10008829 16829600 19901925 22808740
46937 22808740 27366559 29394367 24087875 13749528 6770479 8620961 16224975 22253530
46929 22253530 23150998 21166440 19489285 17933649 14255892 8045665 1605979 -2517614
46921 -2517614 -3240353 -145215 7058166 16931902 25211425 27237422 22007100 13209751
46913 13209751 6210812 4307536 7045234 10679761 10476515 4468352 -4154826 -9458232
46905 -9458232 -8313485 -2882672 2380515 4553187 2785041 -2275582 -7609732 -8507851
46897 -8507851 -3231445 3736225 5952890 2328196 -2344709 -3702055 -1459422 3142921
46889 3142921 9344235 14831606 15708694 11465099 7246019 7963892 12089687 14372122
46881 14372122 12888902 9876376 7003602 3951170 1269689 659647 2026133 3557588
46873 3557588 4948461 7244190 9515192 9718003 9318057 12390487 18696949 22569592
46865 22569592 21225345 19309074 21350883 24207546 22300302 17011586 14489927 15788760
46857 15788760 15901585 12576792 9595746 9894323 11414641 12395249 15331914 21479657
46849 21479657 25344019 19990052 6679839 -4934194 -6395680 2101259 13333648 19766410
46841 19766410 18792418 13374240 8200720 4952518 2077029 -697892 -64495 6707852
46833 6707852 17042222 25099291 27827261 26758446 24576696 22603163 21631827 22575158
46825 22575158 25306562 28287770 29852311 28977176 25279569 19837996 15435958 13717351
46817 13717351 12237800 6972981 -1782146 -8770651 -10221777 -8479299 -8425468 -11232703
46809 -11232703 -13744495 -12717222 -7661335 -523722 5463187 7542115 6229647 5749211
46801 5749211 9418823 15040979 17480934 15830896 14898752 18421498 23756965 25736641
46793 25736641 23669487 21080623 19241558 15142961 7554384 1771343 4474036 14464554
46785 14464554 22336183 20928993 13490980 8895873 10525490 13659423 13734595 12645454
46777 12645454 14361146 17749861 18118704 14632947 11613674 11964241 13375540 12559562
46769 12559562 9642403 6104385 1648147 -3737398 -7274504 -6794926 -4670243 -4078127
46761 -4078127 -2969519 2872084 11270212 14487636 10054416 4567653 3720373 4606486
46753 4606486 2811299 1733713 7577740 18043642 24099035 22571305 19414391 19430500
46745 19430500 20074324 18124551 15779588 15787446 15901421 13532716 11991860 16087598 23684991
46736 23684991 27544461 24898828 20010223 17115392 15715743 14054487 13146419 15002443
46728 15002443 18985335 21792059 20372832 14617902 7998838 4817488 5317054 4674005
46720 4674005 -933820 -8530856 -11634413 -8374194 -2737137 1640428 4609699 6431415
46712 6431415 6567864 6828364 10720695 17202584 19634344 14308893 6066127 1474082
46704 1474082 55340 -2722736 -6488371 -6036023 496625 9107072 15715724 19361387
46696 19361387 19181703 13931652 6576197 4001155 8320939 12317396 8100352 -2072570
46688 -2072570 -8444037 -6165791 -214004 2426470 898927 -1082784 -1325738 -581081
46680 -581081 359015 1974135 4735991 8391972 12178839 14353782 12444684 6013348
46672 6013348 -1466631 -5802457 -6614690 -5884076 -2647814 6182809 18348540 24800939
46664 24800939 19974147 10138507 6328231 10846579 16431828 17937028 18163899 20738224
46656 20738224 23653083 23586441 21924418 21934376 23027089 22410411 20417668 19617028 19702300
46647 19702300 17734153 13393104 9992962 9480113 9594453 7269229 2733493 -918008
46639 -918008 -1011683 2336230 6150456 6886371 3676089 -1054731 -4756231 -7126027 -8211078
46630 -8211078 -6459935 -1327690 4023156 6212676 6768509 9702560 14313477 15047191
46622 15047191 9597504 2821954 339984 1657204 2553101 1845503 2348025 5946838
46614 5946838 10609503 12770682 11366374 9004778 9227337 12401324 14787388 12727058
46606 12727058 7383750 3831611 5604803 11734959 18830985 23929316 25296484 22872223
46598 22872223 18584538 14449773 10282800 5300094 1507386 2313640 7455590 12572969
46590 12572969 14549957 14067830 12251449 8726320 4381258 2010328 2146729 2009886
46582 2009886 679079 1119825 4389071 6441454 4574485 2695000 5201206 9342014
46574 9342014 9621821 7181654 8208903 14103364 19497206 20024773 16534379 11392251
46566 11392251 6004688 2706445 3958267 8319511 11429596 11871140 11853802 11587730 8138228
46557 8138228 1468992 -3329948 -2419700 2007074 5624573 7135496 7260176 5813056
46549 5813056 2241309 -3179258 -9963336 -16710732 -19682075 -16269163 -10432376 -9287290
46541 -9287290 -12612443 -11738380 -1893062 10327686 16028075 14922915 12041933 8922344
46533 8922344 4646554 1384792 1509120 2039881 -805811 -4000124 -2278120 1849479
46525 1849479 1491065 -2139879 -522754 7605776 12437201 7467865 -1334606 -6173947
46517 -6173947 -9339306 -17069891 -27152151 -31193766 -26795712 -19922513 -15950554 -14724121
46509 -14724121 -14430553 -14506521 -13643178 -9728996 -3468017 1535552 3825626 6096087 10500850
46500 10500850 14840620 15759516 13739987 12110057 11824324 10140596 5432640 1243655
46492 1243655 3053805 10989493 18248362 18641140 14311516 13343482 19960065 29716053
46484 29716053 34833474 31940747 24007953 17155735 16318991 21307720 25916974 23468810
46476 23468810 14262905 4663747 -1735934 -7359660 -13303026 -14912519 -9452944 -2840410
46468 -2840410 -1852371 -3432764 65587 7364333 9703713 5913831 5665441 14314816
46460 14314816 23761957 24109876 16995718 10382466 6082391 733516 -4878587 -6782096
46452 -6782096 -6707718 -10958810 -19381369 -23412919 -17870674 -8185061 -2190889 -104768
46444 -104768 2512990 5767294 5467698 1015119 -2271986 59382 6198012 11557258
46436 11557258 15357045 20864683 29467597 37203507 38667065 33108598 24828835 18030460
46428 18030460 13389722 9802678 6949106 4940689 3622160 3846722 7473484 14241384
46420 14241384 20662893 24243151 26665736 30103297 32871529 32635606 31674247 33617847
46412 33617847 36007667 32311897 21997928 12541105 9627232 11199829 13851304 18851982
46404 18851982 27009186 32560719 28734700 17276649 6959832 3639087 5974554 9530892
46396 9530892 10708729 7823701 2696331 309690 2981443 6415903 5929271 4327926
46388 4327926 7420357 13271747 13865561 7986969 4013161 7055589 11184453 9141699
46380 9141699 3151933 180001 1701956 4683141 8495953 13631600 16380517 12455212
46372 12455212 4812176 854099 2206856 3970156 4078388 6046135 10903521 13521843
46364 13521843 10195753 4297111 890675 387918 923032 2524313 5106895 6422243
46356 6422243 6154221 8255605 14638267 20108196 18910604 13397115 10280605 10509210
46348 10509210 9439535 5786893 3081387 1881148 -2007209 -9188727 -12948016 -7557383
46340 -7557383 4167479 14932192 20694093 21308254 17642028 12114982 8954194 9690121
46332 9690121 10599780 8163070 4484792 3307250 3250079 154740 -5190865 -7048888 -2709358
46323 -2709358 3771140 6570671 3937666 -996946 -2725132 2409100 11565030 16611620
46315 16611620 13863106 10605536 16307406 28518993 34607031 28175009 16358615 8625281
46307 8625281 6015048 5653864 8372696 14731703 18681547 13791811 3881383 -322440
46299 -322440 4924779 12428144 14811817 13249277 13344464 17036423 21662805 24296390 24183066
46290 24183066 22019527 18642573 14370414 9487294 5552658 4930400 7666312 10311055
46282 10311055 9914567 7791742 6904398 7136272 6365839 4789126 4245238 4196165 2826917
46273 2826917 1691593 4104823 8259097 7361667 -1213178 -11459157 -16102666 -14537482
46265 -14537482 -10632140 -6736301 -3957616 -5132072 -12037689 -20461188 -22874345 -16969839
46257 -16969839 -8405352 -3956235 -4278128 -4958769 -3264261 -1617433 -3709246 -8361140
46249 -8361140 -9450023 -3016870 7231246 13811297 14078247 12272426 13210897 17118592
46241 17118592 21430744 24570247 26230598 26196030 24726095 22731871 20533305 17868044
46233 17868044 15441373 14218566 12818330 8665324 2831740 482613 4536407 11518838
46225 11518838 15752961 15448746 12981670 11551219 13115185 16908128 18453321 13301050
46217 13301050 3672045 -2315755 -599098 3557860 3475307 96415 -1336441 78101
46209 78101 1344215 2404874 6443500 13839021 20788175 23990953 22982398 18562329
46201 18562329 12786681 9620015 11499388 15865259 18745548 20480474 23657277 26799463
46193 26799463 25323574 18442817 10433366 5307899 4549229 9164550 18713619 28580932
46185 28580932 33397621 33138696 31181009 27526679 19978972 10997444 6016752 4881677
46177 4881677 2656923 -496906 1113683 7622430 11371056 9015453 6537317 7622204
46169 7622204 6701236 253195 -4180657 587690 8372394 8689454 3616108 3937682 11191248
46160 11191248 15545313 11838896 6788856 7543855 11945087 14077257 12782664 10412608
46152 10412608 7822702 4420578 141943 -5154491 -11670186 -17417538 -18645912 -14022034
46144 -14022034 -6449093 -238873 1627382 -1714732 -7679426 -10396625 -6349067 244913
46136 244913 2007231 -1528586 -3338115 726113 6205492 6729674 1770326 -4954246
46128 -4954246 -10606915 -13454942 -11487229 -4808571 2521615 6294014 6456525 5322773
46120 5322773 3397305 -262362 -5034128 -8945194 -11037198 -11229096 -8907553 -4210499
46112 -4210499 128736 1188892 168239 1532395 6994471 12617374 13537555 10031339
46104 10031339 6486731 4647413 815241 -8451182 -19944058 -26476581 -25660928 -22348731
46096 -22348731 -21154648 -20158608 -14643190 -4242143 7055105 16137035 22503684 26203624
46088 26203624 27699462 28871263 30686848 30780455 26853923 21328979 18543122 18396710
46080 18396710 17554041 16247040 18319543 24195064 29370343 30854732 29776997 26800472
46072 26800472 21170370 15871345 16676407 22860870 25678065 20490173 13952799 13577258
46064 13577258 16253527 14255265 7673355 2573657 247011 -2634797 -4929140 -1704183
46056 -1704183 5527835 8405500 4007794 -387321 1486611 5810262 5806710 2630282 3158236
46047 3158236 9880415 18538336 24453181 26413946 24679559 19429042 12180446 5966039
46039 5966039 2822887 2418857 3515480 5280527 6551801 5309134 551776 -5329019
46031 -5329019 -7623263 -4271951 522362 -269405 -8254290 -16412232 -16191517 -6890012
46023 -6890012 4404883 11591572 15091319 18263533 22007550 25197704 27789766 30117426
46015 30117426 30233944 25503039 17173542 10389231 8441758 9388370 10047445 11032978 14856463
46006 14856463 20402900 23411216 22923333 23028025 26010395 27636231 23130506 14964055
45998 14964055 9424523 6923554 2170787 -5308496 -7600068 1230647 16223266 27302181
45990 27302181 30352749 28184956 23816482 18368058 13945889 12935424 14294760 14718866
45982 14718866 13490800 12526377 12023240 10155978 7139283 5592307 6483113 8325818
45974 8325818 10402786 12707695 12743336 7579840 335192 -786800 7190189 16865333
45966 16865333 19000618 13149654 6649267 5614370 9953530 15141640 16129671 11457809
45958 11457809 5931794 6891743 15159129 22327839 20473270 12145585 6518604 7441299
45950 7441299 10405106 10911038 10352954 11839607 14317976 13920920 9381443 3649200 483303
45941 483303 695999 1901513 1799970 1407249 3774241 8863508 11779537 8478758 1899680
45932 1899680 -855549 2827630 8677834 12297200 14579502 18389635 22857342 24147645
45924 24147645 20543265 13832903 6241485 -1097193 -6282693 -6079916 915238 11617215
45916 11617215 20619856 24929265 25563434 24602531 22014802 16322424 7853302 81464
45908 81464 -2782209 867118 9221628 18757923 26000240 28410980 25495881 20014639
45900 20014639 16949826 19466056 25642159 30412690 31094928 29586984 28325584 26105814
45892 26105814 20503551 13468467 10651712 13918337 17868349 16556128 11440321 9133865
45884 9133865 12299613 16646406 17262075 14437040 11949353 12258938 14880701 17334582
45876 17334582 16243106 9604693 -167310 -7100503 -7412371 -3182859 1116952 3984815
45868 3984815 6762225 9894131 12215503 13251471 13499334 12734553 10740251 9664291
45860 9664291 12506605 18250010 21360986 18260221 12521726 11133029 16173348 22459030
45852 22459030 23704360 19231003 13738641 11667884 13064835 14602604 13512610 10288390
45844 10288390 8055733 9226827 12354573 13025673 9262502 5444861 8192448 17581667
45836 17581667 25477002 24963093 19007881 16299011 20135422 25898175 29017463 30050392
45828 30050392 30239365 27120916 18435056 7490834 463913 -576353 1307089 3286691
45820 3286691 6215754 12289146 20948578 27724209 27284157 18856848 8695224 4711084
45812 4711084 7679350 10608874 8394947 4448146 4633175 8148465 9267423 5975973
45804 5975973 1372076 -2604526 -6942600 -10573240 -9493383 -3165877 2810949 3475319
45796 3475319 699564 -272694 2164813 5477653 7611591 9064203 11201907 14817975
45788 14817975 19830613 24811684 27570887 27625055 27193358 28283556 29657859 28319420
45780 28319420 23547835 18002517 14858217 14691735 15096278 13027342 8020305 3254873
45772 3254873 2532446 5956182 9784724 10943425 10220672 10294272 12223532 15170104 18185421
45763 18185421 20441099 20403102 16853428 11189755 7383925 8461283 12896611 15280397
45755 15280397 11687697 4538989 644737 3425674 8735486 10353419 7973560 6445148
45747 6445148 7832024 8564852 5594376 1490956 1059551 5544752 12486606 18976197
45739 18976197 22555973 21040738 14634755 7282470 3254544 2777699 2787481 1109233 -1831807
45730 -1831807 -4275007 -4175069 -267146 5764364 9440572 8190400 4689958 2932811
45722 2932811 2398338 -355692 -5058708 -6860006 -2708596 5029138 12482190 18395803
45714 18395803 22463715 22645984 17395497 9399319 4206310 4783541 8851653 11854683
45706 11854683 11657095 9970258 9617000 11065839 12282552 11834879 10710372 10093758 8756280
45697 8756280 4686603 -1301614 -5911803 -7378116 -6901888 -5613180 -2389669 4034168
45689 4034168 12300995 18973779 20879951 16501206 6927412 -3236742 -7578013 -2759823
45681 -2759823 8373832 19687748 27337897 31484634 33303552 32439044 28219656 22093241
45673 22093241 17140380 14705683 12510751 7427174 53362 -5105482 -4851907 -1050651
45665 -1050651 2506945 5487699 10404008 17069372 21111795 19226374 13388517 8192573
45657 8192573 5739173 4655777 2770118 -545216 -3454397 -2308848 4965492 15312897
45649 15312897 22837713 25869447 28605446 33686207 37091732 34375758 28404740 25138923
45641 25138923 24182040 20865657 16929830 20154365 30925202 37999098 33307987 23913366
45633 23913366 21591992 25835423 26757380 22136974 20559503 26611097 33486891 34711679
45625 34711679 34621539 40614684 51079043 58543779 60994386 62291081 63259047 60088836
45617 60088836 51672330 41732719 32487697 22217155 11080351 3852933 3834325 8194237
45609 8194237 12372812 15417622 17755156 17257213 11954108 4756292 1259708 3353067
45601 3353067 7916449 11187219 11795742 10176564 7644098 5939041 5900990 7078080 9753555
45592 9753555 15405350 22992241 27221463 24325469 18121990 15811593 18093935 18324821
45584 18324821 12474594 5211727 3598407 8266111 13914204 16137049 14555959 10796363
45576 10796363 6859899 5223651 7468826 11824434 13906299 11273178 6670005 5634737
45568 5634737 10573845 17768805 21030546 18210271 12923453 9556162 8462954 7547204
45560 7547204 6629367 7381316 9852719 12378086 14934041 19268355 25027623 28951557
45552 28951557 29113195 27103190 24783035 21955359 18896370 17934779 20106690 23082900
45544 23082900 24949836 27046900 29990536 30125723 24266677 15568876 9883673 8080856
45536 8080856 7111636 6948895 10041830 14555703 15714229 15007091 19958684 31298692
45528 31298692 38234555 32589045 21502626 18385123 25326234 32847650 34597512 33051447
45520 33051447 31057539 27484678 23670947 25361705 33560710 40284828 38748301 32225074
45512 32225074 27270474 23462226 16743777 8732071 4575682 3841135 1816433 -977598
45504 -977598 941956 7507474 11090081 7304441 470690 -4693604 -9575543 -15515100
45496 -15515100 -17798020 -11800890 -574143 9387959 16150094 20765924 21818865 18041068
45488 18041068 13272597 11774367 10641296 4102317 -5773710 -10160536 -5447185 2738521
45480 2738521 8170986 10061327 9342538 5777518 1184589 -375025 1497739 2322707
45472 2322707 -266265 -3248037 -4065158 -4307871 -4918448 -3384220 925217 4139693 4366279
45463 4366279 5116615 7910878 7615942 1084481 -5359213 -4716151 -1084453 -3770831 -12359568
45454 -12359568 -17148486 -13783958 -7986118 -4399942 162758 8623675 16063753 15683316
45446 15683316 8288805 1255798 285033 5252396 12199429 16805257 17308112 15897442
45438 15897442 16345538 19725269 23880730 26816671 28121745 27356595 24450682 21944742
45430 21944742 22929275 25709830 24444948 16927323 8333565 5108761 7973880 12939644
45422 12939644 16342569 16601760 13609727 9039847 5619548 4214337 3124368 1204853
45414 1204853 -684190 -2165104 -3937972 -4442268 108144 9758576 18669223 22315566
45406 22315566 23287983 25764483 27624915 23826230 15822160 11199486 13526439 18063703
45398 18063703 19083570 16733946 14114022 11348728 6463608 672807 -1028189 4298943
45390 4298943 12712418 16210175 10950196 1744763 -3011136 -475159 4646061 7253694
45382 7253694 7811418 9547812 12884157 15696667 16866159 16020257 11545307 3232755
45374 3232755 -3867281 -3165798 4890944 11981433 11438861 5702036 2476946 5857503
45366 5857503 13165412 18897481 20023866 18301149 18291968 22194478 26540775 25829200 19672946
45357 19672946 13774927 12657489 13987774 12257322 6302815 515109 -855625 1734149
45349 1734149 4660362 5793189 6604511 9617602 14382587 17223727 15647646 11598203
45341 11598203 8687606 7541880 6511220 5883786 7483226 10102485 10031659 7598097
45333 7598097 8308434 14359511 19373230 16215605 6949245 -326249 -2407213 -2644987
45325 -2644987 -2601438 848324 8438720 14930938 16270301 15669313 18056157 21604820 19895937
45316 19895937 11402887 2321719 -428780 4069054 11528715 17518063 20740462 22487364
45308 22487364 23480459 21543674 14114985 3957965 -521046 6010273 18350634 26069010
45300 26069010 25754715 23565066 25137383 27978470 26278327 19132843 10294597 2409540
45292 2409540 -4517073 -10235355 -13435486 -13446834 -10221476 -3409453 5989225 14006297
45284 14006297 16769432 14791736 11572744 8830867 6505760 6637108 12388473 22143335
45276 22143335 28987531 28440229 23639003 20745296 22092865 26038038 30459755 33391712
45268 33391712 32756083 28934710 25763324 25655108 25594843 21757048 16303266 14612406 16378712
45259 16378712 15194865 8308012 1437889 821755 4641530 6590580 5252360 4884803
45251 4884803 7614572 9912393 8273677 4567560 3015899 4217968 5560206 6619140
45243 6619140 10175262 16597978 20577373 16818480 7847862 2421599 5342495 11907594
45235 11907594 14496097 12457844 12324027 18686162 27923243 32170341 27859139 18902304
45227 18902304 12088653 10659984 12622606 14329949 14325811 13173860 10879148 6661067
45219 6661067 1561484 -846916 2144604 9326796 17134882 23199322 26901966 27488625
45211 27488625 23922758 16880797 9432594 5127589 5633022 9643667 13354047 12854458
45203 12854458 7455748 482500 -3985377 -4602076 -2517414 747597 3601745 3929432
45195 3929432 704944 -4276837 -8076057 -9592473 -9312582 -7072123 -2471694 2892918
45187 2892918 6199152 6796748 7067328 9658971 15042791 21282762 24975502 23669891
45179 23669891 19040877 15784156 15108317 12298567 4839387 -336140 5275286 17911390
45171 17911390 24231681 19365586 13409761 15732443 21262338 19658100 11663304 6758454
45163 6758454 7655243 7260542 1462569 -3913746 -1766681 7145430 17227856 25483392
45155 25483392 32284987 38046776 42610520 45926825 46745491 42491590 32966510 22772974
45147 22772974 17592896 18582800 21979254 23482155 21619815 17533358 13034574 8978504
45139 8978504 4998128 973522 -1557977 -785910 2377838 4477277 3743892 2734276
45131 2734276 5305101 11813697 18635983 21758202 19578803 13011017 4911277 -411932
45123 -411932 681334 7731735 15387358 17710460 13927958 9175812 9017729 13946577
45115 13946577 19991551 23694058 24762156 24303320 22992436 21865534 22647720 25450970
45107 25450970 27569735 26480934 23033068 19833145 17575861 15304542 13560711 14447404
45099 14447404 18402531 23399384 27829474 31840028 35073833 35467514 31753482 25508590
45091 25508590 19363869 14571693 11548810 11109873 13113156 14879153 13345024 8940599
45083 8940599 5625213 6637804 11379122 16748425 20167778 20603291 18116246 14122889
45075 14122889 11369435 11341097 11335154 6578710 -3191686 -11530567 -12495693 -8531797 -7154132
45066 -7154132 -10054233 -10500581 -3474644 6316409 10447485 7559460 3463776 2507065
45058 2507065 4090879 7106859 12185375 18252427 21547583 20527459 18632664 19933073
45050 19933073 24429085 29564139 33972791 37448330 39120887 38237377 35825837 33627149
45042 33627149 31913257 29574739 25607390 19703954 12651729 7115331 6424389 10981153
45034 10981153 16944597 20037686 19962552 19831352 21989371 25634928 28039955 27126804 23227500
45025 23227500 18882516 16393697 15381127 13665834 10647875 8469833 9524221 14077425
45017 14077425 20336144 25199871 25343206 20438447 15751031 18098388 27492137 35615027
45009 35615027 34670773 25359353 14224966 6081496 1890519 1435856 4219319 8818234
45001 8818234 14212275 20465104 25840003 25938747 19507902 12642171 12083361 15777297 15971080
44992 15971080 11270877 8690225 11946673 14662597 9768804 737512 -2548142 3143269
44984 3143269 11194720 14598017 13540354 12451764 13535535 15565268 16720576 16099388
44976 16099388 13502159 9951257 8188993 10724976 16815318 22595644 24947905 24437077
44968 24437077 23748810 24105228 24300792 22633030 18500783 12695494 7869963 8275072 16288724
44959 16288724 28224362 35949065 34595987 27428128 21516096 19874203 19720470 17549795
44951 17549795 13609395 10989098 11425449 12547455 9701065 1484996 -6974776 -8569524
44943 -8569524 -2423762 5258919 9564122 12385176 17098415 21662685 21833900 19239497
44935 19239497 20827860 30036991 42477928 50954489 51899104 47006621 41527298 40680453
44927 40680453 44683966 47629636 44065638 35577822 27612459 21998063 17747400 17149907
44919 17149907 23461678 32487685 34910610 29424868 25598000 29871651 36554821 38219635
44911 38219635 37530082 40874242 45990420 45390757 38959627 33697649 32328904 31443273
44903 31443273 30789963 34666152 42079784 44940920 40393982 36987418 42554416 52142990
44895 52142990 55262872 51121046 48701401 53104207 59395480 61045824 58182080 54644139
44887 54644139 51277393 46054282 38863036 32549816 29181078 27497058 24778966 20208985
44879 20208985 15676801 13559860 14315302 16656002 19900143 25147015 33203871 41819624
44871 41819624 46525646 44939286 39384868 34468228 32716496 33443527 34997992 36374941
44863 36374941 36774640 35729477 34607927 36263976 41655471 47895794 51183257 50735712
44855 50735712 48244934 44572990 39341014 33253158 28200404 24875311 22503329 20927003
44847 20927003 20350413 18901274 13826957 6309882 1840202 3729962 8896582 12397420
44839 12397420 13719260 15719507 19159691 21467465 20168255 15238149 8961106 5340333
44831 5340333 8053063 16488985 25159328 29406472 29939462 29121326 25625372 17442816
44823 17442816 8106055 3536581 2760048 -1362609 -10013298 -13562384 -3452489 15486302
44815 15486302 30120765 34075697 32303479 31574866 32137768 30427224 25872627 21714230
44807 21714230 20338688 20342291 18627695 14441740 10659721 10761338 14541388 17514970 15362155
44798 15362155 8754152 2956312 2570751 7336181 13179490 16453113 16542371 15280405
44790 15280405 15375263 19350768 27997782 38486585 45324319 45183416 40316276 35446295
44782 35446295 32039785 28113839 23010639 18629407 15495276 11935652 8840628 10519713
44774 10519713 17405003 22234966 18720003 11190731 9701530 16929988 25950891 30548202
44766 30548202 31359218 30883769 28703076 24333728 20078409 18136992 18416854 21178965
44758 21178965 27689971 35732076 38830484 33729489 25545237 21818797 23858190 27238510
44750 27238510 28404591 27157962 24582429 22255848 22305773 24998729 27203383 25933395
44742 25933395 22376131 20122957 20865413 24096330 29060937 34105364 35952707 33013897
44734 33013897 28281207 26059227 27052433 29092349 30508485 29671073 24055552 14518531
44726 14518531 8422636 12617207 23727815 31094110 29900109 26002482 26436620 30381803
44718 30381803 32108761 28843440 22769359 17996537 17936273 23316928 30659685 34657492
44710 34657492 33663233 30802615 28536156 25179327 19180452 14139113 15760700 24218463
44702 24218463 32416296 32759221 24638306 14705751 10084830 11858346 15891596 19516309
44694 19516309 24715982 33010176 39949730 38682214 28307532 15140078 6041420 3962259
44686 3962259 9145488 19505271 29075318 31495407 27363631 23790114 24458027 24953327
44678 24953327 21167099 17258839 19853561 27455575 31704298 28326734 21793773 18832986
44670 18832986 21207389 25645834 28223459 28184638 28901304 34491542 44052071 50824437
44662 50824437 49388319 42050225 35283205 31630869 29010955 26850187 27916174 33132108
44654 33132108 38555448 39482253 35386177 29659489 26315119 27581845 32735653 38428799
44646 38428799 41565287 42119974 41839431 40844329 37857482 33393749 29854619 28332544
44638 28332544 28142633 29498587 32974739 35555511 31551524 20055841 8314668 4464966
44630 4464966 8860629 15344374 19022378 19249362 16425982 10618227 4306860 2640184
44622 2640184 8119102 16420016 19990152 15893059 8540776 4180725 4136790 5074311 5185379
44613 5185379 7135413 13275409 20349963 22437718 18601106 13923172 12238166 11513484
44605 11513484 8356291 3714011 914168 523977 1204550 4313836 12856930 25237292
44597 25237292 34247332 34447388 28137150 22164835 20673366 22580949 24332667 23174408
44589 23174408 19153688 15842964 17827870 25530036 33854987 38131784 39669586 42218688
44581 42218688 44533339 41528368 33260671 27291806 29360607 35990014 40101567 40448290
44573 40448290 40642282 41289756 39049565 33029973 26371693 20612179 13812132 6103476
44565 6103476 1977421 3846719 7371765 7128012 4203995 4335351 10357081 19861287
44557 19861287 28547483 32542246 29279755 20151811 11366146 8461705 10558207 13135801
44549 13135801 14943628 17793147 20691061 19977535 16163524 15277138 21060422 29748574
44541 29748574 34999359 34859292 31737489 28562272 27296822 28519453 30113866 28832095
44533 28832095 25225951 24094482 27409008 29945078 25879824 17681849 13978693 19083977
44525 19083977 28494768 35160460 37100944 37707606 40365080 44020827 43987982 37449866
44517 37449866 27935331 22372630 23028423 25079577 23811750 20881249 20153339 20420937
44509 20420937 17507247 12432380 11668791 18073796 26059909 27923315 22119765 13675384
44501 13675384 8859270 10734247 17454486 23368154 23769957 19879645 17461127 19916706
44493 19916706 25031357 29061191 30791344 30096770 26103892 19791174 15817132 18001026
44485 18001026 23943284 27165055 24246372 17720527 12567418 11812736 14704157 17194270
44477 17194270 15248085 9810307 7084559 11042454 17035515 16727293 8880988 896758
44469 896758 -827672 2610693 7338295 12934463 20238515 26621416 28583212 27647838
44461 27647838 28762607 32789362 34997208 32162269 27395480 25818339 28193365 31328605
44453 31328605 32876775 32934614 31836570 29216326 25520140 22406554 20882486 20135983
44445 20135983 18720482 16242930 13808451 13479137 17056462 24254921 31967432 36514370
44437 36514370 37114714 36341964 36856490 38673638 40212420 41035048 42381028 45088197 47666504
44428 47666504 46694098 39411674 26637646 13304087 5225237 4517185 8357629 12497578
44420 12497578 15439545 18687642 23558017 28890374 32211109 32514986 31106038 29451238
44412 29451238 26993987 22501903 17741682 17676400 24941656 35122579 40062754 35834124
44404 35834124 25347125 13735945 4701831 1597830 6991214 17964698 25727221 24584693
44396 24584693 19290748 18912071 24890810 30462722 31351758 30814368 32553263 34596786
44388 34596786 33796416 31849516 32155086 33581710 32387378 28881139 27205447 28650751
44380 28650751 29747701 27888176 24881689 23248263 22272975 20112836 17359752 15590786
44372 15590786 13767490 9283008 2653473 -1461347 937361 8697040 16824919 21460382
44364 21460382 22630457 22715205 23513894 25089411 26577998 27319740 27241960 26551497 25243215
44355 25243215 23031144 20019351 17406125 16934242 19185554 22723153 25380153 26204024
44347 26204024 25836824 25503365 26306801 29067293 33762182 38989463 42727941 43851059
44339 43851059 42677724 40585301 39755385 42303635 47879840 52472777 51846136 46719846
44331 46719846 42527442 43101873 46596518 49078527 50123146 52356994 56504098 59776440
44323 59776440 59538243 56462083 53170004 51066429 49520800 47587513 45656147 45209341
44315 45209341 47122040 50648038 54606800 59026494 64102669 67553232 65457486 57240530
44307 57240530 47928986 43349438 44435772 48253930 52555243 55851780 54702409 46338551
44299 46338551 34697670 28608515 31489240 37157737 39075792 39437140 44001914 51118685
44291 51118685 53008082 47748706 42855114 44494861 49196979 50659435 50095169 53424494
44283 53424494 60293094 63188620 58714479 53465102 54966531 61016583 63029988 57904995
44275 57904995 51130575 48075835 47433675 45446149 42504061 41802432 43596652 44791413
44267 44791413 43658872 41449874 39213683 36515263 34344342 35988070 42787655 51284018
44259 51284018 57029744 59570366 61112067 61931002 60741838 59113355 61371691 68781475
44251 68781475 76866350 80299065 78221635 73257984 67973682 64655561 65977145 72272610
44243 72272610 79482774 83307921 84309898 84967984 82826245 72500158 55730311 43213896
44235 43213896 42397948 48001222 49876257 46935626 46586870 51526012 54595411 48884124
44227 48884124 37191530 27924070 25521765 28670670 34826922 41841613 46537026 46337807
44219 46337807 42676726 39437940 37550047 34283429 28878989 25616232 28806146 36549660
44211 36549660 42272428 41967145 37556756 33192527 30965399 31274362 34528740 39522734
44203 39522734 41618551 36554279 26601787 19395806 19182561 22570221 24982786 27264794
44195 27264794 31840476 35954462 35159525 32096323 34448513 43144629 49556106 47081912
44187 47081912 39172994 32171045 26522205 20637872 17937437 22434810 30490905 34880421
44179 34880421 35619068 38951078 45937637 50295128 49048946 47296171 48856687 49127612
44171 49127612 42514063 32137818 26386951 28611995 35366421 42810525 49488143 53318381
44163 53318381 51025404 42337318 32107871 26501081 27664077 32435474 35833718 36004462
44155 36004462 35843337 39035847 44844318 48630332 47622924 43786364 40460120 39027839
44147 39027839 39994611 43984666 49411169 52109647 50175980 46786445 45234587 43648034
44139 43648034 38507139 31613926 28979513 33090911 40226259 45663106 48081408 48396871
44131 48396871 47653011 47197845 48296723 50315115 51158754 50285404 49528637 50449167 52690624
44122 52690624 55265798 57257189 56585167 50602901 39767686 29359564 25513980 29394796
44114 29394796 36001058 38839845 35753220 30401587 28185499 31092647 37116908 43868394
44106 43868394 50425250 55338865 56005802 52182337 47834977 46948211 49268306 52525735
44098 52525735 56405436 60901403 63089114 60252085 55106163 53137653 55274675 58070281
44090 58070281 60836207 66851380 76497780 84893299 88584584 89747433 91225457 91949618
44082 91949618 90249375 87574731 85671325 83793187 81999259 83359200 88963789 94249227
44074 94249227 94682456 92037884 90310949 88380677 82622020 75024622 72062669 75105126
44066 75105126 77748125 74540890 68127554 65311108 68553962 73463577 73650284 67151073
44058 67151073 58429685 53642739 53670297 53667794 50364440 46582251 46061758 47361320 47003860
44049 47003860 45630153 45792547 46110768 43927355 42055860 45325908 50609582 48627306
44041 48627306 37625738 27313161 25622119 28715504 28791836 25190036 21682391 18312165
44033 18312165 13381673 9977150 12743063 19764676 24648209 25891637 27519172 30508609
44025 30508609 30430497 25096417 18771932 16557186 19142411 25068526 33506719 41977511
44017 41977511 45386749 41216234 33569316 29041051 29996316 33969251 37705495 39243539
44009 39243539 37602120 33360125 29066432 26874018 26029838 24391606 22022700 21481410
44001 21481410 24392260 29010424 31642854 30119157 25947379 23234382 25125937 31192545
43993 31192545 38583262 45074574 49788697 51665338 49636245 44748869 39976745 37182549
43985 37182549 36173181 37123213 41082188 46846736 50411604 49798199 47883237 47915003 48836914
43976 48836914 48330624 48057873 51459597 57618751 61965720 62772171 62481705 62606251 62296354
43967 62296354 62880170 68296069 78213247 85432040 84374138 79098742 78293348 84040882
43959 84040882 90239749 91759900 90618953 91734414 95792201 98767555 97481385 93784822
43951 93784822 92776314 97228570 104357436 108656453 107438357 102374505 96163151 90229682
43943 90229682 86215403 86609909 91791304 98650381 104570419 111089833 121211126 134618357
43935 134618357 148082848 159229088 167511300 173268574 178684367 187569611 200333051
43928 200333051 210924128 213345188 209817217 207023714 204989194 196413051 178272296 157409118
43920 157409118 141467773 129736271 116923329 101816112 88153037 79993514 79240223
43913 79240223 84111886 87182293 79799907 62937263 49049580 47555162 52667923 52372758
43905 52372758 45683396 42342481 47265312 54934794 59911717 63547782 67397778 68244177
43897 68244177 64176415 59143102 56715700 54837916 51593858 50852615 56330897 64444166
43889 64444166 69664461 73737264 82325280 94207363 101375686 100248770 96174382 95066714
43881 95066714 95839768 93467832 85674429 74469745 64055337 58599639 58841285 59409806
43873 59409806 53013192 39453422 27379628 24614626 29621798 35405139 38903116 42369648
43865 42369648 47310673 52100289 55747837 59544384 63603973 65477026 64344569 63566434
43857 63566434 66143280 69717259 69440035 64667699 59194441 55156058 50721531 44753509
43849 44753509 39678644 37327341 35382356 31467509 28079272 29028702 32871855 35387645
43841 35387645 37863333 46044678 59095825 66752731 62369959 53360883 51754725 57529498
43833 57529498 59418292 51861956 42846880 42215745 49110722 55844191 59277756 62123177
43825 62123177 65498570 67091579 67160624 70438538 79288077 88670916 91338225 86155026
43817 86155026 78225910 72052717 68136675 66181768 67438488 71659244 74723982 72903145
43809 72903145 68399215 67081541 70739228 75167236 76866705 77962710 82132663 88607302
43801 88607302 93541978 95532202 96132544 95763549 92877816 87440095 81955643 78133421
43793 78133421 75117521 72091027 70461474 72118413 76724785 81314105 81618856 74506687
43785 74506687 61516364 49803890 46581096 52046336 60592903 69098124 79661011 92550345
43777 92550345 101604415 101238640 95113701 92493815 96644994 101435219 99942218 92611588
43769 92611588 85485003 83061512 84735504 86887721 86831110 84659100 81662500 77739167
43761 77739167 72051222 66595766 66366220 73612871 83926990 91121009 94567993 98014429
43753 98014429 102095629 102819086 98174826 91599904 86723186 82446885 76246159 69602764
43745 69602764 66662016 68869946 73920243 79065302 82584012 82501500 77051121 67338000
43737 67338000 57600115 51643387 49710159 49170986 47454730 43972110 39926171 36867017
43729 36867017 35422024 35313148 36338609 38740138 42445614 46591000 50153942 52569635
43721 52569635 53540369 53015241 51832058 51772151 54421646 60031087 67072603 72154020 71248775
43712 71248775 63304663 53051003 47941442 51050393 58688953 66038497 72636594 80029200
43704 80029200 86265521 86680688 80191876 71672355 66942906 67203866 69327600 70329844
43696 70329844 70623762 73406247 81007810 91247215 97758272 95185900 84230548 70723368
43688 70723368 59904348 52666324 47250250 43233559 43149426 50176499 63641591 76685528
43680 76685528 80411761 72480099 60667290 55633754 60566257 69938644 77467579 81974049
43672 81974049 85293530 88029496 89021065 86802478 80473749 71299094 64221226 64720211
43664 64720211 72110672 78336510 75975572 66153198 56729082 54157334 58771163 65993735
43656 65993735 69691249 66072533 57384914 50917103 51591253 56326400 58585410 57617532
43648 57617532 59338541 67628370 78599980 85422469 86164969 84393197 83508454 83204460
43640 83204460 81488599 78079034 74588171 72065620 69822686 67169097 64918977 63437285
43632 63437285 60105793 51943618 41504728 36539926 41115912 49904824 55038990 56522277
43624 56522277 60914990 70415964 78951267 80561125 76733904 72662234 70214374 68325477
43616 68325477 67471988 69138510 71722094 71137330 66167650 60355355 57474035 57020937
43608 57020937 55459516 50913877 45495669 43236795 46377421 53614923 61262394 65496763
43600 65496763 64011309 57232715 48777333 43029670 40537632 37351994 31415250 27812341
43592 27812341 33188182 45183271 52987559 50510777 43876062 42135494 45309380 47508260
43584 47508260 48626931 54799677 66856055 76238249 76370923 72730809 76041685 88004642
43576 88004642 99598658 103558315 103341872 107277582 117074754 125842226 126738755 120338395
43568 120338395 112785273 109392231 111802850 119264053 129491974 138586233 143105117 143399861
43560 143399861 143462465 147053953 155290636 167380965 180612863 189112009 186538990 172602496
43552 172602496 154374980 138621374 125226740 111097141 97861291 91068890 92554638
43545 92554638 97991246 102423763 104776954 106477411 109069590 114165942 122671069 132570499
43537 132570499 139703698 141928250 140791384 138718687 137069595 137630291 142795098 152103600
43529 152103600 160756738 164073171 162469844 160198827 159849580 159697503 156249353 148311608
43521 148311608 138442909 130679508 126837374 125577606 125562843 128150880 135136746 144832777
43513 144832777 153049695 157822300 160709140 163774313 168518029 177930420 195550649 220769906
43505 220769906 248257306 273972873 298800898 323965511 345608473 356836267 353554311
43498 353554311 336418917 309540034 279858278 255114740 238348377 225223420 209928478
43491 209928478 192899456 179691608 173127085 170318804 167801132 166248444 168589996 175266638
43483 175266638 182824804 186916764 186541502 185393187 188198155 195620254 204701271 214893036
43475 214893036 230234817 252726163 276373254 292370343 299415879 304736123 314800382
43468 314800382 328697412 340973911 347116067 345038209 334682313 318285083 298954808
43461 298954808 277583373 253212996 227526598 206184623 193250757 185771833 176279867
43454 176279867 160361331 140527982 123239726 113193212 109853704 108317123 103558430
43447 103558430 94383087 83401650 73801563 67211695 64201523 64728183 67360546 69854701
43439 69854701 71779551 75238029 81397753 87229855 87834583 82319953 75619193 73154531
43431 73154531 74556410 74628494 70829149 67392713 69852272 77060897 82211164 81642641
43423 81642641 78433488 75916876 72374921 65868848 60574292 62677294 71279057 78821840
43415 78821840 80719687 79815532 80547283 83239403 85707763 86558966 84969071 80618255
43407 80618255 75893802 75002202 78659874 82565489 83425910 83349231 85090836 85740195 79660537
43398 79660537 66994033 55297879 51999980 57527470 66220404 71893811 71888146 67634943
43390 67634943 62885946 60919591 62120539 63682947 62300138 58116196 55577113 58465423
43382 58465423 63892063 64245695 56902945 48657084 46981405 50022614 50639840 48035497
43374 48035497 47832623 50649624 49231384 40022693 29890623 26255840 26833559 25305159
43366 25305159 21932275 21354810 23792991 26339533 30303596 38602292 46873922 46348522
43358 46348522 36814150 28273009 26987266 27892571 25370100 24170237 32283574 47224094
43350 47224094 57635534 57834386 53843886 53748500 57773228 60905824 61284596 61508434 63060393
43341 63060393 64000337 63265483 63784993 68519649 75130597 78029730 75699141 72749211
43333 72749211 73588635 76815016 77942825 75919194 74676602 78833349 88925323 99828907
43325 99828907 103431031 95263361 80055177 68484202 66600846 70686003 74145509 75915291
43317 75915291 78768226 82735062 85196617 85667949 85487439 83844327 79120648 73581127
43309 73581127 71546503 72771387 72589353 69136181 65584147 64439764 64551159 64975924
43301 64975924 66841053 69538795 69858387 67389502 66629355 70934274 77716430 82028529
43293 82028529 81870400 78162006 72949060 69409395 69786389 71405219 68943993 62713553
43285 62713553 59782300 64109592 70981277 75147900 78855096 86217463 94483683 97871604
43277 97871604 96884032 96666774 98236240 98606224 98437420 101986278 109053331 113771921 112636598
43268 112636598 107955496 102298548 95543424 89191992 87586784 91634941 95908515 95355727
43260 95355727 91558068 89587172 91607250 95889595 99345152 99186955 95167121 91711037
43252 91711037 93915031 99377138 98731940 87903697 75449206 72702787 79811613 87238278
43244 87238278 89018080 88163439 89472529 93616960 99828905 108495348 117778397 122066593
43236 122066593 118322906 111880417 111559643 119216620 127391192 127895774 120264835 110633560
43228 110633560 104278683 101368189 99459869 97703573 97076516 97504124 97023494 94595002
43220 94595002 92170263 92321014 94538479 95877284 95334775 95445407 98514197 103135607
43212 103135607 106398348 108557187 113222506 122934310 136493765 150831338 163326366
43205 163326366 171715485 174551961 173911573 175459375 182494539 190710966 192482601 186939258
43197 186939258 182616782 188636530 205709097 227479644 248141342 265888169 280641130
43190 280641130 292485991 303312258 317491392 338984705 367825778 399642899 428413253
43183 428413253 450230209 465449274 477455709 489136093 500577672 509514764 512356249
43176 512356249 504806305 484518967 455335463 426665651 405287822 388471534 368239026
43169 368239026 341896169 314839068 292845713 275710003 260080133 244848348 230882330
43162 230882330 218175618 206822222 199138817 196811040 196289400 190990585 179086146 165852007
43154 165852007 156544053 149745750 140521835 128276208 117840261 113029131 112676364 114067815
43146 114067815 117021528 122142087 127317204 129333055 128278106 127195493 127232039 126132631
43138 126132631 122472023 118669053 117930811 119806761 120671757 118072997 113599278 111847650
43130 111847650 116591147 126845822 136961012 142421254 145166585 150348051 158095147 162952570
43122 162952570 162647657 161985343 164596186 165954369 160220132 150300295 144153095 143119973
43114 143119973 141615893 138097616 138082597 144250337 151354747 155269172 160832304 175006076
43106 175006076 196527459 218462871 238322680 259286829 282389492 303622595 319601909
43099 319601909 331053205 338810966 340355435 333144209 318984285 302194779 284577674
43092 284577674 264907246 243163643 222511342 205756839 191581771 176428800 159521325
43085 159521325 143568617 130224723 117772249 105044811 95015331 91354846 92835359
43078 92835359 94518369 93770042 91653590 88953323 85171971 82042048 83465653 89976848
43070 89976848 96995732 101033434 104429082 111102139 120272768 127525455 130163660 128570877
43062 128570877 123952822 117818367 112605866 109947608 108811611 107380006 105840113 105419396
43054 105419396 105973781 106768310 108379637 111327552 113844049 113629463 111226824 109340861
43046 109340861 109427371 111147149 114345484 118861420 122560945 122063689 115913429 105703573
43038 105703573 94378897 84742533 78782722 76553462 76097135 76013746 77532191 82563364
43030 82563364 90439089 98156250 103365781 106130760 108623467 113579691 121147993 126678624
43022 126678624 124768553 117036877 111994284 114301514 118245630 116272729 110217651 107982084
43014 107982084 111558256 115513745 116657376 117675519 119706170 117997152 108306606 93408829
43006 93408829 80339016 73906608 74383538 78529353 81576848 80979320 78918150 78482407
42998 78482407 78134940 74370215 69322506 69675771 76874677 84434711 87002289 86223941
42990 86223941 85199372 83498597 81383611 82780747 89100241 95392458 97975305 100840105
42982 100840105 108364326 116397413 118117897 115501070 116897213 124802485 133726798 139516014
42974 139516014 143286712 146059433 147107913 148894659 156314079 168381002 176873153 176486719
42966 176486719 171215588 167436154 165624645 163008055 160236613 160224224 162392133 162750310
42958 162750310 159394513 154804760 152515904 153237502 154314901 152525804 148057235 145263306
42950 145263306 147405834 151054007 149149559 140106522 129677064 122309411 115516836 105976577
42942 105976577 96471243 91682840 90453027 88213387 85049309 84754057 86670509 85853310
42934 85853310 82593907 84370700 94645744 105923147 109391528 107006174 107498329 113062565
42926 113062565 117274328 115769990 111808510 109663926 109059818 109384497 113545748 122401902
42918 122401902 129467846 127629928 119362966 113920604 114706014 115925602 113063320 110037629
42910 110037629 112121858 116940777 118207473 115731631 115661004 121245469 128982922 135281214
42902 135281214 142142871 153085224 166334322 175991504 179331021 179791756 182203847 187408434
42894 187408434 192736338 195843418 195988597 192688831 186211983 179936238 179137675 185273715
42886 185273715 193599056 199270685 204223982 214334299 230555799 247448317 261223650
42879 261223650 274499018 290612476 307249369 319562102 327255164 334666593 344904903
42872 344904903 357081222 368509301 376732804 380005895 378574011 375436002 374100189 376332870
42864 376332870 383369747 396855465 415497894 432893077 442974032 446904572 450636108
42857 450636108 456204198 459750475 458185539 453261165 447991646 442993513 437876120 433032389
42849 433032389 428483375 423185345 415965777 404877237 386650018 361040972 335179323
42842 335179323 317798508 308073849 296104388 276452812 254885097 238485277 225848032
42835 225848032 212447096 199868734 192486676 188753587 183354465 175807897 169673221 164779184
42827 164779184 157885214 150478067 147718036 148506958 144595020 132470215 119239228 112830818
42819 112830818 112266245 112052722 110736461 109455180 106405964 99606891 92710846 90922403
42811 90922403 91643461 86126128 71986310 58255877 54937983 61655419 70089038 74421937
42803 74421937 74962199 73159913 68427577 61235268 55453302 54558496 57061779 58498973
42795 58498973 57400456 56455797 57452272 58209076 56472824 54401162 55859218 60092978
42787 60092978 61657902 57333906 50209706 45539862 44972494 46729326 49393239 52832426
42779 52832426 56391227 58905086 60502905 62304792 64167264 64562834 63017906 61066983
42771 61066983 60486723 62148693 66747775 74438541 82831880 87681019 87592426 86569631
42763 86569631 89438293 95377440 98450555 94668711 86354240 78952788 75421755 74598693
42755 74598693 73345933 69012689 61074154 51763032 44289791 39434026 35004057 29822394
42747 29822394 26671989 29072164 35991834 42352019 44772490 44545564 44770361 47034238
42739 47034238 51617311 58424279 66126623 72150336 75170301 76413853 77236456 76792748
42731 76792748 73540238 67774330 61269104 55765219 53090812 54555064 57792824 56490367
42723 56490367 47314705 36179378 32841538 38593470 44114560 41739073 35274775 33471314
42715 33471314 37157448 39161980 36655854 36999693 48122161 67269097 83761221 90936375
42707 90936375 90869501 88176605 84584220 81122134 80642952 84246138 88089834 87870234 84467679
42698 84467679 80797842 75073588 63430059 49049158 41304794 43145426 45972941 41709083
42690 41709083 34300586 32944520 38290988 43283580 45276065 48390804 53788237 56587924
42682 56587924 55037943 54717707 59095776 62398742 57740200 47907564 41983292 43949348
42674 43949348 50112472 55804372 59268452 60126693 59125951 59071316 61777135 64500162
42666 64500162 63195597 58369580 53460239 48586170 41344020 33608494 31341077 35984900
42658 35984900 41478794 42408676 40559198 40363015 41842882 41723466 38730711 34324003
42650 34324003 30120481 27333506 26905827 27997970 28546014 29195289 33490521 41521355
42642 41521355 47098966 45311727 39789033 37668110 39904319 42028356 42419563 43261734
42634 43261734 44162520 42247631 39694592 43815838 56339965 68445676 70682132 63539189
42626 63539189 54182053 46930771 42134571 41319198 46890791 56707935 63869244 63454497
42618 63454497 57248275 51282902 50101768 52986707 54535017 49983462 41191864 35609780
42610 35609780 37864216 44923694 51645459 57531540 64147621 69322758 69805380 67880960
42602 67880960 68834043 72195479 72143117 67314604 63357611 63671208 64418397 62300787 60948218
42593 60948218 64328798 68742869 67608783 61121626 55143292 52654320 52276497 53826462
42585 53826462 59039380 66902370 74016649 80053759 87363309 94387384 95631197 90810398
42577 90810398 88611645 97098894 113875004 130185203 142496620 155262438 172868462
42570 172868462 193475595 212431205 228996158 247034274 269151647 291862589 308098974
42563 308098974 314598120 314974066 313896613 309952344 297696965 276598661 253743284 235814008
42555 235814008 221967996 207812552 193636174 184029801 179983440 176050068 166948982
42548 166948982 153974309 142752757 136432805 133202814 129556075 123745096 115845116 106251169
42540 106251169 95460661 85001962 77412945 74485154 75451476 77263092 76937612 73717149
42532 73717149 69115803 65276965 63553222 64471620 68439873 75646097 84730253 92075517
42524 92075517 93845281 89498240 82536530 77113116 74895775 76141419 81910104 92155878
42516 92155878 102046746 104209174 96930636 87910650 87096696 96636110 110145751 121039404
42508 121039404 128460905 134534707 139165525 140555682 139887387 142187651 151031725 164004184
42500 164004184 175578075 184181851 194139473 210014293 231671423 257138366 288054427
42493 288054427 327883410 374465024 418694183 452940393 477746665 497262606 510727245
42486 510727245 513092853 503623302 489311401 478125786 471606502 465512389 455138015
42479 455138015 438132533 414734313 388587660 366373741 353175367 347353032 341851438
42472 341851438 331135773 315562014 299204630 285743613 276958599 272461424 269118382
42465 269118382 262837090 253129660 244208334 239074359 234219589 223609925 206902852 189658132
42457 189658132 175652687 163668086 152615650 144369218 138887727 131805594 121395243
42450 121395243 113677746 114604016 119818625 119106229 110297582 101803215 100361712 102947403
42442 102947403 103577416 102430184 103868237 109092853 115381096 120962993 127032952 135450924
42434 135450924 146465610 157891804 165420133 165339191 158099172 147524349 136041487 123401253
42426 123401253 110628826 101084674 95582000 90591256 84341866 80851684 84032519 91228678
42418 91228678 97174689 101457286 106792686 112074014 113131462 109713465 105991534 103672046
42410 103672046 99499638 90592425 78406707 66805669 59674634 60317742 68818030 79315178
42402 79315178 84131004 81877360 78156212 77721397 79718642 81037448 79791542 74463242
42394 74463242 64576382 54255666 50420820 54598011 60374999 61606590 59132397 56440644
42386 56440644 53202761 47581251 41398617 37684999 35171910 30421703 24276074 21136025
42378 21136025 22108234 23573992 22922328 21200526 19026177 14429435 7458774 3652231
42370 3652231 9065916 22686642 36733106 44614496 46313187 45360530 43092001 38396545
42362 38396545 32071955 27871542 27896273 29581793 29544918 28425345 28939968 30687892 30861965
42353 30861965 29702792 30858926 35421922 39631048 40221721 38523990 37099584 35555998
42345 35555998 32505849 29216469 28314831 30394834 34283640 39237326 44763364 49619274
42337 49619274 52813472 54347665 53955652 51400603 49240011 51904866 59420390 65235755
42329 65235755 64013660 59315772 59516876 67500508 78315003 86106711 89369398 89376531
42321 89376531 87045399 82486022 75890214 68269236 61581693 56907990 52250085 45042913
42313 45042913 37965545 38008927 46859953 56692912 60128985 60278853 64748155 73009740
42305 73009740 77505752 75655511 72143259 69010473 62531138 52605771 46729526 49331942
42297 49331942 53498345 49748659 39157729 31354730 31608468 36165365 40180017 44394290
42289 44394290 51417078 58763126 59650596 51382959 40579101 37138384 42614018 47687317
42281 47687317 43579428 33344411 27806026 31747877 39143800 42181260 39812529 35568849
42273 35568849 31280275 26142925 19897839 14510455 13221502 17969691 26316518 31978296
42265 31978296 31252422 27957877 28530683 33461319 38031428 40019401 40511197 37924552
42257 37924552 29225234 18221805 14046307 18126080 20824719 15674744 9152083 10249204
42249 10249204 17539141 24121489 29226177 35963122 42027584 42370419 38735962 37194698
42241 37194698 37310472 32951858 24131976 19214455 23379166 32165621 38866616 42152291
42233 42152291 43854437 44714984 45339570 47187814 49950204 50960917 48737337 44304054
42225 44304054 38657434 32519379 28711907 30305937 35629094 39412050 39700906 39286183
42217 39286183 39633286 38412479 34397837 29868815 26420403 23179167 20856532 22176020
42209 22176020 25799823 25518020 19341555 14422410 18050364 27455969 33711035 33255230
42201 33255230 30575552 31042193 35874085 43661338 52568188 60232835 64160776 63389120
42193 63389120 59283145 55049800 54281132 57892386 61900141 60823708 54405778 48068466
42185 48068466 45162905 42141062 34116391 22418335 13294764 10839790 14139306 20050106
42177 20050106 26070802 31304240 36577611 42843880 48603007 50883462 49734269 48842809
42169 48842809 50151329 51288972 50571345 50607540 53408252 55453616 52174277 44818351
42161 44818351 38227974 33845764 29790717 26230291 25305966 26321703 26132330 24460458
42153 24460458 24333621 27075579 31237430 36596645 44225421 51547884 52447805 45013412
42145 45013412 35686200 32845519 38329761 47191313 53623526 54928437 51224998 43782661
42137 43782661 33937814 23080462 13548854 8425485 8920474 12705221 16835478 21647473
42129 21647473 29207277 38335982 44438420 44856860 41391649 36492865 30080176 22341515
42121 22341515 17350694 20381156 31201900 42192419 45014722 39328483 33342116 34218461
42113 34218461 39231455 39609300 32856986 26449227 27295143 32588437 35302976 34340380
42105 34340380 33132732 31361876 25900821 19274636 19162298 27771808 38306845 44371574
42097 44371574 47069134 50039284 53067966 54332217 54396022 54040506 51918541 48194235
42089 48194235 47006323 51087643 56548349 57002570 50962291 41900417 33174551 26185302
42081 26185302 21427901 17944952 13497816 8279229 6388245 10560058 17795403 23656194
42073 23656194 28359593 34478109 40956344 44448330 45157880 46060902 46987893 45013752
42065 45013752 41123951 40990727 47224086 55130443 58566537 56928543 54166090 53422686
42057 53422686 54908205 57255562 58827856 58591680 57100006 56072614 56552892 58419532
42049 58419532 61708110 66717147 72445135 76890911 79893380 84064973 91665987 101692541
42041 101692541 111178904 118308212 122894686 124671200 123057200 118837135 114263934 110150508
42033 110150508 103911533 92773085 79205195 70478042 70712842 75171765 75390473 68921731
42025 68921731 60440140 53780223 47723818 40863348 35537460 33586732 31970051 26943782
42017 26943782 20543195 18826428 24582969 34884690 44934114 51635069 54489985 55706407
42009 55706407 58509808 63179611 66186736 65189330 62366865 60095600 56553927 49924278
42001 49924278 44259232 45657040 53803666 62444733 67388273 69039670 68188881 65478544
41993 65478544 65056328 72266543 86107078 99176958 106577322 110150184 113187093 116889473
41985 116889473 123888956 138942144 162321384 186965787 205791146 218594502 229566761
41978 229566761 242207349 259187003 282472260 309978871 335926983 357574096 377147202
41971 377147202 393456909 396647561 377161099 337415609 289935978 246241640 211484233
41964 211484233 186415247 168524173 152585072 135332711 119200411 107957204 100528405
41957 100528405 93269919 86137727 81479673 78405893 74150499 70336228 72009677 80048134
41949 80048134 89731372 97490811 103983229 109379761 110763151 106506771 99251666 92038939
41941 92038939 84532019 75374204 65751538 58178441 53199823 48996563 43345986 35322948
41933 35322948 26345101 19877029 18624053 21786770 26388637 30833569 35224964 38809650
41925 38809650 39840827 38064283 34896446 31135920 27050034 24574663 26145069 30585653
41917 30585653 33180744 31212945 27199933 25408026 27056905 30129618 32382554 33481657
41909 33481657 34987012 38285915 41565402 39824242 30205526 16832934 7605538 6086316
41901 6086316 9062209 12000483 13755501 15248086 16600832 17165647 16602688 15054945
41893 15054945 13668020 14808011 19604884 25426792 28440881 28888329 31167874 38287876
41885 38287876 48593205 58003803 62990133 61815255 56177973 51487082 51839946 54651018
41877 54651018 54151651 50171804 48567262 52116775 56353178 56513411 53687172 51225245
41869 51225245 49404161 46975934 44404746 42214643 39088659 34569491 30893770 29656801
41861 29656801 29636893 30054432 32219009 35440445 35756462 32305611 30725089 35923020 45265807
41852 45265807 53444848 60149415 67440491 73003101 72513344 66672358 59763179 52896892
41844 52896892 44886694 38282989 37347379 40040071 39097366 32567351 27154502 28706756
41836 28706756 34308134 36682046 33058328 27248926 25106253 29169751 35944169 38432294
41828 38432294 33716005 27366870 27185376 33426503 39231608 40123900 38358547 37877696
41820 37877696 40008899 44774011 51262399 55413410 52474969 43529653 35136397 31033617
41812 31033617 29133177 28303964 31998474 41697509 52306031 58817289 63335014 70433803
41804 70433803 78768178 82461052 78817641 70334847 60975288 54364095 53326488 56659087
41796 56659087 58150916 53293844 45302086 40022948 37162598 32540356 27545386 28730569
41788 28730569 36857800 43452614 41369793 33201583 25648398 20788961 17663952 17819545
41780 17819545 22508731 26793722 24000190 16326247 13990076 21500620 30873065 32380598
41772 32380598 26898316 22118688 20518974 18509191 15962805 18042978 25671052 31719156
41764 31719156 30892179 27573752 28601277 32970536 35178398 35486479 39252920 47091364
41756 47091364 53278046 55057304 57031664 63938800 74172005 83109668 88628020 90503369
41748 90503369 87926042 80774312 71163024 61498053 52742064 45617042 40959924 37915589
41740 37915589 34669502 31832904 31820734 34162397 35466266 35002059 35453798 36468485 33127561
41731 33127561 24035025 15578601 13827659 16681087 18582973 18668290 19028427 18850901 16196729
41722 16196729 12568336 9954630 6279477 -182370 -4933258 -2812317 3126752 6253938
41714 6253938 8094268 16066665 29116998 35307480 27075584 11248817 -270485 -3649709
41706 -3649709 -2756690 -1184515 157531 976476 1731498 3859559 7035121 8638482 8188322
41697 8188322 9194851 14079079 20462180 25282694 29305904 34184331 37908586 36975980
41689 36975980 31188991 23084021 14439035 6470172 1736013 2497060 8093416 16241556
41681 16241556 25379714 33482552 36826130 33340307 26015013 20110656 18020721 19102924
41673 19102924 22543674 27185714 30281726 30243532 29649179 31898626 35763655 37108887
41665 37108887 35386399 34126290 34948392 35643426 35189190 36180058 40066171 43667856 43443233
41656 43443233 40705167 39375221 40027683 39323210 34919549 28307193 22591689 19522493
41648 19522493 19139376 20519952 21918993 21500509 19318915 17989878 19930532 23829673
41640 23829673 25192036 21142029 13865453 8415834 7689511 10425933 13426639 14387058
41632 14387058 13006793 11032145 11299386 15201063 20909765 25527830 28835408 32809249
41624 32809249 37272463 38858486 35683181 30704149 28559404 30857351 36360583 43756146
41616 43756146 51692376 57783995 60998904 64601688 73530272 88411218 104774961 118850255
41608 118850255 131471058 144554867 155570599 158145241 148445161 129535111 108667466
41601 108667466 91021012 77238020 66717538 60851017 60938119 64178187 64870397 60099179
41593 60099179 51849737 43071830 34657420 27535706 24273485 25634484 27861693 26858199
41585 26858199 23895593 23876496 28461901 34016567 36399639 35108664 32410233 30818586
41577 30818586 32046300 36325070 41561523 44088129 41026232 32056583 19701798 8400919
41569 8400919 1946464 515783 1087601 1418014 1768776 1950328 11023 -3582674 -3871643
41560 -3871643 2180979 9524390 10431430 4949137 551747 1640233 5135347 7398812
41552 7398812 9642004 13842586 18021661 19054103 17089141 14235374 11321789 8487635
41544 8487635 6844507 7358574 9803608 13999917 19623592 23919561 23315867 19177103
41536 19177103 18014739 23204600 30212313 33372601 33658570 35322409 37963574 37347030
41528 37347030 32476840 26715575 22703541 20844878 22053550 26915804 32128314 32808197
41520 32808197 29091379 25837319 25019472 23613862 20856042 22036343 31107520 43546289
41512 43546289 51513664 53830939 55710107 59514537 61353847 58253473 54051171 54667268
41504 54667268 59845135 63526165 61996833 57809996 54324701 49826630 40469744 27415558
41496 27415558 16784154 12101686 10757895 9700723 10933673 17856662 28328974 35570316
41488 35570316 35712207 31202760 26562035 23660322 21711984 19320892 15597691 11211470
41480 11211470 8951866 11244096 16488697 20003795 19451105 17192333 16239512 16260234 15389936
41471 15389936 13976550 14078940 16365352 19834532 23900173 28369105 31654956 31662032 29079507
41462 29079507 27472793 28701165 29999063 27611410 22311487 18804903 19606712 22127905
41454 22127905 23061190 23296916 25897378 30387992 32344256 29084297 23076111 18609925
41446 18609925 17328259 18474283 21550225 26724237 33773163 42265724 51752563 60426931
41438 60426931 65008590 63684255 58006235 50410732 41484481 31458274 22318341 15787169
41430 15787169 10999350 7121092 6286883 10127605 15198168 16753234 15980462 17626592
41422 17626592 20439133 16950211 5252540 -5349679 -4938050 5178761 15893651 21916761
41414 21916761 24495635 24994677 22272833 16919841 13123069 14354645 19651287 25230555
41406 25230555 28124769 27911734 26452460 26018409 26412214 24471757 18019705 9592760
41398 9592760 4200755 3727811 5569338 6652548 6744248 7453516 9578405 12138325 13598373
41389 13598373 14190440 16834959 24025173 33191907 37773620 34726079 28284391 23602406
41381 23602406 19781120 13695855 8239841 10130231 19349708 27417699 28591653 27181363
41373 27181363 29826500 34864396 34688608 26750095 17146211 13178166 15963194 21100707
41365 21100707 23937337 22950383 19509781 15762702 12840534 10852195 9937217 10158658
41357 10158658 10526674 10027550 10117970 13836801 21029317 26869506 27570668 25629751 26120283
41348 26120283 28885768 28377874 21604221 12517901 6896760 5650346 5353041 3451274
41340 3451274 453916 -2093759 -3523966 -4049747 -4328943 -4868570 -4932890 -2871532 1185429
41331 1185429 4233037 4244040 4091748 8281356 15764706 20044081 18011493 14846494 17218513
41322 17218513 24841378 32559862 37920234 41448521 41280979 34314083 23393494 16935969
41314 16935969 18825995 23685211 24810774 21905576 17993314 14278345 12668511 18061091
41306 18061091 31586675 45154067 49518836 45240196 39170752 33424202 26377509 22056827
41298 22056827 27197402 37997148 41331333 33323075 26331102 31108544 41210184 43788326
41290 43788326 38703378 36242853 39681818 41141186 34619933 24065973 16839442 15837220
41282 15837220 19696748 25272542 28438696 27257285 25630994 29392307 37741507 43104326
41274 43104326 40819990 34558180 30439397 30029451 31387982 33213414 34967080 35462589
41266 35462589 34101849 32033249 30339985 28527179 26040347 23754114 22899803 23770152
41258 23770152 25888024 28023917 28252824 26074945 24236142 26010984 31027529 36535422
41250 36535422 41975010 48275304 52993973 51503985 44484976 39237025 40894120 46416768
41242 46416768 50157751 51441135 52902404 54436907 53237200 48551391 42960319 39387047
41234 39387047 38735444 39431879 38001489 31801570 22294425 13461223 6375652 -1154569
41226 -1154569 -8535470 -10966784 -6968222 -2459346 -3024769 -6293652 -7023061 -5736912
41218 -5736912 -5885622 -5453873 775810 11362041 18213314 17496576 14052954 13193592 13988325
41209 13988325 13306186 11449573 10380731 10060561 9903037 11092861 14154482 15978172
41201 15978172 12341406 3117887 -6450711 -9527859 -3016623 9224906 18581328 19243075
41193 19243075 13805958 9423366 9042738 9730530 9481809 10983726 16543346 23063525
41185 23063525 25433541 23041610 19937127 19254947 19776046 18246103 14070449 11018092
41177 11018092 13339901 19861117 24101355 22332950 19103878 20928146 26435807 28328429
41169 28328429 24547396 20866854 21016931 20998574 16520257 10095698 6141989 3977401
41161 3977401 1105667 -545593 2138173 6661680 7791617 5854185 5881904 8803714
41153 8803714 9728781 6194554 2711558 4616704 11077608 16741747 18042657 15918414
41145 15918414 13842237 14537943 17568352 19513426 17562111 13053376 10253239 11756291
41137 11756291 16428382 21510817 25073767 26579762 26662042 26326822 25314229 22100209
41129 22100209 17003564 13953817 16653782 23578536 29250891 30189099 27388138 23510448
41121 23510448 20355204 18966641 19410038 19921186 18450027 15404939 13049778 12320964
41113 12320964 12329059 12811310 14736500 18369849 22690477 26480245 28185525 25878421 20219823
41104 20219823 16363030 19055714 26021424 30013118 27578589 22003683 17595421 15654205
41096 15654205 16653035 20990251 25622241 25235785 19944167 17132729 21603572 27924031
41088 27924031 27578895 20815951 15678515 16561120 19503374 19423800 17057095 16397920 18286493
41079 18286493 19522936 17732956 14914064 14954453 18095019 19761770 16345283 10597306
41071 10597306 8477167 11409074 15324695 17354508 18955602 21211081 21851387 19508004
41063 19508004 16641037 15148382 13140130 9528667 7478162 8893472 9784807 6679652
41055 6679652 3836375 7438859 15588004 21474726 24243442 28211922 32378951 30471248
41047 30471248 22783012 18342701 21733790 26340635 25621970 23312891 25874327 31115569
41039 31115569 32165916 28675435 26116167 26157800 25261243 22196316 20355962 22132828
41031 22132828 26097270 29997715 32092400 29840177 22256095 13680452 10141630 11444087
41023 11444087 11959614 9960361 10201209 15147958 19840865 19692660 18356211 21943019
41015 21943019 28349017 29065342 21548865 13956237 15401648 25237500 34827679 37911332
41007 37911332 36148223 34710834 35196058 34687660 30941633 26134695 24254983 26086314
40999 26086314 28727175 29666488 29167383 28425219 27783047 27744512 29374436 31907525 31943028
40990 31943028 27426432 21099210 17360510 16637760 15920472 14515296 15544573 20516206
40982 20516206 25603421 25769293 20760315 14578414 10300270 8192052 8342625 11731776
40974 11731776 17484660 21663898 21089643 17138500 13462014 10684257 6366724 693372
40966 693372 -1400864 3342397 10139308 10600694 3710338 -1895042 1327230 10231665
40958 10231665 15500713 13415230 8707616 6491451 6421395 6257965 6732336 9531293 13158791
40949 13158791 14794115 15328265 18724719 25760582 31370121 29906018 21639909 12594405
40941 12594405 8529834 10117936 13692185 15624412 15429715 14982964 15685722 17254694
40933 17254694 19082016 21658365 26068118 32551364 39726423 44573434 43426701 34724741
40925 34724741 21562694 9992162 3696234 1772283 2699442 7826128 18025861 28837811
40917 28837811 33483816 31229279 28978321 32905202 41144284 46592597 44957937 38265518
40909 38265518 32094635 31155932 36058232 42271927 43228059 36640168 27529452 23337346
40901 23337346 26134206 30893081 31154246 25079054 16132506 9291458 7024033 8151312
40893 8151312 10022990 11514904 13344836 15588258 16468613 14773860 12380252 12583929
40885 12583929 16017764 19673877 20440921 18786599 18219792 20961449 24441591 23201458
40877 23201458 15490482 7168835 6488735 14364870 22480889 22828654 16850716 12465829
40869 12465829 13720960 17019550 17396646 14878656 13136502 14128294 16116300 16352187
40861 16352187 14389321 12418635 12421392 13432388 12893352 11130116 12360637 19217395 27941754
40852 27941754 32196306 31001134 29204628 29657428 28915764 22780506 12974055 5252152
40844 5252152 2650970 3672491 6124676 9396570 12850294 15295526 17612890 23517608
40836 23517608 35202307 49207057 59394026 64330246 68919467 76866989 83767924 81286620
40828 81286620 68017683 52435760 43512628 41418276 39844369 34835973 27834133 21692637
40820 21692637 17966982 17962850 22363565 28748331 32647527 32408093 30556630 29402000 28155146
40811 28155146 25928735 24758442 27140651 32148331 36047246 35698457 30229145 21405568
40803 21405568 14241101 15017952 25411849 38984218 46006483 42102352 31165321 20819400
40795 20819400 16720092 19982398 27117257 32142801 31146465 25814320 21273832 20181434
40787 20181434 20496301 19540573 18200247 19229624 22299209 23270836 19463587 14000042
40779 14000042 12586751 16075212 18949853 16718551 12346439 12307436 17764057 23854197
40771 23854197 27581193 31380833 36875800 39856438 35784196 27560169 22826991 24207829
40763 24207829 26660315 25060085 20586833 17949531 18995712 21387503 22512153 22708544
40755 22708544 24260132 27776715 30229093 27559602 19788007 12463583 11584047 17239856
40747 17239856 23385595 23948386 18640176 13180468 14351111 24066693 37407933 46938628
40739 46938628 49359183 47073123 43401335 38853604 33477543 30048141 31714200 37581604
40731 37581604 43383193 45846849 44235318 39060931 32464284 28681910 30047381 32715419
40723 32715419 30675962 24649869 22393908 28263270 36796177 39848495 36554151 31939042
40715 31939042 28149778 22635390 14890033 9421934 9534858 11968298 11400633 8359074
40707 8359074 8733482 15883854 27027691 37967834 47299258 53889784 54211069 46323103
40699 46323103 34219954 23717849 15597412 7863743 3339411 7669993 18473393 24008858
40691 24008858 16830374 3256382 -5184868 -4757911 724547 7625004 13268155 13359028
40683 13359028 6686908 191208 1731805 9333562 15002053 17457799 22324599 30295511
40675 30295511 34937004 33767094 32042483 32604526 30986919 24759383 19187921 18124296
40667 18124296 16834757 10355152 2649746 468706 3097324 5081064 4962893 4653467
40659 4653467 3912344 2279258 3300445 9943273 18211018 21703664 20287610 18292361
40651 18292361 16964605 15402137 16184131 22312973 30179340 33229891 31535209 30165038
40643 30165038 29306289 24671773 17577648 15176611 18790277 20735287 15944631 9175253
40635 9175253 6971327 9170711 12350002 15629281 18790229 19942417 19334996 20847713
40627 20847713 25842989 30205811 31237315 32297951 35973463 37748937 32462661 23248731
40619 23248731 17701837 17667408 19021021 19871557 22520655 27275616 29961064 27174197
40611 27174197 20580889 14572491 11426896 9265239 4025154 -5669176 -15057044 -16987004
40603 -16987004 -10421475 -2188699 1810748 3540878 7724734 13484774 16013788 14387617
40595 14387617 12541455 13380722 16330363 19902401 22496106 21639913 17052938 13806137
40587 13806137 17457908 25972939 31321744 29555474 24371992 19848656 15170661 9044731
40579 9044731 4436247 4798467 8317737 9852343 7497495 4234899 3395009 4654420
40571 4654420 4865859 1912938 -2585180 -4591581 -1945697 3418231 8338405 12131025
40563 12131025 15683044 18415048 19135645 19047584 20276644 21397828 18203357 9813851
40555 9813851 705227 -4417526 -4640084 -923636 5758156 12283771 13389456 7585423
40547 7585423 890998 997433 8569394 17067468 20466514 18695666 15873242 15383750
40539 15383750 16919700 17282681 14241281 9856087 8723404 12396667 17403160 19724963
40531 19724963 18983931 16767588 13580955 10059758 8793947 11365438 14976866 15771656
40523 15771656 14766507 16555368 22089783 26720192 26423733 22564147 19002899 17473467
40515 17473467 17600530 18783810 19807611 18789343 15921948 14269066 15143934 14801515
40507 14801515 9584710 3065345 3068666 11046658 19412197 21522442 19547876 18822363 18917445
40498 18917445 16360864 13504532 16854226 26143866 32599073 30657182 24606085 19671998
40490 19671998 13517675 3243990 -4865853 -1954122 9473789 17887246 18980926 19950081
40482 19950081 25441420 28948070 23461685 12912653 5885202 3277389 -64024 -4690005
40474 -4690005 -5524868 -679828 5551617 9140992 10459666 11063438 10882325 10036389 9990563
40465 9990563 11350582 12758884 12974022 12571062 13409883 17478203 25285126 33956850 38586908
40456 38586908 37428804 33685471 30014246 24583295 16301188 10229954 11761076 17696912
40448 17696912 20075811 17799671 16837516 18722904 17378276 9907633 2682053 2372137
40440 2372137 7303464 12542160 17841800 24698834 30030296 29474450 24595418 20901643
40432 20901643 20038785 18947631 15786996 12195225 10178984 10336685 12469238 15075676
40424 15075676 15713739 14723163 16198083 21471209 24328372 18055080 5735369 -2351649
40416 -2351649 -1456849 3100350 4815960 4032677 5132704 10022891 17089225 23893050
40408 23893050 28502453 29603344 26856589 20812279 12993978 7178342 8675233 19053897
40400 19053897 32346396 39926239 38971322 33279175 27037907 22161725 21042566 26210798
40392 26210798 35694850 43051436 43843438 39016920 31475273 23602717 18928261 21000114
40384 21000114 28283481 34482103 36272767 36702729 38839672 40733520 39597930 36431630
40376 36431630 32951562 28256423 22584534 20229682 23815233 28947773 29583569 25956661
40368 25956661 22220877 19138163 15132519 12697452 17058068 28322516 40265152 47354032
40360 47354032 48763893 45764609 39933061 34231200 31366610 30492669 29322015 29307337
40352 29307337 34134852 42784197 48881150 47924223 40933669 30441228 17965953 6819858
40344 6819858 1972638 4114177 7749131 7961347 5821363 4897095 6063281 8411720
40336 8411720 11797825 15372219 16492603 14109538 10658422 8018305 4819664 1025370
40328 1025370 1689772 11206438 25551313 35229559 35877975 32281020 31712918 36187423
40320 36187423 41504308 41820230 35216226 26182419 21727077 23761860 27223422 27390574
40312 27390574 25941373 26453896 27311037 24800891 21523471 24553369 34156636 40939653
40304 40939653 37481321 27803573 21034831 19270250 16900556 10514044 4344442 4885485
40296 4885485 13115343 23460975 29184941 28291088 25099206 26122891 33518257 42695141
40288 42695141 47160883 45137449 40078056 35234239 29983316 22251532 12703545 4881024
40280 4881024 1792309 3497807 7642656 11461591 13741610 15667320 18987638 22365095
40272 22365095 21158025 13515946 5740987 7250806 18827934 29841761 29973557 20448981
40264 20448981 10104559 3740112 22084 -1137141 3217490 12126333 18611735 17909825
40256 17909825 13113053 9421883 7393300 5812113 6675781 11697078 16855778 16664146
40248 16664146 12633768 11767195 16931885 24043320 29079983 32578271 35649343 36009949
40240 36009949 30592951 19853227 8031663 544900 750803 6832359 12521084 13962699
40232 13962699 14847728 20767465 29904982 35325053 36212916 39056002 45309296 45970303
40224 45970303 33962042 15787915 3872632 1354556 1805369 1237288 2117315 5993685
40216 5993685 10268464 14056925 20442168 29878958 36814138 36641753 31902470 27598873
40208 27598873 23752799 17403374 9984318 7263511 11485408 17817806 20383571 19058247
40200 19058247 18094847 19795049 22363419 23777400 24926311 27330164 29458115 27998026
40192 27998026 22832995 18160226 17199485 17648241 14805323 8533804 4392451 7055113
40184 7055113 14563796 20685616 22132814 21786484 24492792 30803572 36060452 35816840
40176 35816840 31100855 27122489 27040045 28509762 26860602 20288943 11086230 3122049
40168 3122049 -612506 739069 5222878 9290238 11334069 13349364 17396897 21545822
40160 21545822 22159515 19876273 19886012 25295745 33267075 39363124 42849172 45184565 45757305
40151 45757305 42908109 38330287 36567280 39349452 43156696 43458999 39312539 32910569
40143 32910569 26880120 23435924 24045350 27782093 31441355 33424515 36184136 42329060
40135 42329060 49643363 53522222 53898175 55401444 59593831 61516839 56767668 48445029
40127 48445029 43200638 42806206 43866660 44140875 44250885 43879468 41698468 39736202 42487709
40118 42487709 49657584 54396289 51605236 44297081 38758442 36885768 36738867 37463198
40110 37463198 39459711 41985257 44811159 50326305 59457173 66936822 65654758 55538434
40102 55538434 43883245 36998728 35481894 37177823 39806907 40079794 35091925 26255031
40094 26255031 18309597 13655005 11408130 12108703 17941891 27039682 33469609 35427551
40086 35427551 37652925 42330239 43791782 37523939 28967657 26411163 28959646 29224916
40078 29224916 25509811 22967908 23413358 22727426 19812891 19823767 24892673 28503507 24229079
40069 24229079 15385787 10635035 12954310 17931432 20929478 20970448 18501928 14304075
40061 14304075 11287133 13351868 20484304 27131097 27405314 21235331 14196609 11499329
40053 11499329 13145871 15548181 17087279 19927276 25288511 29492445 28336609 24533442
40045 24533442 25935250 34860217 43629756 43828629 36469444 28903391 24479364 20654388
40037 20654388 16120019 13563216 14010882 13703954 9680073 5052428 5328112 11454890
40029 11454890 19510950 25717824 28524073 26782475 20068417 11969778 9748167 17758982
40021 17758982 31925597 42937499 45197476 41260075 37257984 35808750 34925449 32668561
40013 32668561 30061149 28627103 27368891 24370792 20430889 18660936 20351251 23457500
40005 23457500 26129072 29810103 36819336 45491330 49925787 45555820 34220203 22907259
39997 22907259 17658553 19110666 23485244 26660662 26831958 24513731 21556515 19908720
39989 19908720 19818226 19157256 16016844 11980304 10638115 12292823 13030363 10880151 9886711
39980 9886711 14555900 22277426 25809588 22612815 16755296 11087234 3153105 -8415630
39972 -8415630 -18238370 -19421816 -11904177 -1536365 7142621 13116766 15875548 15575602
39964 15575602 15860173 20987272 28904051 32066563 27296923 20431112 18276326 20166166
39956 20166166 21729893 23464300 29360424 38093713 42133045 37304028 28311447 22227556
39948 22227556 20513504 20670056 22212558 26354585 31500669 33821461 32128359 28309824
39940 28309824 23138280 15936883 8737833 5743617 6906721 7077627 4572596 5494351
39932 5494351 14458321 25083979 26695332 18756582 11293893 10835223 13356597 13204595
39924 13204595 11861044 13516303 17342325 19611300 20218790 21980454 25484031 29047161
39916 29047161 32082452 34473766 34450417 31443799 29437595 32604548 38516784 40664360
39908 40664360 37435225 33664389 33127636 34599249 36153567 38140547 40051165 39178428
39900 39178428 34987343 30910589 29183983 27604964 24388844 22608028 25782970 31559851
39892 31559851 34154095 31978267 28954290 28500717 29594606 29453256 27807906 27372231
39884 27372231 30679027 36594270 40075223 36767844 28622740 23355645 26760126 36406088
39876 36406088 44192706 44432030 38583043 32994784 32858421 37588814 41798293 41771323 40413692
39867 40413692 43482539 51281305 57722756 58412729 55633914 53584002 53018990 53544214
39859 53544214 56862370 63214156 67817699 66077018 60336834 56410394 55156354 53143411
39851 53143411 50479323 51263741 55565548 57423259 53248454 47053601 44407924 45547689
39843 45547689 47673529 50007449 52411594 52141659 47085634 40901742 39941370 44737857
39835 44737857 48689530 46490021 40542537 36979982 37939324 40777685 43559106 47494340
39827 47494340 53147300 57363119 56310123 50077945 42137755 35450499 31372875 30978630
39819 30978630 33945811 36531961 34612942 29452364 26792064 29136758 32671991 33249063
39811 33249063 31419760 29634668 28787863 30088495 35602176 43277487 46164219 41387220
39803 41387220 35693998 36617781 42121247 45326399 45601392 46977755 48241978 43776674
39795 43776674 33759582 24912970 20697055 18934037 19662436 26274811 36883985 43569675
39787 43569675 43621189 43463134 47760009 52711405 54479419 55906195 59093442 59256257 53313653
39778 53313653 47946732 50756973 58294301 61178388 57369627 52271234 48816882 45832382
39770 45832382 44054018 45289604 46596993 43415927 38369989 39141535 46663444 52540717
39762 52540717 50042798 41699076 33993956 29828877 28587510 29119927 29756550 28349291
39754 28349291 24769952 21730120 21837370 24905604 28274250 28880118 26127291 23818728
39746 23818728 26823955 33837566 36769994 30626274 20449961 14098569 11935274 9601962
39738 9601962 7518237 9738891 14936661 16781069 13453876 9329888 6809647 4172535
39730 4172535 2444978 5912241 13048166 14846259 6513471 -5310136 -11167098 -9218855
39722 -9218855 -3227393 4180893 11110775 13713659 9720003 2719478 -984704 1644537
39714 1644537 9323323 18341661 23821015 23175590 20670261 24184461 34709301 43696397
39706 43696397 44060488 38895777 35326641 34830344 34818370 35138954 36459235 35156963 26471793
39697 26471793 11611919 -3222406 -13383136 -17083375 -12958146 -2094208 9285478
39690 9285478 15126894 16646161 18834915 21333493 19224707 12487729 7657983 8673114
39682 8673114 12080540 13459344 13383394 14411159 16597551 18884291 21288585 22818048
39674 22818048 20429054 13237723 5264334 735780 -1477896 -5333072 -10537478 -11567276
39666 -11567276 -4397678 8023910 18132390 20609302 16332951 10455796 7704036 9449257
39658 9449257 13954292 18041973 18725759 14950742 8813575 4275954 3656873 5707403
39650 5707403 7685657 8750710 10551913 14698566 20218296 23835340 23266262 20289946
39642 20289946 19108192 20648714 20478552 14720721 6132512 694613 -325306 -38049
39634 -38049 1419114 7253083 15796843 19142156 13890658 7283058 7352229 11695303 12120010
39625 12120010 6964094 2084478 1437657 3184360 4774091 6305058 8358339 10778321
39617 10778321 14044839 18707010 23789137 28337870 32933582 36647927 35270686 27185253
39609 27185253 18456040 16105321 17835390 15007794 5499042 -3107551 -3973496 1632020
39601 1632020 9049472 16486884 23890947 30055524 33777737 35167493 34294555 31070642
39593 31070642 26874873 23246707 19172547 13513142 9803085 13836695 25913690 39903890
39585 39903890 50412116 56396238 57814272 54333454 48211133 43052747 38784639 33057282
39577 33057282 27612916 26488742 27450915 23539871 15169291 11628074 16553202 20987974
39569 20987974 17081678 10604517 11763788 19702121 25063851 24096249 21558410 21677230
39561 21677230 23755717 25665050 25528181 21117279 12962707 6552287 6567496 11045815
39553 11045815 15842593 21302205 28457188 32588018 28902569 22315189 22359274 28773459
39545 28773459 31276927 24803687 16167362 12898087 13397281 12286019 9123494 6929669
39537 6929669 6499304 6684503 7205752 7502841 5401510 264632 -4362374 -3883954 2752829
39528 2752829 12826942 22337341 27840423 28227982 25869375 23910870 21960409 17280485
39520 17280485 10812543 8234394 13055727 21614552 27250353 27440932 24999275 24039074
39512 24039074 26393135 30493674 32496713 29784614 24052182 19593674 18502165 19333103
39504 19333103 19971008 19118990 15584729 9940379 6881217 11190024 20143049 24857272
39496 24857272 21597585 16984811 18276882 22663798 21521176 13072462 5065882 4646632
39488 4646632 10074229 14064300 12465691 7497718 3587537 2111170 949702 -1668140
39480 -1668140 -4599099 -5657734 -4294909 -794256 5323369 13070251 17408141 13180875
39472 13180875 2230448 -7031190 -8237989 -2306238 6259465 14094116 18575399 17209290
39464 17209290 10636858 3548148 -66370 -406749 1104981 5069104 11737435 18284311
39456 18284311 21637814 22122519 21793643 21226497 20212084 19200507 17721010 14144781
39448 14144781 9535044 8384730 12180561 15653995 13738434 9253849 8574177 11956083
39440 11956083 13961926 12372332 10747245 11874052 13878772 13943840 11871852 9003724
39432 9003724 6903235 7530952 11403818 15294359 15087616 11187233 7794607 6684789
39424 6684789 5267134 1356544 -3479308 -6169933 -5255446 -1726955 905434 -1453097
39416 -1453097 -8105921 -11647783 -6040437 4565290 10582038 9719674 8267424 9644996
39408 9644996 9885216 6898155 5917129 10730916 16188926 15698443 11384755 10386674 14437889
39399 14437889 19183355 21269086 20462642 17036817 12769157 12687113 19924396 29869205
39391 29869205 34878004 33947216 32264293 31923665 29348019 22779188 16729511 16721537 22900220
39382 22900220 30085631 31813164 24934016 13652793 8037954 14051319 25639561 31601867
39374 31601867 29612940 27393645 30131380 34409809 36673882 39834417 46822383 53827833
39366 53827833 55708107 53657274 51825088 50017824 45761618 40746848 38713822 38364433
39358 38364433 34605113 26575817 18983859 15265990 14438289 15216904 18245654 22819730
39350 22819730 25739886 25494269 24436574 25129668 27337977 30158436 34272926 40023060
39342 40023060 45333434 47581092 46320885 42979129 39188419 36265292 34677854 32993082
39334 32993082 28842395 21912259 14697915 9772948 8049554 10266492 17657386 29312078
39326 29312078 40606914 46505680 45911465 41448613 35787716 29835589 24281383 21152744
39318 21152744 22496425 27183004 29891084 25394160 15076681 7194203 7971927 13710453
39310 13710453 15335573 10311955 5509399 7296564 13634019 18635743 20610316 21356659
39302 21356659 20522775 15835047 7864251 -75318 -6678075 -13235540 -19179395 -21145511
39294 -21145511 -17964285 -13409048 -11958697 -13792416 -15514841 -14062168 -8434042 562354
39286 562354 10080610 15741692 14802817 9241482 4403151 3989476 6719372 7905879 3984780
39277 3984780 -4134279 -11383162 -12252540 -5289686 5389895 13536472 16341943 16308327
39269 16308327 17286556 19913525 22461700 24791209 27969315 29821475 25518733 15279252
39261 15279252 7278722 8146543 13533125 14209104 9752842 8513853 13586829 17375025
39253 17375025 13495712 6363417 3301601 3417708 1591870 -939531 1611051 9220400
39245 9220400 15631120 18038570 19731029 22113918 21162646 14540054 6905540 4690475
39237 4690475 8666035 14102637 16235685 14416639 12611048 15539637 22103825 24345400
39229 24345400 16946208 5858790 1546483 4712519 6329244 2309975 -900971 1358809
39221 1358809 3151637 -2029839 -9406098 -9568600 -2981811 834606 -2857480 -8799306
39213 -8799306 -10516383 -7508049 -2219872 4457300 11807737 16917123 16753027 11711520
39205 11711520 5814448 3435741 5257725 6992276 3694099 -3644063 -8177682 -5729681
39197 -5729681 -356307 1583254 62097 -202343 2079369 3431814 1962217 30188
39189 30188 -113322 672470 564836 -1482386 -6447227 -13926026 -19727733 -19131813 -13745833
39180 -13745833 -10672826 -12762022 -14079539 -8512172 626796 4159817 -1460602 -10658082
39172 -10658082 -16358695 -16943449 -14679809 -10926596 -5584034 347790 4491965 5550610
39164 5550610 4569380 3746727 5242005 10683028 19370099 26393868 25686151 17336343 9381764
39155 9381764 8898877 13191150 14118602 9749666 5975564 6541059 8088843 7015383 4619543
39146 4619543 1976134 -3714268 -12303638 -16107215 -9416928 1394796 5253986 1506043
39138 1506043 -464384 4390717 11167098 14234763 14050020 12782099 10079252 5925768
39130 5925768 2141818 -1201311 -5517197 -8174257 -3653771 6942473 14160407 12328248
39122 12328248 7648929 8893238 14960777 18111337 16250182 14998602 18439418 23658641
39114 23658641 25108414 20582255 12480512 5880093 5173014 10186874 15823830 17200309
39106 17200309 14265432 9974417 5909898 2146392 -342470 -371398 917824 707741
39098 707741 -2370768 -6983030 -10055298 -8220568 -453666 9145847 13590883 10358530
39090 10358530 4573196 2654730 4990260 7430001 7608090 6430371 5187422 4796892
39082 4796892 6502783 9708821 10285764 4938671 -3184741 -6866559 -2906147 4970494
39074 4970494 10977889 12214516 9247704 5138098 4194986 8694897 15818638 19617721
39066 19617721 16581328 8323832 -628986 -6463766 -8520807 -9456343 -11604271 -12307797
39058 -12307797 -5975069 7026744 17514208 17845780 11897116 9165417 11458256 12338946
39050 12338946 8669779 4713583 3505685 1823694 -2795326 -6169397 -3286377 3982399
39042 3982399 9353700 9645458 6184663 956468 -5095194 -11091490 -16091787 -19276092
39034 -19276092 -19415571 -16052876 -11692264 -9641250 -8643731 -3727804 5478722 11707242
39026 11707242 9015823 1276861 -2677158 188713 5758496 10110931 13017299 14707461
39018 14707461 14039641 10791937 6616747 3095240 909239 401368 650975 -789085
39010 -789085 -4216237 -5260070 -48225 8038360 11553430 8921809 6047543 7002561
39002 7002561 8560033 6642525 3441916 4053924 9055516 14420223 16769584 15081706
38994 15081706 9083209 181567 -6774140 -6813895 -474668 6668227 10238582 10252579 8316957
38985 8316957 5033872 1108376 -1838758 -3051298 -3238711 -2306180 1394301 8071245
38977 8071245 14541255 17085840 15354898 12205461 10423225 10355934 9948649 6823185 1428706
38968 1428706 -2284943 -1604909 -109962 -4268425 -14200610 -22340342 -23504152 -21378897
38960 -21378897 -21044421 -19952347 -12745933 -1840930 4611746 4429914 3330688 4613569
38952 4613569 4653438 748836 -3964776 -6893102 -10444628 -15544319 -16986898 -11361412
38944 -11361412 -4719818 -5303780 -11685789 -15183182 -12442648 -8858403 -9727722 -13929487
38936 -13929487 -17100070 -16542875 -12328506 -6992417 -4030102 -3618084 -1136274 6145956
38928 6145956 12761102 10933045 1975383 -4375143 -2629045 2330982 3320707 -368933
38920 -368933 -4623920 -6411903 -5268771 -2168961 840095 2374467 4144457 8738327
38912 8738327 14532613 16573219 13191969 7717535 3133070 -147184 -628736 3858041
38904 3858041 9964173 9521831 292112 -9417425 -11121167 -6201756 -1252051 1253112
38896 1253112 1948052 -774187 -7619301 -12826668 -9551786 -30736 6264848 4543031
38888 4543031 -1002777 -4721666 -5482762 -4384437 -2003533 176258 -392184 -4188594
38880 -4188594 -8885908 -12195495 -12753580 -8684061 770870 11963652 19212305 21187260
38872 21187260 21303184 21387572 19386745 14540541 10146485 8707279 8248884 6562061 5897386
38863 5897386 9610722 15992418 19347289 16931181 11823139 8427646 7306825 5691853
38855 5691853 2154580 -855701 5077 4139131 7011696 5602527 1789090 -1331726
38847 -1331726 -4293036 -9374004 -15240202 -17460675 -14537461 -9789681 -6305172 -3179894
38839 -3179894 1890769 9009205 16602106 23263714 27607313 28381488 26184262 23085542
38831 23085542 19284178 12634338 3502811 -2401495 518979 10105128 17225604 14896205
38823 14896205 5160099 -3510628 -4668192 561563 5648733 5764588 2424138 991086
38815 991086 4383554 10447364 15238348 17085933 16750523 15171443 12655148 9915218
$$ [...]
##END NTUPLES=NMR SPECTRUM
##END=
