##TITLE=31Pdec_DE-111_oil_TFA
CDCl3, 64 sc
 11.9.2025
##JCAMPDX= 6.0         $$ Bruker NMR JCAMP-DX V2.0
##DATA TYPE= NMR SPECTRUM
##DATA CLASS= NTUPLES
##ORIGIN= UXNMR, Bruker Analytische Messtechnik GmbH
##OWNER= root
$$ XWIN-NMR		Version 3.5
$$ Thu Sep 11 14:09:32 2025 Russian Standard Time (UT+4h)  she@DPX200
##.OBSERVE FREQUENCY= 81.013821
##.OBSERVE NUCLEUS= ^31P
##.ACQUISITION MODE= SIMULTANEOUS
##.ACQUISITION SCHEME= undefined
##.AVERAGES= 64
##.DIGITISER RES= 17
##SPECTROMETER/DATA SYSTEM= spect
##.PULSE SEQUENCE= zgpg30
##.SOLVENT NAME= CDCl3
##.SHIFT REFERENCE= (INTERNAL, CDCl3, 0, 198.062)
##AUDIT TRAIL= $$ (NUMBER, WHEN, WHO, WHERE, WHAT)
$$ ##TITLE= Audit trail, XWIN-NMR		Version 3.5
$$ ##JCAMPDX= 5.01
$$ ##ORIGIN= Bruker BioSpin GmbH
$$ ##OWNER= she
$$ F:/spectra/data/she/nmr/P31/2/pdata/1/auditp.txt
$$ ##AUDIT TRAIL=  $$ (NUMBER, WHEN, WHO, WHERE, WHAT)
(   1,<2025-09-11 14:08:20.18 +0400>,<she>,<DPX200>,
      <created by zg, POWCHK disabled, PULCHK disabled
       configuration hash MD5:
       00 E9 B6 7A A2 85 ED C7 34 08 36 98 17 FE 4E 26
       data hash MD5: 32K
       8A B9 8F 28 C4 E2 F3 03 18 62 7B 65 79 16 09 9E>)
(   2,<2025-09-11 14:08:22.84 +0400>,<she>,<DPX200>,
      <Start of raw data processing
       efp BC_mod = 2 LB = 1.5 FT_mod = 6 PKNL = 1 PHC0 = 1620.984 PHC1 = 239.2999 SI = 64K 
       data hash MD5: 64K
       97 7F 0F 8A 22 11 08 3C E0 1F F8 1B 11 E4 A1 C9>)
(   3,<2025-09-11 14:08:56.39 +0400>,<she>,<DPX200>,
      <pk PHC0 = 46.9668 PHC1 = 0 
       data hash MD5: 64K
       5F 8D 35 15 F5 BA 1D CF 3B 63 E0 38 3A 16 97 54>)
(   4,<2025-09-11 14:09:00.59 +0400>,<she>,<DPX200>,
      <abs ABSG = 5 
       data hash MD5: 64K
       08 7E 3E CE A6 13 E9 71 FC 3D 77 24 3E 81 CD 82>)
$$ ##END=
$$ 
$$ hash MD5
$$ D8 AE 0A EA AF 57 A4 C0 DA B7 2F 5F AF C3 EB 21
##$RELAX= 
##$RELAX= 
##$RELAX= 
##$RELAX= 
##$RELAX= 
##$RELAX= 
##$RELAX= 
##$RELAX= 
$$ Bruker specific parameters
$$ --------------------------
##$DU= <F:/spectra>
##$EXPNO= 2
##$NAME= <P31>
##$PROCNO= 1
##$TYPE= <nmr>
##$USER= <she>
##$AMP= (0..31)
100 100 100 100 100 100 100 100 100 100 100 100 100 100 100 100 100 100 
100 100 100 100 100 100 100 100 100 100 100 100 100 100 
##$AQSEQ= 0
##$AQ_mod= 1
##$AUNM= <au_zg>
##$AUTOPOS= <>
##$BF1= 81.014009
##$BF2= 200.13
##$BF3= 200.13
##$BF4= 200.13
##$BF5= 200.13
##$BF6= 200.13
##$BF7= 200.13
##$BF8= 200.13
##$BYTORDA= 1
##$CFDGTYP= 0
##$CFRGTYP= 5
##$CHEMSTR= <none>
##$CNST= (0..31)
1 1 145 1 1 1 1 1 1 1 1 1 1 1 1 1 1 1 1 1 1 1 1 1 1 1 1 1 1 1 1 1 
##$CPDPRG= <waltz16>
##$CPDPRG1= <>
##$CPDPRG2= <waltz16>
##$CPDPRG3= <>
##$CPDPRG4= <mlev>
##$CPDPRG5= <mlev>
##$CPDPRG6= <mlev>
##$CPDPRG7= <mlev>
##$CPDPRG8= <mlev>
##$CPDPRGB= <>
##$CPDPRGT= <>
##$D= (0..31)
0 1 0 0 0 0 0 0 0 0.06 0 0.03 2e-05 3e-06 0 0 0.0002 0 0 0 0 0 0 0 0 0 
0 0 0 0 0 0 
##$DATE= 1757585299
##$DBL= (0..7)
120 120 120 11 120 120 24 19 
##$DBP= (0..7)
150 150 150 150 150 150 150 150 
##$DBP07= 0
##$DBPNAM0= <>
##$DBPNAM1= <>
$$ [...]
##$SUBNAM3= <"">
##$SUBNAM4= <"">
##$SUBNAM5= <"">
##$SUBNAM6= <"">
##$SUBNAM7= <"">
##$SUBNAM8= <"">
##$SUBNAM9= <"">
##$SW= 400.765351723535
##$SWIBOX= (0..15)
0 1 3 0 0 0 0 0 0 0 0 0 0 0 0 0 
##$SW_h= 32467.5324675325
##$TD= 32768
##$TD0= 1
##$TE= 0
##$TE2= 300
##$TE3= 300
##$TEG= 300
##$TL= (0..7)
0 120 53 12 22 120 120 120 
##$TP= (0..7)
150 150 150 150 150 150 150 150 
##$TP07= 0
##$TPNAME0= <>
##$TPNAME1= <>
##$TPNAME2= <>
##$TPNAME3= <>
##$TPNAME4= <>
##$TPNAME5= <>
##$TPNAME6= <>
##$TPNAME7= <>
##$TPOAL= (0..7)
0.5 0.5 0.5 0.5 0.5 0.5 0.5 0.5 
##$TPOFFS= (0..7)
0 0 0 0 0 0 0 0 
##$TUNHIN= 0
##$TUNHOUT= 0
##$TUNXOUT= 0
##$USERA1= <user>
##$USERA2= <user>
##$USERA3= <user>
##$USERA4= <user>
##$USERA5= <user>
##$V9= 5
##$VALIST= <valist>
##$VCLIST= <CCCCCCCCCCCCCCC>
##$VD= 0
##$VDLIST= <DDDDDDDDDDDDDDD>
##$VPLIST= <PPPPPPPPPPPPPPP>
##$VTLIST= <TTTTTTTTTTTTTTT>
##$WBST= 1024
##$WBSW= 4
##$XGAIN= (0..3)
0 0 0 0 
##$XL= 0
##$YL= 0
##$YMAX_a= 14637
##$YMIN_a= -24194
##$ZGOPTNS= <>
##$ZL1= 120
##$ZL2= 120
##$ZL3= 120
##$ZL4= 120
##$ABSF1= 198.0616
##$ABSF2= -202.7028
##$ABSG= 5
##$ABSL= 3
##$ALPHA= 0
##$AQORDER= 0
##$ASSFAC= 0
##$ASSFACI= 0
##$ASSFACX= 0
##$ASSWID= 0
##$AUNMP= <proc_1d>
##$AZFE= 0.1
##$AZFW= 0.5
##$BCFW= 0
##$BC_mod= 2
##$BYTORDP= 0
##$COROFFS= 0
##$CY= -3
##$DATMOD= 1
##$DC= 0
##$DFILT= <>
##$DTYPP= 0
##$F1P= 0
##$F2P= 0
##$FCOR= 1
##$FTSIZE= 65536
##$FT_mod= 6
##$GAMMA= 0
##$GB= 0
##$INTBC= 1
##$INTSCL= 9.790993e-09
##$ISEN= 30
##$LB= 1.5
##$LEV0= 0
##$LPBIN= 0
##$MAXI= 10000
##$MC2= 0
##$MEAN= 0
##$ME_mod= 0
##$MI= 50
##$NCOEF= 0
##$NC_proc= -8
##$NLEV= 6
##$NOISF1= 182.463
##$NOISF2= 159.3651
##$NSP= 0
##$NTH_PI= 0
##$NZP= 0
##$OFFSET= 198.0616
##$PC= 4
##$PHC0= 1667.951
##$PHC1= 239.2999
##$PH_mod= 1
##$PKNL= yes
##$PPARMOD= 0
##$PSCAL= 0
##$PSIGN= 0
##$REVERSE= no
##$SF= 81.0140089999434
##$SI= 65536
##$SIGF1= 159.3651
##$SIGF2= -187.1042
##$SINO= 113.3802
##$SIOLD= 16384
##$SREGLST= <1H.CDCl3>
##$SSB= 0
##$STSI= 65536
##$STSR= 0
##$SW_p= 32467.5324675325
##$SYMM= 0
##$S_DEV= 0
##$TDeff= 32768
##$TDoff= 0
##$TI= <>
##$TILT= no
##$TM1= 0
##$TM2= 0
##$TOPLEV= 0
##$USERP1= <user>
##$USERP2= <user>
##$USERP3= <user>
##$USERP4= <user>
##$USERP5= <user>
##$WDW= 1
##$XDIM= 65536
##$YMAX_p= 224587343
##$YMIN_p= -127070790
$$ End of Bruker specific parameters
$$ ---------------------------------
##NTUPLES= NMR SPECTRUM
##VAR_NAME=  FREQUENCY,     SPECTRUM/REAL,   SPECTRUM/IMAG
##SYMBOL=    X,             R,               I
##VAR_TYPE=  INDEPENDENT,   DEPENDENT,       DEPENDENT
##VAR_FORM=  AFFN,          ASDF,            ASDF
##VAR_DIM=   65536,         65536,           65536
##UNITS=     HZ,            ARBITRARY UNITS, ARBITRARY UNITS
##FACTOR=    0.49542278885378, 1,            1
##FIRST=     16045.7642231865, 0,            0
##LAST=      -16421.768244346, 0,            0
##MIN=       -16421.768244346, -127070790,   0
##MAX=       16045.7642231865, 224587343,    0
$$ Real data points
##PAGE= N=1
##DATA TABLE= (X++(R..R)), XYDATA
$$ [...]
##PAGE= N=2
##DATA TABLE= (X++(I..I)), XYDATA
7360A437470l418214j389313j92799o69011k045291k687553k228378j609924q41540
7351a3644553J216270M005314M612862J771655j501901j622434P80952K425569
7343a956266K376963K306072K510512J336769j186084k688491k456791k790183
7335b547499m665808n103296j517849L520326N159334K784095K59883j40721m33520
7326b685055k382513l607036j070020L441101M946119K180191o48238o2995J927588
7317B039142J451820j519055m155801n435291n961942m481571N79335O150310
7309a1333053O447942J340969k428332j004371Q31746k129515o344658m729892
7301a9349164J895806N707894L437417Q8698K19232J948689K042099J454057K229120
$$ plain form
7360 1437470 -1980744 -3370057 -3562856 -4231867 -6277158 -8964711 -11193089 -12803013 -13644553
7351 -13644553 -12428283 -8422969 -3810107 -2038452 -3540353 -5162787 -4381835 -1956266
7343 -1956266 420697 2726769 5237281 6574050 5387966 2699475 242684 -2547499
7335 -2547499 -7213307 -12316603 -13834452 -10314126 -5154792 -2370697 -2110814 -2251535 -2685055
7326 -2685055 -5067568 -8674604 -9744624 -6303523 -1357404 822787 174549 111554 2039142
7317 2039142 3490962 1971907 -2183894 -7619185 -13581127 -18062698 -17483363 -11333053
7309 -11333053 -4885111 -3544142 -5972474 -6976845 -6145099 -8274614 -14619272 -19349164
7301 -19349164 -17453358 -11745464 -8308047 -8219349 -8000117 -6051428 -4009329 -2555272 -326152
7292c26152K983865J596339k70592N42189L254747L724310K05753m289772n660672
7283A760015k816018K090725N885651O294695K876470k721845p279467p681692
7275a591466l491858J789726L486947Q38592k017586j481443Q81706J350489k30545
7266d65438j157252r91979j666768k768530j479808J962752L467232J442486n31273
7257b188578K32554J152977o32845k801193j583552J862291L338565K000520M70532
7248A851271j89821j267971k736823k920903j817077j075716n23094J685941M935950
7239b058243N742605K699057j093975k018496r4714K171277L070409K447834Q85711
7230A1751465m47739l67525P76789J162561j19585j969337l262868m359751n511845
$$ plain form
7292 -326152 2657713 4254052 3983460 4525649 7780396 11504706 11710459 7420687 1760015
7283 1760015 -1056003 1034722 6920373 13215068 16091538 13369693 6090226 -1591466
7275 -1591466 -5083324 -3293598 193349 1031941 -985645 -2467088 -1585382 -234893 -465438
7266 -465438 -1622690 -2614669 -4281437 -7049967 -8529775 -6567023 -3099791 -1657305 -2188578
7257 -2188578 -1956024 -803047 -1435892 -4237085 -5820637 -3958346 -619781 1380739 1851271
7248 1851271 1661450 393479 -2343344 -5264247 -7081324 -8157040 -8680134 -6994193 -2058243
7239 -2058243 3684362 6383419 5289444 3270948 3176234 5347511 8417920 10865754 11751465
7230 11751465 11303726 10936201 11712990 12875551 12755966 10786629 7523761 3164010 -2347835
7221b347835n368378k814989P48744K895244L314753L426600L147191O42417l873903
7212b30156o610351m634668l70910J097720j171498k840821n92272L353335M761056
7203g238565L037248Q56167j89215o23122p12508j39151K28560q19676k151239
7194g751501j347557J224516K357286P31480j184768j022975L95686J123994P72423
7185d701416j70287j369168j796616k46741K184994K749200J264992O48768J916929
7176D80655K293136L30155r79353P91150L009457K247219n8843m26794P15266
7167H402048M04005j425176k373334j994832j503621n33273J421840J911226j163405
7158C145478m417940k686895K749182N386941K965007j56712o15337N9566M17327
$$ plain form
7221 -2347835 -7716213 -10531202 -9782458 -6887214 -3572461 -145861 3001330 3643747 -230156
7212 -230156 -6840507 -11475175 -11846085 -10748365 -11919863 -14760684 -15352956 -11999621 -7238565
7203 -7238565 -4201317 -3345150 -3534365 -4157487 -4869995 -5009146 -4780586 -5600262 -7751501
7194 -7751501 -9099058 -7874542 -5517256 -4785776 -5970544 -6993519 -6597833 -5473839 -4701416
7185 -4701416 -4871703 -6240871 -8037487 -8284228 -6099234 -3350034 -2085042 -1436274 480655
7176 480655 2773791 3103946 2124593 2915743 5925200 8172419 8113576 7686782 8402048
7167 8402048 8806053 7380877 5007543 3012711 1509090 975817 2397657 4308883 3145478
7158 3145478 -1272462 -3959357 -1210175 4176766 7141773 6985061 6369724 6429290 6846617
7149F846617J669501L105966J139137l840227n514628p94556M323395L214219
7141A0149424j518262k713496J84824J596880k26624r96337J398411L057522O82797
7132A1615139l106642m197545l070962l006830m561032n361437m283979k602183
7124a8575471j174179O89608L033371M331720L884606L232009L618311L569031
7116B609006J075463k802900n007961m717312l735347k724923n46143J796636
7108a4053481P08851l968843o362574k045482M824896O908538M227788L165225
7100f595082N420182N056242j276237p579060o474589K90854M584661K937185
7092c635844l89373r61155L583j104546m346210o029134l505252J655879N534383
$$ plain form
7149 6846617 8516118 11622084 12761221 8920994 3406366 2611810 6935205 10149424
7141 10149424 8631162 5917666 6102490 7699370 7472746 6476409 7874820 10932342 11615139
7132 11615139 8508497 4310952 1239990 -1766840 -6327872 -11689309 -15973288 -18575471
7124 -18575471 -19749650 -19060042 -16026671 -11694951 -7810345 -4578336 -960025 2609006
7116 2609006 3684469 881569 -4126392 -8843704 -12579051 -15303974 -15850117 -14053481
7108 -14053481 -13344630 -17313473 -23676047 -25721529 -20896633 -13988095 -9760307 -6595082
7100 -6595082 -1174900 3881342 2605105 -4973955 -11448544 -11157690 -6573029 -3635844
7092 -3635844 -4025217 -4986372 -4982789 -6087335 -10433545 -16462679 -19967931 -18312052 -12777669
7083a2777669N959149M026037J882011K29018j355713k691126k873602j498614
7075i100509R32932L350643M252633K712886K09525k93882J388016J574552j652582
7066C374214m308276j919419K949479L806699Q6070j999219P91247L941470K376934
7057I099199k483522n835137n784332l620919j039765K38183r73164k833572j675914
7048a4908943K159505L412428m70289m736802l901934O93859L998924M676999
7040i076253M684344L995567J075191k626364l612271j538458M75276N61546j98202
7031f259624m54194P7873J570706L684156M805553M021551K702483J780579o60859
7022A1268224n906695j0528323r692561l619673K744631N600003M660365J148919
$$ plain form
7083 -12777669 -6818520 -2792483 -910472 -681454 -2037167 -4728293 -7601895 -9100509
7075 -9100509 -8167577 -4816934 -564301 2148585 2358110 2064228 3452244 5026796 3374214
7066 3374214 -934062 -2853481 95998 3902697 3988767 1989548 2780795 6722265 9099199
7057 9099199 6615677 780540 -5003792 -8624711 -9664476 -9426293 -10399457 -13233029 -14908943
7048 -14908943 -12749438 -9337010 -9807299 -14544101 -18446035 -17752176 -13753252 -9076253
7040 -9076253 -4391909 -396342 678849 -1947515 -5559786 -7098244 -6622968 -6061422 -6259624
7031 -6259624 -6713818 -6635945 -5065239 -1381083 3424470 7446021 10148504 11929083 11268224
7022 11268224 5361529 -5166794 -14859355 -18479028 -15734397 -10134394 -5474029 -4325110
7014d325110k710132l352533Q40682O425631Q475493O261345K181143k690620
7006A1105899p472269q419513l221262L066204L246028j432047l304884r51258
6998g383102j148229o259073q894737l808368L002135L635016L07191L31437L708025
6989a6509705M293227R78613q66139J068157K787353J658415N23346J435862J016966
6980c613905l725827q793897p502029m0288N933082M946963L85633o54792L050292
6971a0014768N831195L574201n04440p96949K606383M621920L091115J522678
6963I931335K878138M679008K905798k011627o140186p230544o018752l612241
6955d619071p39906Q82158l71549l050758l277917M55713M854049N541388K301858
$$ plain form
7014 -4325110 -7035242 -10387775 -9547093 -3121462 5354031 11615376 13796519 11105899
7006 11105899 3633630 -4785883 -8007145 -4940941 -1694913 -3126960 -6431844 -7383102
6998 -7383102 -8531331 -14790404 -23685141 -27493509 -24491374 -20856358 -20549167 -20217730 -16509705
6989 -16509705 -12216478 -11237865 -12104004 -11035847 -8248494 -6590079 -6066733 -4630871 -3613905
6980 -3613905 -7339732 -16133629 -23635658 -23675946 -17742864 -12795901 -12410268 -13065060 -10014768
6971 -10014768 -4183573 -609372 -1113812 -1910761 695622 5317542 8408657 9931335
6963 9931335 12809473 17488481 20394279 18382652 12242466 5011922 -1006830 -4619071
6955 -4619071 -5358977 -4476819 -4848368 -7899126 -11177043 -10721330 -5867281 -325893 1975965
6946A975965p42165k9756L435248N512718L779855j57197l378438n125936o149350
6937h79056n830769k650790K352454N370307M384238J895723J483118L215491
6929I340716M236880K651957r78766m957911p335314o334298k066933K511720
6921b931949M331011L678066L013614K638832K22212m692832q436644p388343
6913i566033k686681J448015L041740L507221L856340K773572m75521l611668
6905a713015l789472j202284J519206K479114J424566j131715l318663j811733
6897g543996M135858R114935O413468k694558q995338o723829o11811J559506
6889e345765o37733j868499M3053K360510L162476L240555K473947n08801m402792
$$ plain form
6946 1975965 1233800 1204044 4639292 10152010 13931865 13774668 10396230 5270294 -879056
6937 -879056 -6709825 -9360615 -7008161 -1637854 2746384 4642107 6125225 9340716
6929 9340716 13577596 16229553 15250787 10292876 2957562 -3376736 -5443669 -2931949
6921 -2931949 1399062 5077128 8090742 10729574 10951786 6258954 -2177690 -9566033
6913 -9566033 -12252714 -10804699 -7762959 -4255738 -399398 2374174 1898653 -1713015
6905 -1713015 -5502487 -6704771 -5185565 -2706451 -1281885 -2413600 -5732263 -7543996
6897 -7543996 -3408138 5706797 12120265 9425707 430369 -6293460 -6905271 -5345765
6889 -5345765 -5983498 -7851997 -7808944 -5448434 -2285958 954597 3428544 2919743 -1483049
6880a483049n582116l479888j550668j722004j850490j21836J867629K251665
6872a1670757J679691J092928l5720j360195q89790J259816J681010j056782l051118
6863a2350917l34158M841228O600480L015775k053839l851219r40684M482640
6855e90694Q037480N848688j502716q035628p777873j326062M715122N031861
6847D400178R30740k006135n47613K891164L872767K045691J547704M393778O262856
6838B3791130K201205n223771q196569m015350J623690K652187p50942n070075
6830G011505q038878p907290l092019L910012O626974K728481j865069j407428
6822b033712J148093l37761m565238m778418J18986L824967K581414K21355J180858
$$ plain form
6880 -1483049 -7065165 -10545053 -12095721 -13817725 -15668215 -15790051 -13922422 -11670757
6872 -11670757 -9991066 -8898138 -8933858 -10294053 -11183843 -9924027 -8243017 -9299799 -12350917
6863 -12350917 -12685075 -7843847 -1243367 1772408 -281431 -4132650 -5073334 -590694
6855 -590694 7446786 13295474 11792758 3757130 -4020743 -5346805 -631683 4400178
6847 4400178 5330918 3324783 2777170 5668334 9541101 11586792 13134496 17528274 23791130
6838 23791130 25992335 20768564 12571995 8556645 10180335 12832522 12081580 7011505
6830 7011505 -1027373 -8934663 -12026682 -8116670 -1489696 1238785 -626284 -2033712
6822 -2033712 -885619 -1223380 -5788618 -10567036 -10448050 -6623083 -4041669 -3820314 -2639456
6813b639456L782529L531807m47270n181168p766227p229682m146271k75953K459465
6804a7912226L742010M579420M782977K484063k599180o841691n733091N86704
6796a6911014O250422N415828j139864o787674o960183l995950k151791p34627
6788b7014853L212059P251639N507950r63576l344896K064779P377966N007054
6780i01878n06058k48581M413971M548568j194285m324971k49011M863562L926669
6771A0327986j567956n733825o405031n027340k651558m8027J051545K44803j9584
6762i828987K159715M893501M817285J446879k245378k781577O43422M797004
6754C901864M779662l48987n357508n019762j235203p1081k600932l731896m92401
$$ plain form
6813 -2639456 1143073 4674880 4227610 -953558 -8719785 -15949467 -20095738 -20371691 -17912226
6804 -17912226 -14170216 -9590796 -4807819 -2323756 -4922936 -11764627 -17497718 -16911014
6796 -16911014 -10660592 -5244764 -6384628 -13172302 -20132485 -24128435 -26280226 -27014853
6788 -27014853 -23802794 -16551155 -11043205 -12006781 -15351677 -13286898 -5908932 -901878
6780 -901878 -1407936 -1656517 2757454 7306022 6111737 1786766 1537755 6401317 10327986
6771 10327986 8760030 3026205 -3378826 -8406166 -11057724 -11105751 -10054206 -9809403 -9828987
6762 -9828987 -7669272 -2775771 2041514 3488393 1243015 -1538562 -895140 3901864
6754 3901864 8681526 8332539 2975031 -2044731 -3279934 -3351015 -5951947 -9683843 -10176244
6745a0176244L761544M941157L369335J328430m21905j466813o60634J639124
6737B313994L327586L953540M898116N136018J434590n258731q573351n056321
6729B175441M99447J734981r36782k611213j373381P20229J868117J795611M49523
6720D321973j323096j453048K18865N99752j962388m040433j669048L450024N945313
6711D087914L596511j121654n007961o521366n405879k914412j467750j788130
6703a6542727j815375m52522R8882j559869k514385J38731M067028N182693M138005
6694i259539M381821N365713L220770k337479p111144q537774p783729n531160
6686b7592521q85785M578100O757768M740653K295715K041932K354279J721037
$$ plain form
6745 -10176244 -6414700 -1473543 1895792 3224222 2802317 1335504 674870 2313994
6737 2313994 5641580 9595120 14493236 19629254 21063844 15805113 7231762 2175441
6729 2175441 2674888 4409869 3473087 861874 -511507 208722 2076839 3872450 4321973
6720 4321973 2998877 1545829 1764694 2364446 402058 -3638375 -5307423 -1857399 4087914
6711 4087914 7684425 6562771 1554810 -4966556 -10372435 -13286847 -14754597 -16542727
6703 -16542727 -18358102 -18810624 -18711742 -20271611 -22785996 -22647265 -18580237 -13397544 -9259539
6694 -9259539 -4877718 487995 3708765 1371286 -5739858 -14277632 -22061361 -27592521
6686 -27592521 -28478306 -23900206 -17142438 -12401785 -10106070 -8064138 -5709859 -3988822
6678c988822J530113K115832P46405l021044m314205K14576N895919N594257m55048
6669D317983n785646p299849p701614q311392n944893N72239O048446N202989
6661a8901737J77371k376166M9056L921755N474173M680354L507658L313399M270548
6652D116411M963314K800681k496661o510345m936682m13723L56304l050291l324350
6643h495342L055148R049048O836916n93810m114167j276221K691022M457356
6635A1609950N191944M234085j354330r279789j1671212n436472K962531O231548
6627B488255M388185J059958k809204p221178r534407p424250k656100J715101
6619a9993640N134173P593421P442174M655029K805533L873125M341904O88061
$$ plain form
6678 -3988822 -2458709 -342877 403528 -2617516 -6931721 -6717145 -821226 4773031 4317983
6669 4317983 -1467663 -8767512 -16469126 -24780518 -30725411 -30153172 -24104726 -18901737
6661 -18901737 -18724366 -21100532 -21051476 -17129721 -11655548 -6975194 -3467536 -154137 4116411
6652 4116411 9079725 11880406 9383745 2873400 -2063282 -2477005 -2120701 -5170992 -8495342
6643 -8495342 -5440194 3608854 10445770 9851960 5737793 4461572 7152594 11609950
6635 11609950 16801894 21035979 19681649 10401860 -1269352 -6705824 -3743293 2488255
6627 2488255 6876440 7936398 5127194 -2093984 -11628391 -19052641 -21708741 -19993640
6619 -19993640 -14859467 -7266046 176128 4831157 7636690 11509815 15851719 16539780
6611A6539780m313090n507293l182405j997737l570783m805391l019265R74026
6603h882158M490351N051334J876518k546648m095453k102975k62430n88050l08569
6594g368080K364887L887114J102701k821320l307175j494959q73356m37476K242391
6585f705273M184363O82284n951755q721831o063575k578774m86428K225322N204048
6576a8211619M887471J308378j007653k34275P62058N51931J058676K369176J966917
6567f548940L07995P93574L028817K858344M34424P63545M104039L891204k213161
6558G419841p088138m914749q9944N87768j455999o62944K615151L621311J949347
6549A981644J670206L793733M713365K355025p00143j001278J595723L854660
$$ plain form
6611 16539780 12226690 6719397 3536992 1539255 -2031528 -6836919 -9856184 -8882158
6603 -8882158 -4391807 659527 2536045 -10603 -4106056 -6209031 -6471461 -7059511 -7368080
6594 -7368080 -5003193 -1116079 -13378 -2834698 -6141873 -7636832 -8510188 -8947664 -6705273
6585 -6705273 -2520910 -1838626 -7790381 -16512212 -22575787 -25154561 -25640989 -23415667 -18211619
6576 -18211619 -13324148 -12015770 -13023423 -13257698 -12495640 -11943709 -10885033 -8515857 -6548940
6567 -6548940 -6240945 -5447371 -2418554 439790 874214 1637759 5741798 9633002 7419841
6558 7419841 331703 -4583046 -4672990 -4085222 -5541221 -6204165 -3589014 32297 1981644
6549 1981644 3651850 7445583 12158948 14513973 13813830 12812552 14408275 18262935
6541A8262935J996678m436405j0690681j0821205m713360J471831L040059J713505
6533d176643J211819J637743R86393q10953k291119k721489j826462N63022L164992
6524d262697M076953L646281L269229J519846l426765p529279m327148L709471
6516c324109N777331j623915q571281o838832j866457j467030j571876N158124
6508a4328045J3116351J0243545j926156q848983m095458L266463M943156M478524
6500F849397O934108Q554737M302008k217647m318546k376713j220640j562568
6492A4944136j006144n09188k781935n784550m468693R94946M393371J967857
6484G749800k768620m527491l134279k308856l415073l455212L65705O139174
$$ plain form
6541 18262935 20259613 15823208 5132527 -5688678 -10402038 -8930207 -5890148 -4176643
6533 -4176643 -2964824 -1327081 -340688 -1151641 -3442760 -6164249 -7990711 -7427689 -4262697
6524 -4262697 -185744 3460537 6729766 8249612 4822847 -2706432 -7033580 -3324109
6516 -3324109 2453222 829307 -7741974 -14580806 -16447263 -17914293 -19486169 -14328045
6508 -14328045 -1211694 9031851 7105695 -1743288 -5838746 -2572283 2370873 6849397
6500 6849397 13783505 22338242 26640250 24422603 20104057 17727344 16506704 14944136
6492 14944136 13937992 13428804 10646869 4862319 393626 1388572 5781943 7749800
6484 7749800 4981180 453689 -2680590 -4989446 -8404519 -11859731 -11494026 -5354852
6476e354852R045354P062287K770279r33626m248827p767341r094151n878797
6468a4399674p81168J136363m6856J095737O723109J1505754R800217L459100
6460A8492582j207034j966897k032468l654949m443340j351706M103484O768331
6452A4708003L778440j784672m156301j601660J647427J112021j930968k490208
6444I282082R92445M684338M817223J939044j375453m063456n977511o260122
6436D038590m600965k314224k46594K288878M453391K768258l251371p048988
6428c913025k275442O777635Q617799q4595r085752q213775o72534L069323L91074
6419e389292k065276j62119K887386L985561M393289M175567K28638o045073o591001
$$ plain form
6476 -5354852 3690502 10752789 13523068 12589442 8340615 573274 -8520877 -14399674
6468 -14399674 -15180842 -14044479 -14091335 -12995598 -6272489 5233265 15033482 18492582
6460 18492582 17285548 15318651 13286183 9631234 5187894 3836188 7939672 14708003
6452 14708003 18486443 16701771 12545470 10943810 12591237 13703258 11772290 9282082
6444 9282082 10274527 14958865 19776088 21715132 20339679 16276223 10298712 4038590
6436 4038590 -562375 -2876599 -3123193 -834315 3619076 6387334 3135963 -3913025
6428 -3913025 -6188467 589168 9206967 9122372 36620 -8177155 -8849689 -5780366 -5389292
6419 -5389292 -7454568 -7616687 -4729301 -743740 3649549 7825116 8053754 2008681 -4582320
6410d582320J532039Q613374M599689n709590r098842k774137L475433L306823
6402f37531J266917K171891L095262M13924l162513l808753k566426j344789J235424
6393c336594N233283O332943K623169q53915K32298K425712R05389k097162j919326
6384I545797Q6039m5477j070446R5519O67607l753921r528960q567462q21442
6375a3392746N171569M307212n6280l171450l660682j008493M338603P858335
6367C86068N122157m52467j359190K160924K255175l539777q282250o847087k362240
6358a2918687J622166O348047J0913669R239944K97609o439368l259603M219871
6350A0023648N490229L6962m449413m904291n145292p052271p686772n375284
$$ plain form
6410 -4582320 -3050281 5563093 10162782 4453192 -4645650 -7419787 -3944354 -637531
6402 -637531 629386 2801277 5896539 6310463 3147950 -660803 -3227229 -4572018 -3336594
6393 -3336594 1896689 8229632 10852801 9998886 10231184 12656896 13562285 11465123 9545797
6384 9545797 9631836 9586359 8515913 8611432 9279039 5525118 -4003842 -12571304 -13392746
6375 -13392746 -8221177 -3913965 -3970245 -7141695 -10802377 -11810870 -7472267 386068
6367 386068 5508225 5055758 3696568 5857492 8112667 4572890 -3709360 -10556447 -12918687
6358 -12918687 -11296521 -4948474 5965195 15205139 15502748 9063380 5803777 10023648
6350 10023648 15513877 15550839 11101426 6197135 1051843 -6000428 -13687200 -19062484
6342a9062484k265836j98629J093150J530056P92055P32082L491045P257577P788775
6333A157791M152586n20487l688020n213265m924160k350491Q30171J853728J067710
6324g634437J576425L717707L509108j234042o015165m268437L727323R667133
6316C045615O554346k297782o401928q29644P158553O955605j971931r787090
6308B425744q915068k053456L534980M775846L158375N91918j282919m65655K865870
6299D635635N013403L238341r7739r36945P20878J770785J068552n6466j032174
6290A4324270j903850r16222L319674P214642M558689m685395j1865255r194851
6282H51702L12236O172404L133262l415662n955891m614521m357080n223282k325403
$$ plain form
6342 -19062484 -21328320 -21526949 -20433799 -18903743 -18111688 -17379606 -13888561 -6630984 1157791
6333 1157791 5310377 4789890 1101870 -4111395 -9035555 -11386046 -10555875 -8702147 -7634437
6324 -7634437 -6058012 -2340305 1168803 -65239 -6080404 -10348841 -6621518 3045615
6316 3045615 9599961 7302179 900251 70607 7229160 14184765 12212834 2425744
6308 2425744 -6489324 -8542780 -5007800 -231954 2926421 3518339 2235420 1769765 4635635
6299 4635635 9649038 12887379 12789640 11852695 12573573 14344358 15412910 15356444 14324270
6290 14324270 12420420 11504198 14823872 22038514 26597203 21911808 10046553 851702
6282 851702 1163938 7336342 10469604 7053942 1098051 -3516470 -7873550 -13096832 -15422235
6273a5422235L819618M981947k250986q708752m901411M289653O864430K246292
6265i081444Q68160N848626Q060242K414834l595908l530176k554866o061922
6257g632454p984514j229713Q066818Q856339K562870l37810J885289P12376o524691
6248a625490j1149466o411740L209187R323321R075362M623489n43585k555313
6240C945765p5639K154820j711907r125228j0960829m268842L641917O124282
6232a0275661N121049M623246L106850j827912o133147l364676N533684J1702524
6224H485957P939492l754088j4153081j5195581p166406J839258M434161J425779
6216a6144509q70524O11790L225555M382184N155259O884457Q105460O900747
$$ plain form
6273 -15422235 -11602617 -6620670 -8871656 -17580408 -22481819 -18192166 -11327736 -9081444
6265 -9081444 -8213284 -2364658 5695584 8110418 4514510 984334 -1570532 -7632454
6257 -7632454 -15616968 -16846681 -8779863 76476 2639346 2301536 4186825 4899201 -1625490
6248 -1625490 -12774956 -19186696 -15977509 -6654188 2421174 7044663 6501078 3945765
6240 3945765 3870126 6024946 4313039 -4812189 -15773018 -20041860 -16399943 -10275661
6232 -10275661 -5154612 -531366 2575484 747572 -5385575 -8750251 -3216567 8485957
6224 8485957 16425449 12671361 -1481720 -16677301 -23843707 -22004449 -17570288 -16144509
6216 -16144509 -17015033 -16403243 -13177688 -8795504 -3640245 3244212 11349672 18250419
6208A8250419L649289q6894l152913m352527k912120l35970O02393m22469q78316
6199A0360892N77946J944005P61623k456959m451239k291415L144684O473742
6191A4063279L059183l916834n687021Q9981M768909J268901m301427j725454
6183G619517O591890Q472948M02238p966741r162956p022920o867819o378235
6175a4312078j947964L490400N220495L847842K383101R65529r43474j598756
6167b894905k97256O38662M74993J655643L709538J769103m647613p859881k621178
6158a0072894N168004O609730K028171j311862M0890L279207M629005K005409
6150A2375660m409540r909788p809837J178976P161422L944327j959633j700238
$$ plain form
6208 18250419 21899708 21812814 18659901 14307374 11395254 11059284 11661677 11239208 10360892
6199 10360892 10938838 12882843 13644466 11187507 6736268 4444853 7589537 14063279
6191 14063279 17122462 13205628 7518607 7608588 12377497 13646398 9344971 7619517
6183 7619517 14211407 22684355 23086593 15119852 5956896 -1066024 -7933843 -14312078
6175 -14312078 -16260042 -12769642 -7549147 -3701305 -1318204 -352675 -1296149 -2894905
6167 -2894905 -3192161 -2553499 -2078506 -422863 3286675 5055778 408165 -7451716 -10072894
6158 -10072894 -4904890 1704840 3733011 2421149 2462039 5741246 10370251 12375660
6150 12375660 7966120 -1943668 -9753505 -8574529 -1413107 2531220 571587 -1128651
6142a128651K520067K790574q68600k107019k00417r6730k126654j780090N77497
6133b420023m37674m791202n689985p12257L938143L076572n89878k242600j567792
6124a1436696m19404J182397L478472M740000K975660j936663p910096j0610319
6116a9936649o075850L045892P247449J710900n420398l767509L603467M989438
6108a4603260j423823n670754l267630j591732n191316o963644q02551P171554
6100c2343156Q419086N002575L948887N077867L842407J473455K534486N222601
6092C178208L550964j846275l670803Q73710O136618O524332L084786n4460j195652
6083A6581428j158640j023413j232873j207485J79162K291876K283319q35453
$$ plain form
6142 -1128651 1391416 4181990 3313390 1206371 1005954 909224 -1217430 -2997520 -2420023
6133 -2420023 -2857697 -7648899 -13338884 -14051141 -10112998 -7036426 -7626304 -9868904 -11436696
6124 -11436696 -11856100 -10673703 -7195231 -2455231 520429 -1416234 -9326330 -19936649
6116 -19936649 -26012499 -22966607 -15719158 -14008258 -19428656 -23196165 -19592698 -14603260
6108 -14603260 -16027083 -21697837 -24965467 -26557199 -31748515 -38712159 -39514710 -32343156
6100 -32343156 -23924070 -18921495 -14972608 -9894741 -6052334 -4578879 -2044393 3178208
6092 3178208 6729172 4882897 1212094 2085804 8222422 14746754 17831540 17777080 16581428
6083 16581428 15422788 14399375 13166502 11959017 12138179 14430055 16713374 15877921
6075A5877921l615363k767472m00862p40799l193029l431867q00009M98667j674989
6066b47802m015523l219713r76006p13935j871163p15914L732424P461631O345099
6057E779098J954646L29440M247836Q852518P558471J073800l473771k589976
6049B3732062p48415k676094o174038o529116m215925l153729l818345l467754
6041g051354j715046m37377J038026M966587R355252Q895045K921346k854370
6033A5118109m389604m093325n124364n753076l013261J829521N484239P394623
6025G452862Q215647O105254o10519q440017j1394095q550437m528359k187306
6017a3936970L85251M337732O520882M646032K020789K719071M618461K513640
$$ plain form
6075 15877921 12262558 9495086 9094224 8353425 5160396 1728529 928520 1427187 -247802
6066 -247802 -4263325 -7483038 -8459044 -9172979 -11044142 -11760056 -8027632 -566001 5779098
6057 5779098 7733744 8063184 12311020 21163538 28722009 29795809 26322038 23732062
6049 23732062 22983647 20307553 14133515 7604399 3388474 234745 -3583600 -7051354
6041 -7051354 -8766400 -9203777 -8165751 -3199164 6156088 15051133 17972479 15118109
6033 15118109 10728505 6635180 1510816 -4242260 -7255521 -5426000 58239 7452862
6025 7452862 15668509 21773763 21163244 12723227 1329132 -7221305 -11749664 -13936970
6017 -13936970 -13551719 -9213987 -2693105 1952927 3973716 6692787 11311248 13824888
6009A3824888k969625n584729l373402k044597n224520p143472j138570Q209953
6001e444074R520025Q68609o634792m312484K366146L039756j977123l103741
5993e677678L618666J1036503J1322241N328471j173424n381989p746269q067070
5985C259451n925723l268302k462481k498305o50612K498028L383052J188957
5977d475935l76494J525554M736993N524438L813054K347902K144921J737029
5969A6977462L54874j041624k078519l722305o037989p406560o915656n571443
5961a5441760m060285j276154L378014P831740R278053P198098L080580j483236
5953H505050m829136n093235k538389p44581k508579n219710l655870K416087
$$ plain form
6009 13824888 10855263 5270534 1897132 -147465 -5371985 -12515457 -13654027 -5444074
6001 -5444074 4075951 4944560 -1690232 -6002716 -3636570 -596814 -2573937 -5677678
5993 -5677678 -2059012 8977491 20299732 25628203 24454779 19072790 11326521 3259451
5985 3259451 -2666272 -5934574 -8397055 -10895360 -11545972 -9047944 -5664892 -4475935
5977 -4475935 -4852429 -3326875 1410118 6934556 10747610 13095512 15240433 16977462
5969 16977462 17332336 16290712 14212193 10489888 4451899 -2954661 -9870317 -15441760
5961 -15441760 -19502045 -20778199 -17400185 -9568445 -290392 6907706 9988286 8505050
5953 8505050 3675914 -1417321 -3955710 -4700291 -7208870 -12428580 -16084450 -13668363
5945a3668363O808077M379897k629159p466185o300415j030260M158025P023577
5937h724806P929097P491306M893347l98156n636394o052085p90121M562374M280539
5928G555101m7154j853096J371501N374438N640993K549186r47354l137979l722840
5919A2782796l310930l793724o074355p013023k876065L556338M974264M92004
5911a262695j994447J773587M579631j161286j0191581j1162141l484238K200155
5903b0703015n8612m392959l629622J294596N664009P855581P782613M128731
5895b058678k096049n449118k358157L326268N260497K617932p23218k521950
5887d002473l276539k738934j43237K483427J548352k897430o342481n115623
$$ plain form
5945 -13668363 -6860286 -2480389 -5109548 -12575733 -18876148 -19906408 -15748383 -8724806
5937 -8724806 -795709 6695597 11588944 11190788 5554394 -497691 -1287812 3274562 7555101
5928 7555101 7507947 5654851 7026352 12400790 18041783 20590969 19643615 16505636 12782796
5919 12782796 9471866 5678142 -396213 -7409236 -10285301 -6728963 -1754699 -1262695
5911 -1262695 -3257142 -1483555 3096076 1934790 -8256791 -19418932 -22903170 -20703015
5903 -20703015 -20761627 -25154586 -28784208 -27489612 -21825603 -13970022 -6187409 -2058678
5895 -2058678 -4154727 -9603845 -11962002 -8635734 -3375237 -757305 -1480523 -4002473
5887 -4002473 -7279012 -10017946 -10161183 -7677756 -6129404 -9026834 -15369315 -20484938
5879b0484938l27980M094098N578105M565814L128721K180490j36495o024261
5871g426446j3208156j4912656p278998M649992J1481893R441196L012975j649594
5863a5889794k557635j170518N36833J256232J219218K557464O297872Q933064
5855A182736N533159k935309r320679q931255m575748q52798K179229O000451
5847a1720214Q288997N810084M19554l041251l593579l837281l765545m89059
5839a1928294N547762R417058Q080148L563629j211677n245855p015870m346186
5831c139285J087368L780854J548734j555006j944846j536148k978942m518721
5823i255992l499885q51683J857109N542482R543539R242391L072014k733709
$$ plain form
5879 -20484938 -20812918 -16718820 -11140715 -6574901 -3446180 -1265690 -1402185 -7426446
5871 -7426446 -20634602 -35547258 -42826256 -38176264 -26694371 -17253175 -14240200 -15889794
5863 -15889794 -18447429 -19617947 -19081114 -17824882 -16605664 -14048200 -7750328 1182736
5855 1182736 6715895 3780586 -5540093 -14471348 -19047096 -19899894 -17720665 -11720214
5847 -11720214 -3431217 2378867 2798421 -242830 -3836409 -7673690 -11439235 -11928294
5839 -11928294 -6380532 3036526 11116674 14680303 13468626 8222771 1206901 -3139285
5831 -3139285 -2051917 1728937 3277671 1722665 -222181 -1758329 -4737271 -9255992
5823 -9255992 -12755877 -13607560 -11750451 -6207969 3335570 12577961 15649975 12916266
5815A2916266k542912Q0793p64696k648912P3360M462149L156068j820405j363939
5806A1547772M739513O760407J949169m62924M186692P042007Q72829o747919
5798B9887546n292837J836070L138054l405744q997049p556933j696548L324859
5790A1237418M340904L61706n922967q308392l992743J935517L613003K338771
5782E603217J978490J088279l097980o834567m521329J444772M004946K698818
5774B364646K985161N621422N497822P95218m705049q193322r202332n517931
5766a0354365L806363J2166836J1310565L374436k144792k956722m991952q795523
5758A414846p329335Q1577M128565N42870k954861o06195J844809j007995l534668
$$ plain form
5815 12916266 10373354 10454147 9689451 7040539 7113899 11576048 14732116 12911711 11547772
5806 11547772 16287285 23047692 24996861 24533937 28720629 35762636 36635465 29887546
5798 29887546 24594709 26430779 29568833 26163089 17166040 9609107 7912559 11237418
5790 11237418 15578322 15940028 10017061 1708669 -2284074 -348557 3264446 5603217
5782 5603217 7581707 8669986 5572006 -1262561 -5783890 -4339118 -334172 2364646
5774 2364646 5349807 10971229 16469051 17264269 12559220 4365898 -4836434 -10354365
5766 -10354365 -6548002 5618834 16929399 20303835 18159043 15202321 10210369 1414846
5758 1414846 -5914489 -5832912 -1704347 -1161477 -4116338 -4722533 -2877724 -3885719 -7420387
5749g420387N85217O403984O275081K930549L327508N460390K506574m051597
5741A6017319o480328l511657q87670p19543K75255K625599K828332J54513k651613
5732G650207n033569q003434q772598l482085M953854Q902428O050172R44266
5724C209241l012855o175871p632952n126647o08541J248096Q46520K855314O788033
5715g609662O263455k97810o022388n845184l179270k153631n8561O392573J2240219
5706b70259R235391j635262q927207l957232P881037J2160643K441057j0267234
5698F660934r445390N321440J5599848P625879q414940j1903174j26529R470602
5690A4788670N201893m344121o330019j978745k78761k226289j885369J585396
$$ plain form
5749 -7420387 -6835170 -431186 5843895 8774444 12101952 17562342 20068916 16017319
5741 16017319 9536991 6025334 5137664 4418121 4693376 7318975 10147307 10301820 7650207
5732 7650207 2616638 -5386796 -14159394 -17641479 -12687625 -3785197 2264975 3209241
5724 3209241 196386 -5979485 -13612437 -18739084 -19347625 -18099529 -17253009 -14397695 -7609662
5715 -7609662 -1346207 -1644017 -7666405 -13511589 -16690859 -18844490 -18903051 -12510478 -270259
5706 -270259 8965132 7329870 -1597337 -5554569 2326468 14487111 16928168 6660934
5698 6660934 -2784456 2536984 18136832 25762711 17347771 5444597 5318068 14788670
5690 14788670 19990563 15646442 9316423 7337678 7058917 4832628 2947259 4532655
5682D532655L130232J324474L6479M48526j356223p182074j2350409j1092072
5674b2508412l656704L890448O130021L725232K043296M049589O325940M678173
5666D677583J488460K036207M413176R08672q749768j4128256q776457k71308
5658a8401691J353148j578273k7801O246503R094034N497824N27231k611426n580060
5649e480511p250143l045684N255835Q202417J733101n940575n872484m73836
5641a2871880K108038N87151J67138K382201K857108q03276m882071m836436q05298
5632a6097325L738796O090764N534679K480805j755545m987525n333863k668569
5624a2997783J321621M537129N850976N225758L045781J56297j672105r85556
$$ plain form
5682 4532655 7662887 8987361 9023840 9472366 8116143 934069 -11416340 -22508412
5674 -22508412 -26165116 -22274668 -16144647 -12419415 -10376119 -6326530 -590 4677583
5666 4677583 6166043 8202250 12615426 13524098 4774330 -9353926 -18130383 -18401691
5658 -18401691 -17048543 -18626816 -18654617 -12408114 -3314080 2183744 2710975 99549 -5480511
5649 -5480511 -12730654 -15776338 -10520503 -2318086 -584985 -6525560 -12398044 -12871880
5641 -12871880 -10763842 -10176691 -10009553 -7627352 -4770244 -5573520 -10455591 -15292027 -16097325
5632 -16097325 -12358529 -6267765 -733086 1747719 -7826 -4995351 -10329214 -12997783
5624 -12997783 -11676162 -7139033 -1288057 3937701 6983482 7139779 5467674 4482118
5616D482118Q84805L88476l595581p273035o308430j305018L725928O844457Q381448
5607F225168O829576K243q741879j1135618m207605M416636N748173Q93284j841453
5598a811475N03126K034748k143287q144446q686759l043746K516167L315214
5590a5460458J368640P65771R63227k065533q389260j1426765n335669O341775
5582c3238272J3056465R298631J384629l10463N763937J0748304O931326k543134
5574A1091423p816883m240778L003884O071085L199652j142828k786217k133287
5566E246051k327118m906360p631447o357902K454O144548M646166m380906j1050369
5557b0614883p385282J294176L224680k462565m074484M427369J2952305R844282
$$ plain form
5616 4482118 5366923 5755399 2159818 -5113217 -11421647 -12726665 -9000737 -2156280 6225168
5607 6225168 13054744 13056987 4315108 -6820510 -11028115 -6611479 -863306 29978 -1811475
5598 -1811475 -1308349 726399 -1416888 -9561334 -18248093 -21291839 -18775672 -15460458
5590 -15460458 -14091818 -13326047 -12362820 -14428353 -22817613 -34244378 -39580047 -33238272
5582 -33238272 -20181807 -10883176 -9498547 -9809010 -4045073 6703231 13634557 11091423
5574 11091423 3274540 -966238 2037646 8108731 11308383 10165555 7379338 5246051
5566 5246051 2918933 -1987427 -9618874 -15976776 -15974322 -9829774 -5183608 -9564514 -20614883
5557 -20614883 -28000165 -26705989 -23481309 -25943874 -30018358 -25590989 -12638684 -2794402
5549b794402m58091m034283K343866Q275192N881720j339332o807881q472221
5541g405432n788824J769896R421743Q840263L08328m650016J080963R145545
5533A2722466P877898p74752n860074m621637m380256q441263j0538400n239486
5525a9255504M166812J1005786J2425281Q914024K070889m504852o632365m408411
5517C781660k072012j535582k44509K982595M890830L192479N01043m29782j337942
5508I728780m418255p115174n582425j100417J708098J988597L382136P387161
5500E978501R885006O061180k900481r615287p369183K447903J0347578Q105829
5492B2941046j658636p911016m222213L839005O581780K220532k854215l755077
$$ plain form
5549 -2794402 -3252493 -7286776 -4942910 3332282 9214002 7874670 1066789 -7405432
5541 -7405432 -13194256 -11424360 -2002617 6837646 7145974 2495958 3576921 12722466
5533 12722466 20600364 19825612 13965538 9343901 4963645 -3477618 -14016018 -19255504
5525 -19255504 -15088692 -4082906 8342375 17256399 19327288 14822436 8190071 3781660
5517 3781660 1709648 174066 -70443 2912152 7802982 10995461 11496504 11066722 9728780
5508 9728780 5310525 -1804649 -7387074 -8487491 -6779393 -4790796 -1408660 5978501
5500 5978501 15863507 21924687 19024206 9408919 2039736 4487639 14835217 22941046
5492 22941046 21282410 13371394 9149181 12988186 19569966 21790498 18936283 15181206
5484A5181206k132829j575701k514231l403889l856863m132779l000438J401257
5476d034267Q244795J2900689J0603018J905279o493123q247069m588038k567097
5468G724187n449867q126561m321488M573016J1306895J1341067N783882k341203
5460B0489928r759546j1821373n932688K681983M655196j222261m899416J268148
5452d540029J0573665J0293979o82243j0348191r859471l622007l39917r15560
5444i439774q09174L32364j083857m214200l182945L681610J0128609J0309142
5436E721775N836217J074680l729548r332202j1383482m908093O030052J0766036
5428G5435N784038o03619m28582L131929K161628l336669n940070k311933K347285
$$ plain form
5484 15181206 13048377 11472676 8958445 5554556 1697693 -2435086 -5435524 -4034267
5476 -4034267 4210528 17111217 27714235 29619514 23126391 14879322 10291284 7724187
5468 7724187 2274320 -5852241 -10173729 -5600713 5706182 17047249 22831131 20489928
5460 20489928 10730382 -1090991 -7023679 -4341696 313500 -908761 -5808177 -4540029
5452 -4540029 6033636 16327615 15645372 5297181 -4562290 -8184297 -8524214 -9439774
5444 -9439774 -10248948 -9916584 -11000441 -15214641 -18397586 -14715976 -4587367 5721775
5436 5721775 11557992 12632672 8903124 -429078 -11812560 -16720653 -10690601 75435
5428 75435 5859473 5255854 4827272 7959201 10120829 6784160 844090 -1467843 879442
5419H79442K202875j846545m714289l788438r00092N27015j299828n037022o955638
5410b0932520m125891K472637Q562179J0324144P088780J201263l354212l041128
5402a804748K236896Q125363R715979O700519K913624P55157j465869n657065
5394B1519856r758977r736516n086699k49198K58296k811931m248042q62784M126658
5385f849337M879738N91687l173082j580695L562712O733492N424825J704825
5377A1294165j325434k114147q33682O10071l79178l936567o709345n948036l054000
5368a2396153q62875M26115J699493J861000K95924j9720L093520N551177K108246
5359A756727m193202m838957J535700O746752N006358k0840k932644m042041m720634
$$ plain form
5419 879442 3082317 1235772 -3478517 -7266955 -8167047 -7640032 -8939860 -13976882 -20932520
5410 -20932520 -25058411 -22585774 -14023595 -3699451 3389329 4590592 1236380 -1804748
5402 -1804748 432148 8557511 18273490 24974009 27887633 28642790 27176921 21519856
5394 21519856 11760879 2024363 -3062336 -3311534 -3053238 -5865169 -10113211 -10975995 -6849337
5385 -6849337 -1969599 -1377912 -4550994 -6131689 -2568977 4164515 9589340 11294165
5377 11294165 9968731 7854584 7020902 7630973 7251795 3315228 -3394117 -9342153 -12396153
5368 -12396153 -13259028 -12832913 -11133420 -9272420 -8976496 -8996216 -5902696 -351519 1756727
5359 1756727 -2436475 -7275432 -5739732 1007020 6013378 5992538 3059894 -982147 -5702781
5350e702781k141369M937475J0069175O090369m251367j1127976r966398n348133
5342a7441005k904838k398644p0269N217608R769172Q609070J540313n061616
5334b740209n031826n45233O88592l505575p227032o312182l649031j692874K373247
5325b7642123Q688697R932866K353533n227857k982519M794063O848640K939326
5317b95374K264620O243280O449167L30151m336409l539097k982853n440679m299253
5308e606447L587278R440139N470860k492240m512692j568267j261104m032373
5300i74846m130642j110271k21289k460335l151629n64792J593121R90990k43027
5291a0272720K5043J498124L613959N513750M475977n58140m756164k574995L112529
$$ plain form
5350 -5702781 -7844150 -2906675 7162500 13252869 9001502 -2126474 -12092872 -17441005
5342 -17441005 -20345843 -22744487 -22814756 -17597148 -7827976 781094 2321407 -2740209
5334 -2740209 -7772035 -8317268 -7628676 -11134251 -18361283 -24673465 -28322496 -30015370 -27642123
5325 -27642123 -18953426 -9020560 -6667027 -11894884 -14877403 -10083340 -3234700 -295374
5317 -295374 1969246 8212526 14661693 14991844 10655435 7116338 4133485 -1307194 -5606447
5308 -5606447 -2019169 7420970 12891830 10399590 5886898 4318631 3057527 -974846
5300 -974846 -5105488 -6215759 -6437048 -8897383 -12049012 -12613804 -11020683 -10029693 -10272720
5291 -10272720 -10247677 -8749553 -5135594 378156 4854133 4295993 -460171 -3035166 77363
5282G7363L539377l421648r666367q017492j370195K479742Q55183k374694k492193
5273b0390924J766517P480437R161347L300229o950629j3600695j1652041l311193
5265c4196952N877961J1904842J2542081P175286o92220m179022k15960N831484
5257D047500O349299R88887l803011m137603l118506m636575o671097m366116
5249a5347222J698595M646190L10502n922960n003353L664479J0311773O928882
5241A286886k264555o213893q77638O921784R143139N280489K13621k489311k450824
5232H549698m51179K412370M687424N692187N751873M300490k22682o859695j0758485
5223A3102001q175238j764241J817627p95843o721452j0433507q400362j151052
$$ plain form
5282 77363 3616740 195092 -9471275 -17488767 -18858962 -16379220 -15524037 -17898731 -20390924
5273 -20390924 -18624407 -11143970 -1982623 1317606 -5633023 -19233718 -30885759 -34196952
5265 -34196952 -28318991 -16414149 -3872068 3303218 2610998 -1568024 -1783984 4047500
5257 4047500 10396799 11385686 7582675 3445072 326566 -4310009 -10981106 -15347222
5249 -15347222 -13648627 -9002437 -8691935 -14614895 -19618248 -15953769 -5641996 1286886
5241 1286886 -977669 -7191562 -8069200 -1147416 7995723 13276212 13489833 11000522 8549698
5232 8549698 8098519 10510889 15198313 20890500 26642373 30942863 30720181 23860486 13102001
5223 13102001 4926763 3162522 4980149 4184306 -2537146 -12970653 -21371015 -22522067
5215b2522067O840049J0013699O947930K162535M17477N76517j336940m363915
5207a264715l454919J405129L377456p88038m377608k71936P351300Q024159m0734
5198I960094p457908o679788n83530M075823N441591M991360K467021k275011
5190I939652n516552l384926J991110M846988L690233K337400L075562L326681
5182B0306148L37606m468006p635649p587207m762915j49672M382663N937547
5174F360515L090097j811792m395450k596213J362735L534864K529982O62533
5166H737271L77926M63080k207453p165264r423340n568097J507887N893579M817344
5157b567067j2931m593084m263934L137895J2486126J3713373L849953o903077
$$ plain form
5215 -22522067 -15682018 -5668319 1279611 3442146 3859623 4436140 3099200 -1264715
5207 -1264715 -4719634 -3314505 62951 -725087 -5102695 -5374631 1976669 10000828 9960094
5198 9960094 2502186 -4177602 -4761132 -685309 4756282 9747642 12214663 9939652
5190 9939652 4423100 1038174 3029284 7876272 11566505 13903905 16979467 20306148
5182 20306148 20643754 16175748 8540099 952892 -3810023 -3959695 422968 6360515
5174 6360515 9450612 7638820 3243370 647157 2009892 5544756 8074738 8737271
5166 8737271 9115197 9578277 7370824 205560 -9217780 -14785877 -13277990 -7384411 -2567067
5157 -2567067 -2579998 -7173082 -11437016 -8299121 4187005 17900378 21750331 14847254
5149A4847254p371567m59232J957110l036534o617987l776660o74132k661942
5141g793690m795644p45796O187896Q198840M087304j225916m227142m125221
5133d439369p02996L490548K880446l387420p677996m201622J309343r7052o402468
5124a9228586p748968j681802M188410M597345K743349K625613L160422K371130
5116h973087J208003Q90781J406933L799529Q762329J2358309R191154R91353
5108B9635304m244493l327078j599756l320435n148934k992151P81654J980956
5100A1765067J819459L983300P194709N826483k670395j3864820j9624748j4898490
5092b0469435l232418M725130J864258o254470p737751j40733O606928M944062
$$ plain form
5149 14847254 7475687 7016455 8973565 5937031 -680956 -4457616 -5131748 -7793690
5141 -7793690 -12589334 -13335130 -7147234 1051606 5138910 3912994 -314148 -4439369
5133 -4439369 -5142365 -1651817 1228629 -2158791 -9836787 -14038409 -12729066 -12826118 -19228586
5124 -19228586 -26977554 -28659356 -24470946 -19873601 -17130252 -14504639 -11344217 -8973087
5116 -8973087 -7765084 -6874303 -5467370 -1667841 7094488 19452797 28643951 29635304
5108 29635304 25390811 22063733 20463977 17143542 11994608 9002457 9784111 11765067
5100 11765067 13584526 17567826 24762535 30589018 27918623 14053803 -5570945 -20469435
5092 -20469435 -23701853 -18976723 -17112465 -23366935 -31104686 -31245419 -24638491 -19694429
5084a9694429k58392r65013J618991Q88136l607576o249529m734635k266659j207443
5075c6476549n88659L37344J279813L314318P150078R413220O051303k77743j825315
5066a1622190L755665R638177R063145M083388J537810L157990L950788j06346
5058B3458427o265870q271439l960532K112358L972760R50765k347866k303184
5050G345419j11781J314536J436381Q89504j384353o262255j0695640r694543
5042a7162732k578210N668040R969073R496403N857878K96645n265769p152909
5034h71581l321240K946537N637215K500167l065530o593262o724990m461777
5026a3954461r79458K309789L744610L498671L903595N563165N262497Q39863
$$ plain form
5084 -19694429 -19952821 -20917834 -19298843 -18410707 -22018283 -28267812 -33002447 -35269106 -36476549
5075 -36476549 -37065208 -36727864 -35448051 -32133733 -24983655 -15570435 -9519132 -9796875 -11622190
5066 -11622190 -7866525 1771652 10834797 14918185 16455995 19613985 23564773 23458427
5058 23458427 17192557 8921118 4960586 7072944 11045704 11996469 9648603 7345419
5050 7345419 7233638 8548174 9984555 10874059 9489706 3227451 -7468189 -17162732
5042 -17162732 -19740942 -14072902 -4103829 5392574 11250452 11547097 6281328 -871581
5034 -871581 -4192821 -1246284 4390931 6891098 3825568 -2767694 -9492684 -13954461
5026 -13954461 -14933919 -12624130 -8879520 -5380849 -1477254 4085911 9348408 10188271
5018A0188271l926803l747890J32318J783213J18649r3606K083572Q68109n635611
5009A770222r578349m660719K802718K510146m090092o001801R26034Q820990
5001g500851R319737K450541o820351j3614540j3625115n875586L101804M497115
4993b8067246j315341m811471n73284O311483R359745Q845891P345304M240134
4985A335215n31934l208141j861105m13086k064083l324840J58009N718768O971243
4976B780046K297978m289054q271621p236348j478600M778947O217707L480901
4968a720044L254848Q063452J1131223O220251k172500m650266J53991M755402
4960B5036357L431986j778139n411462m971399k602141k061022l808179l743727
$$ plain form
5018 10188271 6261468 2513578 2645896 4429109 4547758 4454152 6537724 7405833 1770222
5009 1770222 -7808127 -12468846 -9666128 -7155982 -11246074 -17247875 -16321841 -7500851
5001 -7500851 1818886 4269427 -2550924 -16165464 -29790579 -35666165 -32564361 -28067246
4993 -28067246 -29382587 -34194058 -34767342 -28455859 -19096114 -10250223 -2904919 1335215
4985 1335215 803281 -2404860 -4265965 -4679051 -6743134 -10067974 -9909965 -4191197 2780046
4976 2780046 5078024 788970 -7482651 -14718999 -16197599 -11418652 -5200945 -1720044
4968 -1720044 1534804 9598256 20729479 26949730 24777230 20126964 20280955 25036357
4960 25036357 28468343 26690204 21278742 16307343 13705202 11644180 7836001 4092274
4952D092274P50166N241580L955276l89749l14160L023038M38547q880965j3158567
4943e242560n858429L290148L247178k081540k372246K446285M964677L670586
4935B064099K780248L154584K942406K960944K872749k368702j2930494j7414696
4927a5938862o999267R212642J5035461Q898333K430706J492574J759819L60246
4919A6251652j248748m161139r379799j0501930j767032Q899637Q486953j148114
4911E431480o005221j545244L015223J854187p72135j899621l698487m661763
4903h281581n31321N041111M136027j094302j728855J246410o02857m991881j207820
4894h015069R106705J2618716P208216M289665O318863L498033m042306l942312
$$ plain form
4952 4092274 4842440 10084020 14039296 13649547 13335387 16358425 16796972 7916007 -5242560
4943 -5242560 -11100989 -7810841 -4563663 -6645203 -9017449 -6571164 -1606487 2064099
4935 2064099 4844347 7998931 10941337 13902281 16775030 14406328 1475834 -15938862
4927 -15938862 -22938129 -13725487 1309974 10208307 12639013 14131587 15891406 16251652
4919 16251652 15002904 10841765 1461966 -9039964 -10806996 -1907359 6579594 5431480
4911 5431480 -573741 -2118985 896238 2750425 1978290 78669 -3619818 -8281581
4903 -8281581 -8812902 -3771791 364236 -730066 -2458921 -1212511 -1815368 -6807249 -8015069
4894 -8015069 1091636 13710352 20918568 25208233 31527096 35025129 30982823 27040511
4886B7040511L917716M946881k536721l343314M204290L022959q594945j0097298
4878A8560079J733513K840958j1395366j2048722L964751j1630966p9092845j28220051
4870b15288649p9891817L3515684R9985701P4305166K2297017J0594212K3299652
4863c1183034J6886299l023665n143860P621555R590739M67057o8580P738479
4855B884990N897951o707509j3124212q022883k401855q55638K939674Q911829
4847a0477653Q846717K325963k312615k970282n101558q656102p503270j645884
4839b7494684K365249K859522L874780N712453N262270M210492O482784R135980
4831A2408846O005380j340208o194404p779008r251953p700228J506704J1954001
$$ plain form
4886 27040511 30958227 35905108 33368387 30025073 34229363 37252322 28657377 18560079
4878 18560079 20293592 23134550 11739184 -309538 3655213 -7975753 -87068598 -215288649
4870 -215288649 -295180466 -261664782 -161679081 -87373915 -65076898 -54482686 -31183034
4863 -31183034 -14296735 -17320400 -22464260 -14842705 -5251966 -4784909 -4853489 2884990
4855 2884990 8782941 2075432 -11048780 -19071663 -21473518 -22329156 -19389482 -10477653
4847 -10477653 -1630936 695027 -1617588 -4587870 -9689428 -18345530 -25848800 -27494684
4839 -27494684 -25129435 -22269913 -18395133 -12682680 -7420410 -3209918 3272866 12408846
4831 12408846 18414226 17074018 10879614 3100606 -6151347 -13851575 -12344871 -390870
4823c90870J1108281j152483j1224973j0732111n145663j354698J245697L343080
4815a4303740J144731m621528n052637M133686J3744231J2690727K771010n340178
4807E166302o391900l685518j109982O72119J194748m79508k972799l378873j359181
4798a2344592N31257P08671R5055k90656o42696o02611J530429O217211J0389610
4789E591678R731876L802851k404376l556987l40825J255165k274639o984051
4781D820692o273424O12492P416938Q026074K551337m074904p421973o299123
4773f41891j801270M131127Q937509R905174O081106k17374m969788o056888m619431
4764A0748274k842270j907404k446582m591242o207825l826662K175678N978159
$$ plain form
4823 -390870 10717411 9564928 -1660045 -12392156 -17537819 -18892517 -17646820 -14303740
4815 -14303740 -13159009 -17780537 -22833174 -18699488 -4955257 7735470 10506480 5166302
4807 5166302 -1225598 -4911116 -6021098 -5348979 -4154231 -4633739 -7606538 -10985411 -12344592
4798 -12344592 -11813335 -11104664 -11009609 -11300265 -11942961 -12545572 -11015143 -4797932 5591678
4789 5591678 15323554 19126405 16722029 13165042 12824217 14079382 11804743 4820692
4781 4820692 -1452732 -840240 6576698 14602772 17154109 13079205 5657232 -641891
4773 -641891 -2443161 1687966 10625475 20530649 26611755 26394381 21424593 15367705 10748274
4764 10748274 7906004 5998600 3552018 -1039224 -7247049 -11073711 -8898033 -2919874
4756b919874L442631j477343j977682J764450L622943J576270J41824J762421
4748E935640K311108j884316p701149r543264o414752j550211K128009L644853
4740a3074082L665747M432590P363957R672449O895889k44375n904099p243071
4732E565005p182757p190017l839613L468155P641074K905389n536889p462677
4724a1632330r13671O435661P915424M532369J332542J405865L865105N113359
4716A8054324K205862l528509p266570o163670k232591R43026J619836n01595
4708C130113m142610n022518M87802Q703886J1236810O428137J665806J244546
4700B3731972k22129o855285j1902364p436489K031117N147203k45093n692817
$$ plain form
4756 -2919874 522757 -954586 -2932268 -1167818 2455125 4031395 4173219 5935640
4748 5935640 8246748 6362432 -1338717 -10881981 -17296733 -18846944 -16718935 -13074082
4740 -13074082 -9408335 -4975745 2388212 12060661 18956550 18712175 12808076 5565005
4732 5565005 -1617752 -8807769 -12647382 -9179227 -1538153 1367236 -4169653 -11632330
4724 -11632330 -12546001 -6110340 1805084 6337453 7669995 9075860 12940965 18054324
4716 18054324 20260186 16731677 9465107 3301437 1068846 2011872 3631708 3130113
4708 3130113 -1012497 -6035015 -5547213 3156673 14393483 20821620 22487426 23731972
4700 23731972 23509843 16654558 4752194 -2684295 -653178 4494025 4248932 -1443885
4692a443885n116986r31973K260942K831600Q17811k711012m950802m335614k918991
4683a6498910k069645Q38475O488388Q872808L550586l329453k722639L577484
4675a292906O095554K393857j364196k506525m744601q248844p555925k004422
4667a9228008J460132l73698j557760K528910O972822N198681q26745m047765
4659i873431k116916J216759K113753L62296j464272n77804L002910N638712M189421
4650B491428K75948k229739k602568k706928k842435k297377j973182j889168
4642a3774021J055881P257204R981053M147972l905767m413918R43360K513138
4634C804902j167045k715728o46905j315185m756814k643020N902925J0186056
$$ plain form
4692 -1443885 -6560871 -7492844 -5231902 -2400302 -1582491 -4293503 -9244305 -13579919 -16498910
4683 -16498910 -18568555 -17730080 -11241692 -2368884 1181702 -2147751 -4870390 -1292906
4675 -1292906 4802648 7196505 5832309 3325784 -1418817 -9667661 -17223586 -19228008
4667 -19228008 -17767876 -18141574 -19699334 -17170424 -10197602 -4998921 -5825666 -9873431
4659 -9873431 -11990347 -10773588 -8659835 -8297539 -9761811 -10339615 -7336705 -1697993 2491428
4650 2491428 2767376 537637 -2064931 -4771859 -7614294 -9911671 -11884853 -13774021
4642 -13774021 -12718140 -5460936 4520117 8668089 4762322 348404 1291764 3804902
4634 3804902 2637857 -77871 -724776 -2039961 -6796775 -9439795 -3536870 6649186
4626F649186N190388j70361J074898K738103j222080m630021j376670J102863
4618I356306o058733j5517019j2601511K271616J3445232J1180179K058693k083230
4610B051533K593081J0238419J1423377J951590j0684909j3361761l956305M027524
4602D282549m41375j0039985j0138422l4658P580716N168121k338835p425321
4594a3387210p429297k361847N849149J1330437Q857426J151354m141712m101433
4586d233133j712788O19155K318187J440497k720211n434701j997549M118878
4578g601665N651638K515174R52357K994260M387210K392508j403858n328521
4570D559103q100703o580198N8400N750834M387744r45560l076303j958056j940872
$$ plain form
4626 6649186 11839574 11669213 12744111 15482214 14260134 9630113 8253443 9356306
4618 9356306 3297573 -12219446 -24820957 -22549341 -9104109 2076070 4134763 2051533
4610 2051533 4644614 14883033 26306410 28258000 17573091 4211330 255025 4282549
4602 4282549 3841174 -6198811 -16337233 -16371891 -8791175 -3623054 -5961889 -13387210
4594 -13387210 -20816507 -23178354 -17329205 -5998768 2858658 4010012 -131700 -4233133
4586 -4233133 -5945921 -5326766 -3008579 -1568082 -4288293 -9722994 -11720543 -7601665
4578 -7601665 -1950027 565147 1517504 4511764 8898974 11291482 9887624 4559103
4570 4559103 -3541600 -10121798 -10063398 -4312564 75180 -870380 -3946683 -5904739 -7845611
4561g845611j442243L555230Q230290L995664n644010p662144O64328P678925
4553A530429N860301J314441M33022j97605m284003p401021n392268k119202j941478
4544a2197384k315756M1322K964485M009263M478358M203035O88679k941001O09768
4535d59231R026478R964944O21493n294776J063403Q587911M346441n404563p053076
4526A5399024k440982l009601q285210q155144k597028j112649l839581j042349
4518a5083520P256698Q357932k144576j1719283r460604n01429N007929O089513
4510a2197340O312977M461726j332378o647291o095013j357978K285689L610284
4502a0959324M385660M421119K686789N76987J39553J427332L754944O067466
$$ plain form
4561 -7845611 -9287854 -5732624 2497666 6493330 849320 -6812824 -6148496 1530429
4553 1530429 7390730 8705171 9138193 8940588 4656585 -2744436 -8136704 -10255906 -12197384
4544 -12197384 -14513140 -14471818 -11507333 -7498070 -3019712 1183323 1872002 -1068999 -459231
4535 -459231 8567247 18532191 19153684 13858908 14922311 23510222 27856663 22452100 15399024
4526 15399024 12958042 9948441 1663231 -6491913 -9088941 -10201590 -14041171 -15083520
4518 -15083520 -7826822 531110 -1613466 -13332749 -22793353 -23294782 -18286853 -12197340
4510 -12197340 -5884363 -1422637 -2755015 -9402306 -15497319 -16855297 -14569608 -10959324
4502 -10959324 -6573664 -2152545 534244 1111231 1250784 2678116 6433060 12500526
4494A2500526M815048k877637j1710685j1041474L14104R166328M407653p532978
4486a959115j1741723m833347L476690O316808O626597P482111N713597n83861
4478A0497757o000515n297469j777253j746729m091846k572596K988696N801978
4470b197977L579079K818944P239171R132558L10849j2648078j4568515k880120
4462i214089Q065991P051944P1140j895499L47134m23855k655338J144313R243054
4453A1734795J1380665N121949o41947j049435k293242q407569j2092717o460422
4445b707923K632852M979466P00492k453665j982396j589598k114345q02924J270521
4436b067520l47535m996913o310569j734773L473350L753581j79649m081502n222506
$$ plain form
4494 12500526 17315574 14437937 2727252 -8314222 -8000118 1166210 5573863 -1959115
4486 -1959115 -13700838 -18534185 -15057495 -8740687 -2114090 5368021 11081618 10497757
4478 10497757 4497242 -800227 -2577480 -4324209 -8416055 -10988651 -7999955 -2197977
4470 -2197977 1381102 4200046 11439217 20571775 20882624 8234546 -6333969 -9214089
4462 -9214089 -1148098 5903846 5974986 4079487 4426621 4002766 1347428 2491741 11734795
4453 11734795 23115460 28237409 27595462 26546027 24252785 15845216 3752499 -2707923
4445 -2707923 -75071 4904395 5604887 3151222 1168826 -420772 -2535117 -3338041 -2067520
4436 -2067520 -2415055 -7411968 -13722537 -15457310 -11983960 -8230379 -8410028 -12491530 -17714036
4427a7714036l034841J331956M330169K414393k969287n720140k209172M314621
4419a9256337P874474O110819J251277l080528m594017l395051j367796L34077
4411a6123082K766360O459275Q291946M499922l186147q255063p424417m416495
4403a7387701l934092n173537m119163M2995M055943N135114L595663J155536
4395a6629242j114756k663436k757063r28607J972340L704279K421694r36630
4387a6931421k812290p07961L743643O585285N898396K968933j83745k333117
4379c772277k307266Q15650N878444R397288P913556N02854r823216j6245815
4371g640782j2382391J00265J0028521P975669j454264m454589L828831J2510856
$$ plain form
4427 -17714036 -20748877 -19416921 -15086752 -12672359 -15641646 -21361786 -23570958 -19256337
4419 -19256337 -11381863 -5271044 -4019767 -7100295 -11694312 -15089363 -16457159 -16123082
4411 -16123082 -13356722 -6897447 1394499 5894421 2708274 -5546789 -12971206 -17387701
4403 -17387701 -21321793 -26495330 -30614493 -30571498 -26515555 -21380441 -17784778 -16629242
4395 -16629242 -17743998 -20407434 -23164497 -24093104 -22120764 -18416485 -15994791 -16931421
4387 -16931421 -19743711 -20451672 -16708029 -10122744 -4224348 -1255415 -1439160 -3772277
4379 -3772277 -6079543 -5263893 614551 10011839 17925395 18428249 8605033 -7640782
4371 -7640782 -20023173 -19922908 -9894387 -1918718 -3372982 -7827571 -3998740 8512116
4363H512116R701916j981070j0271668r396774m419000j417728o94743l45216
4355a0312167j63374L28499K801848O108626N385984j053981o943177m885074
4347h732816L330807Q264605N170641j26291j97609L382942L148419k752760q196326
4338C291612q614212o748243o127026m395211J700418Q554299R515870M795398
4330A972905R21745O10786n3362l288196n289686l000878O23725J763826J418447
4321d320688K217708L746646M776977O076600P099738M220369l015815q087136
4313A2714399n721389m65782m95736n364168p100030k399027L517398N449001
4305A34666L850513O93977l931784q458694q196314q51577Q857318J3076742Q569086
$$ plain form
4363 8512116 18214032 16232962 5961294 -3435480 -7854480 -9272208 -9966951 -10312167
4355 -10312167 -10475541 -10147042 -7345194 -1236568 4149416 3095435 -3847742 -8732816
4347 -8732816 -5402009 2862596 8033237 7906946 7709337 11092279 14240698 11487938 3291612
4338 3291612 -5322600 -12070843 -18197869 -22593080 -20892662 -12338363 -2822493 1972905
4330 1972905 2894650 3505436 3452074 163878 -5125808 -8126686 -7502961 -5739135 -4320688
4321 -4320688 -2102980 1643666 6420643 12497243 19596981 23817350 20801535 12714399
4313 12714399 6993010 6527228 6031492 667324 -6432706 -8831733 -5314335 134666
4305 134666 3985179 4679156 747372 -7711322 -15907636 -16759213 -7901895 5174847 13743933
4296A3743933m01031o258421n293826j180154j56674k622381k969390J028376
4288d109568M068285K145163m03267J415698M212196K806887O15289L232698N835516
4279A9818897l04395j0645535j1232840r01052N505843L62872n391867j669361
4271d457438M198744J295721o060214o560752p89222J820175m92536j587480k58501
4262a2891503n31380j082506L284962R990354J0125367K515827m047162m073255
4254C290704j290960K47316J390806J873653j494959p026204p131295L28732P116006
4245b696201O143739J502472J205228M960888N539234l63434q083598j0995271
4237b786943p191103o38074K725546Q64207k210313j844061Q15652J406603L63021
$$ plain form
4296 13743933 13342902 7084481 1790655 610501 453827 -2168554 -5137944 -4109568
4288 -4109568 -41283 2103880 1700613 3116311 7328507 10135394 10750683 13983381 19818897
4279 19818897 19514502 8868967 -2363873 -3264925 2240918 2603790 -2788077 -4457438
4271 -4457438 -258694 1037027 -5023187 -11583939 -12373161 -10552986 -11045522 -12633002 -12891503
4262 -12891503 -13422883 -14505389 -11220427 -1230073 8895294 11411121 7363959 3290704
4254 3290704 1999744 2247060 3637866 5511519 4016560 -3009644 -10140939 -9812207 -2696201
4245 -2696201 3447538 4950010 6155238 11116126 16655360 16291926 8208328 -2786943
4237 -2786943 -9978046 -10616120 -7890574 -7026367 -9236680 -11080741 -10265089 -8858486 -8495465
4228h495465K640849Q546481J0946982M687967n830927j1998506j0530486m618978
4220a4652083J257033M251722L251690l56417k806822j174372L617500P566382
4212I54633O719030J91040q066482j1370872o910085M01837L575951J942608K64597
4203a2297743R60451K246611L165888M501598M583403N73441n006785n501569
4195f774705J83826N231092M562209Q34220j768458l412444m902054m228936j021279
4186a1296529R83025J16719J75775L424977N866062M363743K584525L808444L676129
4177A3702870k111039p626794l778643O738328J1426437N309973k837638m200806
4169A6622688j955467m516584j1895143j5264865q918068K683629J0968712J2465485
$$ plain form
4228 -8495465 -5854616 2691865 13638847 18326814 12495887 497381 -10033105 -14652083
4220 -14652083 -13395050 -9143328 -5891638 -6248055 -9054877 -10229249 -6611749 954633
4212 954633 7673663 7864703 -201779 -11572651 -18482736 -18080899 -14504948 -12562340 -12297743
4203 -12297743 -11337292 -9090681 -5924793 -1423195 3160208 3733649 -1273136 -6774705
4195 -6774705 -6590879 -1359787 3202422 4036642 2268184 -1144260 -6046314 -10275250 -11296529
4186 -11296529 -10313504 -10196785 -10021010 -6596033 -729971 3633772 6218297 10026741 13702870
4177 13702870 11591831 3965037 186394 6924722 18351159 23661132 20823494 16622688
4169 16622688 14667221 10150637 -1744506 -17009371 -25927439 -23243810 -12275098 190387
4161A90387R290419L560736l499002p759376m566633K707294L904769l140608
4153F87986o906828O59973R313796N151376o414214q742406j462267N179p226722
4144a4934127q453564O2125K692012l543267M730030L7306750O0086141L5976426
4136A13922526j7597423m6717679l1713039n149294K752478N94411N706512J0430501
4128C2228993R39674j2825149j1703302R27120N582564k065943p825978m232862
4120A025117K01055j502816m040330j095754M209953N421431J742549l222230
4112B738975o354133n657858l39533P023656J1162674Q964833K436899l435658
4104A6539855m718878j259898L122874L992042Q07320l045524m796595m412105
$$ plain form
4161 190387 9480806 13041542 9542540 1783164 -2783469 -76175 3828594 687986
4153 687986 -6218842 -5558869 3754927 8906303 2492089 -6250317 -7712584 -7707405 -14934127
4144 -14934127 -23387691 -23325566 -20633554 -24176821 -19446791 17859959 77946100 113922526
4136 113922526 96325103 49607424 17894385 12745091 15497569 16091980 21798492 32228993
4128 32228993 33168667 20343518 8640216 9567336 15149900 13083957 5257979 1025117
4120 1025117 1226172 -276644 -4316974 -5412728 -1202775 4218656 5961205 2738975
4112 2738975 -3615158 -9273016 -9612549 -2588893 8573781 17538614 19975513 16539855
4104 16539855 11820977 10561079 13683953 17675995 18483315 15437791 10641196 6229091
4096F229091k180140J960941N721763N334207Q75567l183749m249104m091081
4088F417495l789903j696346J435634J415809k042952l101697J064349N077535
4080D779924M069262J243482R06919K90946m237171q270096n461863J257609L721051
4071a699937J412896J108421M633416O071292J857968m291867q005582r064113
4063g977506q115115m697658k56970K133284K461707L414676M611320K585419
4055e840843k326640m668583j551868L102051M353555K318406K98953K65594K066948
4046a982427M212202M196217R25563k614944k500834R0930K13113k950456m603530
4037e014166k316414r1991j468128l425876j525445K340600K348539k604253p122675
$$ plain form
4096 6229091 4048951 6009892 11731655 17065862 17941429 14757680 10508576 6417495
4088 6417495 2627592 931246 2366880 3782689 1739737 -1361960 -297611 4779924
4080 4779924 8849186 10092668 10999587 11290533 7053362 -1216734 -6678597 -5420988 -1699937
4071 -1699937 -287041 821380 5454796 11526088 13384056 9092189 1086607 -7977506
4063 -7977506 -16092621 -20790279 -21047249 -18913965 -16452258 -13037582 -8426262 -5840843
4055 -5840843 -8167483 -12836066 -14387934 -11285883 -6932328 -4613922 -4314969 -4049375 -1982427
4046 -1982427 2229775 6425992 7351555 4736611 2235777 2326707 2539820 -410636 -5014166
4037 -5014166 -7330580 -7422571 -8890699 -12316575 -13842020 -11501420 -9152881 -11757134 -18879809
4028a8879809o230484r33829L758340M480581K346112P64656J089693J330429
4020a2274311j93134j481500M99074M664808O563456M443396J225802m15227j548146
4011A484218l938350o465605o721207m096088L76371N131696P649179N686104
4003h93682J010066q62479K560875O609674N354892k93785m181281l268969j57054
3994E878257K212685L637647L704611O06145m643059o751047k574230L508247
3986E579256M583747K4717m754131o312069o091826n188335j800462L823498O852825
3977c282780M172079l84250j431816K59987L52464j287525j366027k83290j697587
3968d948745m903405m660530j98675K395134l87171l974276l492905j153896q22255
$$ plain form
4028 -18879809 -25110293 -26044122 -22285782 -17805201 -15459089 -14694433 -13604740 -12274311
4020 -12274311 -12467445 -13948945 -13449871 -8785063 -2221607 2221789 3447591 3032364 1484218
4011 1484218 -2454132 -8919737 -15640944 -19737032 -19360661 -14228965 -6579786 -893682
4003 -893682 116384 -746095 1814780 8424454 13779346 13485561 9304280 6035311 5878257
3994 5878257 8090942 11728589 15433200 16039345 11396286 4645239 2071009 5579256
3986 5579256 10163003 10187720 5433589 -878480 -6970306 -12158641 -13959103 -10135605 -3282780
3977 -3282780 889299 505049 -926767 -666780 -314316 -1601841 -2967868 -3251158 -4948745
3968 -4948745 -9852150 -14512680 -14711355 -12316221 -12703392 -16677668 -20170573 -21324469 -22146724
3959b2146724l12514M445371J0712311J1135977L764200n294176q993552n536827
3951a2225934J688722P087733O766270K185750j367720j648250j764692l517966
3943b796087l213901J618344O085332M573044j52933j356564R23199R82709k381716
3934D281427m449763k780624J74346K372774L485092J627861l990444p851023
3926g130354l784948M062264M989825k168198o283429m45207Q021671R058834
3918F320458L386786j620129l102190l069947k294758k61402J814494K865895
3910D039207M017690N053425K779874l018844o395943l026911K649597L445522
3902I543617o67512m161059m661868m244656l944433k731861j076829n50030l51885
$$ plain form
3959 -22146724 -22459238 -18013867 -7301556 3834421 7598621 2304445 -6689107 -12225934
3951 -12225934 -10537212 -3449479 3316791 5502541 4134821 2486571 721879 -2796087
3943 -2796087 -6009988 -4391644 1693688 6266732 6113799 4757235 5680434 6663143 4281427
3934 4281427 -168336 -2948960 -2774614 -401840 3083252 4711113 720669 -7130354
3926 -7130354 -10915302 -6853038 -1863213 -4031411 -10314840 -10760047 -2738376 6320458
3918 6320458 9707244 8087115 4984925 1914978 -379780 -641182 1173312 4039207
3910 4039207 8056897 13110322 15890196 12871352 6475409 3448498 6098095 9543617
3902 9543617 8876105 4715046 53178 -4191478 -8135911 -10867772 -11944601 -12494631 -12846516
3893a2846516J539503M287099N098240L722781K598095K955380L768262L954088
3885A5076932K986884K85447l447236n472785m200807j858469j439678k380437
3877d50149j897270O98165L639056N515730O102733N376593L523079R10749k724604
3868B0694082p080505r123306n858173k7427J926914o69469j219821L215400O336691
3859H194386K963308j901299j561742Q62620j344629n223762k101297O785468
3851F673053R937121K234690p948505j1160359p836470l027474K174326Q443419
3843e10199J2699949J0656684K765478n965327j0603360r109853k986787L320878
3835B67463N915845N231907M076274K335312k330473q302970r650638l969355
$$ plain form
3893 -12846516 -11307013 -7019914 -1921674 1801107 4399202 7354582 11122844 15076932
3885 15076932 18063816 18349263 14902027 9429242 5228435 3369966 1930288 -450149
3877 -450149 -2347419 -1649254 1989802 7505532 13608265 18984858 22507937 23418686 20694082
3868 20694082 13613577 4490271 -1367902 -1395329 531585 -137884 -1357705 1857695 8194386
3859 8194386 11157694 9256395 7694653 8557273 7212644 1988882 -112415 6673053
3851 6673053 16610174 18844864 10896359 -264000 -8100470 -11127944 -8953618 -510199
3843 -510199 12189750 22846434 25611912 19646585 9043225 -66628 -3053415 267463
3835 267463 6183308 11415215 15491489 17826801 15496328 7193358 -2457280 -6426635
3827f426635L622790O816456N117927K224819M14058q43965k583652m656896n446339
3818a761437l113803J345160L463281P62457k540165p64273M304826N460761R65058
3809H121865l201061l081864j703068j847929r90705K614930N193337L602629
3801H708134O47620o75921k486516n816693n214635K565742R404947N131762o436539
3792E827901j1068007l758140N162812N683831N00498k643171k949979m215377
3784g459632n803570l702273J384474L816540J207195k250726j894198J679870
3776a3022320M602328M677243K424043q11742l437879l321127M48724N122449
3768c318281N785184Q07787n234046n912329j89538O244442P345888L005695k043410
$$ plain form
3827 -6426635 -2803845 4012611 9130538 11355357 11769415 10925450 8341798 3684902 -1761437
3818 -1761437 -4875240 -3530080 -66799 695658 -1844507 -2608780 1696046 7156807 8121865
3809 8121865 4920804 1838940 135872 -1712057 -2702762 -87832 5105505 8708134
3801 8708134 9355754 8679833 6193317 376624 -4838011 -2272269 7132678 12264440 5827901
3792 5827901 -5240106 -8998246 -3835434 1848397 2348895 -294276 -3244255 -7459632
3784 -7459632 -13263202 -16965475 -15581001 -11764461 -10557266 -12807992 -14702190 -13022320
3776 -13022320 -8419992 -3742749 -1318706 -2130448 -5568327 -8889454 -8440730 -3318281
3768 -3318281 2466903 3274690 -1959356 -7871685 -8061223 -1816781 5529107 8534802 6491392
3759F491392m316202m504840m385375l250151N83359N633026P400582L800636
3751G452427j474059l085655n24507J986381J557146l90459j504886j538478q00936
3742A676974J068414K866235J769929j842127l061425M39173L556825J023224
3734G497222l617325k854827K833092N574970K561016k81832J070763K476496
3726A5259575j27099l282831k243593Q20675Q75782j732038l133687k996931l672257
3717b32404m472447k829691J51267J019153R7281P81866L031024L032756j62491
3708D16314k749251j969160N53412K348612K866511J588197k376372o984553p387986
3699a3694276j850125N197558Q181538O237298K389831n89713j479052k001K649574
$$ plain form
3759 6491392 2175190 -2329650 -6715025 -9965176 -9381817 -3748791 3651791 7452427
3751 7452427 5978368 2892713 2368206 4354587 5911733 5521274 4016388 2477910 1676974
3742 1676974 2745388 5611623 7381552 5539425 2478000 2917173 6473998 7497222
3734 7497222 3879897 1025070 3858162 9433132 11994148 11712316 12783079 15259575
3726 15259575 15132476 11849645 9606052 10426727 11302509 9570471 6436784 3439853 -232404
3717 -232404 -4704851 -7534542 -7383275 -6364122 -6266841 -5484975 -2453951 578805 416314
3708 416314 -2332937 -4302097 -3748685 -1400073 1466438 3054635 678263 -6306290 -13694276
3699 -13694276 -15544401 -10346843 -2165305 4071993 6461824 5872111 4393059 4391058 7040632
3690G040632M017074K939745Q38302o71800j721196k478312j736533P57929K647871
3681A1633712K307158K070649M638403P266205L988730n464874j3121648j1850237
3673A468098m283120Q22055l43198l302208l015657m10970R65676J096711K332898
3664d669715M042336L090197m32948k401976q11738J120441J02490k301747k767835
3655e030495j658005j848107l537318l787865j003232K883954M850077L611654
3647e519337L73809j720238J31733M822519P374271M857449O52194l73753O82434
3638A1281081j288153o512489q954447n338474l31337N03518j301764o86974K197293
3629a0431746K411296j165537l220313J04220M885009M488443j145474n302546
$$ plain form
3690 7040632 11057706 13997451 14835753 14163953 12442757 9964445 8227912 8985841 11633712
3681 11633712 13940870 16011519 20649922 27916127 31904857 26439983 13318335 1468098
3673 1468098 -2815022 -1992967 -2336165 -5638373 -8654030 -9065000 -8099324 -7002613 -4669715
3664 -4669715 -627379 2462818 2029870 -372106 -1183844 -63403 39087 -2262660 -5030495
3655 -5030495 -6688500 -8536607 -12073925 -15861790 -16865022 -13981068 -9130991 -5519337
3647 -5519337 -5145528 -6865766 -6734033 -1911514 5462757 10320206 10972400 10598647 11281081
3638 11281081 9992928 3480439 -5474008 -10812482 -11143819 -10640301 -11942065 -12629039 -10431746
3629 -10431746 -8020450 -9185987 -12406300 -12302080 -7417071 -2928628 -4074102 -9376648
3621i376648l472938J236227L286910K229977J788256L078965L102158M26054
3613B298961j840727q87855J340856J559750M44494Q70657K651163L151968K152721
3604A1741988J670835J235046j814984o538476p887421m081406M344j07384j991338
3595g768796r42837K008723J915711j685895l717463j379369J828982J740675
3587h000269o80646j896889j425268j592398l006902l587626j995796P06107L237373
3578a8242314N468031O756048N413772J579838j433039j140813J82941j392014
3570b807550n183840o379808l114190P78763J594122P44503J399205L193051L642491
3561f133253K649955J931273J454787K04645o02300R31383L180458K491189j106899
$$ plain form
3621 -9376648 -12849586 -11613359 -8326449 -6096472 -4308216 -1229251 1872907 2298961
3613 2298961 458234 -429621 911235 2470985 2915479 3786136 6437299 9589267 11741988
3604 11741988 13412823 14647869 12832885 6294409 -1593012 -5674418 -5670074 -5777458 -7768796
3595 -7768796 -8711633 -6702910 -4787199 -6473094 -10190557 -11569926 -9740944 -8000269
3587 -8000269 -8680915 -10577804 -12003072 -13595470 -16602372 -20189998 -22185794 -21479687 -18242314
3578 -18242314 -12774283 -6018235 -604463 975375 -457664 -1598477 -1415536 -2807550
3570 -2807550 -7991390 -14371198 -17485388 -16706625 -15112503 -14368000 -12968795 -9775744 -6133253
3561 -6133253 -3483298 -1552025 -97238 107407 -494893 436490 3616948 6108137 5001238
3552E001238l731524l475884k239948j195807R36601L718151L844047N36541k184299
3543A209116j470592J20973l21790p79828J600135M477820L624458Q7445j453092
3534G094645l96696p37534l832989n919991m038762j27684K391935K651195J398780
3525a517101r14183l413080m549063l952235k594457n65872K734383N748265N508985
3516c514358K409380O05323J816077K456659l58485l645713l240421o31273k75450
3507d378261k017067j683205J291594K597462M96499q49107J827283N111089L761346
3498F157633j412954m731236l434543l59309J035774Q01640P74304J368292J586473
3489A786074P88403p49211k253806k838316k248894j504117j741625k204150q37577
$$ plain form
3552 5001238 1269714 -2206170 -4446118 -5641925 -4705324 -987173 2856874 3393415 1209116
3543 1209116 -261476 -140503 -462293 -1242121 358014 4835834 8460292 8547737 7094645
3534 7094645 6697949 5960415 2127426 -3792565 -7831327 -7959011 -5567076 -2915881 -1517101
3525 -1517101 -2431284 -5844364 -10393427 -14345662 -16940119 -17505991 -14771608 -9023343 -3514358
3516 -3514358 -1104978 -499655 1316422 3773081 3414596 -231117 -3471538 -4102811 -4378261
3507 -4378261 -6395328 -8078533 -6786939 -4189477 -3692978 -4542085 -2714802 2396287 6157633
3498 6157633 4744679 13443 -3421100 -3780409 -2744635 -1942995 -1168691 199601 1786074
3489 1786074 2574477 1825266 -428540 -3266856 -5515750 -7019867 -8761492 -10965642 -11803219
3480a1803219K453874M744852L568548K26628j984182j940709j148504n16864
3472f399576R22370L501210N196816L875888J94021l093212m137885l173526j155796
3463d269690J398940M049211N900390N971362L887893L00020l068408m222295
3455I947423k637130j82920N27058j135628l412961m463547m109261l150427k152363
3446a0769756j483261j470332j739472j307967R824J416809K941812N534187Q038571
3437A170415O621908J69329n813958n066327N16323K984598k91004l300458j546432
3428d555606R03673q28433l202756J31880O790140P855320R31781o682105q605608
3419g261714n919045j541564M310765R671615R037188J420253n330790m348741
$$ plain form
3480 -11803219 -9349345 -4604493 -1035945 -809317 -2793499 -4734208 -5882712 -6399576
3472 -6399576 -5477206 -1975996 3220820 7096708 7290729 4197517 59632 -3113894 -4269690
3463 -4269690 -2870750 1178461 7078851 13050213 16938106 17238126 14169718 9947423
3455 9947423 7310293 7127373 7654431 6518803 3105842 -1357705 -5466966 -8617393 -10769756
3446 -10769756 -12253017 -13723349 -15462821 -16770788 -16760964 -15344155 -12402343 -6868156 1170415
3437 1170415 7792323 7961652 2147694 -2918633 -2402310 582288 291284 -3009174 -4555606
3428 -4555606 -3651933 -4480366 -7683122 -7551242 -761102 7094218 8025999 1343894 -7261714
3419 -7261714 -13180759 -14722323 -10411558 -739943 8297245 9717498 4386708 37967
3411C7967L91611M96172m094749o257283l586127r73754j086748j50775M266109
3402a0957577P697050N078470j475734n354362l784329j74381R08631j212577
3394i274809l140769j392757L232198N838771L258344j405701k584849J75217
3386e294355J900886m76898m271549n531887l880489j329036O46379J100445n31483
3377a7667987k708501k278359J655016O482291R629299J0489221Q117088J333203
3369A5051271o819777r511315m759525M40611p89588n602010o442937k599814
3361b1033084K37968L37188J809944N533358O325344K250320m36210L313288Q523704
3352F861820P112171L0511m460388k978592l03993k11968j11743K582695M661770
$$ plain form
3411 37967 429578 925750 -3168999 -9426282 -13012409 -13986163 -15072911 -15223686 -10957577
3402 -10957577 -3260527 1817943 342209 -5012153 -8796482 -8970863 -8062232 -9274809
3394 -9274809 -12415578 -13808335 -10576137 -4737366 -1479022 -2884723 -5469572 -5294355
3386 -5294355 -3393469 -3870367 -8141916 -13673803 -17554292 -18883328 -18236949 -17136504 -17667987
3377 -17667987 -20376488 -22654847 -20999831 -14517540 -4888241 5600980 13718068 15051271
3369 15051271 8231494 -1279821 -6039346 -5598735 -6388323 -11990333 -18433270 -21033084
3361 -21033084 -20795116 -20457928 -18647984 -13114626 -6789282 -4538962 -4975172 -1661884 6861820
3352 6861820 13973991 14004502 9544114 6565522 6261529 6049561 5937818 8520513 13182283
3343A3182283K117081k955720n348055m292553l082230k528576k57798L317714
3335A52146L821761l21077m387662l544330P45807L583220L156296J041409j613082
3326B634488m186717m514448j211123K473728J572636l390529o144067k760095
3318a5526127L437918O564906M912623J365641n57066N63686L439555M893321
3310I094457K834843q62097k302116p84301M11058r09957k971474l432818k593173
3301a515578j412503O20527L231280L708917M76782l744973n261989m061368k217911
3292a0176816K98938M349496P506070N910140N56842k580096k77935L485330L118699
3283A2190668j094683m168303l769248k781316l943080n199034k900067K104550
$$ plain form
3343 13182283 15299364 12343644 6995589 2703036 -379194 -2907770 -3165568 152146
3335 152146 3973907 3652830 -734832 -4279162 -3533355 49865 3206161 4247570 2634488
3326 2634488 -1552229 -6066677 -7277800 -4804072 -3231436 -6621965 -12766032 -15526127
3318 -15526127 -12088209 -5523303 -610680 754961 197895 761581 4201136 9094457
3310 9094457 11929300 11067203 8765087 7980786 8391844 7481887 4510413 1077595 -1515578
3301 -1515578 -2928081 -2307554 923726 4632643 5109425 1364452 -3897537 -7958905 -10176816
3292 -10176816 -9877878 -5528382 1977688 7887828 8444670 5864574 5586639 9071969 12190668
3283 12190668 11095985 6927682 3158434 377118 -3565962 -8764996 -11665063 -9560513
3275i560513M940391L186274l78891k318240k501237j943857k88764J887358J854052
3266e123427n23447n20808M068223P157822K832373l694809k717810L956115M698730
3257A0132962l155827q350670l932702J535384j178552o374245l397342N436231
3249i284761R059942N131019J073918J66123j346895l778537k311444K765768
3241A475133M546016Q19751k214547n41290J767067O92771j458680j941656k675642
3232D68923m971172n306424j204232L620599M421834J584923j901086m757030
3224h043665n884964l263108J913786M503315K587765Q78764L124916N949137
3216A765946M814682J475592J44349K57196j150888l135303k866800j380182j375099
$$ plain form
3275 -9560513 -4620122 -1433848 -1812739 -4130979 -6632216 -8576073 -8864837 -6977479 -5123427
3266 -5123427 -5646874 -6167682 -2099459 5058363 7890736 4195927 1478117 5434232 10132962
3257 10132962 6977135 -1373535 -5306237 -3770853 -4949405 -11323650 -14720992 -9284761
3249 -9284761 -224819 4906200 5980118 6146241 4799346 1020809 -1290635 1475133
3241 1475133 6021149 6840900 4626353 4085063 5852130 6544901 5086221 3144565 468923
3232 468923 -4502249 -9808673 -11012905 -7392306 -2970472 -1385549 -3286635 -8043665
3224 -8043665 -13928629 -17191737 -15277951 -10774636 -8186871 -7308107 -4183191 1765946
3216 1765946 6580628 8056220 8200569 8457765 7306877 4171574 1304774 -75408 -1450507
3207a450507j400238J661414N759842N564937P26237l503005l996218k794318
3199E68144j951277m74874K291193M502389M652985L390883J409979j497734m425957
3190H465731n376301m320069l521025l765583k900505N11477M301286N130169
3182a474820K509692q76634k113512o77023J250406R11744j969291m519389l872084
3173a0830911n17630K382194K414843j82339l061663l206721P66511O214444P825013
3164A803741L474501k418769l782361k87727K766504J519984k363484m957929
3156d245540m738058k902054r72324M33442J285122J794802K353678L282561M344327
3147F35956M510943K825900J11165j040805N50854K221471M97964l755076o125451
$$ plain form
3207 -1450507 -2850745 -1189331 4570511 10135448 10861685 7358680 3362462 568144
3199 568144 -1383133 -1858007 433186 4935575 9588560 12979443 14389422 12891688 8465731
3190 8465731 3089430 -1230639 -4751664 -8517247 -11417752 -10906275 -6604989 -1474820
3182 -1474820 1034872 158238 -1955274 -2632297 -1381891 -470147 -2439438 -6958827 -10830911
3173 -10830911 -11348541 -8966347 -6551504 -6733843 -9795506 -13002227 -12235716 -6021272 1803741
3164 1803741 5278242 2859473 -922888 -1210615 1555889 3075873 712389 -4245540
3156 -4245540 -8983598 -11885652 -12857976 -12424534 -11139412 -9344610 -6990932 -3708371 635956
3147 635956 5146899 7972799 8083964 7043159 7594013 9815484 10313448 6558372 432921
3138D32921m741648k116368j84191K362815N897168P259597M539157R89578M95802
3129A4934831J976739K075942P06026k96424j582818m584840p203994o180879
3121a55417k621243l61338J87947J577448L479060K819646j40152j337096N16744
3112C965599J858925J82775k455136l430293k988332k065852n32702P01333l91498
3103e155181k984095k944809J319626N665962N331564Q45915l310143l907654
3095e138815j122067K530218L946261J947929j009147j565147j40747r5917k001749
3086b649181k588670m29981J579404J388860J217713K965388M110058J964552
3078G558143j113730j170519P87100L61219k994259m888789k670129O36514P94748
$$ plain form
3138 432921 -4308727 -6425095 -6609286 -4246471 1650697 8910294 13449451 14439029 14934831
3129 14934831 16911570 18987512 19693538 19397114 17814296 13229456 6025462 -155417
3121 -155417 -2776660 -3137998 -2950051 -1372603 2106457 4926103 4785951 3448855 3965599
3112 3965599 5824524 6007299 3552163 121870 -2866462 -4932314 -5465016 -4763683 -5155181
3103 -5155181 -8139276 -11084085 -9764459 -4098497 1233067 2078982 -1231161 -5138815
3095 -5138815 -6260882 -3730664 215597 2163526 1154379 -410768 -551515 -647432 -2649181
3086 -2649181 -5237851 -5667832 -4088428 -2699568 -1481855 1483533 5593591 7558143
3078 7558143 6444413 5273894 6060994 6422213 3427954 -1460835 -4130964 -3494450 -2699702
3069b699702j636738k170525J221293M774651L511230j687090m405651j260468
3061d353000K976898K004663k780855m564331j361044J966965K227226J973303
3053a910175L135346K962243j31235k306909n16243J714559q8722l806953m420045
3044e368134k144108j003447j637254j562789r08734j715342k561364j59733M011600
3035a3049305M898347K005749K24332J662406K847009J717621J188936K960260
3027D455355L548344L80181l018074k549480m39847j434921m712174n074298j145518
3018i990432K737025L040360J212141M02777J342926K785518L545066K734170
3010G809551j26681l900475o128645n646314l721239j736313O73850L702155N115927
$$ plain form
3069 -2699702 -4336440 -6506965 -5285672 -511021 3000209 1313119 -3092532 -4353000
3061 -4353000 -1376102 628561 -2152294 -6716625 -8077669 -6110704 -3883478 -1910175
3053 -1910175 1225171 4187414 4056179 1749270 1233027 2947586 2858864 -948089 -5368134
3044 -5368134 -7512242 -8515689 -10152943 -11715732 -12624466 -14339808 -16901172 -17060905 -13049305
3035 -13049305 -8150958 -6145209 -5920877 -4258471 -1411462 306159 1495095 4455355
3027 4455355 8003699 8383880 5365806 2816326 2376479 941558 -3770616 -8844914 -9990432
3018 -9990432 -7253407 -4213047 -3000906 -2598129 -1255203 1530315 5075381 7809551
3010 7809551 7682870 3782395 -2346250 -7992564 -11713803 -13450116 -12776266 -9074111 -3958184
3001c958184K500967k485741m772706j812508L059532M709175K257029p63548
2993a265984j314689L10352K243513L244069K672776L79333k347395l249597j618554
2984i46176P25902J721126J184661M4154j127994j926282j813478j044412p90713
2975c973212j567257k692635l713246m610153m169573p55732M082703N708123
2967a1690982K302818j910812k111494P98391K608053K443085K808123M082501
2959f70317L540237J90743l222876l994460k368527m6614J630080J593233k43966
2950c592467j803388r38616J100542J183814n49920n90267K056093L684078J490844
2941B040713j985578k667742o74564O75763p702r37853l71515J176638J853175
$$ plain form
3001 -3958184 -1457217 -3942958 -8715664 -10528172 -7468640 -2759465 -502436 -1265984
2993 -1265984 -2580673 -2270321 -26808 3217261 5890037 6269370 3921975 672378 -946176
2984 -946176 -220274 1500852 2685513 2729667 1601673 -324609 -2138087 -3182499 -3973212
2975 -3973212 -5540469 -8233104 -11946350 -16556503 -20726076 -21481808 -17399105 -11690982
2967 -11690982 -9388164 -11298976 -13410470 -12612079 -10004026 -7560941 -4752818 -670317
2959 -670317 2869920 3060663 -162213 -4156673 -6525200 -6571814 -4941734 -3348501 -3592467
2950 -3592467 -5395855 -6334471 -5233929 -4050115 -4600035 -5190302 -3134209 549869 2040713
2941 2040713 55135 -2612607 -3287171 -2611408 -2619110 -3556963 -3928478 -2751840 -898665
2932h98665L43665k785455m871348l238637J531398N383713M919920J027095k406899
2923i95213k588047M3370K827780L267268J069289j679768k824180k380919j632430
2914d892850q31614L97659J162369L90431n96414K95126J828772P13673k504839
2905d037687l190929J84767L085817J786113j018040j020249J008933J647623
2897a553652Q70127Q58831J116440j32739j377953L586K161052R88443k542750
2888C91385l146577L36823L241929K997083K656051M217609M327576L47003m203631
2879A1165251m725093k255832n01310N45842K784193M277209J344400m422950
2871H211710o984658m254082p21904m30741j769520j315338Q16751K130173J670650
$$ plain form
2932 -898665 -555000 -3340455 -8211803 -11450440 -9919042 -4535329 384591 1411686 -995213
2923 -995213 -3583260 -3539890 -712110 2555158 3624447 1944679 -879501 -3260420 -4892850
2914 -4892850 -5724464 -5326805 -4164436 -3774005 -4370419 -4075293 -2246521 -1532848 -4037687
2905 -4037687 -7228616 -7043849 -3958032 -2171919 -3189959 -4210208 -3201275 -1553652
2897 -1553652 -683525 175306 1291746 1159007 -218946 -215360 1945692 2934135 391385
2888 391385 -2755192 -2418369 823560 3820643 6476694 10694303 15021879 15368882 11165251
2879 11165251 6440158 4184326 3683016 4228858 7013051 11290260 12634660 8211710
2871 8211710 1227052 -3027030 -3748934 -4179675 -5949195 -7264533 -6447782 -4317609 -2646959
2862b646959J80938j778220l394876k824897N42330L960051M004770J014199j421264
2853b363928j261451P792N09765O80320J626573K648374K275916Q71217K42455
2844E237033P72385O96422j189464l441001l617795j335066J358287K358243J369187
2835B208231m50184j751549j788698p89643J57180J89894k23836L022P25143N82557
2825a137883p18684j529343o55104O43284N40523m69313m76709P10877J586373
2816a505979J852648K695478L758185K737586o85141l257824k648374j139970
2808A806609j941077l736413k775162N11844J546155j062875k718787K69877M603701
2799c496128M389254n00431m462478l870989q89621R14792J260699J694342J967520
$$ plain form
2862 -2646959 -2466021 -4244241 -7639117 -10464014 -9921684 -5961633 -1956863 -942664 -2363928
2853 -2363928 -3625379 -3617587 -3107822 -2427502 -800929 1847445 4123361 4994578 5237033
2844 5237033 6009418 6705840 5516376 2075375 -1542420 -2877486 -1519199 839044 2208231
2835 2208231 1758047 6498 -1782200 -2571843 -2414663 -2224769 -2448605 -2445583 -1720440 -1137883
2825 -1137883 -1856567 -3385910 -4041014 -3397730 -2857207 -3326520 -3803229 -3092352 -1505979
2816 -1505979 346669 3042147 6800332 9537918 8852777 5594953 2946579 1806609
2808 1806609 -134468 -3870881 -6646043 -6134199 -4588044 -5650919 -8369706 -8099829 -3496128
2799 -3496128 893126 392695 -4069783 -7940772 -8830393 -7915601 -6654902 -4960560 -2993040
2790b993040N56618k023878k880694l03374L644723N071521K522827j410577l029846
2781h45720j613353K01042Q3379j150749j197582L11530J666740J937784J986998
2772A380069K268321J619317n64992k535310k328014p95783n30809k028125k929587
2763f444913j511532Q49137J723673R11258L08260J039053K044269J691441J6053
2754F26699j051905K97677L390049M973745K444978k555036n084215k515354J966052
2745B492690L194630M80345k179543k113476j144300j710676k791332k035280
2737e806942J21522J405462J598806K338561L428669K664774p3450j591817K54368
2728D339953L186911L348937J50861l435967m590816l192127j146913l58319j207308
$$ plain form
2790 -2993040 -2436422 -4460300 -7340994 -7644368 -3999645 1071876 3594703 2184126 -845720
2781 -845720 -2459073 -2258031 -2174652 -3325401 -4522983 -4211453 -2544713 -606929 1380069
2772 1380069 3648390 5267707 4702715 2167405 -160609 -956392 -1487201 -3515326 -6444913
2763 -6444913 -7956445 -7107308 -5383635 -4472377 -4164117 -3125064 -1080795 610646 626699
2754 626699 -425206 -127529 3262520 8236265 10681243 8126207 3041992 526638 2492690
2745 2492690 5687320 6167665 3988122 1874646 730346 -980330 -3771662 -5806942
2737 -5806942 -5685420 -4279958 -2681152 -342591 3086078 5750852 5677402 4085585 4339953
2728 4339953 7526864 10875801 11026662 7590695 2999879 -192248 -1339161 -1697480 -2904788
2719b904788k396252k414866j203034J81149J255169K253944K718037J725636
2711g85005l6166l00413J731057L901658L671407R01361k620381m918282m538255
2702b993019j551098J290365P34379k412125l506979m83854K904300K644439K56168
2693c117424k84673J233634K150788J950362J872864J140033j416827l078158
2685D50599k84061M277641L857806k083612o124179l661803O85368J033753j033421
2676b881909o59396J788387K307693N16486o41409p86572j871348k868962n95755
2667e692785L852571N129937J491955k380655k423846m54976L22206P68208K836436
2658C449051M449641K272797k029789l395899j072896J50388k396398m860348
$$ plain form
2719 -2904788 -5301040 -7715906 -8918940 -8737791 -7482622 -5228678 -2510641 -785005
2711 -785005 -821171 -1121584 609473 4511131 8182538 9083899 6463518 1545236 -2993019
2702 -2993019 -4544117 -3253752 -2519373 -4931498 -8438477 -8922331 -6018031 -3373592 -3117424
2693 -3117424 -3402097 -2168463 -17675 1932687 3805551 4945584 3528757 450599
2685 450599 166538 4444179 8301985 6218373 94194 -3567609 -2882241 -1848488 -2881909
2676 -2881909 -3541305 -1752918 554775 1071261 429852 -356720 -2228068 -5097030 -5692785
2667 -5692785 -1840214 3289723 4781678 2401023 -22823 -477799 -155593 612615 3449051
2658 3449051 7898692 10171489 8141700 4745801 3672905 3823293 1426895 -3433453
2650c433453k791783J958413M002780K082177j68957m27294l82457j582403k540728
2641c283705j836664q69704r81333m26028K625410N888930N424138J538530j315359
2632F764215o27557J362022J535416k04465j891106k179612j120460J00954k85979
2623C453428k714440m871168m205364j640185j86788p5249J207500L580556L361000
2614b090710n63334l642049j819586K415222L767139J575763l86157p4481Q18646
2605D53N18973o24574j703051k307958j845882J1141K072456K582481J315968
2596B0007o28116k357447k987612j252200K402508M533402K379327j866654l496162
2587c252947j663465n3439r52701k121595q58719J701777K433924P18858q76466
$$ plain form
2650 -3433453 -6225236 -4266823 -264043 1818134 1649177 1221883 839426 -742977 -3283705
2641 -3283705 -5120369 -5990073 -6971406 -7397434 -4772024 1116906 6541044 8079574 6764215
2632 6764215 6136658 7498680 9034096 8829631 6938525 4758913 3638453 3739407 3453428
2623 3453428 738988 -4132180 -8337544 -9977729 -10164517 -10239766 -9032266 -5451710 -2090710
2614 -2090710 -2654044 -6296093 -8115679 -5700457 -1933318 -357555 -743712 -818193 453
2605 453 519426 -105148 -1808199 -4116157 -5962039 -5950898 -3878442 -1295961 20007
2596 20007 -608109 -2965556 -5953168 -7205368 -4802860 -269458 2109869 243215 -3252947
2587 -3252947 -4916412 -4969851 -5922552 -8044147 -8902866 -7201089 -4767165 -4048307 -4924773
2578d924773J30919L384531O072204N676664K506045p10765k049226k411265l526907
2569D147427n044963n176528l508368j387186J51404J186794J900083K252985
2561e478352K410426K256666J172545m12392m74343J703286L421618J925317j198129
2552E326642k027134q4187J242882k6601k168543l137831k988038k140633k94812
2543f298255J892235K752409K225751J964903K061858O01665k458221m061357
2535a319012k303093Q35174K650835K972351K585834J262040n41128p58339R60662
2526F345324J482031j379032m813438m679957j590212K40351o18757j189553R92588
2517e210655M396691N828042M176506Q83951k019533l487264l641592k943831
$$ plain form
2578 -4924773 -4793854 -1409323 4662881 10339545 12845590 12134825 10085599 7674334 4147427
2569 4147427 -897536 -6074064 -9582432 -10969618 -10818214 -9631420 -7731337 -5478352
2561 -5478352 -3067926 -811260 361285 -51107 -525450 1177836 4599454 6524771 5326642
2552 5326642 3299508 3215321 4458203 4431602 2263059 -874772 -3862810 -6003443 -6298255
2543 -6298255 -4406020 -1653611 572140 2537043 4598901 5200566 2742345 -1319012
2535 -1319012 -3622105 -2786931 -136096 2836255 5422089 6684129 6143001 5384662 6345324
2526 6345324 7827355 6448323 1634885 -3045072 -4635284 -4394933 -5013690 -6203243 -5210655
2517 -5210655 -813964 5014078 9190584 10074535 8055002 4567738 926146 -2017685
2509b017685j450105O26599J951961J135441r46990j647896j38780J298101O21527
2500e67827j229065k297403k298879j597421M29368L652800N594976M339262J716023
2491G741834O65103N52081j463945m911978n714596k115905K461731L977477K568861
2482C760663R62601J80529p75349j985376j894483J23395K206009K083357Q825
2473D670171j586609j369482p51561j523859l052347l371266k252678j046461
2465a0284092J85997K630348N361496N090920Q42924l691795m562667k268476
2457f695345N2076J095347J536852J497183P80958L92549R73958Q47302j449290
2448i68410l736881k637404J172884L611563K947748J497402J335280J684342
$$ plain form
2509 -2017685 -3467790 -2841191 -889230 246211 -700779 -2348675 -2487455 -1189354 -567827
2500 -567827 -1796892 -4094295 -6393174 -7990595 -7561227 -3908427 1686549 6025811 7741834
2491 7741834 8406937 8959018 7495073 2583095 -3131501 -5247406 -2785675 1191802 3760663
2482 3760663 4723264 4903793 4128444 2143068 248585 371980 2577989 4661346 4670171
2473 4670171 3083562 1714080 962519 -561340 -3613687 -6984953 -9237631 -10284092
2465 -10284092 -10098095 -7467747 -2106251 2984669 3827593 135798 -4426869 -6695345
2457 -6695345 -6643269 -5547922 -4011070 -2513887 -1732929 -1340380 -366422 480880 -968410
2448 -968410 -4705291 -7342695 -6169811 -2558248 389500 1886902 3222182 4906524
2440D906524J303531M55628m69971j722285k750621k392984j097895m95238l78887
2431b642198R80414L009901K767209j57130k232117j291301K09446l26188j161876
2422h43840M97412L309289L650058J136321j353612k263303k453289k173847n26646
2413a021457J676659J764538q84707l166709k020773J550118L638961K006311
2405C542941j457776k832483n31886K638505K524496j151150m115959l067504
2397d450816j5732J004033k0842L37716K742416L471152L56497l132587k491036
2388b199199J328725L291016J239224j756373k176222k54344J621249K266015
2380C360091J722236k14971l078954m284208j401556L879704O603055M425629
$$ plain form
2440 4906524 6210055 6665683 6195712 4473427 1722806 -670178 -1768073 -2263311 -2642198
2431 -2642198 -1661784 1348117 4115326 3958196 1726079 434778 644224 318036 -843840
2422 -843840 -346428 2962861 6612919 7749240 6395628 4132325 1679036 -494811 -1021457
2413 -1021457 655202 2419740 1535033 -1631676 -3652449 -2102331 1536630 3542941
2405 3542941 2085165 -747318 -1279204 1359301 3883797 2732647 -1383312 -4450816
2397 -4450816 -4466548 -3462515 -3483357 -3145641 -403225 3067927 3424424 291837 -2199199
2388 -2199199 -870474 2420542 3659766 1903393 -272829 -527173 1094076 3360091
2380 3360091 5082327 4867356 1788402 -2495806 -3897362 -17658 6585397 11011026
2372A1011026N61465o86286N64923J018689m54424j806573j815651j761254k337443
2363D294472k052875l83807L02947j512703l153982j429989J880074K195397p22641
2354e83107k222764j71902J627199j59227k592418j101411K735843L159102q22013
2345a30698l763556k114387O58816q0190l016158l458358o65325J745350J819364
2336i005142J433361K070128K274946Q09168o27710R1149K206231L290544K546391
$$ plain form
2372 11011026 11572491 10886205 11451128 12469817 12015393 10208820 8393169 6631915 4294472
2363 4294472 2241597 1857790 2160737 648034 -2505948 -3935937 -2055863 139534 -583107
2354 -583107 -2805871 -2977773 -1350574 -1509801 -4102219 -5203630 -2467787 691315 -130698
2345 -130698 -3894254 -6008641 -5349825 -5430015 -8446173 -11904531 -12569856 -10824506 -9005142
2336 -9005142 -7571781 -5501653 -3226707 -2417539 -3045249 -2954100 -747869 2542675 5089066
$$ [...]
##END NTUPLES=NMR SPECTRUM
##END=
