##TITLE=31Pdec_DE-109rm-3h
, 64 sc
 4.9.2025
##JCAMPDX= 6.0         $$ Bruker NMR JCAMP-DX V2.0
##DATA TYPE= NMR SPECTRUM
##DATA CLASS= NTUPLES
##ORIGIN= UXNMR, Bruker Analytische Messtechnik GmbH
##OWNER= root
$$ XWIN-NMR		Version 3.5
$$ Thu Sep  4 14:33:09 2025 Russian Standard Time (UT+4h)  she@DPX200
##.OBSERVE FREQUENCY= 81.013821
##.OBSERVE NUCLEUS= ^31P
##.ACQUISITION MODE= SIMULTANEOUS
##.ACQUISITION SCHEME= undefined
##.AVERAGES= 64
##.DIGITISER RES= 17
##SPECTROMETER/DATA SYSTEM= spect
##.PULSE SEQUENCE= zgpg30
##.SOLVENT NAME= CDCl3
##.SHIFT REFERENCE= (INTERNAL, CDCl3, 0, 198.062)
##AUDIT TRAIL= $$ (NUMBER, WHEN, WHO, WHERE, WHAT)
$$ ##TITLE= Audit trail, XWIN-NMR		Version 3.5
$$ ##JCAMPDX= 5.01
$$ ##ORIGIN= Bruker BioSpin GmbH
$$ ##OWNER= she
$$ F:/spectra/data/she/nmr/P31/2/pdata/1/auditp.txt
$$ ##AUDIT TRAIL=  $$ (NUMBER, WHEN, WHO, WHERE, WHAT)
(   1,<2025-09-04 14:31:17.43 +0400>,<she>,<DPX200>,
      <created by zg, POWCHK disabled, PULCHK disabled
       configuration hash MD5:
       00 E9 B6 7A A2 85 ED C7 34 08 36 98 17 FE 4E 26
       data hash MD5: 32K
       6D 53 37 FF 4A B3 8E D4 18 A4 95 84 6D 0E 55 BD>)
(   2,<2025-09-04 14:31:20.50 +0400>,<she>,<DPX200>,
      <Start of raw data processing
       efp BC_mod = 2 LB = 1.5 FT_mod = 6 PKNL = 1 PHC0 = 1419.605 PHC1 = 149.4999 SI = 64K 
       data hash MD5: 64K
       9E 87 53 F5 99 57 B8 5F 0D D4 60 C1 F1 9F 3D A5>)
(   3,<2025-09-04 14:31:41.18 +0400>,<she>,<DPX200>,
      <pk PHC0 = -66.1573 PHC1 = 0 
       data hash MD5: 64K
       F2 74 D3 09 68 D3 2B 5B B6 D9 CF D1 2D 40 BD 4B>)
(   4,<2025-09-04 14:32:07.54 +0400>,<she>,<DPX200>,
      <pk PHC0 = 2.97049 PHC1 = -5.4 
       data hash MD5: 64K
       FB 80 8F BD EB FD 18 E1 82 96 1D D8 30 7A 0F 95>)
(   5,<2025-09-04 14:32:32.95 +0400>,<she>,<DPX200>,
      <pk PHC0 = 1.292531 PHC1 = 0 
       data hash MD5: 64K
       47 2E 46 34 D5 83 72 00 7D AB 40 A5 45 43 19 1E>)
(   6,<2025-09-04 14:32:38.59 +0400>,<she>,<DPX200>,
      <abs ABSG = 5 
       data hash MD5: 64K
       D1 DB 7B 56 AC D8 AD EA 6E 15 44 55 B5 20 4D 1B>)
$$ ##END=
$$ 
$$ hash MD5
$$ 6A 22 98 F6 04 57 E1 21 DF 8B 63 4D 4E 66 77 A1
##$RELAX= 
##$RELAX= 
##$RELAX= 
##$RELAX= 
##$RELAX= 
##$RELAX= 
##$RELAX= 
##$RELAX= 
$$ Bruker specific parameters
$$ --------------------------
##$DU= <F:/spectra>
##$EXPNO= 2
##$NAME= <P31>
##$PROCNO= 1
##$TYPE= <nmr>
##$USER= <she>
##$AMP= (0..31)
100 100 100 100 100 100 100 100 100 100 100 100 100 100 100 100 100 100 
100 100 100 100 100 100 100 100 100 100 100 100 100 100 
##$AQSEQ= 0
##$AQ_mod= 1
##$AUNM= <au_zg>
##$AUTOPOS= <>
##$BF1= 81.014009
##$BF2= 200.13
##$BF3= 200.13
##$BF4= 200.13
##$BF5= 200.13
##$BF6= 200.13
##$BF7= 200.13
##$BF8= 200.13
##$BYTORDA= 1
##$CFDGTYP= 0
##$CFRGTYP= 5
##$CHEMSTR= <none>
##$CNST= (0..31)
1 1 145 1 1 1 1 1 1 1 1 1 1 1 1 1 1 1 1 1 1 1 1 1 1 1 1 1 1 1 1 1 
##$CPDPRG= <waltz16>
##$CPDPRG1= <>
##$CPDPRG2= <waltz16>
##$CPDPRG3= <>
##$CPDPRG4= <mlev>
##$CPDPRG5= <mlev>
$$ [...]
##$SUBNAM3= <"">
##$SUBNAM4= <"">
##$SUBNAM5= <"">
##$SUBNAM6= <"">
##$SUBNAM7= <"">
##$SUBNAM8= <"">
##$SUBNAM9= <"">
##$SW= 400.765351723535
##$SWIBOX= (0..15)
0 1 3 0 0 0 0 0 0 0 0 0 0 0 0 0 
##$SW_h= 32467.5324675325
##$TD= 32768
##$TD0= 1
##$TE= 0
##$TE2= 300
##$TE3= 300
##$TEG= 300
##$TL= (0..7)
0 120 53 12 22 120 120 120 
##$TP= (0..7)
150 150 150 150 150 150 150 150 
##$TP07= 0
##$TPNAME0= <>
##$TPNAME1= <>
##$TPNAME2= <>
##$TPNAME3= <>
##$TPNAME4= <>
##$TPNAME5= <>
##$TPNAME6= <>
##$TPNAME7= <>
##$TPOAL= (0..7)
0.5 0.5 0.5 0.5 0.5 0.5 0.5 0.5 
##$TPOFFS= (0..7)
0 0 0 0 0 0 0 0 
##$TUNHIN= 0
##$TUNHOUT= 0
##$TUNXOUT= 0
##$USERA1= <user>
##$USERA2= <user>
##$USERA3= <user>
##$USERA4= <user>
##$USERA5= <user>
##$V9= 5
##$VALIST= <valist>
##$VCLIST= <CCCCCCCCCCCCCCC>
##$VD= 0
##$VDLIST= <DDDDDDDDDDDDDDD>
##$VPLIST= <PPPPPPPPPPPPPPP>
##$VTLIST= <TTTTTTTTTTTTTTT>
##$WBST= 1024
##$WBSW= 4
##$XGAIN= (0..3)
0 0 0 0 
##$XL= 0
##$YL= 0
##$YMAX_a= 23189
##$YMIN_a= -28467
##$ZGOPTNS= <>
##$ZL1= 120
##$ZL2= 120
##$ZL3= 120
##$ZL4= 120
##$ABSF1= 198.0616
##$ABSF2= -202.7028
##$ABSG= 5
##$ABSL= 3
##$ALPHA= 0
##$AQORDER= 0
##$ASSFAC= 0
##$ASSFACI= 0
##$ASSFACX= 0
##$ASSWID= 0
##$AUNMP= <proc_1d>
##$AZFE= 0.1
##$AZFW= 0.5
##$BCFW= 0
##$BC_mod= 2
##$BYTORDP= 0
##$COROFFS= 0
##$CY= -3
##$DATMOD= 1
##$DC= 0
##$DFILT= <>
##$DTYPP= 0
##$F1P= 0
##$F2P= 0
##$FCOR= 1
##$FTSIZE= 65536
##$FT_mod= 6
##$GAMMA= 0
##$GB= 0
##$INTBC= 1
##$INTSCL= 9.790993e-09
##$ISEN= 30
##$LB= 1.5
##$LEV0= 0
##$LPBIN= 0
##$MAXI= 10000
##$MC2= 0
##$MEAN= 0
##$ME_mod= 0
##$MI= 50
##$NCOEF= 0
##$NC_proc= -9
##$NLEV= 6
##$NOISF1= 182.463
##$NOISF2= 159.3651
##$NSP= 0
##$NTH_PI= 0
##$NZP= 0
##$OFFSET= 198.0616
##$PC= 4
##$PHC0= 1357.71
##$PHC1= 144.0999
##$PH_mod= 1
##$PKNL= yes
##$PPARMOD= 0
##$PSCAL= 0
##$PSIGN= 0
##$REVERSE= no
##$SF= 81.0140089999434
##$SI= 65536
##$SIGF1= 159.3651
##$SIGF2= -187.1042
##$SINO= 113.3802
##$SIOLD= 16384
##$SREGLST= <1H.CDCl3>
##$SSB= 0
##$STSI= 65536
##$STSR= 0
##$SW_p= 32467.5324675325
##$SYMM= 0
##$S_DEV= 0
##$TDeff= 32768
##$TDoff= 0
##$TI= <>
##$TILT= no
##$TM1= 0
##$TM2= 0
##$TOPLEV= 0
##$USERP1= <user>
##$USERP2= <user>
##$USERP3= <user>
##$USERP4= <user>
##$USERP5= <user>
##$WDW= 1
##$XDIM= 65536
##$YMAX_p= 515823141
##$YMIN_p= -258806509
$$ End of Bruker specific parameters
$$ ---------------------------------
##NTUPLES= NMR SPECTRUM
##VAR_NAME=  FREQUENCY,     SPECTRUM/REAL,   SPECTRUM/IMAG
##SYMBOL=    X,             R,               I
##VAR_TYPE=  INDEPENDENT,   DEPENDENT,       DEPENDENT
##VAR_FORM=  AFFN,          ASDF,            ASDF
##VAR_DIM=   65536,         65536,           65536
##UNITS=     HZ,            ARBITRARY UNITS, ARBITRARY UNITS
##FACTOR=    0.49542278885378, 1,            1
##FIRST=     16045.7642231865, 0,            0
##LAST=      -16421.768244346, 0,            0
##MIN=       -16421.768244346, -258806509,   0
##MAX=       16045.7642231865, 515823141,    0
$$ Real data points
##PAGE= N=1
##DATA TABLE= (X++(R..R)), XYDATA
$$ [...]
##PAGE= N=2
##DATA TABLE= (X++(I..I)), XYDATA
7372G03341n314601k186953L370099Q564598J0925361P220692k776747j1442857
$$ 703341 -4611260 -6798213 -3428114 5136484 16061845 23282537 20505790 9062933
7364I062933r381900J721686R320363O329240K18411P25476N261580M498239j955496
$$ 9062933 -318967 1402719 10723082 17052322 17270733 17996209 23257789 27756028 25800532
7355B5800532n110731p90467M904421N707980K820285k90089l695344p699332
$$ 25800532 20689801 19899334 24803755 30511735 33332020 33041931 29346587 21647255
7347B1647255r515626p827111o092182o839106o922121l176000J460765K974686
$$ 21647255 12131629 4304518 -1787664 -8626770 -15548891 -18724891 -17264126 -14289440
7339a4289440L394264O316549Q808379N692999k25853j043321L587065N718414
$$ -14289440 -10895176 -4578627 4229752 9922751 9696898 8653577 12240642 17959056
7331A7959056K077525j424215q35257o96376m642973p546887l628938L562678
$$ 17959056 20036581 18612366 17777109 17080733 12437760 4890873 1261935 4824613
7323D824613O237329L163253j074845m060594o389645p299761n660796l396608
$$ 4824613 11061942 14225195 13150350 9089756 2700111 -4599650 -10260446 -13657054
7315a3657054k553554j090810L179504O929429N448039M85255j979673l07062
$$ -13657054 -16210608 -17301418 -14121914 -7192485 -1744446 -1259191 -3238864 -3545926
7307c545926K174358L467981L791890J708721l907680q756150o730983J218833
$$ -3545926 -1371568 2096413 5888303 7597024 3689344 -5066806 -11797789 -10578956
7299a0578956P929279R611723Q492044O300942K227727k122399l019047j393305
$$ -10578956 -2649677 6962046 15454090 21755032 23982759 21860360 18841313 17448008
7291A7448008k595807p497414j0284067p329979k103365J231645L217650N371800
$$ 17448008 14852201 7354787 -2929280 -10259259 -12362624 -11130979 -7913329 -2541529
7283b541529O405064M991785K021483j453229m168420k816331L381976O915351
$$ -2541529 3863535 8855320 10876803 9423574 5255154 2438823 5820799 12736150
7275A2736150k44042j2392746j4479849l678971N354931K390935l630482p89679
$$ 12736150 12492108 99362 -14380487 -18059458 -12704527 -10313592 -13944074 -14733753
7267a4733753O323107N930895n19922j869472L370928N692236J372123k654290
$$ -14733753 -8410646 -2479751 -2999673 -4869145 -1498217 4194019 5566142 2911852
7259B911852j606104Q72487J145233N19821k84778k878547n533889m030572J23048
$$ 2911852 1305748 2178235 3323468 3843289 3558511 679964 -4853925 -8884497 -8761449
7250h761449N53631l150301m103746J06146L408852K410571K275961O320070Q406694
$$ -8761449 -8207818 -11358119 -15461865 -15355719 -11946867 -9536296 -7260335 -940265 7466429
7241G466429K799626n215117o527598j403690K280191J021158j406510j517770
$$ 7466429 10266055 5050938 -1476660 -2880350 -600159 420999 -985511 -2503281
7233b503281l7480J615041L638462N994252P449420O762429L265513k452704p064838
$$ -2503281 -2540761 -925720 2712742 8706994 16156414 22918843 26184356 23731652 16666814
7224A6666814o334633o96079L744409K372277k573510o256278p204062n926736
$$ 16666814 10332181 9636102 13380511 15752788 13179278 6923000 -281062 -6207798
7216f207798k036016K701380K904056k780481o553763j464759O713486O814778
$$ -6207798 -8243814 -5542434 -2638378 -5418859 -11972622 -13437381 -6723895 90883
7208I0883k72964k543761L686835P303422L62588q421825o740830K935596Q514740
$$ 90883 -182081 -2725842 960993 8264415 8627003 205178 -6535652 -3600056 4914684
7199D914684O482934L442997K050789k256889r524208j1858499n804023J322361
$$ 4914684 11397618 14840615 16891404 14634515 5110307 -6748192 -12552215 -11229854
7191a1229854K776615J946666M218837O589182L516879k275811l887785j568701
$$ -11229854 -8453239 -6506573 -2287736 4301446 7818325 5542514 1654729 86028
7183H6028p55371j279503J426764N399989L531309k799726k925775O171977J2895462
$$ 86028 -669343 -1948846 -522082 4877907 8409216 5609490 2683715 8855692 21751154
7174B1751154P645818k903910o757943m187741l963992p377135p895583m624485
$$ 21751154 29396972 26493062 19735119 15547378 11583386 4206251 -3689332 -8313817
7166h313817m125084p715483p664848L35172R335465J0540793M539363j490934
$$ -8313817 -12438901 -20154384 -27819232 -27484060 -18148595 -7607802 -3068439 -4559373
7158d559373l285591j828714N90907K673573M089041N433721O832876O245681
$$ -4559373 -7844964 -9673678 -9082771 -6409198 -2320157 3113564 9946440 16192121
7150A6192121K058027k638062k785009Q43596J837579k045306n019035k478221
$$ 16192121 18250148 15612086 12827077 13670673 15508252 13462946 8443911 5965690
7142E965690J530742R10615k945041m115684j635108K30505l23980p00831M72935
$$ 5965690 7496432 8407047 5462006 1346322 -288786 -58281 -382261 -1083092 -610157
7133f10157J105030J0607o50664J110818L928525M850860K768439o25611k475787
$$ -610157 494873 505480 -145184 965634 4894159 9745019 12513458 11887847 9412060
7124I412060j573457K2881n19599k301285j532578J763457K098754k935279o837326
$$ 9412060 7838603 7861484 7341885 5040600 3508022 5271479 7370233 4434954 -2402372
7115b402372k929792M160463L849538m196738q352390k102020N946315M949573
$$ -2402372 -5332164 -1171701 2677837 -1518901 -9871291 -11973311 -6026996 -1077423
7107a077423k142561l907950J819885N246991M9214p405283q111613l008499N92744
$$ -1077423 -3219984 -7127934 -5308049 -61058 -11844 -7417127 -15528740 -18537239 -17944495
7098a7944495J196797M148177J0747433J3690543O875025m917651j1092992p933583
$$ -17944495 -16747698 -12599521 -1852088 11838455 18713480 13795829 2702837 -5230746
7090e230746j358365K339711L294829M334693N296974M457100K607868J760037
$$ -5230746 -6589111 -4249400 -954571 3380122 8677096 13134196 15742064 17502101
7082A7502101J296497p53200l300266l001221J84651J988724k46635l800436m756288
$$ 17502101 18798598 18045398 14745132 11743911 11928562 13917286 13670651 9870215 5113927
7073E113927l276336j887908n05773K989351P605017Q795601M764116M5485p8331
$$ 5113927 1837591 -50317 -556090 2433261 10038278 18833879 23597995 23643480 23565149
7064B3565149L091634L490339r53392n229238m274056Q9082J868082j297089n886531
$$ 23565149 26656783 30147122 29193730 23964492 19690436 19779518 21647600 20350511 14463980
7055A4463980p169687l663205K340575O239110L894824m103728j1278752j1397842
$$ 14463980 7294293 3631088 5971663 12210773 16105597 12001869 723117 -10674725
7047a0674725n609460k70766J794865L276265N366362M902774J220509j18481
$$ -10674725 -16284185 -16554951 -14760086 -11483821 -6117459 -1214685 5824 -112657
7039a12657M441989Q999044N572314l628334q523645n042543O57624K843216L566581
$$ -112657 4329332 13328376 18900690 15272356 6748711 1706168 2363792 5207008 8773589
7030H773589N875304O269347L53828p444249p293051K468097J1178278Q280583
$$ 8773589 14648893 20918240 21272068 13827819 6534768 9002865 20181143 28461726
7022B8461726l595126j1888125r216055j091149K528369k41971k714678j68899
$$ 28461726 24866600 12978475 3762420 2671271 5199640 4957669 2242991 2074092
7014B074092L912341L672348q59113m642904m675221k437109j46070J654189K477147
$$ 2074092 5986433 9658781 8799668 4156764 -518457 -2955566 -3101636 -1447447 1029700
7005A029700J365558p71276j093188J166697K814492Q72744k952724m395589k418774
$$ 1029700 2395258 1623982 530794 1697491 4511983 5384727 2432003 -1963586 -4382360
6996d382360k78882n93958j874738j467734j08293p82620l373826l742861K97369
$$ -4382360 -4661242 -5255200 -7129938 -8597672 -8705965 -9488585 -12862411 -16605272 -16307903
6987a6307903M965454N472560K892358J872284K657929R19360l901540o256200
$$ -16307903 -11342449 -5869889 -2977531 -1105247 1552682 2472042 -1429498 -7685698
6979g685698l234951J14598j326667m426998l124079J707757M401235L953160
$$ -7685698 -10920649 -10806051 -12132718 -16559716 -19683795 -17976038 -13574803 -9621643
6971i621643M042662M938139L154931p01221j540514J285885K059330j768690
$$ -9621643 -5578981 -640842 2514089 1812868 272354 1558239 3617569 1848879
6963A848879m995366l048058J300514L639839M609083O168536O279953K714304
$$ 1848879 -3146487 -6194545 -4894031 -1254192 3354891 9523427 15803380 18517684
6955A8517684j780773l413869l129349l444656k881709Q96697N162600N133017
$$ 18517684 16736911 13323042 10193693 6749037 3867328 4764025 9926625 15059642
6947A5059642R75382l442374o649616q902776p756732r94255P140977R445225
$$ 15059642 16035024 12592650 5943034 -2959742 -10716474 -11710729 -4569752 4875473
6939D875473N459599J450158N67559n09244m188506p565352p330024l871123J121394
$$ 4875473 10335072 11785230 12352789 11843545 7655039 89687 -7240337 -11111460 -9990066
6930i990066O231023Q424349N192408m11m96986L360203L508868l295571r287334
$$ -9990066 -3759043 4665306 9857714 9857303 9360317 12720520 16229388 12933817 3646483
6921C646483o921983l680K698145j3401k643686k831736k848430l280377k343684
$$ 3646483 -3275500 -3279180 -581035 -594436 -3238122 -6069858 -8918288 -12198665 -14542349
6912a4542349o94971n77821o77225K006153N390874L956167k099849n749412l021219
$$ -14542349 -15237320 -15815141 -16492366 -14486213 -9095339 -5139172 -7239021 -12988433 -16009652
6903a6009652J784478L282444K140143J743480K201868J658142M08524j21147
$$ -16009652 -14225174 -10942730 -8802587 -7059107 -4857239 -3199097 -2790573 -2911720
6895b911720k34582m99105L74997K801141L562130j30347m955130m239692L192670
$$ -2911720 -3146302 -3645407 -3270410 -469269 3092861 2962514 -1992616 -6232308 -3039638
6886c039638J0483341J0403272L339439l722779m873248q12377K670049J031466
$$ -3039638 7443703 17846975 21186414 17463635 12590387 11778010 14448059 15479525
6878A5479525m252606p463395n160804J79660L706217L803933K424244J070617
$$ 15479525 11226919 3763524 -1397280 -1217620 2488597 6292530 8716774 9787391
6870I787391p13240k852251l702802k771927k178190l514294m979244m053343
$$ 9787391 9074151 6221900 2519098 -252829 -2431019 -5945313 -10924557 -14977900
6862a4977900j835434j475870k361337J91032P450411J2966631R873870R45547
$$ -14977900 -16813334 -18289204 -20650541 -20459509 -13009098 -42467 9831403 10776950
6854A0776950l682685N45729O822498O492907L4625n411700o130320m142881j318035
$$ 10776950 7094265 7639994 14462492 20955399 20990024 15578324 9448004 5305123 3987088
6845C987088K539046N521456L797434j976281n722620m318689k081186l248718
$$ 3987088 6526134 12047590 15845024 13868743 8146123 3827434 1746248 -1502470
6837a502470m794494k029456K510075K695338o36307m58432M807716Q051961M361619
$$ -1502470 -6296964 -8326420 -5816345 -3121007 -3757314 -4215746 591970 8643931 13005550
6828A3005550j604858l355867k126689l012301n535804n049576j827741j292574
$$ 13005550 11400692 8044825 5918136 2905835 -2629969 -7679545 -9507286 -10799860
6820a0799860m279938m010433L792702J2899357J3669392N421715l385742o262386
$$ -10799860 -15079798 -19090231 -15297529 -2398172 11271220 16692935 13307193 7044807
6812G044807m898970l793146l558777k138538N84477K678572L047535J649164
$$ 7044807 2145837 -1647309 -5206086 -7344624 -6760147 -4081575 -1034040 615124
6804F15124j836133o560520q734971n001191K263108O656889N777710L925093
$$ 615124 -1221009 -7781529 -16516500 -21517691 -19254583 -12597694 -6819984 -2894891
6796b894891M899230N862320K148463m307638o521052k376880J935765M86538
$$ -2894891 2004339 7866659 10015122 5707484 -813568 -3190448 -1254683 -768145
6788g68145m093978m451306J112755O268110N184013j35296l381822k532415j235715
$$ -768145 -4862123 -9313429 -8200674 -1932564 3251449 3116153 -265669 -2798084 -4033799
6779d033799j981098k102170J377730O182838P520312M479873n6774m445292q529628
$$ -4033799 -6014897 -8117067 -6739337 -556499 6963813 11443686 11386912 6941620 -1588008
6770a588008r537271l751594O182320J1404327P487480J69631l153564k823770
$$ -1588008 -11125279 -14876873 -8694553 2709774 10197254 10366885 7213321 4389551
6762D389551l097219l685032j702667J202875J147913k81647J730134N931104
$$ 4389551 1292332 -2392700 -4095367 -2892492 -1744579 -2026226 -296092 5635012
6754E635012N938143J090395j770391O24056L046694J204060j544219j582152
$$ 5635012 11573155 12663550 10893159 11517215 14563909 15767969 14223750 12641598
6746A2641598k173082o950389j1726207r907296k579134L550439N815872O851736
$$ 12641598 10468516 3518127 -8208080 -18115376 -20694510 -17144071 -11328199 -4476463
6738d476463Q009392P764778N888578L838074J656156r02772j561125J122923
$$ -4476463 3532929 11297707 17186285 21024359 22680515 21777743 20216618 21339541
6730B1339541L247658K97388m936161n772829k198619m63413j878241o04575M949729
$$ 21339541 24587199 24884587 19948426 14175597 11976978 11513565 9635324 9030749 13980478
6721A3980478P172278P89993p588693q220324j923964K026112q29406n635096
$$ 13980478 21152756 21942749 14354056 6133732 4209768 6235880 5406474 -228622
6713b28622o170651j726148M042010O786686L998959k288218n486492j106144
$$ -228622 -6399273 -8125421 -4083411 2703275 6702234 4414016 -1072476 -2178620
6705b178620O494330Q257601K131571l783836j929479M667293O608300L99467
$$ -2178620 4315710 12573311 14704882 10921046 8991567 13658860 20267160 20666627
6697B0666627p379651q260345j428541O034354P020960J310267m921285n581540
$$ 20666627 13286976 5026631 3598090 9632444 16653404 17963671 13042386 7460846
6689G460846n14226M670090M254587k028461q777867j0055783m833370K464397
$$ 7460846 6946620 11616710 15871297 13842836 5064969 -4990814 -9824184 -7359787
6681g359787O591980O334378M644969M495735N399154M253911q06321p743915
$$ -7359787 -767807 5566571 10211540 14707275 20106429 24360340 23554019 15810104
6673A5810104j1846090r897074l400277K716514M983456M337801L524820K769671
$$ 15810104 3964014 -5933060 -9333337 -6616823 -1633367 2704434 6229254 8998925
6665H998925J88208l760415n237933j997592K937311N159481M978422O202482
$$ 8998925 9187133 5426718 188785 -1808807 1128504 6287985 11266407 17468889
6657A7468889R092066Q730537K400912m868443n885763p39460L565200K496261
$$ 17468889 26560955 35291492 37692404 32823961 26938198 26198738 29763938 32260199
6649C2260199j600738n260573q669118j1634407r976521j762588O059517M684022
$$ 32260199 30659461 25398888 16729770 5095363 -4881158 -6643746 -584229 4099793
6641D099793l573568p154363j639994L769980M25109o307028m926615N186928
$$ 4099793 526225 -6628138 -8268132 -4498152 -4073043 -10380071 -15306686 -10119758
6633a0119758J2933856J0499336J777340m939068o465741m953078l288267k774440
$$ -10119758 2814098 13313434 15090774 10151706 3685965 -1267113 -4555380 -7329820
6625g329820k709719r81255K849430N388158L521006n9891n8068K853214K541978
$$ -7329820 -10039539 -11020794 -8171364 -2783206 737800 677909 619841 3473055 6015033
6616F015033k140141l943484K097427J0176030J1217335M945794j426435l955709
$$ 6015033 3874892 -68592 2028835 12204865 23422200 28367994 26941559 22985850
6608B2985850m936768o047422n265958k107249l99226k669205n295042k944262
$$ 22985850 18049082 12001660 6735702 4628453 4229227 1560022 -3735020 -6679282
6600f679282L781647Q542066O941515J332394k879667l705183l506757m346765
$$ -6679282 -2897635 5644431 12585946 13918340 11038673 7333490 3826733 -520032
6592e20032m964299l409865q16784l07342k523989m310661k431151K542847O584595
$$ -520032 -5484331 -8894196 -9710980 -10018322 -12542311 -16852972 -19284123 -16741276 -10156681
6583a0156681O048422J397366k580093j401937L482411N611074J750123l330548
$$ -10156681 -4108259 -2710893 -5290986 -6692923 -3210512 2400562 4150685 820137
6575H20137l628162r84427j987923o788927p945273k152955L681057K354629k981362
$$ 820137 -2808025 -3792452 -5780375 -12569302 -20514575 -22667530 -18986473 -16631844 -19613206
6566a9613206l992807L27631L050898L82079l051886j551147L716236O960222
$$ -19613206 -23606013 -23278382 -20227484 -19845405 -22897291 -24448438 -20732202 -13771980
6558a3771980N399092J760094k0195P77624K068230K296426J727976O12045j723946
$$ -13771980 -8372888 -6612794 -6632989 -5855365 -3787135 -1490709 237267 849312 -874634
6549h74634m570697m726782n37696M235210M305105K41211k284566j026761L8528
$$ -874634 -5445331 -10172113 -10709809 -6474599 -2169494 -1928283 -4212849 -5239610 -5201082
6540e201082j730515k513693J669725P522454Q444669L919065j04142K99203K561526
$$ -5201082 -6931597 -9445290 -7775565 -253111 8191558 12110623 12006481 12305684 14867210
6531A4867210K351635o29901l228835l419016k436774k264298k180281L24794
$$ 14867210 17218845 16588944 13360109 9941093 7504319 5240021 3059740 3384534
6523C384534M604282N573635M00471n636525m823170K147533O667212M137562
$$ 3384534 7988816 13562451 13962922 8326397 3503227 5650760 12317972 16455534
6515A6455534p03941k268098j694711k614247m831065o300042o838709o056304
$$ 16455534 15751593 13483495 11788784 9174537 4343472 -1956570 -8795279 -14851583
6507a4851583k098586L847669O697376M987334L776696N687697N464172o62564
$$ -14851583 -16950169 -13102500 -6405124 -1417790 2358906 8046603 13510775 12848211
6499A2848211o730620n797064j230336n68548k957101k370643M49374k16550l655114
$$ 12848211 6117591 320527 -909809 -1478357 -4435458 -6806101 -6356727 -6573277 -10228391
6490a0228391l688654k3008J598744L04796J141518M769969N775488K331809j392584
$$ -10228391 -13917045 -13940053 -12341309 -12036513 -10894995 -6125026 -349538 1982271 589687
6481E89687l362394n377627o081101j687375N277738P504925M418832K563209
$$ 589687 -2772707 -8150334 -14231435 -15918810 -10641072 -3136147 1282685 3845894
6473C845894L496137J898248k725436l954305o20349O74057j651682j168434K985529
$$ 3845894 7342031 9240279 6514843 2560538 1940189 2614246 962564 -205870 2779659
6464B779659K959953k240417k528951M609016O277155m733609j5261945j1136735
$$ 2779659 5739612 3499195 970244 5579260 11856415 7122806 -8139139 -19275874
6456a9275874J248255P254863O833057Q671470J0697240M772849m874380o347409
$$ -19275874 -18027619 -10772756 -3939699 4731771 15429011 20201860 15327480 8980071
6448H980071l48239J526939k805347m179856o12174m16346n072296n306517J973063
$$ 8980071 8631832 10158771 7353424 3173568 2561394 2145048 -2927248 -8233765 -6260702
6439f260702P691764O228144L307513L078972N67453o482726j0439385o168776
$$ -6260702 1431062 7659206 10966719 14045691 14613144 8130418 -2308967 -8477743
6431h477743k08389K93383j331884Q31532M429338M073387P55646j662637l580802
$$ -8477743 -8686132 -8392749 -9724633 -8893101 -4463763 -390376 365270 -1297367 -4878169
6422d878169o181056o292917j796290K595916J702061k081104l219266j592933
$$ -4878169 -11059225 -17352142 -19148432 -16552516 -14850455 -16931559 -20150825 -21743758
6414b1743758p46049j183931r40677K79862K122354N343922Q692826Q224206L494646
$$ -21743758 -22489807 -23673738 -24614415 -24334553 -22212199 -16868277 -8175451 48755 3543401
6405C543401m86717j250157k702473o460421o681015j35994N701377L172689k893016
$$ 3543401 3056684 1806527 -895946 -7356367 -14037382 -14173376 -8471999 -5299310 -8192326
6396h192326k634450L395083O616324M873790L436963L287380k22246o666277
$$ -8192326 -10826776 -7431693 -815369 4058421 7495384 10782764 10560518 3894241
6388C894241r183138n703319k091525j583666M9694N394355R508361P546946J854105
$$ 3894241 -5288897 -10992216 -13083741 -14667407 -14617713 -9223358 285003 7831949 9686054
6379I686054k723756n003647n152168j882579L508051N222366J78758o453320
$$ 9686054 6962298 1958651 -3193517 -5076096 -1568045 3654321 3833079 -2620241
6371b620241p675913l659320K46338J838163L191428M745143L628415j085866
$$ -2620241 -10296154 -13955474 -13709136 -11870973 -8679545 -3934402 -305987 -1391853
6363a391853n189181l754696K486650P288767O069513J592867K47262L001936
$$ -1391853 -6581034 -10335730 -7849080 -560313 5509200 7102067 7349329 10351265
6355A0351265M093719N40312k125877J386913O073632L306377m633247o526451
$$ 10351265 14444984 14985296 12859419 14246332 20319964 23626341 18993094 12466643
6347A2466643M91978N967037K252733m170169m030712M04716J130460j487980
$$ 12466643 12958621 18925658 21178391 17008222 12977510 13382226 14512686 13024706
6339A3024706o01276M188580N956441K098764k100215k629496j895272k916211
$$ 13024706 12423430 16612010 22568451 24667215 22567000 19937504 18042232 15126021
6331A5126021m766003n780059n883002m200502L01227M559489L753446m23016
$$ 15126021 10360018 4579959 -1303043 -5503545 -5202318 -642829 3110617 2687601
6323B687601m06441N560417R336573M935884j826686k091674K636485L463146
$$ 2687601 2281160 7841577 17178150 22114034 20287348 18195674 20832159 24295305
6315B4295305k299322q244830q788535m954215J45842N150700Q134445O060965
$$ 24295305 21995983 13751153 4962618 8403 154245 5304945 13439390 19500355
6307A9500355n15732n948673n586461j117226K169814J626691p87216j345503
$$ 19500355 18984623 13035950 7449489 6332263 8502077 10128768 9341552 7996049
6299G996049J620951N658527O048676J359224l701201l768458l04369N49852k451732
$$ 7996049 9617000 15275527 21324203 22683427 18982226 15213768 14909399 15459251 13007519
6290A3007519l598397M20420M552144K779788k641399m616379j602539J049154
$$ 13007519 9409122 9829542 14381686 17161474 14520075 9903696 8301157 9350311
6282I350311k28574k393649j098882K942555N406077M395902K578741L137904
$$ 9350311 9121737 6728088 5629206 8571761 13977838 18373740 20952481 24090385
6274B4090385M965915L405787l540137j1172393j2694686p562433k123717j313358
$$ 24090385 29056300 32462087 28921950 17749557 5054871 -2507562 -4631279 -5944637
6266e944637l372713m482608m446152m402419k685771K050404O042457M505700
$$ -5944637 -9317350 -13799958 -18246110 -22648529 -25334300 -23283896 -17241439 -12735739
6258a2735739m80361k052696J271097L418482L23976l849690l098644K086619
$$ -12735739 -13216100 -15268796 -13997699 -10579217 -10255241 -14104931 -17203575 -15116956
6250a5116956O540159P611140O518671M291011N81145l455088m489558p41578
$$ -15116956 -8576797 -965657 5553014 9844025 10425170 6970082 2480524 1738946
6242A738946N008151P534626M418930j357895m664803l879810k003481j759509
$$ 1738946 6747097 14281723 18700653 17342758 12677955 8798145 6794664 5035155
6234E035155j859833j09377J941573J017819k106110k943148J53005L498804L333933
$$ 5035155 3175322 3065945 5007518 6025337 3919227 976079 1129084 4627888 7961821
6225G961821M40907j855259j636099Q17089L536865L306528j238424n901120m279690
$$ 7961821 8402728 6547469 4911370 5728459 9265324 12571852 11333428 5432308 1152618
6216A152618L119595P369753K243986o753887r251699l647754J606618K2951m899065
$$ 1152618 4272213 11641966 13885952 7132065 -2119634 -5767388 -4160770 -4137819 -9036884
6207i036884n412760L35128O710937P822733M020028O94612J442476L715145K385568
$$ -9036884 -14449644 -14114516 -7403579 419154 4439182 5133794 6576270 10291415 12676983
6198A2676983l034566p124302n291408M87260M388575L552738J63273k153603
$$ 12676983 9642417 2518115 -2773293 -2286033 2102542 5655280 5818553 3664950
6190C664950j960124n41194k83439k055554l434408r15257M929162Q390405M995787
$$ 3664950 1704826 1163632 880193 -1175361 -4609769 -5525026 -595864 7794541 12790328
6181A2790328k277515n819625k153242M384861O951459L407433k334572n022759
$$ 12790328 10512813 4693188 2539946 6924807 13876266 17283699 14949127 9926368
6173I926368l326076m39966K48923q38590q40419J109812L024621L405667K707887
$$ 9926368 6600292 6160326 6409249 5570659 4730240 5840052 8864673 12270340 14978227
6164A4978227J098110k146530n932800p159173m807503j345163J414950M420179
$$ 14978227 16076337 13929807 7997007 837834 -3969669 -5314832 -3899882 520297
6156E20297P496811P513121L488397m43598j082390j371687m791583q115509n836222
$$ 520297 8017108 15530229 19018626 18575028 17492638 16120951 11329368 3213859 -2622363
6147b622363N82461M447889L521764J426015K36503j239322j822604J618387O603700
$$ -2622363 -2039902 2407987 5929751 7355766 7592269 6352947 4530343 6148730 12752430
6138A2752430N703316k088059p856573n114725Q61788J813396r98877n20307L505448
$$ 12752430 18455746 16367687 8511114 3396389 4258177 6071573 5072696 4552389 8057837
6129H057837M230242p05243n264508m411592r61755N913j400245k010525j701159
$$ 8057837 12288079 11582836 6318328 1906736 944981 950894 -449351 -2459876 -4161035
6120d161035k652606m076546k426612K845048P659081Q697179P172804N384005
$$ -4161035 -6813641 -10890187 -13316799 -10471751 -2812670 5884509 13057313 18441318
6112A8441318K697299j875273n594177m943772j602576n56087k209553j791844
$$ 18441318 21138617 19263344 13669167 8725395 7122819 6566732 4357179 2565335
6104B565335K076799M096304O44266m080411m787785l084734l042308l107021
$$ 2565335 4642134 8738438 9382704 5302293 514508 -2570226 -5612534 -8719555
6096h719555L77242M626731L621651j567976m077441k453653j713917k706382
$$ -8719555 -8342313 -3715582 -93931 -1661907 -5739348 -8193001 -9906918 -12613300
6088a2613300k97075N437178O621939R67328k389977K411197O793340J170947
$$ -12613300 -12910375 -7473197 -851258 116070 -2273907 137290 6930630 8101577
6080H101577p989228o969770L574369R329887M064546k600422j829038K140769
$$ 8101577 112349 -6857421 -3283052 6046835 10111381 7510959 5681921 7822690
6072G822690J992529l83533N28189L063197J912423j718188k030835J173701K004965
$$ 7822690 9815219 9431686 9959875 13023072 14935495 13217307 11186472 12360173 14365138
6063A4365138k001040o483647p036555l718815J999825Q962192J3260020R475190
$$ 14365138 12364098 5880451 -1156104 -4874919 -2875094 6087098 19347118 28822308
6055B8822308j324881r595562q117424j493544M03566l833608o197755j657420
$$ 28822308 27497427 17901865 9784441 8290897 8694463 4860855 -1336900 -2994320
6047b994320N004047O807638L806532J123507J176091J901556J177785m38600
$$ -2994320 2009727 8817365 12623897 13747404 14923495 16825051 18002836 17564236
6039A7564236j143047j27752J269989J12901m685841q977615o815858R85204N871246
$$ 17564236 16421189 16293437 17563426 17676327 12990486 4012871 -2802987 -1817783 4053463
6030D053463K539086l239862k904020K428479M739674K061541N5888O70675j345150
$$ 4053463 6592549 3352687 448667 2877146 7616820 9678361 9734249 10404924 9059774
6021I059774p555088j0173881l114338P645498J1583179P391590K449184J291348
$$ 9059774 1504686 -8669195 -11783533 -4138035 7445144 14836734 17285918 18577266
6013A8577266J510370J88048j738756k021403K50649M539496Q024653O140917
$$ 18577266 20087636 20275684 18536928 16515525 16766174 21305670 29330323 35471240
6005C5471240j829416r129476q788428l667996k990860q560230j1683654o382668
$$ 35471240 33641824 24512348 15723920 12055924 9065064 504834 -11178820 -17561488
5997a7561488J364529K636245j548912l121974K78313L054439J958348J284969
$$ -17561488 -16196959 -13560714 -15109626 -18231600 -17953287 -14898848 -12940500 -11655531
5989a1655531N046210R588995Q670648K757077j852317k035932r61072j777192
$$ -11655531 -6609321 2979674 11650322 14407399 12555082 10519150 9558078 7780886
5981G780886l107080k963471k899353m594731n452447k321064K272669L032739
$$ 7780886 4673806 1710335 -1189018 -5783749 -11236196 -13557260 -11284591 -8251852
5973h251852M10929K49034M123928O425237L629791J89745O59620J613427j954038
$$ -8251852 -7840923 -7591889 -3467961 2957276 6587067 6776812 7436432 9049859 7095821
5964G095821o194714k791872P327553J3160382Q178073j406397o046187m705681
$$ 7095821 901107 -1890765 5436788 18597170 26775243 25368846 19322659 14616978
5956A4616978l103717m486981p060261q134363o362849j272373N458305R105325
$$ 14616978 11513261 7026280 -33981 -8168344 -14531193 -15803566 -10345261 -1239936
5948a239936O120850p13069m507470k048229L193360O094427N184165K126127
$$ -1239936 4880914 4167845 -339625 -2387854 805506 6899933 12084098 14210225
5940A4210225j295841l747680l779717j217117J407920R91951k306460n038075
$$ 14210225 12914384 9166704 5386987 4169870 5577790 6569741 4263281 -774794
5932g74794m824714l161507k689481l040373j551504K199482N126272M925384
$$ -774794 -5599508 -8761015 -11450496 -14490869 -16042373 -13842891 -8716619 -3791235
5924c791235L475687L837112N161947L519210k055943p158632p180393l018795
$$ -3791235 -315548 3521564 8683511 12202721 10146778 2988146 -4192247 -7211042
5916g211042M81475Q43659K55337J418934L600246M325284L326057K356247J594463
$$ -7211042 -6729567 -5885908 -5630571 -4211637 -611391 3713893 7039950 9396197 10990660
5907A0990660p99242m510727n315557l57787O292099P184125R95516n170229m837148
$$ 10990660 10191418 5680691 365134 7347 6299446 13483571 14479087 9308858 4471710
5898D471710l00976J616131k60476n42803L173527N257158K08439p466932p412804
$$ 4471710 4170734 5786865 5526389 4983586 8157113 13414271 13622710 6155778 -1257026
5889a257026K279565J0618030P113750m179820r760485m656889J596621p17132
$$ -1257026 1022539 11640569 18754319 14574499 4814014 157125 1753746 1036614
5881A036614p655175q028489N9585O916885N465374K93429l94775L828257O818962
$$ 1036614 -6618561 -14647050 -14587465 -7670580 -2205206 -1911777 -2306552 1521705 8340667
5872H340667M950558J60348m325350o877730o697362m016422j263274j010481
$$ 8340667 13291225 13451573 9126223 2248493 -4448869 -8465291 -9728565 -10739046
5864a0739046k384296j980454J375004N155950O776933O252997M498459J512338
$$ -10739046 -13123342 -15103796 -13728792 -8572842 -1795909 4457088 8955547 10467885
5856A0467885k121066l922370k193532P02697L33521l920271p120527m668126
$$ 10467885 8346819 4424449 2230917 2933614 3267135 -653136 -7773663 -12441789
5848a2441789J335676M218247J100771l927335o121992o160273o931591p089544
$$ -12441789 -11106113 -6887866 -5787095 -9714430 -15836422 -21996695 -28928286 -36017830
5840c6017830k717480N254333J0373173Q529027K559211k242308l468395j128813
$$ -36017830 -38735310 -33480977 -23107804 -14578777 -12019566 -14261874 -17730269 -18859082
5832a8859082L925747Q644765Q488511K626549m026760o378415m329015o50516
$$ -18859082 -14933335 -6288570 2199941 4826490 799730 -5578685 -9907700 -10558216
5824a0558216K825803M525930K588188j569485k695718J405556N702935M740062
$$ -10558216 -7732413 -3206483 -618295 -2187780 -4883498 -3477942 2224993 6965055
5816F965055K84210k392141k485970k535608k404411n86353R02582m18905j520982
$$ 6965055 7249265 4857124 2371154 -164454 -2568865 -3155218 -2252636 -2671541 -4192523
5807d192523J838169O372127N069374o92730k008987L130561N680523m12399q416798
$$ -4192523 -2354354 4017773 9087147 8394417 6385430 9515991 15196514 14784115 6367317
5798F367317q741985k131339L509518M717725M213573M058988L486459K235580
$$ 6367317 -2374668 -4506007 -996489 3721236 7934809 11993797 15480256 17715836
5790A7715836R05840j196864m379534n839488k994509J144955O55961m609187
$$ 17715836 18621676 17424812 13045278 7205790 4211281 5356236 6012197 1403010
5782A403010p320989j857047P626472J1477474O249001j055108k080484J828702
$$ 1403010 -5917979 -7775026 -148554 11328920 17577921 16522813 14442329 16271031
5774A6271031J801901n073045r903155l843928Q148117J2299082L851526p281391
$$ 16271031 18072932 12999887 3096732 -747196 7400921 19700003 23551529 16270138
5766A6270138j0103882n085601N3621J323047M19491n10079r87443q28239m09416
$$ 16270138 6166256 1080655 1134276 2457323 2876814 2366735 1379292 551053 141637
5757A41637j032531k418570j753640K182677O174431O779743N188387M552620
$$ 141637 -890894 -3309464 -5063104 -2880427 3294004 10073747 15262134 19814754
5749A9814754M393616J573242m004200q284698p857851l562410O86265J281255
$$ 19814754 24208370 25781612 21777412 13492714 5634863 2072453 2758718 4039973
5741D039973k036876n249002l629319K262187O131328L545689k163803m392032
$$ 4039973 2003097 -3245905 -6875224 -4613037 1518291 5063980 2900177 -1491855
5733a491855j772064J361954J963330J641814K568869L560191K162733j200964
$$ -1491855 -3263919 -1901965 61365 1703179 4272048 7832239 9994972 8794008
5725H794008l321022k217514M30591J630088R55445M36355P73263M33915l59302
$$ 8794008 5472986 3255472 3686063 5316151 6271596 6707951 7481214 7915129 7555827
5716G555827J590053O490473Q045337J400673p862924r755732l937721L47136
$$ 7555827 9145880 15636353 23681690 25082363 17219439 7463707 3525986 3873122
5708C873122j123706k378842M05806J279015m525522j0300148o997326L012716
$$ 3873122 2749416 370574 776380 2055395 -2470127 -12770275 -19767601 -16754885
5700a6754885R980809J0416327P993991M205012k255691q160968p445344j065103
$$ -16754885 -6774076 3642251 11636242 15841254 13585563 5424595 -2020749 -3085852
5692c085852K905768N69710l249704l275235k30338K729374M190055L172781r50648
$$ -3085852 -180084 389626 -2860078 -6135313 -6365651 -3636277 553778 3726559 2775911
5683B775911n243518m895808n3324L786382L845668L349194M681891M897794J466925
$$ 2775911 -2467607 -7363415 -7416739 -3630357 215311 3564505 8246396 13144190 14611115
5674A4611115k405367k574146n24722o45800l243682m535179k500428P75132K402771
$$ 14611115 12205748 9631602 9106880 8461080 5217398 682219 -1818209 -1043077 1359694
5665A359694K023658J753370L745689P360994Q705941M517058l314844r084348
$$ 1359694 3383352 5136722 8882411 16243405 24949346 29466404 26151560 17067212
5657A7067212r468141o237016k668564j63163R24019L43076o89148k723K126903
$$ 17067212 7599071 1362055 -1306509 -1469672 -545653 -202577 -891725 -894448 1232455
5648A232455K848657J492766J160506L223515L636064j434546q472979r711370
$$ 1232455 4081112 5573878 6734384 9957899 13593963 12159417 3686438 -6024932
5640f024932l104863M778601O770611K845443j828906m046990m861731n620493
$$ -6024932 -9129795 -4351194 2419417 5264860 3435954 -611036 -5472767 -11093260
5632a1093260n179524k505467L76469P85490l28172L12916K862370L857385K061958
$$ -11093260 -16272784 -18778251 -18401782 -17616292 -17944464 -17631548 -14769178 -10911793 -8849835
5623h849835P72559K078738K798899k06965l950639l303473J030304L679966K630630
$$ -8849835 -8077276 -5998538 -3199639 -3406604 -7357243 -10660716 -9630412 -5950446 -3319816
5614c319816Q11914N0361r98406k125950k71659M879162Q441110O392830J052691
$$ -3319816 -2507902 -2457541 -3455947 -5581897 -5853556 -974394 7466716 13859546 14912237
5605A4912237k255489j862158n72998j095619k677796k165369K057637P075547
$$ 14912237 12656748 10794590 10221592 9125973 6448177 4282808 6340445 13415992
5597A3415992P620831K608241k458262k446196J4023j438437o551939p998558
$$ 13415992 21036823 23645064 21186802 18740606 18754629 17316192 10764253 2765695
5589B765695k289133M512203M938095k37950m224397l408459n18267L61057j210412
$$ 2765695 476562 4988765 9926860 9688910 5464513 2056054 1537787 1898844 688432
5580F88432k403756r90628J972098L578003K947889K177747K660291K655585M55169
$$ 688432 -1715324 -2705952 -733854 2844149 5792038 7969785 10630076 13285661 13740830
5571A3740830k304960l265623l113262l444698l164723j028886N00281j236458
$$ 13740830 11435870 8170247 5056985 1612287 -1552436 -2581322 -2081041 -3317499
5563c317499l696092k594624R54609K470282J445416L45881j513098n331081o147404
$$ -3317499 -7013591 -9608215 -8653606 -6183324 -4737908 -4392027 -5905125 -11236206 -17383610
5554a7383610J390489J1239484J1213882J436534m372957N09639O258397L435906
$$ -17383610 -15993121 -4753637 6460245 7896779 3523822 4033461 10291858 13727764
5546A3727764k553953k658625N76870l11400l773737l478038o33223o11739j593093
$$ 13727764 11173811 8515186 9092056 8780656 5006919 1528881 895658 283919 -1309174
5537a309174J922143P204638O396005R1062l213368j006339M75465j818751l321019
$$ -1309174 612969 7817607 14213612 14304674 11091306 10084967 10560432 8741681 5420662
5528E420662j616286j249131m987687p942719m972204J465878M943968K868372
$$ 5420662 3804376 2555245 -2432442 -10375161 -15347365 -13881487 -8937519 -6069147
5520f069147k093591n371473l716918K013092O618688N980908K273521K83311
$$ -6069147 -8162738 -13534211 -17251129 -15238037 -8619349 -2638441 -364920 -81609
5512h1609M0078j744882m191579k945876J485652L221105L58199j972272l26866
$$ -81609 -41531 -1786413 -5977992 -8923868 -7438216 -4217111 -3858912 -5831184 -6158050
5503f158050J868215J287520O81557L146330N429906K735007k854444m550827
$$ -6158050 -4289835 -3002315 -2320758 825572 6255478 8990485 6136041 1585214
5495A585214l63050M455520M646667Q90839k584324l759770m093503m634343l189931
$$ 1585214 1222164 5677684 10324351 11215190 8630866 4871096 777593 -3856750 -7046681
5486g046681K646247J0336152J3441751R149373J973162k041153j980442n24369
$$ -7046681 -4400434 5935718 19377469 28526842 30500004 28458851 26478409 25954040
5478B5954040P43042P92037k510330q466675j1002337o045953J032052K112956
$$ 25954040 26697082 27489119 24978789 16512114 5509777 -536176 495876 2608832
5470B608832j713328k878574n97213j688289p310029r085120k063199P283891
$$ 2608832 895504 -1983070 -2580283 -4268572 -11578601 -20663721 -22726920 -15443029
5462a5443029J0817478Q939954N965079K441895j944203m182328l203829l716663
$$ -15443029 -4625551 4314403 10279482 12721377 10777174 6594846 3391017 -325646
5454c25646p891737q721335N0328J1741306J4006402O020073j261036j433231
$$ -325646 -8217383 -16938718 -16888390 -5147084 8859318 14879391 13618355 12185124
5446A2185124N15877q19892k890797j891924k02252j236795k066527K049373Q282493
$$ 12185124 12701001 11881109 8990312 7098388 6896136 5659341 3592814 5642187 13924680
5437A3924680Q212712l68404r039017q713388q68077M656291K019173m230873
$$ 13924680 22137392 21768988 12729971 4016583 3148506 7804797 9823970 5593097
5429E593097o305945l379400j089000k286676l136669K27268N380630P272131
$$ 5593097 -712848 -4092248 -5181248 -7467924 -10604593 -10377325 -4996695 2275436
5421B275436N662207M777838O208299O095199O23149q104452j3573718j1712882
$$ 2275436 7937643 12715481 18923780 25018979 25642128 17537676 3963958 -7748924
5413g748924n068207K74150J492115J476823L730820O745763O431652L219663
$$ -7748924 -12817131 -12542981 -11050866 -9574043 -5843223 902540 7334192 10553855
5405A0553855K118525M530539N042291k27280o443414o518423j872297j28285
$$ 10553855 12672380 17202919 22245210 22017930 15574516 9056093 7183796 7055511
5397G055511k997393l843118J076092O045043M756460J97312k87267L566344N230192
$$ 7055511 4058118 215000 1291092 7336135 12092595 12289907 12002640 15568984 20799176
5388B0799176J956739j818935k525872k450362m009124m682016j925798J240113
$$ 20799176 22755915 20936980 18411108 15960746 11951622 7269606 5343808 6583921
5380F583921Q57308q92302P04610M105946L203840k396616n889434l628704k59074
$$ 6583921 7441229 6548927 7253537 11359483 14563323 12166707 6277273 2648569 2389495
5371B389495n04397j992819o15501K132214K476341J173799J482288L171937L856978
$$ 2389495 1885098 -107721 -723222 1408992 3885333 5059132 6541420 9713357 13570335
5362A3570335L787982L928096J672356n396880j3082712j4326609q848813l129690
$$ 13570335 17358317 21286413 22958769 17561889 4479177 -9847432 -18696245 -21825935
5354b1825935j162465j162657j189782j535338j027215K398049O151772M567809
$$ -21825935 -22988400 -24151057 -25340839 -26876177 -27903392 -25505343 -19353571 -14785762
5346a4785762j945020n580715j679738N140245Q416228P874041O444577M431022
$$ -14785762 -16730782 -22311497 -23991235 -18850990 -10434762 -2560721 3883856 8314878
5338H314878J148804j515159j665655q43216j308813k245291j629527L12190J830216
$$ 8314878 9463682 7948523 6282868 5439652 4130839 1885548 256021 568211 2398427
5329B398427J675773q38355m810273o187134j675010M866533N622782K05449k829309
$$ 2398427 4074200 3235845 -1574428 -7761562 -9436572 -4570039 1052743 1258192 -1571117
5320a571117J031811N068993K220606l789042n171954k251966p98082j248183
$$ -1571117 -539306 4529687 6750293 2961251 -2210703 -4462669 -5260751 -6508934
5312f508934P28959N057994O785103L976733o78706n109909q298221p144726k81653
$$ -6508934 -5779975 -721981 6063122 10039855 9361149 4251240 -4046981 -11191707 -11473360
5303a1473360O031370L890719m193885p281504j244768N915654O321557K074369
$$ -11473360 -5441990 -1551271 -5745156 -13026660 -14271428 -8355774 -2034217 40152
5295D0152r09123k059067l844415n234860l420700L38628J550086j545928n935029
$$ 40152 -868971 -2928038 -6772453 -12007313 -15428013 -15089385 -13539299 -15085227 -21020256
5286b1020256p237850l478165L459205Q897150R150217M992370Q5333l567018
$$ -21020256 -28258106 -31736271 -28277066 -19379916 -10229699 -5237329 -5151996 -8719014
5278h719014n913603n305753O19058R287675J3321221R264618K355774q15629
$$ -8719014 -14632617 -19938370 -19319312 -10031637 3289584 12554202 14909976 14094347
5270A4094347r45660l022948p372134r102963n927843j518275M6644n22582J37136
$$ 14094347 13148687 10125739 2753605 -6349358 -12277201 -13795476 -13748832 -14271414 -14134278
5261a4134278L107274O184319O502192L067518k110086m673695j392776N592703
$$ -14134278 -11027004 -4842685 1659507 4727025 2616939 -2056756 -3449532 2143171
5253B143171R404139N346659l365746q763636o796263q56693L319298L690595
$$ 2143171 11547310 16893969 13528223 4764587 -2031676 -2888369 430929 4121524
5245D121524J991266N03086P87784L602410P483516Q673953N040179p49298m180978
$$ 4121524 6112790 6615876 7403660 11006070 18489586 27163539 32203718 31454420 27273442
5236B7273442l962154j957117P2331N58791k799348r461002j3254710q985595
$$ 27273442 23311288 21354171 21426502 21985293 19185945 9724943 -3529767 -12515362
5228a2515362r84592J742705j057526n39443O250437J0358658M991563l017521
$$ -12515362 -13499954 -11757249 -12814775 -13354218 -7103781 3254877 8246440 5228919
5220E228919l751081L93877k54131o116030p820059j675487M605476M117400L98727
$$ 5228919 1477838 1871715 1617584 -4498446 -12318505 -13993992 -9388516 -5271116 -4872389
5211d872389O10076M854365P248779M622012j09059k305433o65069K160959K929365
$$ -4872389 -4262313 592052 7840831 12462843 12353784 10048351 9383282 11544241 14473606
5202A4473606J286316o67900j992899l902839o291065o178854j894871L686826
$$ 14473606 15759922 15092022 13099123 9196284 2905219 -3273635 -5168506 -1481680
5194a481680O694017O709417N189966K432560p65818j791370m73020j111999n495314
$$ -1481680 5212337 11921754 17111720 19544280 18778462 16987092 16514072 15402073 9906759
5185I906759p669907j948637O999874R542486M652146L2713n10237j081374m097018
$$ 9906759 2236852 288215 7288089 16830575 21482721 21515434 21005197 19923823 15826805
5176A5826805n358017j940535J931789J022502l750293p756342q521046o565923
$$ 15826805 10468788 8528253 10460042 11482544 7732251 -24091 -8545137 -15111060
5168a5111060l674566k111099k535557k029923K216263P384694P936920L980533
$$ -15111060 -18785626 -20896725 -23432282 -25462205 -23245942 -15861248 -7924328 -3943795
5160c943795J093857J564601K318540K360568M714168Q803520Q798640L196054
$$ -3943795 -2849938 -1285337 1033203 3393771 8107939 16911459 25710099 28906153
5152B8906153j448601r37929k52694m162115q024809n620078p04584j750555q094346
$$ 28906153 27457552 26519623 26266929 22104814 14080005 8459927 7755343 6004788 -2089558
5143b089558j0343558m158992M082047O503818K701125k132902l701007j584513
$$ -2089558 -12433116 -16592108 -12510061 -6006243 -3305118 -5438020 -9139027 -10723540
5135a0723540J362134J553004j477722l779076j425614M303254Q268956P375672
$$ -10723540 -9361406 -7808402 -9286124 -13065200 -14490814 -10187560 -1918604 5457068
5127E457068L124134r84997k598725j728431n40347j208464k792361j746321K996341
$$ 5457068 8581202 7596205 4997480 3269049 2728702 1520238 -1272123 -3018444 -22103
5118b2103P364109O697625J439733l833934n705872m242023j458800L85467Q4912
$$ -22103 7342006 14039631 15479364 11645430 5939558 1697535 238735 624202 709114
5109G09114j084480l61836K590825M406095K412804j374363k802461q45616J633873
$$ 709114 -375366 -737202 1853623 6259718 8672522 7298159 4495698 3650082 5283955
5100E283955J371703k498885p812502j0257540o632597J216218P301878P687812
$$ 5283955 6655658 4156773 -3655729 -13913269 -20545866 -19329648 -12027770 -4339958
5092d339958M060594K60026j939128k004243R22463N664259P769181M437150r18287
$$ -4339958 -279364 -19338 -1958466 -3962709 -3040246 2624013 10393194 14830344 13912057
5083A3912057k728116p60173L30288j528875l122740j833623l80716k628148o534026
$$ 13912057 11183941 10423768 10754056 9225181 6102441 4268818 3888102 1259954 -5274072
5074e274072n377330K856247J0602854Q909016n92666o786233l434445K868817
$$ -5274072 -10651402 -7795155 2807699 11716715 11124049 4337816 903371 3772188
5066C772188K908459j907077l045588J383622M569802K523785m49658J58818K487164
$$ 3772188 6680647 4773570 1727982 3111604 7681406 10205191 9755533 9914351 12401515
5057A2401515L001497K048044J192845k30896k468320l306887j821285m94968
$$ 12401515 15403012 17451056 18643901 18413005 15944685 12637798 10816513 10321545
5049A0321545j037347j847603j786639k205436l091718j997845P87684J194383
$$ 10321545 9284198 7436595 5649956 3444520 352802 -1645043 -857359 337024
5041C37024j742459l482327j682245l77049k460630m014724j133438L080731L754888
$$ 337024 -1405435 -4887762 -6570007 -6947056 -9407686 -13422410 -14555848 -11475117 -7720229
5032g720229J506893p92111l249603n307771k644218N373174J0558998O314532
$$ -7720229 -6213336 -7005447 -10255050 -15562821 -18207039 -12833865 -2274867 4039665
5024D039665j367323k078771L484812N710044J368882l252658l798069k709811
$$ 4039665 2672342 593571 4078383 9788427 11157309 7904651 4106582 1396771
5016A396771j912204M54730M103498N123594K779322J155553J785190R03346l336421
$$ 1396771 -515433 -60703 4042795 9166389 11945711 13101264 14886454 15789800 12453379
5007A2453379o660208m891633K12760M373983O121653N755512K475891l778859
$$ 12453379 5793171 901538 1114298 5488281 11609934 17365446 19841337 16062478
4999A6062478r394067r279234k251395P006951J1829673R657133M119062J77330
$$ 16062478 6668411 -2610823 -4862218 2144733 13974406 23631539 27750601 27927931
4991B7927931k047809n861674j0728196j1313273n765459J40987R08989j068610
$$ 27927931 25880122 20018448 9290252 -2023021 -7788480 -7647493 -6738504 -7807114
4983g807114m88174K232592L003646J801123K110523M148044M420294J533883
$$ -7807114 -8295288 -6062696 -3059050 -1257927 852596 5000640 9420934 10954817
4975A0954817k179007m259283l624995J33893N156412O722215K355058l889893
$$ 10954817 8775810 4516527 891532 1025425 6181837 12904052 15259110 11369217
4967A1369217n863137k490090K441485N204849L944706j061522n666385m385357
$$ 11369217 5506080 3015990 5457475 10662324 14607030 13545508 7879123 3493766
4959C493766J715065M483245K23319m149687k139541J653150k67240n128767m605630
$$ 3493766 5208831 9692076 9915395 5765708 3626167 5279317 5012077 -116690 -4722320
4950d722320J095118M080162J939838M17386L065882O429688O184898K039170
$$ -4722320 -3627202 452960 2392798 2810184 5876066 12305754 18490652 20529822
4942B0529822l317092n693599k011087M285305M543152l284530r760823p290691
$$ 20529822 17212730 11519131 9508044 13793349 18336501 15051971 5291148 -1999543
4934a999543j526472j089560l158303j90225N243241M998174K91153q84768J900510
$$ -1999543 -3526015 -4615575 -7773878 -7964103 -2720862 2277312 2568465 1683697 3584207
4925C584207K513509R30282K148601M731390L259786J76339K221637O893135N564135
$$ 3584207 6097716 7027998 9176599 13907989 17167775 17344114 19565751 26458886 32023021
4916C2023021j467726n921411n551768m370861j863417M041806O723202q37393
$$ 32023021 30555295 24633884 19082116 14711255 12847838 16889644 23612846 22775453
4908B2775453j0586577q799846J765564O391375K157206j385788k286766o452743
$$ 22775453 12188876 3389030 5154594 11545969 13703175 12317387 10030621 3577878
4900C577878j0105993m085699N487108L932116n302111n132800M346542O102104
$$ 3577878 -6528115 -10613814 -5126706 -1194590 -6496701 -11629501 -7282959 -1180855
4892a180855k166314n125363m00437j602107p889592l320064R286869R328271
$$ -1180855 -3347169 -8472532 -8872969 -10475076 -18364668 -21684732 -12397863 -3069592
4884c069592j600823Q5015J3386635J1131090n933843n490206J1750360M978040
$$ -3069592 -4670415 -4585400 8801235 19932325 13998482 8508276 20258636 25236676
4876B5236676k6149801k6901485N288781j8232919j34488559k20292517j35313019
$$ 25236676 -913125 -27814610 -22525829 -40758748 -175247307 -395539824 -530852843
4869e30852843O6231828J86824732J40695949L9724191Q376059L0501999L0078610
$$ -530852843 -464621015 -277796283 -137100334 -97376143 -89000084 -58498085 -28419475
4862b8419475M208377k103775J0609911Q207812p075233o617293O207813M892468
$$ -28419475 -24211098 -26314873 -15704962 -7497150 -14572383 -21189676 -14981863 -10089395
4854a0089395q134187q299873L365451M142569o551066p863889K989800Q373495
$$ -10089395 -18223582 -26523455 -23158004 -19015435 -25566501 -33430390 -30440590 -22067095
4846b2067095M024444K371752M717311N13689p382992n104483N532501Q788898
$$ -22067095 -18042651 -15670899 -10953588 -10439899 -17822891 -22927374 -17394873 -8605975
4838h605975K472692j005677K90930l637936j1389094r643038K377523J0299184
$$ -8605975 -6133283 -7138960 -6848030 -10485966 -21875060 -31518098 -29140575 -18841391
4830a8841391Q597919O385962P270558L986593l975786o937869k805033k92977
$$ -18841391 -10243472 -3857510 3413048 7399641 3423855 -3514014 -6319047 -6612024
4822f612024j457019J123335O865306N450028l329843o430179J75153L953243
$$ -6612024 -8069043 -6945708 -80402 5369626 2039783 -4390396 -4215243 -262000
4814b62000k346034q222449l754867M470688N832589J843359j27747O40596J171732
$$ -262000 -2608034 -10830483 -14585350 -10114662 -4282073 -2438714 -2566461 -1925865 -754133
4805g54133K092443M068943L868446K50929k753147l032928l585146m829156k299627
$$ -754133 1338310 5407253 9275699 9526628 6773481 3740553 155407 -4673749 -6973376
4796f973376L876830O313394J944063k699790k562173r61555l98100K929606Q771110
$$ -6973376 -3096546 3216848 5160911 2461121 -101052 -1062607 -1460707 1468899 10240009
4787A0240009Q026686k588125j1004858n902549N766536R317093L778939l86662
$$ 10240009 18266695 15678570 4673712 -1228837 4537699 13854792 17633731 17247069
4779A7247069l14574k789862q576495r480375l572634k24347m676862q521901
$$ 17247069 16932495 14142633 5566138 -3914237 -7486871 -7711218 -12388080 -20909981
4771b0909981k892770P301708J1085718P572393M753514N166604L129196l173810
$$ -20909981 -23802751 -16501043 -5415325 2157068 6910582 12077186 15206382 12032572
4763A2032572o575480j998142M676822M778599r54102m969734m533082l396806
$$ 12032572 5457092 3458950 8135772 12914371 11960269 6990535 2457453 -939353
4755i39353l293961j781002P29898k02140m385008m494154L116129J1103949J0473682
$$ -939353 -4233314 -6014316 -5284418 -5486558 -9871566 -14365720 -11249591 -145642 10328040
4746A0328040K829929k912594k962613j318023j615022k592915j942771p5028
$$ 10328040 13157969 10245375 7282762 5964739 4349717 1756802 -185969 -260997
4738b60997Q76273n33229l420985m301887o50484M169816L637030k145089m983787
$$ -260997 615276 82047 -3338938 -7640825 -8291309 -4121493 -484463 -2629552 -7613339
4729g613339q86975K618633j926713q903094p417392J654063P002370M006056
$$ -7613339 -8500314 -5881681 -7808394 -16711488 -24128880 -22474817 -15472447 -11466391
4721a1466391k65012k47173K51170l072883o837705n756726o71474L935632O170160
$$ -11466391 -11731403 -11978576 -11727406 -14800289 -21637994 -27394720 -28066194 -24130562 -17960402
4712a7960402O493451M749820J082584k438455l702564k632836n00632J009426
$$ -17960402 -11466951 -6717131 -5634547 -8073002 -11775566 -14408402 -14909034 -13899608
4704a3899608L66353j569842j052823L110790N472475Q74093n923715n038487
$$ -13899608 -13533255 -15103097 -16155920 -13045130 -7572655 -6698562 -12622277 -17660764
4696a7660764L719686R200951M729011k551576k900435K400456N099586K646090
$$ -17660764 -13941078 -4740127 -11116 -2562692 -5463127 -3062671 2036915 4683005
4688D683005m73833j403530j884044l119646l525341k290290p34947R55914M581636
$$ 4683005 4209172 2805642 921598 -2198048 -5723389 -8013679 -8748626 -7792712 -3211076
4679c211076R665983J1272429N171305n539655j1976512q939769r84869L251570
$$ -3211076 6454907 17727336 22898641 17358986 5382474 -3557295 -4542164 -1290594
4671a290594J595116m10229J193409L246304J842923n79156M47602L151122J744312
$$ -1290594 304522 -105707 1087702 4334006 6176929 5597773 6045375 9196497 10940809
4662A0940809m171482q419912o796565j656448K778745M935188M634676J952156
$$ 10940809 6769327 -1650585 -8447150 -10103598 -7324853 -2389665 2245011 4197167
4654D197167q39194m3984M508245Q085612O559736J251350l127793l762390j992871
$$ 4197167 3357973 3313989 7822234 15907846 22467582 23718932 20591139 16828749 14835878
4645A4835878j360981l697699o713512o519049k976478L9955Q28008K240271N314217
$$ 14835878 13474897 9777198 3063686 -3455363 -6431841 -6391886 -5563878 -3323607 1990610
4636A990610N541756J88763n465251n493436k618178k583577l275019R88142O988242
$$ 1990610 7532366 7721129 2255878 -3237558 -5855736 -8439313 -11714332 -10726190 -3737948
4627c737948N750041k012553n201508O99240O896600N442396J32703j981752j206508
$$ -3737948 2012093 -460 -5201968 -4502728 2393872 7836268 7968971 5987219 4780711
4618D780711j124478j147269L57338J169756o02615k230881j333735l94379j632495
$$ 4780711 3656233 2508964 2866302 4036058 3433443 1202562 -131173 -525552 -2158047
4609b158047k376129l94991J204542l50068j691562J246244O054678P508585M836043
$$ -2158047 -4534176 -4929167 -3724625 -4074693 -5766255 -4520011 1534667 9043252 13879295
4600A3879295N81084l904939p087630n609636O14682N468930M243500O77368R87530
$$ 13879295 14460379 10555440 3467810 -2141826 -1527144 3941786 8185286 8862654 9850184
4591I850184M303680M876791J132000l083791m368331k419971R07082J692815
$$ 9850184 14153864 19030655 20162655 17078864 12710533 10290562 11197644 12890459
4583A2890459l353228j0696087j1398946l403377L394893P03963n420841l850354
$$ 12890459 9537231 -1158856 -12557802 -15961179 -12566286 -11862323 -17283164 -21133518
4575b1133518M391119Q367876M138024j189343j909297j59820J338363L750978
$$ -21133518 -16742399 -8374523 -4236499 -5425842 -7335139 -7494959 -6156596 -2405618
4567b405618O658401N928363N60964m399046n035921l620641l680245m613974
$$ -2405618 4252783 10181146 10742110 6343064 1307143 -2313498 -5993743 -10607717
4559a0607717m145426k348116m65660J381070L169872M023923L658499K666281
$$ -10607717 -14753143 -17101259 -17566919 -16185849 -13015977 -8992054 -5333555 -2667274
4551b667274R33665j658727k997309n53634M146540O243184L490463j397298m690742
$$ -2667274 -1733609 -3392336 -6389645 -6943279 -2796739 3446445 6936908 5539610 848868
4542H48868m890080j893282L391377P659061O877291J136039m313865m386319
$$ 848868 -4041212 -5934494 -2543117 5115944 11993235 13129274 8815409 4429090
4534D429090M76748M724324L021783l947718q590041l930912O538794J0580238
$$ 4429090 4905838 9630162 12651945 8704227 114186 -3816726 2722068 13302306
4526A3302306K185514r487164j1633572m391592J642095J862646J886176M960991
$$ 13302306 15487820 6000656 -5632916 -10024508 -8382413 -6519767 -4633591 327400
4518C27400N488051p77088q350527r758906n767633j853212P65447L908014N769457
$$ 327400 5815451 5038363 -3312164 -13071070 -18838703 -20691915 -19926468 -16018454 -10248997
4509a0248997L055230j540162j522001K972530L992928k068036p297733k713402
$$ -10248997 -7193767 -8733929 -10255930 -7283400 -3290472 -5358508 -12656241 -15369643
4501a5369643P937604J2055581N293535k844148l174175O14159j99535m344976
$$ -15369643 -7432039 4623542 9917077 7072929 3898754 4512913 4313378 -31598
4493c1598k930725M602605P625448L74134q594231q942938l208494j217762m846363
$$ -31598 -2962323 1640282 9265730 9639864 1045633 -7897305 -11105799 -12323561 -17169924
4484a7169924o916502l053691L179729O557695N449645J069029l421937l653553
$$ -17169924 -24086426 -27140117 -23960388 -17402693 -11953048 -10884019 -14305956 -17959509
4476a7959509J448447O823662P131700L623939Q00736q03561k763333k898005
$$ -17959509 -16511062 -9687400 -2555700 1068239 1868975 1065414 -1697919 -4595924
4468d595924J412753O361964O108653K308564R05038J232587j760194n412444
$$ -4595924 -3183171 3178793 9287446 11596010 12501048 13733635 11973441 6560997
4460F560997j363168Q738432J1854634K395987q638433r532037l148394Q11278
$$ 6560997 5197829 13936261 25790895 28186882 19548449 10016412 6868018 7679296
4452G679296J81210j360637l236202o176706o654694j823488L751491M149048
$$ 7679296 7860506 6499869 3263667 -2913039 -9567733 -11391221 -7639730 -3490682
4444c490682J408239J174432K485004K94163m136765m167526J339639N858929
$$ -3490682 -2082443 -908011 1576993 1871156 -2265609 -6433135 -5093496 765433
4436G65433M640949N3095l314707l680603j631638R16084J124821j635641l711271
$$ 765433 5406382 5459477 2144770 -1535833 -3167471 -2251387 -1126566 -2762207 -6473478
4427f473478j905036J275903J496445k64630J15013K264108K204113N4863L8972
$$ -6473478 -8378514 -7102611 -5606166 -5870796 -5755783 -3491675 -1287562 -1232699 -1193727
4418a193727K558416L086212J46561k133195j343014m58575j670172k446098j017562
$$ -1193727 1364689 4450901 4597462 2464267 1121253 662678 -1007494 -3453592 -4471154
4409d471154l59933k641827m333570j527094L423455N449625M371771L990256
$$ -4471154 -4831087 -7472914 -11806484 -13333578 -9910123 -4460498 -88727 3901529
4401C901529N064113M077953r46053p089396r698495o843777o63783M122295L747777
$$ 3901529 8965642 13043595 12097542 5008146 -4690349 -11534126 -12197909 -8075614 -4327837
4392d327837p06028l751480j772417K138457K059929k749315o671741m815248
$$ -4327837 -5033865 -8785345 -10557762 -8419305 -6359376 -9108691 -15780432 -20595680
4384b0595680J352248O355856O701855L397513j8591o89947J489952M001815M216969
$$ -20595680 -19243432 -12887576 -6185721 -2788208 -2806799 -3496746 -2006794 1995021 6211990
4375F211990K100994k28345j621140l068041m990300n117327j227171M649473
$$ 6211990 8312984 8084639 6463499 3395458 -1594842 -6712169 -7939340 -3289867
4367c289867P458413N311196K009525J468613J644733k401833r697697j2152856
$$ -3289867 4168546 9479742 11489267 12957880 14602613 12200780 2503083 -9649773
4359i649773m763685O283636J0162446M799387j356388j468401J357717Q29410
$$ -9649773 -14413458 -8129822 2032624 6832011 5475623 4007222 5364939 6194349
4351F194349k476289l348854j301119p64467k362419j253169L814550O623814
$$ 6194349 3718060 369206 -931913 -1696380 -4058799 -5311968 -1497418 5126396
4343E126396K891038k102035j193762L413544L725803j395811m903086k812058
$$ 5126396 8017434 5915399 4721637 8135181 11860984 10465173 5562087 2750029
4335B750029P07497J149509j66754n63012p31857j491748r93331R20053L79300
$$ 2750029 3457526 4607035 4440281 3877269 3145412 1653664 660333 1580386 1959686
4326A959686l986052o645458k587227M530894P352031M892568J605479r54568
$$ 1959686 -2026366 -8671824 -11259051 -6728157 623874 5516442 7121921 6167353
4318F167353m599577q120363p665186l444279M58294L066378O599795R185385
$$ 6167353 1567776 -6552587 -14217773 -17662052 -17203758 -14137380 -7537585 1647800
4310A647800N249995m369287r965163m894265N367283J0483113P394467J096511
$$ 1647800 6897795 2528508 -7436655 -12330920 -6963637 3519476 10913943 12010454
4302A2010454l009157l182999m60634K316830K318778J94832m79370R98486Q90488
$$ 12010454 9001297 5818298 5357664 7674494 9993272 10188104 9708734 10707220 11597708
4293A1597708k309261m292398j971522N80133j270720m212522k105429L036886
$$ 11597708 9288447 4996049 3024527 3604660 2333940 -1878582 -3984011 -947125
4285i47125L349815k062511m901339p3404O968231Q570423M597898j86567l413636
$$ -947125 2402690 340179 -4561160 -4634564 2333667 10904090 15501988 15315421 11901785
4276A1901785n055754m158958j066146n5837l958954p964255n095790K771667
$$ 11901785 6846031 2687073 1620927 1565090 -2393864 -10358119 -15453909 -12682242
4268a2682242O339373K462049j073172J970131N891302J943617o884844q898244
$$ -12682242 -6342869 -3880820 -4953992 -2983861 2907441 4851058 -2033786 -10932030
4260a0932030o93469P790193P570953K121890k60854O95195p79914m983172n350921
$$ -10932030 -11625499 -3835306 3735647 5857537 5596683 6291878 5511964 528792 -4822129
4251d822129J021212Q089739Q636548L089214k213356k791456O24253M676970
$$ -4822129 -3800917 4288822 12925370 16014584 13801228 11009772 11634025 16310995
4243A6310995O510343M793231n9052n767437q993294p344004j539508M255021
$$ 16310995 22821338 27614569 27555517 21788080 12794786 5450782 3911274 8166295
4235H166295N437440J513383k813500k329933K865075P151179N318943j735464
$$ 8166295 13603735 15117118 12303618 9973685 12838760 19989939 25308882 23573418
4227B3573418p681785p297527j934011K556762L140638K450765L287699L727066
$$ 23573418 15891633 8594106 6660095 9216857 12357495 14808260 18095959 21823025
4219B1823025J054673k425482k594256n27550k66932j022219R99275L493976j19277
$$ 21823025 22877698 20452216 17857960 17330410 17063478 16041259 17040534 20534510 20415233
4210B0415233q215504j0067314j317360Q900617J1464203Q805078O616690L336843
$$ 20415233 12199729 2132415 815055 9715672 21179875 29984953 36601643 39938486
4202C9938486l573217r020684p867396m641211n802560q307050o038391j782106
$$ 39938486 36365269 27344585 19477189 14835978 9033418 726368 -5312023 -7094129
4194g094129j792787l707089j380586L039137L662553K600174M725460N911355
$$ -7094129 -8886916 -12594005 -13974591 -10935454 -7272901 -4672727 52733 5964088
4186E964088M19186m978592j46878Q964316P449483m035511j0128339n707315
$$ 5964088 6383274 1404682 1257804 10222120 17671603 13636092 3507753 -2199562
4178b199562j163571j495469N55856O982073Q716195K533895l058297l637072
$$ -2199562 -3363133 -4858602 -4302746 2679327 11395522 13929417 10871120 7234048
4170G234048m325059n586739q25535P751142Q864307K071596o69734K745081J157908
$$ 7234048 2908989 -2677750 -3503285 4247857 13112164 15183760 14514026 17259107 18417015
4161A8417015o730636q282357j318140J471005j590081K480442J2204729R283733
$$ 18417015 11686379 3404022 2085882 3556887 1966806 4447248 16651977 25935710
4153B5935710n224400o490952R208877J3088695m585704j3103306L674587J5466863
$$ 25935710 20711310 14220358 23429235 36517930 31932226 18828920 22503507 37970370
4145C7970370J928090n934223J5933785L3426742J8665118J7249019P2511893
$$ 37970370 39898460 33964237 49898022 83324764 101989882 119238901 191750794
4138A91750794J19560617N5839638r1166599j73084738j17478059j7450263J4332162
$$ 191750794 311311411 367151049 275984450 102899712 -14578347 -32028610 -17696448
4131a7696448r926323j4861168Q332529J4349849j440200l191325J2005718J2366510
$$ -17696448 -27622771 -42483939 -34151410 -19801561 -21241761 -24433086 -12427368 -60858
4123f0858n338996j1242027J212492O776443k396827n669825L856693P632439
$$ -60858 -5399854 -16641881 -15429389 -8652946 -11049773 -16719598 -12862905 -5230466
4115e230466j480297p245644k111314J350165j986417q96512O502871O634557
$$ -5230466 -6710763 -13956407 -16067721 -14717556 -16703973 -17600485 -11097614 -4463057
4107d463057k319452m100072O084535J1237248J847773q043359n484836J534610
$$ -4463057 -6782509 -10882581 -4798046 6439202 8286975 243616 -5241220 -3706610
4099c706610J067458l780059m876382l245501k293018N29545N979565Q074217
$$ -3706610 -2639152 -6419211 -11295593 -14541094 -16834112 -16304567 -10325002 -2250785
4091b250785M341044O26478K53190p36073l383692k932531j17189k355916r124675
$$ -2250785 2090259 2716737 2969927 2233854 -1149838 -4082369 -4199558 -6555474 -15680149
4082a5680149r580757k60659Q070347P410826L584348L675224M791614K747747
$$ -15680149 -25260906 -25521565 -17451218 -10040392 -6456044 -2780820 2010794 4758541
4074D758541O02645J051010O09350j870196j216081L223338L780259j672168l679715
$$ 4758541 5361186 6412196 7021546 5151350 3935269 7158607 10938866 9266698 5586983
4065E586983K754912P614110J555167p883740p488279J681819P424332M584431
$$ 5586983 8341895 15956005 17511172 9627432 2139153 3820972 11245304 15829735
4057A5829735r20559l585849m323035n662555p663575q533929n911799P83270
$$ 15829735 14909176 11323327 7000292 1337737 -6325838 -14859767 -20771566 -19988296
4049a9988296P473370Q449128L723126j242927l884648o282945p838275m521238
$$ -19988296 -12514926 -4065798 -342672 -1585599 -5470247 -11753192 -19591467 -24112705
4041b4112705K367114N521066K846429M08684R38154m52828m712271m290469L226041
$$ -24112705 -21745591 -16224525 -13378096 -12969412 -12031258 -12484086 -17196357 -21486826 -18260785
4032a8260785P922752K666127m431186k642134M729143P160983L407416o5398
$$ -18260785 -10338033 -7671906 -12103092 -14745226 -10016083 -2855100 552316 486918
4024D86918j671559m467383p261442o586552m603629n386054o259331k257343
$$ 486918 -1184641 -5652024 -12913466 -19500018 -24103647 -29489701 -35749032 -38006375
4016c8006375L820704N618322M746447P577882J2297698J0377288J175984n656719
$$ -38006375 -34185671 -28567349 -23820902 -16243020 -3945322 6431966 7607950 1951231
4008A951231m311897K8385R93718k79769m5313J107053N97183j214916k105426
$$ 1951231 -2360666 -2332281 -1338563 -1618332 -1663645 -556592 40591 -1174325 -3279751
3999c279751j261431P66165L185461M780041M482800K638969L39600j738181k445712
$$ -3279751 -4541182 -3775017 -589556 4190485 8673285 11312254 11651854 9913673 7467961
3990G467961l72898K696033J665982m694870r559525o217076J874721N240714
$$ 7467961 7095063 9791096 11457078 6762208 -2797317 -9014393 -7139672 -1898958
3982a898958J340159l035369k272258J498894L625409L074260J027332k118890
$$ -1898958 -558799 -3594168 -5866426 -4367532 -742123 2332137 3359469 1240579
3974A240579n270157n160847K54730P787837J0702819N191969n004303j1285606
$$ 1240579 -4029578 -9190425 -8935695 -1147858 9554961 14746930 9742627 -1542979
3966a542979q909931k561185o10246m024390n398481l27685N838935O313426K758393
$$ -1542979 -10452910 -13014095 -13624341 -17648731 -23047212 -23374897 -17535962 -11222536 -8464143
3957h464143J232266K182807J351724j553493k323535Q9234J979570J470607P95533
$$ -8464143 -7231877 -5049070 -3697346 -5250839 -7574374 -7485140 -5505570 -4034963 -3239430
3948c239430J045744J73360k215530l152097j531905n97745k517845m151349j470000
$$ -3239430 -2193686 -2020326 -4235856 -7387953 -8919858 -9517603 -12035448 -16186797 -17656797
3939a7656797M152121P311481N346196J258513l02177J359180K234666j306518
$$ -17656797 -13504676 -6193195 -846999 411514 109337 1468517 3703183 2396665
3931B396665p326014r816923n781723J223899N719496O147146M298645J532479
$$ 2396665 -4929349 -14746272 -20527995 -19304096 -13584600 -7437454 -3138809 -1606330
3923a606330j354198k365374k26185K548935J991185j720773l813733p30814N506957
$$ -1606330 -2960528 -5325902 -5552087 -3003152 -1011967 -2732740 -6546473 -7277287 -1770330
3914a770330R369337P308183J185449l362535k690784O41034J009053k920542
$$ -1770330 7599007 14907190 16092639 12730104 10039320 10680354 11689407 8768865
3906H768865o688600o440505l293797J00702L369429O298552O775885M178119
$$ 8768865 2080265 -4360240 -7654037 -7553335 -4183906 2114646 8890531 13068650
3898A3068650J509391P95133k28772l216010m997030l015259j062238l473602
$$ 13068650 14578041 15373174 15144402 11928392 6931362 3916103 2853865 -619737
3890f19737o711629m040794L029410N892512J702738k553617q77583L577042M694994
$$ -619737 -7331366 -11372160 -8342750 -2450238 -747500 -3301117 -4178700 -601658 4093336
3881D093336K514480J463403K526815K145508j490725m919195l825443P20362
$$ 4093336 6607816 8071219 10598034 12743542 11252817 6333622 2508179 3228541
3873C228541K968776J0813l829630k705910K338270M904000K772428N93053J902632
$$ 3228541 6197317 6208130 2378500 -327410 2010860 6914860 9687288 10280341 12182973
3864A2182973M124457M021445K571641J076259j924630n680670n107271R65356
$$ 12182973 16307430 20328875 22900516 23976775 22052145 16371475 11264204 12229560
3856A2229560N176521J816226l804255l847259p62843k319342p544656q099981
$$ 12229560 17406081 19222307 15418052 11570793 10807950 8488608 943952 -7156029
3848g156029k172224L147774L304840Q83689j469521l765685l807975J229261
$$ -7156029 -9328253 -6180479 -2875639 -1991950 -3461471 -7227156 -11035131 -9805870
3840i805870P106246N449987l603810j0249104q729023l800769j061096L90646
$$ -9805870 -2699624 2750363 -853447 -11102551 -19831574 -23632343 -24693439 -24302793
3832b4302793K184793K068344n17078j577148N28972K212656K202310M175972
$$ -24302793 -22118000 -20049656 -20566734 -22143882 -21614910 -19402254 -17199944 -13023972
3824a3023972P830770O126634k627043q402115l009421O865164Q917059K279358
$$ -13023972 -5193202 933432 -1693611 -10095726 -13105147 -6239983 2677076 4956434
3816D956434l741715m281623k957001k897330k286967O98725M770269P959686
$$ 4956434 1214719 -3066904 -6023905 -8921235 -11208202 -10509477 -5739208 2220478
3808B220478Q824321N728565j005336p141834q560442o087763k960438L37058
$$ 2220478 11044799 16773364 15768028 8626194 65752 -6022011 -8982449 -8645391
3800h645391M526859P169260N166479N40443j439574L46355J864526L19469k628167
$$ -8645391 -4118532 3050728 8217207 8757650 7318076 7664431 9528957 9848426 7220259
3791G220259m391938m512354l551345k000786r33457j209375j533726M35571M455802
$$ 7220259 2828321 -1684033 -5235378 -7236164 -8169621 -9378996 -10912722 -10477151 -6021349
3782f021349P054315N388115P67914k420010j386061J567719J230917l770344
$$ -6021349 1032966 6421081 7188995 4768985 3382924 4950643 6181560 2411216
3774B411216p958775n440167J803045O041482L922978l06978k244025k412901
$$ 2411216 -5547559 -10987726 -9184681 -3143199 779779 472801 -1771224 -4184125
3766d184125k052611K86510M327720N370138O98985n173797o434330l841082j777459
$$ -4184125 -6236736 -5950226 -1622506 3747632 4446617 -727180 -7161510 -11002592 -12780051
3757a2780051n06099K749333O659348N996640l63569o386118n743307O11245N365017
$$ -12780051 -13286150 -10536817 -3877469 2119171 1755602 -4630516 -10373823 -9762578 -4397561
3748d397561K933068l912032o530488o94606P473168R164447M685694J859203
$$ -4397561 -1464493 -5376525 -11907013 -12601619 -5128451 4035996 8721690 10580893
3740A0580893L128554K019054n222005j2224339j1469315m519241J940078N063459
$$ 10580893 13709447 15728501 10506496 -1717843 -13187158 -17706399 -15766321 -10702862
3732a0702862N673686M083257J424486N55242Q00829k769733r718049j0831941
$$ -10702862 -5029176 -945919 478567 1033809 1834638 -935095 -10653144 -21485085
3724b1485085j539351Q246161P088845j019869l599055R60980L363504L21318
$$ -21485085 -23024436 -14778275 -7689430 -8709299 -12308354 -11347374 -7983870 -7662552
3716g662552j623347N65072J765409l69865j070796J595400K478582q78874l214281
$$ -7662552 -9285899 -8720827 -6955418 -7325283 -8396079 -6800679 -4322097 -5200971 -8415252
3707h415252q50489J909032N21609k466291k498981L87729L934996P012231P403779
$$ -8415252 -9265741 -7356709 -6835100 -9301391 -11800372 -11412643 -7477647 -465416 6938363
3698F938363K462381m663695o122588o16787L294191j54587n002654l346683K397757
$$ 6938363 9400744 4737049 -1385539 -2002326 1291865 1137278 -3865376 -7212059 -4814302
3689d814302M604099K965305L380138O711648O927847P71000o842183q648737
$$ -4814302 -210203 2755102 6135240 12846888 19774735 20545735 13703552 5054815
3681E054815l077110M201696N352239j928064j0758161j1570284l450077M702002
$$ 5054815 1977705 6179401 11531640 9603576 -1154585 -12724869 -16174946 -11472944
3673a1472944O140273M343662N408773P626030M958112k201766o896731n605949
$$ -11472944 -5332671 -989009 4419764 12045794 17003906 14802140 7905409 2299460
3665B299460k106598n56941j01874J436509K408674o33908o825401r852945m539255
$$ 2299460 192862 -364079 -465953 970556 3379230 2745322 -4080079 -13933024 -18472279
3656a8472279O055277J2525325R654155K802755O57006L612948M387945o07947
$$ -18472279 -12417002 108323 9762478 12565233 13222239 16835187 21223132 20615185
3648B0615185o783275r143090q046944n063790J81423N516357N288788j005060
$$ 20615185 13831910 4688820 -3358124 -8421914 -8240491 -2724134 2564654 1559594
3640A559594n123551j209832M740682L648363k847766n714854k883991j175296
$$ 1559594 -3563957 -4773789 -33107 3615256 767490 -4947364 -7831355 -9006651
3632i006651m209108o883768l815350L084972P913441P311517K077443m176505
$$ -9006651 -13215759 -20099527 -23914877 -20829905 -12916464 -5604947 -3527504 -7704009
3624g704009o855550l850421K120978O600872P932809O578687K461316l211808
$$ -7704009 -14559559 -18409980 -16289002 -9688130 -1755321 4823366 7284682 4072874
3616D072874o179272m232175j695514k982403m230364J013083R311744R933445
$$ 4072874 -2106398 -6338573 -8034087 -11016490 -15246854 -14233771 -4922027 5011418
3608E011418R27752o830236n055297R09347J600786k840544m786777n47534O227927
$$ 5011418 5939170 -891066 -5946363 -5037016 -3436230 -6276774 -11063551 -11611085 -5383158
3599e383158R963031P628747K81243o497774o603713q24667L265472J671914n44373
$$ -5383158 4579873 12208620 12489863 5992089 -611624 -1436291 1829181 3501095 2956722
3590B956722J797293N088870L370583p77836j15442M615999M938972j865897p829324
$$ 2956722 4754015 9842885 13213468 12435632 12320190 16936189 21875161 20009264 12179940
3581A2179940n795167O67820L099879m64397m471114l894967O02514M759261N202651
$$ 12179940 6384773 7052593 10152472 9688075 5216961 1321994 1924508 6683769 11886420
3572A1886420J924283k153544l935131k903506q93076M96881J160890J501943
$$ 11886420 13810703 11657159 7722028 4818522 3925446 4422327 5583217 7085160
3564G085160J721686J982407J799379k77261m391538p305097n386594J64186M149042
$$ 7085160 8806846 10789253 12588632 12311371 7919833 614736 -4771858 -4607672 -458630
3555d58630M215649L608077N433346P413945N342295k75401m478010m160090j259784
$$ -458630 3757019 7365096 12798442 20212387 25554682 25279281 20801271 16641181 15381397
3546A5381397M98222j64992j689305k148664j525459j891999m982843r248271
$$ 15381397 15879619 15714627 14025322 11876658 10351199 8459200 3476357 -5771914
3538e771914j0545400o853506r69719L141281N250314P559553R558907P929335
$$ -5771914 -16317314 -23170820 -24140539 -20999258 -15748944 -8189391 1369516 9298851
3530I298851K128454l642774o007837o837402r054327j0371836n730093M235397
$$ 9298851 11427305 7784531 1776694 -5060708 -14115035 -24486871 -30216964 -25981567
3522b5981567J1797315J1237427N974404L430442M962027N099944L74331n698863
$$ -25981567 -14184252 -2946825 3027579 6458021 11420048 16519992 16894323 11195460
3514A1195460q088563o864277n262479l915002j182344K053273K554996k9400
$$ 11195460 3106897 -3757380 -9019859 -12934861 -14117205 -12063932 -9508936 -9538336
3506i538336k243899k097409j302560r06111Q95814M109358M612662L88119l789838
$$ -9538336 -11782235 -13879644 -15182204 -16088315 -15192501 -11083143 -6470481 -6082362 -9872200
3497i872200k855059N72898O49438j802144j140881K546396L217516R9103K30071
$$ -9872200 -12727259 -12154361 -11504923 -13307067 -14447948 -11901552 -8684036 -8584933 -8354862
3488h354862O450402J1219226P869095Q26520k279375k491245n042565p916002
$$ -8354862 -1904460 9314766 17183861 18010381 15731006 13239761 8197196 281194
3480B81194n199086N63539O25470m962449n871946J805821Q000013L851913m437573
$$ 281194 -4917892 -4354353 -3728883 -8691332 -14563278 -12757457 -4757444 -905531 -5343104
3471e343104n374433N65024L387302M4590k008421K103700P450948Q017275N253305
$$ -5343104 -10717537 -10152513 -6765211 -6720621 -8729042 -6625342 825606 8842881 14096186
3462A4096186L670088L387235K012893Q5848o09065j626812n311770q990282p397871
$$ 14096186 17766274 21153509 23166402 23252250 22643185 21016373 15704603 6714321 -683550
3453f83550r85009L741857L334657J235484J46496l186799j0451257j4338903
$$ -683550 -1668559 2073298 5407955 6643439 6789935 3603136 -6848121 -21187024
3445b1187024o793864P381379J4095313Q066076j042149l301685q47310k06883
$$ -21187024 -27980888 -20599509 -6504196 1561880 519731 -2781954 -3629264 -3836147
3437c836147j90911L901711Q977511P341804l05806n013889l555095k823089p311095
$$ -3836147 -4027058 -125347 8852164 16193968 15888162 10874273 7319178 4496089 -2815006
3428b815006j0945577o885549J203143M589131K068729m2306J397995K597659
$$ -2815006 -13760583 -20646132 -19442989 -14853858 -12785129 -12827435 -11429440 -8831781
3420h831781J69837l439095m042043j697674J13787j58997o684L520138R177513
$$ -8831781 -8661944 -12101039 -16143082 -17840756 -17726969 -17885966 -17892650 -14372512 -5194999
3411e194999J1917595Q481452J455308l675305m614316l415963k416302j888334
$$ -5194999 6722596 15204048 16659356 12984051 8369735 4953772 2537470 649136
3403F49136j613041j615430q87432J513633L561209J940296k440628m414887j628576
$$ 649136 -963905 -2579335 -3466767 -1953134 1608075 3548371 1107743 -3307144 -4935720
3394d935720K044617K203854m22066k258920j547004J462671N512485P321857
$$ -4935720 -2891103 -687249 -1109315 -3368235 -4915239 -3452568 2059917 9381774
3386I381774L520489l661528o818352k791331K616643L093146K26378j294434
$$ 9381774 12902263 9240735 2422383 -368948 2247695 5340841 5567219 4272785
3378D272785j821685l579935l688228J519428P749334O971783l48397n404662
$$ 4272785 2451100 -1128835 -4817063 -3297635 4451699 11423482 11075085 5670423
3370E670423l618342P61961L356191M894830N825663L478437j988523n312219
$$ 5670423 2052081 2814042 6170233 11065063 16890726 20369163 18380640 13068421
3362A3068421l553054l63933N38015O89230J913431J515373k685862o883266o130325
$$ 13068421 9515367 9151434 9689449 10378679 12292110 13807483 11121621 4238355 -1891970
3353a891970j663785J437821J608348J346135K065536K387390P51115k876499
$$ -1891970 -3555755 -2117934 -509586 836549 2902085 5289475 6040590 3164091
3345C164091o793782p681221l435777K683144M423674J159370m25794L465305
$$ 3164091 -3629691 -11310912 -14746689 -12063545 -7639871 -6480501 -6906295 -3440990
3337c440990O995024L363078m163129o691156k474682K042660K793364K362851
$$ -3440990 3554034 6917112 2753983 -3937173 -6411855 -4369195 -1575831 787020
3329G87020L292632L935238K857701J810149J828921P69616k639304n636971m868184
$$ 787020 4079652 8014890 10872591 12682740 14511661 15281277 12641973 7005002 2136818
3320B136818p53396L301669M269736J298696l670099o514921m522978J56986K919192
$$ 2136818 1383422 4685091 8954827 10253523 6583424 68503 -4454475 -4297489 -1378297
3311a378297K448506J230482P33349P94p41345L85800K660727K656547J89346
$$ -1378297 1070209 2300691 3034040 3034834 2293489 2679289 5340016 7996563 8185909
3302H185909l57432K705684M507791Q09365n012777o824846m454404k468417k483922
$$ 8185909 7828477 10534161 15041952 15851317 10838540 4013694 -440710 -2909127 -5393049
3293e393049k140142o31305R0863m06980l31333L15619o36370k995886l327005
$$ -5393049 -7533191 -8164496 -8073633 -8480613 -8811946 -8496327 -9132697 -12128583 -15455588
3284a5455588q1040L543637L408866j043419o652659q780279m153121N265254
$$ -15455588 -15536628 -11992991 -8584125 -9627544 -16280203 -25060482 -29213603 -23948349
3276b3948349J1710489R268364K149210L4138M352433N876532j039211q905933
$$ -23948349 -12237860 -2969496 -820286 -786148 3566285 9442817 8403606 -502327
3268e02327p710885L99362M946583K650049N15387L695395Q330265Q520169M201666
$$ -502327 -8213212 -7813850 -2867267 -217218 298169 3993564 12323829 20843998 25045664
3259B5045664o96960l384415l135292r94542l72412l955311q432844o897407J352718
$$ 25045664 24348704 20964289 17828997 16834455 16462043 12506732 4073888 -2823519 -1470801
3250a470801Q322389P575898K029146k195058m355963o157976n132951J444070
$$ -1470801 6851588 14427486 16456632 14261574 9905611 3747635 -1385316 58754
3242E8754Q645102Q153626K71241n774136m555168n83967K91011r91331p25166
$$ 58754 8703856 16857482 17128723 11354587 6799419 6215452 6506463 5515132 4789966
3233D789966Q74938J545692J667693K498010K495348j66795l527742m615139m545188
$$ 4789966 5664904 7210596 8878289 11376299 13871647 13704852 10177110 5561971 1016783
3224A016783o142608p605108m059250L980230R097997O406694L14890j759822
$$ 1016783 -5125825 -12730933 -16790183 -12809953 -3711956 2694738 3009628 1249806
3216A249806M02518N31744m150301q659689p486969k163551J602780K019689K329578
$$ 1249806 1652324 2184068 -1966233 -10625922 -18112891 -20276442 -18673662 -16653973 -14324395
3207a4324395M416520N749863M146893J813316J757520K788348J681941j218922
$$ -14324395 -9907875 -4158012 -11119 1802197 3559717 6348065 8030006 6811084
3199F811084k593371j785718j552499k584951j718259K346054N479264L766763
$$ 6811084 4217713 2431995 879496 -1705455 -3423714 -1077660 4401604 8168367
3191H168367k1414k2740L749183M801526o08602p816443r843418o276662k526482
$$ 8168367 8146953 8124213 11873396 16674922 16066320 8249877 -1593541 -7870203 -10396685
3182a0396685j629310j099451J412322L558022K272965n18036l32522K823790
$$ -10396685 -12025995 -13125446 -11713124 -8155102 -5882137 -6400173 -6732695 -3908905
3174c908905M327801K128280m72779o28613L9076k02533N68465L256222L502654
$$ -3908905 418896 2547176 2074397 1445784 1484860 1282327 1850792 5107014 8609668
3165H609668k036368q052279o355996J728033O344013L199714j108073m14594
$$ 8609668 6573300 -1478979 -7834975 -6106942 237071 3436785 2328712 1914118
3157A914118K076541J029237j496981p33800J116576j829880p988292q906730
$$ 1914118 3990659 5019896 3522915 2789115 3905691 2075811 -5912481 -14819211
3149a4819211k051653M348837K477445m440364p114845k589854L202799M350928
$$ -14819211 -16870864 -12522027 -10044582 -14484946 -21599791 -24189645 -20986846 -16635918
3141a6635918J987261J155177L529322N818522M740167J118883j991172l585648
$$ -16635918 -14648657 -13493480 -9964158 -4145636 594531 1713414 -277758 -3863406
3133c863406m939594o008689m301368J385718P849016J0009171O190039k30899
$$ -3863406 -8803000 -14811689 -19113057 -17727339 -9878323 130848 6320887 6089988
3125F089988m230448l659120p78490M30159j088803k028656P40751N023436N559102
$$ 6089988 1859540 -1799580 -2578070 -2147911 -3236714 -5265370 -4524619 498817 6057919
3116F057919J607461j448001K21738L253145K199967k641290o457000o912882
$$ 6057919 7665380 6217379 6439117 9692262 11892229 9250939 2793939 -4118943
3108d118943n438616k772538J593539N377558M311719j037232l740344R34604
$$ -4118943 -9557559 -12330097 -10736558 -5359000 -1047281 -2084513 -5824857 -4890253
3100d890253Q440452J0153472M113870l041949m564081q02090K888778L068961
$$ -4890253 3550199 13703671 17817541 14775592 10211511 9409421 12298199 15367160
3092A5367160J133242p5029p20307l649609r482665j3546527r891481J208773
$$ 15367160 16500402 16425373 15705066 12055457 2572792 -10973735 -20865216 -19656443
3084a9656443J1784311J3920262Q029856J527676j85686J106820Q51279j457592
$$ -19656443 -7872132 6048130 14077986 15605662 15419976 16526796 17378075 15920483
3076A5920483k463509q98923j09376l420560q894383j0744460n755855L030649
$$ 15920483 13456974 12558051 12448675 9028115 133732 -10610728 -16366583 -13335934
3068a3335934R303002R363635M635340j107410n753412r133093j0108994o207625
$$ -13335934 -4032932 5330703 9966043 8858633 3105221 -6027872 -16136866 -22344491
3060b2344491K104237R047594Q936451L244576j440117k234410k034296k213850
$$ -22344491 -20240254 -11192660 -2256209 988367 -451750 -2686160 -4720456 -6934306
3052f934306M70184O448484Q939259K858783o173980q642780m098956L2235N81660
$$ -6934306 -6464122 -15638 8923621 11782404 5608424 -3034356 -7133312 -7101077 -6519417
3043f519417J121792K709392J240830l989412p302848n419752k102719o26104
$$ -6519417 -5397625 -2688233 -1447403 -5436815 -12739663 -18159415 -20262134 -20888238
3035b0888238J308196N014418O302903K939934K60184L001616O988406N854694
$$ -20888238 -19580042 -14565624 -8262721 -5322787 -5062603 -2060987 4927419 10782113
3027A0782113J430786l359J840343K255223K51212j425070k940932o216634q409933
$$ 10782113 12212899 12209540 14049883 16305106 16556318 15131248 12190316 5973682 -2436251
3018b436251m637478K896969O244080L079074l50780Q13178L586738K873794j674082
$$ -2436251 -7073729 -4176760 2067320 5146394 4795614 5608792 9195530 12069324 10395242
3009A0395242o801963r464578p932844k838792K025542L495196L449131N406837
$$ 10395242 3593279 -5871299 -13804143 -16642935 -14617393 -11122197 -7673066 -2266229
3001b266229P897573O851645L555080K965445M083764N37832p352265j0143203
$$ -2266229 5631344 12482989 16038069 19003514 23087278 23625110 16272845 6129642
2993F129642l220128M953234M677339j434258l930169o90586K221731J109781
$$ 6129642 2909514 7862748 12540087 11105829 7175660 6485074 8706805 9816586
2985I816586j583847l236599m252537m916247m188774k491996j757547j954623
$$ 9816586 8232739 4996140 743603 -4172644 -8361418 -10853414 -12610961 -14565584
2977a4565584q61655J953418L774753K421392o68793k027658J69040M356514O920706
$$ -14565584 -15427239 -13473821 -9699068 -7277676 -7946469 -9974127 -9805087 -5448573 1472133
2968A472133N574216J941926Q2022J824638M559800M447275P93485l707613o188890
$$ 1472133 7046349 8988275 9070297 10894935 15454735 19902010 20695495 16987882 10798992
2959A0798992o001712m345847k383249q6210K687863M375285K879830o79486k038749
$$ 10798992 4797280 451433 -1931816 -2018026 669837 5045122 7924952 7245466 5206717
2950E206717M13740K868919K189863J302467L626832N476191J207448n877016
$$ 5206717 5620457 8489376 10679239 11981706 15608538 21084729 22292177 16415161
2942A6415161o564227q1304L859892n7875m955147l451239J229513K295639M67266
$$ 16415161 9850934 9769630 13629522 13571647 8616500 5165261 6394774 8690413 9157679
2933I157679K13757K78597l368021q339129q151045k458851K467132L088200J918134
$$ 9157679 9371436 9650033 6282012 -2057117 -10208162 -12667013 -10199881 -7111681 -5193547
2924e193547J570600J548848J549575K650260M142851L455956K70549k540714
$$ -5193547 -3622947 -2074099 -524524 2125736 6268587 9724543 9995092 7454378
2916G454378k551675K13737M307930P023755M757990l075700j1190622j3083096
$$ 7454378 4902703 5116440 9424370 16448125 21206115 18130415 6939793 -6143303
2908f143303q149085j285803L299003M578077K857785j78976p88700K932003P245099
$$ -6143303 -14292388 -15578191 -12279188 -7701111 -4843326 -5022302 -5811002 -2878999 4366100
2899D366100P174976L614964J258408O73034j615376n386611n714796j207889
$$ 4366100 11541076 15156040 16414448 17087482 15472106 10085495 4370699 3162810
2891C162810K698575J360240k868049m948091l848881j865377k05554J546842
$$ 3162810 5861385 7221625 4353576 -594515 -4443396 -6308773 -6514327 -4967485
2883d967485L132244L266010J270103j638579k380005J500496P722889R605108
$$ -4967485 -1835241 1430769 2700872 1062293 -1317712 182784 7905673 17510781
2875A7510781L768620m300355o927844n023052o057223j1421238j3198317o058175
$$ 17510781 21279401 16979046 10051202 5028150 -1029073 -12450311 -25648628 -31706803
2867c1706803M399246R647515R247952Q282270P672556L902959k775280o454734
$$ -31706803 -27307557 -17660042 -8412090 -129820 7542736 11445695 8670415 2215681
2859B215681l544209J803259L035598l14362k581754j00906L567875K545012k804706
$$ 2215681 -1328528 474731 3510329 3195967 614213 513307 4081182 6626194 3821488
2850C821488n904652l311498Q5565j588838n941292n581374P26342O054315N054143
$$ 3821488 -2083164 -5394662 -5309097 -6897935 -12839227 -18420601 -17694259 -11639944 -6585801
2841f585801K34381l344540m622276m708207k702090K324209P529502Q841102
$$ -6585801 -6351420 -9695960 -14318236 -19026443 -21728533 -19404324 -11874822 -3033720
2833c033720O492475M331168L531386M71862p431192j5944697j7102040q546893
$$ -3033720 3458755 7789923 11321309 11793171 4361979 -11582718 -28684758 -37231651
2825c7231651K614300P481096N401088K953477L645369L939485J082337j276733
$$ -37231651 -34617351 -27136255 -21735167 -18781690 -15136321 -11196836 -10114499 -11391232
2817a1391232K92036K145755j50782k838927N08750O851850O518179j785039q215780
$$ -11391232 -11099196 -8953441 -9104223 -11943150 -11434400 -4582550 1935629 150590 -8065190
2808h065190o069708n5550L003170L525052M564554N030233L138071R83419L05706
$$ -8065190 -14134898 -14190448 -11187278 -7662226 -3097672 1932561 5070632 6054051 6359757
2799F359757j143344l906892l213425K773750O706836J871052o077954o181743
$$ 6359757 5216413 1309521 -1903904 869846 7576682 9447734 3369780 -2811963
2791b811963J420217N605709O72374o313470o640910j057902L641073L722205
$$ -2811963 -1391746 4213963 4886337 -1427133 -8068043 -9125945 -5484872 -1762667
2783a762667L95235l865689p221777q320513o758033l312448Q48669M446136O070194
$$ -1762667 -1367432 -5233121 -12454898 -20775411 -27533444 -30845892 -29997223 -25551087 -19480893
2774a9480893N441136M167339L666951L284751K189143J446626J691250P40889
$$ -19480893 -14039757 -9872418 -6205467 -2920716 -731573 715053 2406303 3147192
2766C147192k863515n698408l461759J833345L944698J660750K28973K350090
$$ 3147192 283677 -5414731 -8876490 -7043145 -3098447 -1437697 -1208724 1141366
2758A141366L776823Q31940l113905l208658j132158k114688o340065q987843
$$ 1141366 4918189 5750129 2636224 -572434 -1704592 -3819280 -10159345 -19147188
2750a9147188p908256n695876l895957o86388M073463O716596N712002N192892
$$ -19147188 -27055444 -32751320 -36647277 -37333665 -33260202 -26543606 -20831604 -15638712
2742a5638712Q231406J0290116N211888m323290r076396n858792r68987L96979
$$ -15638712 -7407306 2882810 8094698 3771408 -5304988 -11163780 -12132767 -11735788
2734a1735788R86590M286584P295383O103573L327678L284001L897542Q67646
$$ -11735788 -10749198 -6462614 832769 6936342 10264020 13548021 17445563 18313209
2726A8313209l283271k644124J502397K253848j596522m799766n921263q346064
$$ 18313209 15029938 12385814 13888211 16142059 14545537 9745771 3824508 -4521556
2718d521556j0123458m197076P758516J3182280O289382k618170l128586M0235
$$ -4521556 -14645014 -18842090 -11083574 2098706 8388088 5769918 2641332 2681567
2710B681567k259327o555816l285882N292965P839384K594748l86191L331181
$$ 2681567 422240 -6133576 -9419458 -4126493 3712891 6307639 5921448 9252629
2702I252629N635228L31506o134479m829118K008362M617143m58480o303331m952285
$$ 9252629 14887857 15219363 9084884 4255766 6264128 10881271 10422791 4119460 -832825
2693h32825K939140R080226P507820J800240j36506K385412J986055m376918r271775
$$ -832825 2106315 11186541 18694361 20494601 20358095 22743507 24729562 20352644 11080869
2684A1080869o181977k02891M78275j967237q4477M556310L984188j137540j876009
$$ 11080869 4898892 4696001 5174276 3207039 3122562 7678872 11663060 10525520 8649511
2675H649511L020336M432216j071998n081543k279355K07360m333021r881428
$$ 8649511 11669847 16102063 15030065 9948522 7669167 7876527 3543506 -6337922
2667f337922p079269K176030Q139964O233748m98863p260089r425535l622783
$$ -6337922 -13417191 -11241161 -3101197 3132551 2633688 -4626401 -14051936 -17674719
2659a7674719O457042J0117057K345336q038189r616818k912379L561953O478257
$$ -17674719 -11217677 -1100620 1244716 -6793473 -16410291 -19322670 -15760717 -9282460
2651i282460P937881O949188J208357m840725m271094O97129J428860k788059
$$ -9282460 -1344579 5604609 6812966 1972241 -2298853 -1601724 -172864 -2960923
2643b960923l704589J199012L974798n2355m009331j022241M310659L620826j956923
$$ -2960923 -6665512 -5466500 -1491702 -1544057 -5553388 -6575629 -2264970 1355856 -601067
2634f01067m324709p44573L989739N895547N385330L120427j258973n498898n412010
$$ -601067 -4925776 -5670349 -1680610 4214937 9600267 12720694 11461721 5962823 550813
2625E50813j090516J929560J59670k662877r89397M375486P340113M992196J175314
$$ 550813 -539703 1389857 1549527 -1113350 -2102747 2272739 9612852 14605048 15780362
2616A5780362O13889K461431K031901k480535p536205q377704l859167K855601
$$ 15780362 16394251 18855682 20887583 18407048 10870843 2493139 -1366028 1489573
2608A489573O920984N279729o86229n742227n651559j563085K051099L307925
$$ 1489573 8410557 13690286 13004057 7261830 1610271 47186 2098285 5406210
2600E406210L925520M413450K445774k146413m786551k071375K505245K963476
$$ 5406210 9331730 13745180 16190954 14044541 9257990 7186615 9691860 12655336
2592A2655336n59835k075437J584795O467157O879885J998236m389768q604553
$$ 12655336 12095501 10020064 11604859 18072016 24951901 26950137 22560369 13955816
2584A3955816r799329q904812o391281j730234M686400R783854R862694N049897
$$ 13955816 4156487 -4748325 -11139606 -12869840 -8183440 1600414 11463108 16513005
2576A6513005l43799l104765m394156n949124o060119k956105J15819j684019
$$ 16513005 16169206 13064441 8670285 2721161 -3338958 -6295063 -6179244 -7863263
2568g863263o738658p702780j680389M952901M702427j342695n415734k926930
$$ -7863263 -14601921 -22304701 -23985090 -19032189 -14329762 -15672457 -21088191 -24015121
2560b4015121L025993O598272N620393K200392r76148k920762l246221r44692
$$ -24015121 -20989128 -14390856 -8770463 -6570071 -7546219 -10466981 -13713202 -14657894
2552a4657894M021841Q605947Q564591L391517k415704m361536k717884p63293
$$ -14657894 -10636053 -2030106 6534485 9926002 7510298 3148762 430878 -332415
2544c32415J9543N64466J137866N57840j434551l271835l408747j661810J082765
$$ -332415 -312872 251594 1389460 1947300 512749 -2759086 -6167833 -7829643 -6746878
2535f746878L162295K934726J019386O51460L508535O384887N065557N42284k415215
$$ -6746878 -3584583 -649857 369529 1020989 4529524 10914411 15979968 16522252 14107037
2526A4107037k392903k462377l769687l281736q842J645155j465006n270735m056113
$$ 14107037 11714134 9251757 5482070 2200334 2191492 3836647 2371641 -2899094 -6955207
2517f955207O97061K465307n59458l459391k504096L16825K117727L429072M878557
$$ -6955207 -6258146 -3792839 -4352297 -7811688 -10315784 -9998959 -7881232 -4452160 426397
2508D26397L919824q49512n042391l374905J943423L181636j967379o712226m750319
$$ 426397 4346221 3496709 -1545682 -4920587 -2977164 204472 -1762907 -8475133 -13225452
2499a3225452J070664L573429J384383q51435p94343j260622m117374o308073
$$ -13225452 -12154788 -8581359 -7196976 -8048411 -8842754 -10103376 -14220750 -20528823
2491b0528823m278347R18097N368315O939378O142080M255730K556258K003158
$$ -20528823 -24807170 -23889073 -18520758 -11581380 -5439300 -1183570 1372688 3375846
2483C375846K170699J767897J057463J727791L360003K688819j773103o727215
$$ 3375846 5546545 7314442 8371905 10099696 13459699 16148518 14375415 7648200
2475G648200p797221m301653J308436O288493Q074327N027564o62871l759583
$$ 7648200 -149021 -4450674 -3142238 3146255 11220582 16248146 15585275 11825692
2467A1825692k476453r87860k335759k972499Q74586N371424M130412j480537
$$ 11825692 9349239 8361379 6025620 3053121 3927707 9299131 13429543 11949006
2459A1949006m246247j961621R82390K301645M191330O241486M025495k832883
$$ 11949006 7702759 5741138 6723528 9025173 13216503 19457989 23483484 20650601
2451B0650601q284095q554026o819216o107795m143032O64538M319610L453645
$$ 20650601 12366506 3812480 -3006736 -9114531 -13257563 -12593025 -8273415 -4819770
2443d819770J336645K433303N321353O208155N416457M981038L525317q07736
$$ -4819770 -3483125 -1049822 4271531 10479686 15896143 20877181 24402498 23594762
2435B3594762n490477p151294o867551o541781l756056L173175Q504210N507125
$$ 23594762 18104285 10952991 4085440 -2456341 -6212397 -3039222 5464988 10972113
2427A0972113k368107n190445q25581K834934M76768l957309n018621k874307
$$ 10972113 8604006 3413561 2587980 5422914 5899682 1942373 -3076248 -5950555
2419e950555j57629K011165K441898J61326j683424J565285P445701P403697m56389
$$ -5950555 -6108184 -4097019 -1655121 -1493795 -3177219 -1611934 5833767 13237464 12781075
2410A2781075p130832n700033j052122n23324j956106O14596M821351L409969
$$ 12781075 5650243 -49790 -1101912 -1625236 -3581342 -2966746 1854605 5264574
2402E264574k919422o004608l031864K47745m1188p62997O75784J285175j397374
$$ 5264574 2345152 -3659456 -6691320 -6443575 -6484763 -7247760 -6571976 -5286801 -6684175
2393f684175m211829l398832j20628K623263M533844O041156N635618K830097
$$ -6684175 -10896004 -14294836 -14415464 -11792201 -7258357 -1217201 4418417 7248514
2385G248514M66474M72593M53474j853430m028387l171304j507458k465655l513592
$$ 7248514 7714988 8187581 8641055 6787625 2759238 -412066 -1919524 -4385179 -7898771
2376g898771O53838Q332714J0884719M306862m602290o598513r83128M824538
$$ -7898771 -7244933 1087781 11972500 16279362 11677072 5078559 4095431 8919969
2368H919969M583095o35726m751215l392365J532202L890941P44058l375092k129070
$$ 8919969 13503064 12867338 8116123 4723758 6255960 10146901 10890959 7515867 5386797
2359E386797L422950N427340k2021p180125q449828m227793q73488j183185j888233
$$ 5386797 8809747 14237087 14215066 7034941 -1414887 -5642680 -6516168 -7699353 -9587586
$$ [...]
##END NTUPLES=NMR SPECTRUM
##END=
