##TITLE=31Pdec_DE-108_rm_3h
, 64 sc
 1.9.2025
##JCAMPDX= 6.0         $$ Bruker NMR JCAMP-DX V2.0
##DATA TYPE= NMR SPECTRUM
##DATA CLASS= NTUPLES
##ORIGIN= UXNMR, Bruker Analytische Messtechnik GmbH
##OWNER= root
$$ XWIN-NMR		Version 3.5
$$ Mon Sep  1 14:31:54 2025 Russian Standard Time (UT+4h)  she@DPX200
##.OBSERVE FREQUENCY= 81.013821
##.OBSERVE NUCLEUS= ^31P
##.ACQUISITION MODE= SIMULTANEOUS
##.ACQUISITION SCHEME= undefined
##.AVERAGES= 64
##.DIGITISER RES= 17
##SPECTROMETER/DATA SYSTEM= spect
##.PULSE SEQUENCE= zgpg30
##.SOLVENT NAME= CDCl3
##.SHIFT REFERENCE= (INTERNAL, CDCl3, 0, 198.062)
##AUDIT TRAIL= $$ (NUMBER, WHEN, WHO, WHERE, WHAT)
$$ ##TITLE= Audit trail, XWIN-NMR		Version 3.5
$$ ##JCAMPDX= 5.01
$$ ##ORIGIN= Bruker BioSpin GmbH
$$ ##OWNER= she
$$ F:/spectra/data/she/nmr/P31/2/pdata/1/auditp.txt
$$ ##AUDIT TRAIL=  $$ (NUMBER, WHEN, WHO, WHERE, WHAT)
(   1,<2025-09-01 14:30:21.15 +0400>,<she>,<DPX200>,
      <created by zg, POWCHK disabled, PULCHK disabled
       configuration hash MD5:
       00 E9 B6 7A A2 85 ED C7 34 08 36 98 17 FE 4E 26
       data hash MD5: 32K
       2B 4E A0 C9 46 50 C6 07 03 0F 9F BC 95 98 52 E9>)
(   2,<2025-09-01 14:30:23.53 +0400>,<she>,<DPX200>,
      <Start of raw data processing
       efp BC_mod = 2 LB = 1.5 FT_mod = 6 PKNL = 1 PHC0 = 1431.666 PHC1 = -31.50003 SI = 64K 
       data hash MD5: 64K
       85 2F 12 88 93 68 3F 29 8A 53 B8 69 76 4C F2 CB>)
(   3,<2025-09-01 14:30:46.20 +0400>,<she>,<DPX200>,
      <pk PHC0 = -14.67785 PHC1 = 0 
       data hash MD5: 64K
       CD FD 1C 34 9F 3E F1 54 DA 2B 6C F3 63 9D FD E8>)
(   4,<2025-09-01 14:31:15.28 +0400>,<she>,<DPX200>,
      <pk PHC0 = -68.84564 PHC1 = 193.9999 
       data hash MD5: 64K
       60 64 29 5C 2C DE 05 C0 30 4E B4 E2 F4 77 65 3C>)
$$ ##END=
$$ 
$$ hash MD5
$$ 82 A2 EB 1C FA 29 12 AC 87 B8 40 FF 1D 35 44 D9
##$RELAX= 
##$RELAX= 
##$RELAX= 
##$RELAX= 
##$RELAX= 
##$RELAX= 
##$RELAX= 
##$RELAX= 
$$ Bruker specific parameters
$$ --------------------------
##$DU= <F:/spectra>
##$EXPNO= 2
##$NAME= <P31>
##$PROCNO= 1
##$TYPE= <nmr>
##$USER= <she>
##$AMP= (0..31)
100 100 100 100 100 100 100 100 100 100 100 100 100 100 100 100 100 100 
100 100 100 100 100 100 100 100 100 100 100 100 100 100 
##$AQSEQ= 0
##$AQ_mod= 1
##$AUNM= <au_zg>
##$AUTOPOS= <>
##$BF1= 81.014009
##$BF2= 200.13
##$BF3= 200.13
##$BF4= 200.13
##$BF5= 200.13
##$BF6= 200.13
##$BF7= 200.13
##$BF8= 200.13
##$BYTORDA= 1
##$CFDGTYP= 0
##$CFRGTYP= 5
##$CHEMSTR= <none>
##$CNST= (0..31)
1 1 145 1 1 1 1 1 1 1 1 1 1 1 1 1 1 1 1 1 1 1 1 1 1 1 1 1 1 1 1 1 
##$CPDPRG= <waltz16>
##$CPDPRG1= <>
##$CPDPRG2= <waltz16>
##$CPDPRG3= <>
##$CPDPRG4= <mlev>
##$CPDPRG5= <mlev>
##$CPDPRG6= <mlev>
##$CPDPRG7= <mlev>
##$CPDPRG8= <mlev>
##$CPDPRGB= <>
##$CPDPRGT= <>
##$D= (0..31)
0 1 0 0 0 0 0 0 0 0.06 0 0.03 2e-05 3e-06 0 0 0.0002 0 0 0 0 0 0 0 0 0 
0 0 0 0 0 0 
##$DATE= 1756722620
##$DBL= (0..7)
120 120 120 11 120 120 24 19 
##$DBP= (0..7)
150 150 150 150 150 150 150 150 
##$DBP07= 0
##$DBPNAM0= <>
$$ [...]
##$SUBNAM3= <"">
##$SUBNAM4= <"">
##$SUBNAM5= <"">
##$SUBNAM6= <"">
##$SUBNAM7= <"">
##$SUBNAM8= <"">
##$SUBNAM9= <"">
##$SW= 400.765351723535
##$SWIBOX= (0..15)
0 1 3 0 0 0 0 0 0 0 0 0 0 0 0 0 
##$SW_h= 32467.5324675325
##$TD= 32768
##$TD0= 1
##$TE= 0
##$TE2= 300
##$TE3= 300
##$TEG= 300
##$TL= (0..7)
0 120 53 12 22 120 120 120 
##$TP= (0..7)
150 150 150 150 150 150 150 150 
##$TP07= 0
##$TPNAME0= <>
##$TPNAME1= <>
##$TPNAME2= <>
##$TPNAME3= <>
##$TPNAME4= <>
##$TPNAME5= <>
##$TPNAME6= <>
##$TPNAME7= <>
##$TPOAL= (0..7)
0.5 0.5 0.5 0.5 0.5 0.5 0.5 0.5 
##$TPOFFS= (0..7)
0 0 0 0 0 0 0 0 
##$TUNHIN= 0
##$TUNHOUT= 0
##$TUNXOUT= 0
##$USERA1= <user>
##$USERA2= <user>
##$USERA3= <user>
##$USERA4= <user>
##$USERA5= <user>
##$V9= 5
##$VALIST= <valist>
##$VCLIST= <CCCCCCCCCCCCCCC>
##$VD= 0
##$VDLIST= <DDDDDDDDDDDDDDD>
##$VPLIST= <PPPPPPPPPPPPPPP>
##$VTLIST= <TTTTTTTTTTTTTTT>
##$WBST= 1024
##$WBSW= 4
##$XGAIN= (0..3)
0 0 0 0 
##$XL= 0
##$YL= 0
##$YMAX_a= 31512
##$YMIN_a= -42701
##$ZGOPTNS= <>
##$ZL1= 120
##$ZL2= 120
##$ZL3= 120
##$ZL4= 120
##$ABSF1= 0
##$ABSF2= 0
##$ABSG= 0
##$ABSL= 0
##$ALPHA= 0
##$AQORDER= 0
##$ASSFAC= 0
##$ASSFACI= 0
##$ASSFACX= 0
##$ASSWID= 0
##$AUNMP= <proc_1d>
##$AZFE= 0.1
##$AZFW= 0.5
##$BCFW= 0
##$BC_mod= 2
##$BYTORDP= 0
##$COROFFS= 0
##$CY= -3
##$DATMOD= 1
##$DC= 0
##$DFILT= <>
##$DTYPP= 0
##$F1P= 0
##$F2P= 0
##$FCOR= 1
##$FTSIZE= 65536
##$FT_mod= 6
##$GAMMA= 0
##$GB= 0
##$INTBC= 1
##$INTSCL= 9.790993e-09
##$ISEN= 30
##$LB= 1.5
##$LEV0= 0
##$LPBIN= 0
##$MAXI= 10000
##$MC2= 0
##$MEAN= 0
##$ME_mod= 0
##$MI= 50
##$NCOEF= 0
##$NC_proc= -8
##$NLEV= 6
##$NOISF1= 182.463
##$NOISF2= 159.3651
##$NSP= 0
##$NTH_PI= 0
##$NZP= 0
##$OFFSET= 198.0616
##$PC= 4
##$PHC0= 1348.142
##$PHC1= 162.4999
##$PH_mod= 1
##$PKNL= yes
##$PPARMOD= 0
##$PSCAL= 0
##$PSIGN= 0
##$REVERSE= no
##$SF= 81.0140089999434
##$SI= 65536
##$SIGF1= 159.3651
##$SIGF2= -187.1042
##$SINO= 113.3802
##$SIOLD= 16384
##$SREGLST= <1H.CDCl3>
##$SSB= 0
##$STSI= 65536
##$STSR= 0
##$SW_p= 32467.5324675325
##$SYMM= 0
##$S_DEV= 0
##$TDeff= 32768
##$TDoff= 0
##$TI= <>
##$TILT= no
##$TM1= 0
##$TM2= 0
##$TOPLEV= 0
##$USERP1= <user>
##$USERP2= <user>
##$USERP3= <user>
##$USERP4= <user>
##$USERP5= <user>
##$WDW= 1
##$XDIM= 65536
##$YMAX_p= 382193110
##$YMIN_p= -239058870
$$ End of Bruker specific parameters
$$ ---------------------------------
##NTUPLES= NMR SPECTRUM
##VAR_NAME=  FREQUENCY,     SPECTRUM/REAL,   SPECTRUM/IMAG
##SYMBOL=    X,             R,               I
##VAR_TYPE=  INDEPENDENT,   DEPENDENT,       DEPENDENT
##VAR_FORM=  AFFN,          ASDF,            ASDF
##VAR_DIM=   65536,         65536,           65536
##UNITS=     HZ,            ARBITRARY UNITS, ARBITRARY UNITS
##FACTOR=    0.49542278885378, 1,            1
##FIRST=     16045.7642231865, 0,            0
##LAST=      -16421.768244346, 0,            0
##MIN=       -16421.768244346, -239058870,   0
##MAX=       16045.7642231865, 382193110,    0
$$ Real data points
##PAGE= N=1
##DATA TABLE= (X++(R..R)), XYDATA
$$ [...]
47382 -2085922 -1708528 -1786704 -2428436 -2725653 -2771055 -4211399 -7779142 -11391323 -12249913
47373 -12249913 -10468398 -8941182 -9354705 -10025413 -8620749 -5505260 -2788256 -1097160
47365 -1097160 606487 2366470 2726388 1356438 63462 74391 28070 -1798067 -4490478
47356 -4490478 -5524441 -4183096 -2243241 -1406401 -1586648 -1970806 -2511449 -3808396 -6174956
47347 -6174956 -9184951 -11812777 -13076624 -12981576 -12607739 -12719922 -12665254 -11434830 -9393364
47338 -9393364 -7784399 -6708197 -5086544 -2964515 -2264728 -4161160 -6794862 -7205867
47330 -7205867 -5329557 -4486430 -7183384 -11461501 -12822363 -9793818 -6123748 -6385707
47322 -6385707 -10369103 -13662970 -13622886 -12328868 -12507990 -12865504 -10072456 -4297739 330774
47313 330774 1048581 -423775 -1050762 -525097 -543430 -1616721 -2588096 -2758512 -2836907 -3673025
47303 -3673025 -4955403 -5324147 -3548864 43221 3165255 3382395 765459 -2021679
47295 -2021679 -2719087 -1694895 -783299 -1126511 -2909428 -5827948 -8497195 -8563722 -5172405
47286 -5172405 -760808 1197129 -115368 -2754718 -4947167 -6365937 -6974240 -6785982
47278 -6785982 -6895488 -8595162 -10916887 -11070068 -8242559 -5138765 -4491908 -5601212 -5831665
47269 -5831665 -4294803 -2310500 -1084047 -785180 -1487926 -3129845 -4544125 -4388178 -3528211
47260 -3528211 -4824163 -9448730 -14490806 -15564083 -11491453 -5386596 -1184280 -53895
47252 -53895 -450885 -758726 -975890 -1974613 -4000742 -6426374 -8607272 -10303085 -11172498
47243 -11172498 -10470011 -7753891 -3708219 251913 3314272 5855780 8399244 10129700
47235 10129700 8935043 3385181 -5215907 -13057118 -16544405 -15040545 -10954851 -7323785
47227 -7323785 -5600843 -5581433 -6453251 -7039159 -5548085 -736498 5851774 9893139 8108374
47218 8108374 2019938 -3492124 -5662905 -6365639 -8409963 -11136005 -11766030 -10149925
47210 -10149925 -9252184 -10422283 -10896126 -7723460 -2320925 1201251 1370022 640191 1464145
47201 1464145 3290189 4099520 3193518 1412005 -278252 -1303309 -1270187 -273733 829836
47192 829836 1152615 618783 -349638 -1634514 -3303490 -4887352 -5469570 -4682629 -3215045
47183 -3215045 -2026010 -1173092 269987 2966744 6196653 8366062 8617306 7453284
47175 7453284 5750789 3955256 2558717 2265198 2709029 1932702 -1407468 -5846996 -8740679
47166 -8740679 -9724678 -10563105 -11550967 -10601950 -6905805 -3097374 -1875226 -2189870 -1136216
47157 -1136216 1447020 2883965 1839605 -334 -856719 -1224224 -2347638 -4049106
47149 -4049106 -5303020 -5830777 -5974310 -5830529 -5580741 -5975495 -7344773 -8545271 -8005749
47140 -8005749 -5711120 -3261300 -1980546 -1718247 -1522745 -742222 712424 2499403 3799171
47131 3799171 3535828 1260367 -1984048 -3923971 -2730489 1069488 4519295 4818577
47123 4818577 2220571 -359284 -947996 -686201 -1513815 -2823637 -2290155 309093 2362152
47114 2362152 2134395 1100351 1175197 1400879 -422082 -3760086 -5491245 -3972656 -761829
47105 -761829 2051630 4106230 5628208 6114166 5504024 5069608 5569308 5738668 4232606
47096 4232606 2024979 1104744 1622735 2268515 2837341 4173428 5711333 5411705 2641424
47087 2641424 -774054 -2945959 -3682257 -3365245 -1957381 7080 1159517 1100181 997712
47078 997712 1407321 1086797 -817990 -3012801 -3919236 -3763813 -3199488 -1495448 1759197
47069 1759197 4576729 4843071 3777278 4322891 6611694 8057080 7844744 7906975 8709354
47060 8709354 7597406 3228281 -1218379 -1879450 644421 2733181 3068065 3484959 4845158
47051 4845158 5043530 2046368 -3033744 -7114826 -8393015 -7501462 -6075945 -5020079
47043 -5020079 -4054802 -2452397 26034 2968826 5862629 8251109 9275139 7968515
47035 7968515 4720402 1767735 1204163 2715803 4101819 3817666 2252764 844038
47027 844038 841659 2569693 4723887 4683719 1095130 -3633399 -5007598 -1383964 3948374
47018 3948374 6397447 4665149 852046 -2716581 -5157118 -6202129 -5632457 -3914078
47010 -3914078 -2254610 -1546944 -1808646 -2655795 -3563116 -3686925 -2484162 -910783 -1159566
47001 -1159566 -4532727 -9894114 -14565827 -16470640 -15333898 -12403152 -9339614 -6966109
46993 -6966109 -4851353 -2453465 -510981 -356181 -1709139 -2501691 -1713854 -1111450 -2705002
46984 -2705002 -5384390 -6125796 -4444007 -3426428 -5463099 -8767361 -9761870 -7851855
46976 -7851855 -5798022 -5433546 -4983875 -1657909 4192673 8910308 9479711 6697673 4119794
46967 4119794 4463603 7436845 10603936 11719982 10358132 7911276 6147308 5379569
46959 5379569 4100273 915465 -3335248 -6272918 -6798007 -5977604 -4731534 -2254815
46951 -2254815 1953724 5821351 6528243 4157051 1495400 220445 -658928 -2166308
46943 -2166308 -3315190 -2795502 -1013881 910476 2863691 4920740 5816894 4020600
46935 4020600 52247 -3623152 -4936411 -3569238 -451143 2895092 4724099 4020752
46927 4020752 1348723 -1792517 -4292636 -5714316 -6010461 -5889095 -6704619 -8625888 -9453556
46918 -9453556 -6979268 -2416678 401221 -299563 -2137560 -2123338 -753684 -935888 -3621908
46909 -3621908 -6429033 -6843756 -5243615 -3754395 -3059417 -1900789 273546 1901099
46901 1901099 1614179 676361 1280365 3025033 3423969 2144914 2168944 5457030 9636003
46892 9636003 10937870 8930444 6309514 5221497 5920452 7940172 10075266 9907602
46884 9907602 6066720 809237 -2103645 -2010323 -1444913 -1911273 -2488584 -2772848 -3860629
46875 -3860629 -5459019 -5226243 -2562946 -200566 -74471 -238879 1666869 4031142 3260562
46866 3260562 -1037585 -5516651 -7156269 -5757855 -2873621 -164276 1367494 1907706
46858 1907706 2398985 2863128 2109594 -55765 -1819120 -1841478 -1123079 -726059 568770
46849 568770 3950785 7338544 7318955 3719562 -320736 -2402073 -2515329 -1124964 1552408
46840 1552408 4230073 5176928 4692609 4725512 5555514 5102476 2263825 -1123148 -2654854
46831 -2654854 -2126295 -1067342 -833867 -1850359 -3593974 -4793089 -4596831 -3683513 -3113574
46822 -3113574 -2253743 589124 5363689 9685542 11370540 10314632 7822770 5320532
46814 5320532 3532796 1681882 -1866396 -6646233 -9025261 -6572050 -2343437 -1473744
46806 -1473744 -4162058 -5981442 -4945456 -3577890 -3252428 -1711433 1646084 3003510
46798 3003510 36707 -3562380 -3459453 -1172233 -845857 -2361574 -2479652 -897873 -193684
46789 -193684 -753952 -431838 1224176 2698018 4147569 7072425 10322113 10570109 7200989
46780 7200989 3069636 199942 -1554269 -1689684 539770 2440194 -283086 -6477494
46772 -6477494 -9391160 -6015345 -1727085 -2144486 -4748675 -3325346 2360746 6659768
46764 6659768 6327569 3675052 1616636 -49529 -2561174 -5573215 -7799989 -8459934
46756 -8459934 -7628077 -6489568 -6875465 -8958454 -10157953 -8313098 -5045220 -3501838
46748 -3501838 -3641826 -2951008 -1477388 -2322818 -6329977 -9963766 -10287167 -8991122 -9059125
46739 -9059125 -9792505 -8079019 -3292383 1894258 5116014 6451618 7145782 8188690
46731 8188690 10178157 12762123 13907034 11324874 5327744 -697959 -3176546 -1135131
46723 -1135131 3805608 9121437 12741826 13786694 12760469 10724313 8075374 4628581
46715 4628581 883700 -1791034 -2723210 -2818161 -3152177 -3392211 -2561227 -911373 86037
46706 86037 -457653 -2088404 -4157821 -6648705 -9369701 -11267739 -11462775 -10589674 -10277961
46697 -10277961 -11323120 -12912904 -13648758 -12932767 -11430127 -10521134 -11082554 -12315365 -12024726
46688 -12024726 -8804364 -3909609 -170908 1042796 871912 714454 95343 -2236094
46680 -2236094 -5829720 -8545128 -9062538 -8272231 -7814529 -8097814 -8276267 -7471631 -5261055
46671 -5261055 -1446894 3600022 8325528 10729976 10243161 8196254 5873986 2923902
46663 2923902 -1190340 -4839228 -5308979 -2601401 -161420 -593013 -2365285 -2578323 -1359662
46654 -1359662 -679353 170612 3911203 9510968 11357109 6705781 576760 -600633
46646 -600633 1873578 801957 -6399044 -13768432 -14747454 -10236678 -6257904 -6166978 -8145169
46637 -8145169 -9168313 -8588917 -7693050 -7569876 -7968400 -7557001 -5269304 -1711720 1187152
46628 1187152 2185687 1664668 389424 -1414752 -3264798 -4242402 -4541573 -5587864 -7371816
46619 -7371816 -7504079 -4874713 -2527503 -4105976 -8480696 -11094174 -10317716 -9073175
46611 -9073175 -9682028 -10549997 -9415288 -6947977 -5026199 -3703401 -2315327 -1970259 -4262759
46602 -4262759 -8249703 -11029589 -11060302 -9082722 -6142208 -2654192 615139 2509091
46594 2509091 2781891 2118102 812593 -1078263 -2218650 -573529 3631998 7075710
46586 7075710 6747630 3282369 -312447 -2488926 -4173960 -6138212 -7105557 -5424928
46578 -5424928 -1704534 1460460 2219682 875457 -1437429 -4082542 -6237779 -6318424 -3772018
46569 -3772018 -802344 -372359 -2510216 -4431653 -4460620 -3692252 -3238600 -2352176 -695863
46560 -695863 -78847 -1677925 -3336937 -2302696 572253 2192213 1961012 2059475 3199711
46551 3199711 3338717 1260847 -1351367 -2487221 -2212188 -1460712 -429123 718831 1242385
46542 1242385 906400 240021 -725742 -2089549 -2179348 1192443 6488911 8448408 4349865
46533 4349865 -2181179 -5871632 -5925526 -4791564 -3250277 -546345 1960022 1584246 -1162850
46524 -1162850 -2556457 -940603 1042777 569568 -1714390 -3547000 -4269544 -4431253 -3843386
46515 -3843386 -2036265 96353 849649 -61008 -815779 646226 4271585 7500269 7510124
46506 7510124 4095256 -134042 -2759057 -3936177 -5080962 -6309735 -6616083 -5770159
46498 -5770159 -4322431 -2256832 548082 2945520 3576101 2989313 2630269 2077652 -145688
46489 -145688 -3129502 -4105385 -3080683 -3616860 -7385237 -10956735 -10378462 -6593751 -3567716
46480 -3567716 -2749506 -2409086 -1506504 -1136420 -2093864 -3449765 -4083267 -4060584 -4125303 -4897797
46470 -4897797 -6612936 -8745113 -10120380 -10224784 -9884745 -9779751 -9147935 -7223467 -5076241
46461 -5076241 -4410438 -5179873 -6078106 -6782815 -7779173 -8398662 -7298588 -4983306 -3699046
46452 -3699046 -4415609 -5856505 -6956350 -8163565 -9507161 -9582416 -7984900 -7041638 -9141147
46443 -9141147 -13226112 -15808457 -15180688 -13047396 -11858927 -11762027 -10746628 -7333701 -2686558
46434 -2686558 124087 -807931 -4026518 -6187291 -5694957 -3955969 -2888295 -2620679 -2553173
46425 -2553173 -3282737 -5640516 -8380942 -8925821 -6812407 -4707223 -5079923 -7108732 -8074725
46416 -8074725 -6980723 -5328205 -4589674 -4432566 -3823484 -2728128 -2024404 -2465517 -4332223
46407 -4332223 -7380541 -10379156 -11409249 -9710703 -6872304 -5151663 -4947855 -5102549
46399 -5102549 -5274748 -6219302 -7547831 -7255650 -4459150 -945579 1286351 2559859 4021745
46390 4021745 5029198 4278675 2725966 2760474 4482762 5376491 4262318 3035022 3203769
46381 3203769 3140651 1038116 -1133953 250671 4778570 7591515 5553027 1114937
46373 1114937 -1729521 -3049172 -5602893 -9087158 -9626286 -5764164 -1512706 -1232876
46365 -1232876 -3916161 -5346880 -4183116 -2463891 -1027398 1548077 5135995 7161581
46357 7161581 6845192 6787782 8357136 8832604 5876448 1941255 807168 2003382 2546649
46348 2546649 2539182 4630109 8677063 11515653 12183296 12924897 14159895 12871171 7843931
46339 7843931 2639292 804665 1195111 833195 -157054 383238 2532597 4581163 6407542
46330 6407542 9359846 13031349 15008981 14252472 12527317 11722837 11277454 9188237 4821984
46321 4821984 -34276 -2895928 -3148238 -2576059 -3034213 -4224781 -4781992 -4763624 -5058283
46312 -5058283 -4724345 -1874717 2195520 3139881 -367411 -3823019 -2914908 336239 1052379
46303 1052379 -891951 -1138063 2044614 5508272 6673094 7131282 9209234 12074125
46295 12074125 13303907 12222065 9844544 7083234 4609682 3305589 3454609 4268191
46287 4268191 4982563 5419815 4994199 2728598 -836027 -3286036 -3128126 -1722797 -1235222
46278 -1235222 -1844724 -2340248 -2394856 -2588191 -2806231 -2260249 -898968 521889 1664167
46269 1664167 2724447 3406541 3014126 1810849 1186585 1827009 2383045 849298 -2694515
46260 -2694515 -5400840 -4358607 73307 4356528 5538592 4166444 2749750 2246579
46252 2246579 1571989 147625 -1120163 -1900929 -3578955 -7066991 -10679630 -11598796 -8923643
46243 -8923643 -4290912 -44708 2298880 2444690 1392575 866255 1650020 2555679 1770817
46234 1770817 -890193 -3660131 -4544567 -2988385 -339691 852320 -1188831 -5258395
46226 -5258395 -7620388 -5870313 -1877441 457307 -11590 -818438 198820 2173565
46218 2173565 3250479 3529035 4282981 5268909 4858558 2803862 1036436 1033463 1741030
46209 1741030 1222128 -480068 -1532723 -1167793 -911806 -2433029 -5120875 -6612463 -5266184
46200 -5266184 -1457800 3193086 7126968 9491307 10145152 9230356 6777191 3207208
46192 3207208 274848 286987 3367039 6494336 6885934 5738653 6529119 9651324 11314518
46183 11314518 8849804 4813269 3718784 6075484 8159224 7268686 4672462 2781265
46175 2781265 1581894 -557193 -3667111 -5662312 -5149048 -3355622 -2452091 -2677910 -2294229
46166 -2294229 -347833 1767609 2197599 1128596 277627 471108 1157621 2102705 3799087
46157 3799087 5710814 5780036 2866117 -1311216 -3852315 -3750002 -2364994 -1397777 -1397556
46148 -1397556 -1965489 -2474500 -2562117 -2417942 -2511655 -2879827 -3126496 -3224848 -3472726 -3391833
46138 -3391833 -1888408 750691 2274826 1133826 -1166123 -1765408 80155 2574441
46130 2574441 3892011 3620688 2018133 -493409 -2835399 -3588663 -2366714 -286276
46122 -286276 1070580 798199 -831920 -2384313 -2310832 -756717 369356 38205 -143421
46113 -143421 1838271 5410463 8472248 10571158 12596020 13688759 11432767 5860995
46105 5860995 749011 -439250 1846680 4795982 6649278 7247744 6764111 5600298
46097 5600298 4672659 4397149 3975487 2652860 923311 -427785 -1634894 -3330336 -5376989
46088 -5376989 -7225492 -8672198 -9455544 -9026205 -7652901 -6800191 -7294471 -7880679 -6637844
46079 -6637844 -3167589 1332867 5096684 6096776 2956440 -2879102 -7242155 -7480672
46071 -7480672 -5672285 -5707183 -8154752 -10291335 -10395731 -9248681 -7621285 -5270938 -2950387
46062 -2950387 -2646055 -4699478 -6873915 -7409552 -7016181 -6666879 -5464420 -2319978 1867908
46053 1867908 5352820 7470403 7917328 5768890 1363125 -2108234 -1474738 2450768
46045 2450768 6157242 8411929 11427195 16807593 22942304 27659163 31684776 37969485
46037 37969485 48329327 61352390 72497413 75843347 67760198 50711947 32568548
46030 32568548 20422767 15210666 13155725 11250481 9413991 8054888 6354796 3819222
46022 3819222 1525636 511081 197575 -314980 -444049 908846 3223853 4726400 4666512
46013 4666512 3818300 2688037 681476 -2462939 -5630138 -7579321 -8522312 -9569346
46005 -9569346 -10926818 -11436881 -9974320 -6908059 -4075893 -3334794 -4921465 -7148547
45997 -7148547 -7990793 -7086206 -5871196 -5674109 -6170709 -6017486 -4591774 -2690391 -1744334
45988 -1744334 -2638141 -4997664 -7275118 -7814114 -6286733 -3978730 -2368344 -1638401 -927690
45979 -927690 240629 1346815 1624540 895983 -419521 -1683277 -2269441 -1851996 -810660
45970 -810660 -83874 -114651 28114 1800175 4986237 6950987 5204564 733499 -2582815
45961 -2582815 -2533752 -1147117 -1348578 -2402564 -1118414 2867431 6080572 6329107 5925099
45952 5925099 7754659 10300750 9402680 4001973 -2526282 -6410399 -6437211 -3093424 2483367
45943 2483367 8004782 10810157 10426419 8991438 8422130 8693815 9567282 12020324 16590176
45934 16590176 21973311 27010352 32719519 40273963 47786736 51415679 49642161 44561062
45926 44561062 38734117 32576436 25472077 17900130 11306055 6643907 3975373 3041377
45918 3041377 3397038 4115943 4001446 2358833 -394958 -2821059 -3432193 -2107520 -526890
45909 -526890 -620426 -2454820 -4217299 -4452660 -3589518 -2818243 -2255840 -1222693 4871
45900 4871 48075 -1505454 -2944595 -2419976 -606649 429 -1339160 -2198122 -196546
45891 -196546 3410517 5020622 3190882 -73191 -2796352 -5550606 -9108131 -11519300
45883 -11519300 -10145706 -6008469 -3323051 -4078517 -5392476 -3639716 499915 3050508
45875 3050508 1946868 -810566 -2217231 -1748123 -1182148 -2174562 -4889881 -8327232 -11008613
45866 -11008613 -11563723 -9606550 -6474344 -4714962 -6250946 -10748180 -15809943 -18849627
45858 -18849627 -18700159 -15478119 -9695548 -2620371 2701289 2766565 -2525652 -8392382
45850 -8392382 -9619678 -6355679 -3442405 -3829297 -5211453 -4324709 -1813411 -275172
45842 -275172 459963 2392952 4471390 2911003 -2671214 -7290878 -6903888 -3652039 -2063146
45833 -2063146 -2506504 -1969076 239295 1694950 1514023 1803242 3615675 4863639 3716730
45824 3716730 1261775 -895926 -3093750 -5615418 -6579124 -4473265 -1143356 550396
45816 550396 858838 1968708 3536028 2812664 -661758 -3861161 -4770199 -5141227 -7101430
45807 -7101430 -9435211 -9533210 -7489500 -5800425 -5699460 -6043553 -5661364 -4755719 -3702679
45798 -3702679 -2274429 -726009 -108449 -440845 214066 3315848 7026478 7559745 3698872
45789 3698872 -1398682 -3711176 -2600805 -384941 1423684 3416685 5718588 6415617
45781 6415617 4127439 845679 199856 3220783 7552205 10800519 12790722 14011609
45773 14011609 13727460 11084721 7103556 3969958 2452525 1163411 -1305561 -4128050
45765 -4128050 -4644403 -1211745 4397700 8040868 7334838 4345561 3039660 4253963
45757 4253963 4870292 2441800 -1279171 -2813992 -1460023 637127 2005729 3076196
45749 3076196 3907687 3016623 -493772 -4994133 -7618098 -6905392 -3656671 106864 2495089
45740 2495089 2765738 1760785 1218782 2436517 5671281 10345392 14970881 17290376
45732 17290376 16049006 12916696 11156889 11766877 12391119 10905503 8470362 7595706
45724 7595706 8552258 9614595 9934541 9997123 9725600 8547669 7408939 8236756 10725807
45715 10725807 12029384 10895020 9925285 11803171 14954423 15476999 12578550 9439957
45707 9439957 8577210 8781515 7613291 5190709 4100907 6262262 10817102 14777747
45699 14777747 15343670 12143567 7583019 4490389 3340913 2608149 1725112 1976570 3699272
45690 3699272 4483363 2085031 -1869261 -3301980 -628892 3686750 6647513 7806226
45682 7806226 8291826 8676387 8904902 8855952 7752249 4331526 -971130 -5159542 -5689538
45673 -5689538 -3543053 -1611071 -887711 -458436 -618922 -2968379 -6853813 -8695478 -6487575
45664 -6487575 -2695358 -639901 72321 1881206 4433642 4823805 2613212 1256470
45656 1256470 3270380 6522431 7249938 5156228 3329858 3772068 5058596 4719420 2623339
45647 2623339 1271246 2938319 6747116 8951057 6845686 2280447 -40878 1798737
45639 1798737 4560671 4187896 866851 -2113763 -3222528 -3693401 -4126647 -3197621 -588459
45630 -588459 1375181 575647 -2097370 -4205714 -4553193 -3106568 366299 5626321 10738003
45621 10738003 13307083 12604173 9347375 4365046 -946471 -3939456 -2884831 391522
45613 391522 2186168 1270521 -393182 -1189150 -1628417 -2069970 -1246483 1492518 4330412
45604 4330412 5005829 3449607 1099876 -1108887 -2553846 -1870880 1933844 7486401
45596 7486401 11475181 11259254 6835157 955906 -2441426 -1356459 1839603 2445318
45588 2445318 -1114483 -5447422 -6954289 -6300654 -6105164 -6314143 -5001632 -2394005 -490120
45579 -490120 704601 2773325 4780847 3699752 -185708 -2390325 -578210 1852972
45571 1852972 1091234 -1309626 -1204846 1824087 4462054 4761108 3969550 3716567 4076502
45562 4076502 4351516 3806149 1943491 -364113 -839251 1459171 4560984 6567787 8413317
45553 8413317 11058415 12044425 8813770 4076664 2959999 5045249 4567554 -469698
45545 -469698 -4777274 -3654480 598823 3490151 5113448 7639740 9478463 7417930
45537 7417930 2893841 782162 2347551 4120460 3950759 3650111 4715324 5633281 5210116
45528 5210116 5191964 7354122 10354958 11473045 9676145 5485188 -208378 -5508237
45520 -5508237 -7652585 -5905085 -2996288 -1836194 -2044468 -1565132 -276755 473459 1008269
45511 1008269 3110826 6598326 8651788 7345002 3996630 1186077 34878 446690
45503 446690 2504546 5967678 9099941 9767864 7909730 5738651 5083518 5400777 4927762
45494 4927762 2977393 232550 -2601182 -5138072 -6470264 -5571551 -3114121 -1476308
45486 -1476308 -1913952 -2893610 -2502414 -1330474 -1157705 -1751205 -1434713 -543642 -1513028
45477 -1513028 -4955662 -8275080 -9315191 -9006575 -8885494 -8337024 -6502233 -4991250 -5857681
45468 -5857681 -7922698 -8037942 -5745443 -3999463 -4920930 -7065378 -7559401 -5245533 -1108418
45459 -1108418 2947141 5120884 4749364 2916579 1206558 -217305 -2170910 -4211570
45451 -4211570 -4565202 -2783131 -837004 -577100 -1273781 -811990 1358386 3500430 3653453
45442 3653453 1884145 430709 1460208 4481179 6640299 6317608 5480760 6933601
45434 6933601 9954111 10916177 8234054 4299657 1949073 1321429 1172807 1036898 681990
45425 681990 -574125 -2415103 -3239670 -2975410 -4097345 -7566436 -9719136 -6338836 1281783
45416 1281783 7632805 9812172 9640071 8985488 6918376 2912526 -562007 -1260556 -854021
45407 -854021 -2563579 -6157852 -8016149 -6020677 -2063916 815387 1982802 2936414
45399 2936414 4682870 6611050 7539436 6844482 4605849 1558720 -825525 -1062098 808009
45390 808009 2839351 3163711 2132628 1599472 2225888 2739643 2173092 1552130 2506438
45381 2506438 5013482 7312377 7477537 4695629 46503 -3430340 -2973835 408269
45373 408269 2222983 13978 -2828118 -1219973 4582403 9083859 8589195 5112560
45365 5112560 2631937 2367196 3179575 4204616 5100193 5262827 4665123 4456727 5382946
45356 5382946 6743911 8066820 10176529 12956710 13826457 11001906 7179520 6981060
45348 6981060 10877579 14488508 14438911 12323502 11711751 13387145 15279175 15693089 14656334
45339 14656334 12662567 9895992 6852880 4467519 3173750 2590040 2562358 3953654
45331 3953654 7715420 13179170 17783501 18936551 16216639 11595919 7538963 5127531
45323 5127531 3998816 3539705 3620350 4289614 5237702 5796574 5474081 4511151 3814472
45314 3814472 4094349 5119338 6165941 7082092 8229868 9288540 9077744 7236417 5396923
45305 5396923 5744220 8587833 12049609 14021713 13844371 12200235 9998571 7457950
45297 7457950 4013951 -737501 -5879277 -9500346 -10609861 -10134015 -9431084 -8529280 -6714509
45288 -6714509 -4148822 -1607766 1013164 4495813 8630722 12070402 13939653 14334151
45280 14334151 13165262 10006573 5414259 876955 -3045318 -6917799 -10094255 -10121610
45272 -10121610 -5900001 169791 4966780 8206401 11141161 13066505 12177721 9541709
45264 9541709 8752198 10662515 11492341 8048837 2477004 -612474 -86673 1416670 2134222
45255 2134222 2915123 4218532 4429979 2343749 -896050 -3712684 -6121044 -8246524
45247 -8246524 -8473972 -5296766 -225036 3345356 4064196 3635856 3850220 4375852 4021322
45238 4021322 2781408 1811317 2075336 3434065 4574104 3964385 1675837 -138372 121258
45229 121258 728838 -1603048 -7017507 -11718113 -12639632 -10811825 -8876110 -7401496 -5583121
45220 -5583121 -3836765 -3187218 -3041207 -2061528 -790593 -1006951 -2579140 -3276072 -1968702
45211 -1968702 75078 1500382 2404844 2849586 1805504 -1135416 -4294286 -5424081
45203 -5424081 -4024434 -1394043 931603 2220711 2716889 3264995 4253852 4860766 4073947
45194 4073947 2241518 422329 -1547371 -4589022 -7849887 -8686983 -5939105 -1453325
45186 -1453325 2416247 4919070 5624491 3450319 -1125484 -4820764 -4929807 -2754222
45178 -2754222 -1444716 -1588995 -1489833 -930499 -1575866 -3555197 -4504226 -2862362 -40011
45169 -40011 1603664 1378548 207735 -597472 15221 1983867 3483099 2644330 357723
45160 357723 -335596 1756359 4398845 5168522 4336097 3369005 2608044 2167288 3247596
45151 3247596 6157991 8408737 7615580 5560573 6171173 9360342 10280686 6062328 378905
45142 378905 -1160658 1609882 3585019 1461647 -2164055 -2544649 1337950 6013629
45134 6013629 7668076 5664494 2175915 -463027 -1487560 -1296747 -199237 1794987
45126 1794987 3994464 4768806 3227654 923892 737749 3696113 7783907 10379678
45118 10379678 10912859 10357446 9186693 7351224 5805315 6184685 8494686 10523696
45110 10523696 10444586 9163880 9136260 11148895 13015879 11658631 6498310 781397 -1080548
45101 -1080548 1792974 5300446 4878265 1095182 -1102525 1133589 5082817 6445837
45093 6445837 4644111 2358288 1495261 1987468 3639268 6576075 9897673 11938995
45085 11938995 12068622 10696426 7733514 2973929 -2010594 -4543137 -3950576 -2163365
45077 -2163365 -726683 782118 2653774 3692274 3466820 3934554 6692001 9903200
45069 9903200 10311880 7696229 5010684 4200977 4227774 3850779 4137016 6535768 9754872
45060 9754872 10741458 8761958 6609460 6906957 8702395 9355404 8908040 10114237 13684125
45051 13684125 15979747 13276729 6869665 1818034 1339514 4356726 7836449 9216787
45043 9216787 6992066 1770173 -2900619 -3503117 -1102077 -258173 -2452055 -3673053
45035 -3673053 -406614 4935398 7367183 5862357 3311310 1635298 667976 1065733
45027 1065733 4251700 8989437 11565151 10689928 9516620 11252016 14878957 16862418
45019 16862418 15472182 11766243 7540790 4100921 2494868 3375830 6396213 10268217
45011 10268217 13366498 14314326 12793181 10159259 8540357 8864733 10244010 11286457
45003 11286457 11101547 9005942 4702760 -573190 -4342480 -5291477 -4514953 -3528878 -2125093
44994 -2125093 524799 3459078 4359506 2456112 -323336 -1532634 -667965 1048897
44986 1048897 2712688 4728889 7642402 10547792 11480980 9759869 7365234 7106127
44978 7106127 9418543 11813577 11808444 9833958 8908995 11727927 18018205 24277371 26368541
44969 26368541 23328199 18605674 16450624 16982928 16236262 11521636 5079026 1204513
44961 1204513 1038374 1854358 875467 -1850922 -4255383 -4574560 -2744314 -374159 666638
44952 666638 298470 499447 2726147 5796634 7782354 9404337 13273474 19343471 23474433
44943 23474433 22113232 16901714 12636129 11383120 10792205 8305787 4860997 3287250
44935 3287250 4444854 6531739 7660325 7635389 7278033 7420682 8825405 11597078 13873834
44926 13873834 12515681 6663549 -74594 -2687056 84612 5041085 8731398 10475229
44918 10475229 11004996 10505305 9381019 9074745 10096532 10468439 8385248 5648288 5848923
44909 5848923 9217362 12015182 11734844 10223442 10122190 10602644 9124855 5892947 3546487
44900 3546487 2946012 2426984 1665165 3072020 7696505 12409105 13856843 13591785 16059604
44891 16059604 21992225 27093190 27826946 25442862 22840520 20192852 16119824 11440753
44883 11440753 8863458 9417539 11439713 12884746 12796137 10920715 7996226 6204910
44875 6204910 7038179 8665326 7896425 5082995 4230872 7177486 10490604 10122324 6899753
44866 6899753 4928654 6083354 8712307 10894772 12270655 12789535 12056829 10433508
44858 10433508 9127579 8624267 8070218 6490201 3847598 952167 -988255 -1082949 180014
44849 180014 1133271 1086575 1494735 3762952 6768177 8257435 8132938 8409083 10016883
44840 10016883 11453288 10790837 7642145 3177994 -483059 -1279788 760352 2905074
44832 2905074 2975619 2607087 4781096 8601966 9969298 7970188 6805377 9502073 13066874
44823 13066874 12813770 9125560 6481394 7110540 9158012 10761529 12415079 14446540
44815 14446540 15010539 12448014 8186996 5408872 5127668 5001629 2453320 -1929803
44807 -1929803 -5174699 -6008908 -6677478 -9567595 -13266463 -14230126 -12061573 -10305161 -11101434
44798 -11101434 -11785348 -8797831 -2957048 1727891 3325899 3468462 4162269 5706062
44790 5706062 7814381 10466831 13029204 14233460 13693031 12303527 10937365 9975610
44782 9975610 10149028 12171906 15004304 15994178 13754960 10060449 8057103 9047717 11500661
44773 11500661 12862377 12129487 10898327 11663132 14634145 16877071 15640459 11926376
44765 11926376 9156816 8576924 8092847 6146379 4524566 5820796 9580562 12858651
44757 12858651 13970971 13906878 14043841 14050654 12724454 10045909 7603366 7105973 8792463
44748 8792463 11183395 12194029 10697964 7478527 4807721 4626020 6577480 8022124
44740 8022124 6695459 3373367 1045500 1202365 2012981 961005 -1606308 -2788044
44732 -2788044 -697281 3350443 6287909 6307349 4456522 3610147 5584393 9040133 10926255
44723 10926255 10353427 9908047 12223304 16371171 19029746 18423195 15643257 12766892
44715 12766892 11286576 11870474 13923724 15586031 15598146 14772499 14291127 13536217 11602430
44706 11602430 9940988 10744345 13194829 14370930 13810292 13848020 15017124 14753759 11945553
44697 11945553 9363585 9651198 11750207 13384214 14509358 16068377 17651933 18707350
44689 18707350 19914783 21092451 20054256 16179258 12830491 13104910 15129396 15008296
44681 15008296 12845620 12106334 14049074 16565647 17999399 18560410 18310355 17178467
44673 17178467 16678990 18191527 19902796 19119149 17208333 17964996 21092296 22271872
44665 22271872 20630376 20868745 25791215 31634885 34025518 34285283 35766887 37330087
44657 37330087 35240276 29589317 24246033 21285857 19339361 16982273 14361052 11759979
44649 11759979 9575508 9332225 11770712 14358730 13857948 11148404 10182772 12038235
44641 12038235 13509062 12265989 9917983 8649923 8062036 7231570 7105409 8460420
44633 8460420 9605921 8629782 6399033 4928932 4109887 2720446 1780589 3840644 8816446
44624 8816446 13223899 14363607 13171547 11844097 10450013 7603503 3577325 893007
44616 893007 1564260 4692801 7175395 6492253 2794668 -1404831 -3503130 -2903416 -881804
44607 -881804 1431512 4234527 7752685 10527960 10461797 7890615 6269501 8533720 13317034
44598 13317034 16232390 15049422 12246499 11714690 14018520 16196530 15836150 13900630
44590 13900630 13103796 14471580 16337715 16381453 13877235 9916656 6176512 3973348
44582 3973348 3984355 5797150 7473671 6636762 2993888 -765020 -1776679 -456420 270456
44573 270456 -773692 -1335539 890629 4895567 7855093 8776080 8843593 8981787 9216547
44564 9216547 10164312 12792726 16222350 17866507 16769555 15155687 15422873 16893037
44556 16893037 16959695 14600545 11378977 9474941 9863351 11966285 13996837 14030309 11807576
44547 11807576 9209323 8071892 8021984 7472745 6106913 4977998 4650159 4933989 6227074
44538 6227074 9124640 12456692 13772260 12552899 11141904 11533527 13033072 14272052
44530 14272052 15497384 16899560 16490006 12561069 7506596 6131734 9897646 15371300
44522 15371300 18864442 20155878 20833882 21508114 22187641 23355476 24842361 25253309 24364992
44513 24364992 24562849 27705855 31794282 33249986 31729157 30062087 29864216 30054650
44505 30054650 29811326 30012406 30900628 30956907 29357850 27284117 25378572 22129787 16680851
44496 16680851 11383591 9258229 10101093 11269752 11368582 10984859 10600933 10220879 10703232
44487 10703232 12981660 15819789 16603525 14840790 12936915 12945689 14308484 15359951 15327578
44478 15327578 14231921 12626766 12217994 14819197 19557649 22930964 23011279 21821975
44470 21821975 21909674 22501334 21530624 19959121 20787394 24162226 26835341 27092674 27135721
44461 27135721 29152517 31663126 31914596 30023884 28219900 27107074 25431681 23268294
44453 23268294 22709852 24744196 27588564 29130035 29269556 28645071 26713890 22976522
44445 22976522 19041191 17200384 17137594 16221530 13563398 11821498 13783595 18494323
44437 18494323 22229254 22559783 20048601 16430849 12797274 9766287 7983151 7635620
44429 7635620 8175553 9071682 10229457 11185557 10687308 8099194 4939793 3845308 5621000
44420 5621000 8146917 8915204 8152804 8423012 11144088 14689492 16646885 16979444 17541354
44411 17541354 18837367 19164283 17641594 16388277 18059497 22063446 25100562 25401800
44403 25401800 24693666 25440403 27581233 28983537 28237311 25947662 23710849 22732284 23247555
44394 23247555 24499087 25267175 25000627 24474528 24907891 26422219 27761177 27567156 25616101
44385 25616101 22820248 20434547 19373257 19873758 21423152 23064396 24033503 24186638
44377 24186638 23766382 22827889 21072331 18280936 14760194 11296485 8852870 8388049
44369 8388049 10578457 15190909 20744795 25286209 27781365 28728985 29555454 31519700
44361 31519700 34618306 36894686 35506802 29940995 24016052 22775999 26728646 30986850
44353 30986850 31234337 28632965 27025998 27190590 26841953 25404486 25206026 27460411 30223479
44344 30223479 31654408 32809165 35553722 39684558 43860238 47725752 51326852 53996970
44336 53996970 55904046 59298606 65649570 72348348 75068395 73341711 71118865 71312388
44328 71312388 72380008 71526477 69040477 67418969 67504431 67858169 67753093 68629926 71836641
44319 71836641 76426929 80462502 83639841 86978148 89962587 89810499 84576490 75788103
44311 75788103 66672131 58655857 51274369 44796122 40476972 37937933 34778457 29995426
44303 29995426 25852453 24802501 26014249 26587210 25078607 22272161 19577685 18393789
44295 18393789 20018024 24157659 28137332 29503196 28984438 29155964 30826726 32763083
44287 32763083 34341687 35967089 36974903 35701619 32058816 27797286 23768083 19197924
44279 19197924 14334365 11467171 12167361 15350444 19083708 22503279 24954758 25247867
44271 25247867 23235892 20571317 18559797 16781326 15069963 14983157 17435616 20358566
44263 20358566 20886022 19075994 17665263 18766823 22236207 26383651 28763376 27344613
44255 27344613 22851030 19180886 19524324 22585012 24483451 23762119 22418746 22464422 23771367
44246 23771367 25209438 25629842 23654014 18873501 13687833 11625659 13066783 14728205
44238 14728205 14243045 13056617 13551203 15479876 17126723 18297278 19839533 21168285
44230 21168285 20678034 18447717 16477310 15918166 15667809 14265488 12020439 10661509
44222 10661509 11638117 15109901 19776730 23270736 23615636 21160613 18646922 18550539 20517459
44213 20517459 22118407 22007596 21418837 22242098 24490054 26499467 27291611 27817256 29707342
44204 29707342 33370503 37526819 40259303 40568235 39506984 39856763 43828136 50568240
44196 50568240 56576618 59297886 59937559 61950226 66808047 71990764 73480735 69859410
44188 69859410 63396362 57032079 51102675 44229131 37284764 34273826 37496796 43243080
44180 43243080 45034116 40922538 34824624 30451308 27301843 23939545 21688270 22326498
44172 22326498 24691512 26746286 29033301 32662266 35643541 35359790 33617658 34604603
44164 34604603 38008828 39142811 36789675 35832757 39790556 45212034 46913492 45497796
44156 45497796 45886953 50607871 58148873 66265619 73254165 77150328 77476215 77369812
44148 77369812 80461521 85542111 87516157 84012228 77950835 72698511 67597405 59996388
44140 59996388 49793447 40162432 34594134 34115166 36534531 37838212 35411764 30625210
44132 30625210 27430857 27982539 30585088 32275888 32107565 31117730 30280457 29769644 29696423
44123 29696423 30306237 31262456 31405189 29660827 26230402 22706813 20695204 20309084 20515917
44114 20515917 20937776 22288625 24667994 26794291 27873992 28775825 29870296 29238556
44106 29238556 25357416 20511532 18662119 20280102 22265933 22987379 24026808 26237165
44098 26237165 27662504 27086535 26429118 27263302 27788199 26220531 24818087 26868254 31132992
44089 31132992 33250134 32226449 31680604 34155461 37730608 39675482 40703252 43596919
44081 43596919 49140944 55099605 58488605 57962597 54779388 52025990 51962279 53571462
44073 53571462 53611209 50375059 45277111 40516126 36825483 34223325 33179860 33578078
44065 33578078 33722151 32027244 29190523 27519963 28563517 32183605 37074145 41128637
44057 41128637 42326146 40782727 39212642 39737439 40873853 39625018 36173901 34080510
44049 34080510 35370619 37732706 37790893 35414688 33285612 33453165 35932205 39803705
44041 39803705 43935535 47056649 48881432 51145471 55852071 62061973 65828119 64123445
44033 64123445 58023723 51433933 47405787 46157742 45748970 43828629 39399360 33884577
44025 33884577 30195496 29984268 32058280 34009475 34686848 34103780 31813200 27339807
44017 27339807 22270835 19846291 21455751 24922124 27314510 28156197 28501343 28190374
44009 28190374 26297864 23909924 23961453 27525757 32004416 34075488 33220278 31250501
44001 31250501 29420984 27457926 24954509 22310543 20189994 18940130 18617374 18904815
43993 18904815 19009910 18269722 16862172 15460658 14440103 14045042 14922729 17388023 20194902
43984 20194902 21253920 20029578 18397442 18702772 21635305 26195571 30738942 33623879
43976 33623879 34074727 33483416 35078768 41065115 50293567 59486479 66261860 70182808
43968 70182808 71690878 71496133 70717746 70110823 69061614 66562571 63117542 60310743
43960 60310743 58601467 57349352 57211518 60206359 66268697 71806838 73589674 72841362
43952 72841362 73660048 78308215 85819831 94241268 101902013 106807031 107160211 102958087
43944 102958087 95594053 86049812 75254328 65786547 60454330 58660342 56883812 53809048
43936 53809048 52228065 54180165 56985324 56879119 54582378 53849497 55485197 56449938
43928 56449938 54993717 53196992 53248789 53997205 53119760 51055514 50858232 54828490 62526364
43919 62526364 71548450 79338728 84827399 89246174 95148030 104283175 116916513 133175154
43911 133175154 153547228 176912257 198924970 213768688 217771475 211246806 197594020
43904 197594020 181159869 165135530 150568351 137578465 127466676 122227392 121312751
43897 121312751 120659460 116681296 110070017 103688232 97879478 90779776 82929006 77954486
43889 77954486 77408743 78096846 76993264 76514598 81547526 92225190 103342584 111426988
43881 111426988 119003154 129987684 143265412 153535947 157463720 156303669 152658584
43874 152658584 147374937 140451173 132642961 124438868 114915813 103520304 92068199 82967160
43866 82967160 75986443 68991868 61786951 56753074 55014594 54295282 51871032 47725356
43858 47725356 43281730 38932314 34908413 32952990 34347532 37055918 37549018 35095730
43850 35095730 31619423 27812109 22903215 18622620 19245342 25591717 32259858 33720791
43842 33720791 30793975 27994804 26663038 24899239 23279316 25640649 32919924 40042895
43834 40042895 41333783 36842300 31313067 28697844 29779930 33632183 38607672 42229214
43826 42229214 42635077 40782160 39614087 40365327 40935738 38754265 34298826 30664426
43818 30664426 30014722 31533250 32965316 33166001 32473445 31298327 29638534 28108038
43810 28108038 28098431 29938239 31720841 31318786 29278102 28288564 29711984 32166910 34054514
43801 34054514 35905636 39103069 43522710 47978105 52250995 56960044 61633349 64570132
43793 64570132 64846584 63122281 60243181 56509517 52788102 50682303 50442284 50001781
43785 50001781 47616549 44519534 43053241 42644001 40047028 34211743 28702413 27662237
43777 27662237 30732883 33903636 34616331 33791639 32938781 31918809 30716383 31141915 34384515
43768 34384515 37842871 37046046 31106950 24286575 21276962 22389618 24421386 24902007
43760 24902007 23816134 21814892 18790511 14777736 10937846 8670464 8258720 9052109
43752 9052109 10537636 12458719 14168485 14931962 15136778 16213072 18584362 20464805
43744 20464805 19976282 18174902 18266308 21275882 24217539 23986951 21774430 21435460 23932871
43735 23932871 25933465 24604252 21638317 21029187 24203199 29009241 32787325 34813075
43727 34813075 35887333 36863461 37889199 38500186 38394767 38258250 39251042 41413737 43617335
43718 43617335 45694532 49093022 53922323 56792914 54156714 47422074 42058014 41117075
43710 41117075 42052102 40942325 37585458 34663138 33566420 33335031 33047775 33135830 34216944
43701 34216944 36125976 38369087 40446850 41528712 40866241 38988112 37721447 38409616
43693 38409616 40391745 41643752 40825639 38468446 36152373 34710369 33534932 31799156
43685 31799156 29941192 29250343 29999574 30762977 29910962 27253987 24002881 21727203 21500001
43676 21500001 23127324 24780956 24449642 22552707 22131096 25367074 30759041 34992066
43668 34992066 36714540 36732678 35217369 31344768 26140620 23096873 24333756 27762448
43660 27762448 29870588 30193959 30904583 32500178 32404685 28551035 22509101 17804551 16252012
43651 16252012 17257053 19876297 23699670 27559380 29115605 26988273 22807548 20146137
43643 20146137 21304412 25525387 30236337 33535605 35401634 36944717 38982976 41637919
43635 41637919 45212806 50643000 58092899 65403464 69538682 70223935 70639965 73276115
43627 73276115 76580551 77721654 77407369 78847056 82037882 82653988 78022082 71203310
43619 71203310 66876424 65497764 64332120 62511387 61658168 62249272 62896817 63469967 65697465
43610 65697465 69748639 73067390 74128955 75123547 79101470 86046135 93497080 99749396
43602 99749396 104704487 108754117 112929250 119529212 130394313 144361657 158024916 169277774
43594 169277774 178768811 187620461 195218189 200041223 201522602 199934779 195079860 186488509
43586 186488509 175040102 163202402 152921321 143920913 134966995 126288061 119306881
43579 119306881 113887988 107675836 99331745 91038934 86020955 84387953 83440173 81601567
43571 81601567 79649546 77933715 75042695 70288229 65333888 61982542 60124046 59140444
43563 59140444 59311851 60138654 59460080 56759439 55503651 58877687 64202876 65360960
43555 65360960 60855518 55808333 54932753 56830142 57133302 54693294 52115895 51632053
43547 51632053 52889154 54323742 54876487 54408895 53492438 52601159 51080606 47865776 43866926
43538 43866926 42165217 44414811 48252031 50065530 49455831 48952665 49983336 51559101
43530 51559101 52945544 55106373 58739018 63019668 67447534 73130558 80776477 88826718
43522 88826718 95241481 100088823 104637356 108774707 111450407 113335975 116733415 122491137
43514 122491137 129247293 136776156 148063357 166062338 189322134 212850554 233131073
43507 233131073 250413177 265542716 276093194 277043285 265247690 242797860 216025513
43500 216025513 191256123 171229803 155322396 142684774 134011134 129600285 126993083
43493 126993083 122586077 115613882 108642111 103531994 98730083 91712012 82584938 73649198
43485 73649198 66404425 60726073 56379839 53589034 52349511 52681053 55181552 59640242
43477 59640242 63497107 63980889 62174462 62784434 68879062 78503609 87471072 93817869
43469 93817869 98142236 100986671 101755748 99736520 94930094 88275400 81799430 77585001
43461 77585001 75490360 72858153 67802862 61877171 57995598 56649093 56020407 55061254
43453 55061254 54166196 53155839 51214227 49171191 49277958 51741646 53720522 53067307
43445 53067307 51053400 49764370 48736769 46493496 44070652 44189952 47218604 50568693
43437 50568693 52538108 54533304 58586381 64447105 70363937 75469674 79985461 83743610
43429 83743610 85775480 85145518 81423819 74756492 66310270 58229193 52111924 47628878
43421 47628878 43493564 39626502 37330719 37290320 38458795 39216131 38741915 37053602 34807478
43412 34807478 33488903 34519103 37289240 39157460 38416732 36188055 34221939 32320537
43404 32320537 29998568 29318634 32718205 38145301 40180393 37345338 34794435 37302935
43396 37302935 42607683 45202071 44506120 44765968 47670890 49969658 49247710 47674965
43388 47674965 48057981 49791370 51317344 53616122 58113826 63427448 67752640 72824392
43380 72824392 81327457 90852376 94803655 90459234 82790744 78611236 79499983 82386147
43372 82386147 84861174 87184938 89934415 92247552 92856108 91596844 89460490 87571168
43364 87571168 86051511 83675911 79088681 72628907 66305112 61631838 58304231 55448193
43356 55448193 53117961 51692112 50729994 49632608 48872016 49313032 50505944 50678043 48393109
43347 48393109 43581884 37310916 31366222 27658002 26956019 28284756 30347407 33191265
43339 33191265 37442731 42286685 45671618 46636109 46071085 44870257 42781684 39864957
43331 39864957 37770875 38155175 40325732 41866532 41773267 41865178 44330444 48381175 50469304
43322 50469304 48294373 43892919 41847741 44749213 51517981 59901730 68596360 76102852
43314 76102852 79751032 78306305 74715523 73734962 76591298 79816980 79677555 76146647
43306 76146647 72164416 70514837 71919755 74850378 76704314 76276707 75307561 76502097
43298 76502097 80257236 84948316 90066620 96640043 104402519 111429443 117472716 124771312
43290 124771312 134108668 142912701 149308039 155470986 164501739 176234571 188828084 202292293
43282 202292293 217191384 231609875 242936751 251340830 257924292 260869361 257914371
43275 257914371 252117187 250183239 254122968 258722839 258556776 253621685 246359752 236894284
43267 236894284 223914424 207778560 190269727 172955181 157488181 145731554 137971957
43260 137971957 132499320 127855497 123571031 118280316 110329572 101602434 97229361 99125573
43252 99125573 102826675 103402577 101719837 101954238 105748944 112385477 122255538 136021849
43244 136021849 151996232 168300173 186039643 206016221 223495380 231032594 226348512
43237 226348512 213366913 196053417 175973298 155809518 139706928 128456838 118726946
43230 118726946 108724703 100447203 94546621 87493592 76783148 65331258 57463192
43223 57463192 53365947 50503182 47764550 44976021 40901027 35512356 32283337 34173925
43215 34173925 38540711 40028931 37901041 36489951 38273788 40416388 39339731 35637101
43207 35637101 32713063 32536027 34349911 36310364 36955761 35686254 32910706 29820044
43199 29820044 27809553 27979381 30510184 33955971 35850405 34943648 32407660 30140972
43191 30140972 28704453 27905087 28375747 30964694 35077504 39136046 42331026 44614953
43183 44614953 45581609 45015976 44142836 44555750 46069967 47260660 47844548 48699878 49766943
43174 49766943 50114922 50281148 52308442 56806032 61947882 66200646 70169041 74645656
43166 74645656 78455515 79551463 77124338 71602008 63712961 54641067 46104439 39213945
43158 39213945 34027628 30859777 30694320 33249821 36037503 36892651 36387440 36078212 35443953
43149 35443953 32926999 29649818 29310385 33367260 38368224 39781077 37439234 35383758
43141 35383758 36608369 39812485 41958009 42495112 43509985 46284623 49632634 52202497
43133 52202497 54872641 59511895 66095686 72384629 76122476 76384234 73165436 67179425
43125 67179425 60084941 53416054 47006518 39813798 32466111 27266844 25091151 24118483
43117 24118483 22761179 22150305 24056986 27578496 29828915 29361549 27299416 25576675
43109 25576675 25602205 28027920 31848801 33964953 31877551 27266882 24882300 27018971
43101 27018971 30830190 32243053 30945792 29870215 30858237 32883250 34325699 35184375
43093 35184375 36636989 39657054 44450896 50128734 54470035 55317841 53288930 52148824
43085 52148824 54882514 59556694 60721885 55511098 47104260 41187116 39890954 40504396
43077 40504396 39579177 36531148 32871142 29544505 26299779 22967136 20067891 18203607
43069 18203607 17726310 19027149 22247734 26365178 29298170 29607592 27876529 25903676
43061 25903676 24666007 23615526 21961453 19916518 18257064 17220439 16590313 16648609
43053 16648609 18189744 21472968 25838135 30433526 34525123 37018765 36904924 34772854
43045 34772854 32693404 31663104 30299736 27297115 23964616 22495051 22607214 22219276
43037 22219276 21026542 20734282 21594473 21707543 20750070 21383559 25007812 28698292 29093240
43028 29093240 27435529 27498130 29579214 30193166 27751867 25035915 24933381 26593586 27491823
43019 27491823 27143752 26816586 27114978 27941174 29845673 33294003 37041617 39189023 39736713
43010 39736713 40274566 41087558 40599877 38332316 36444718 36978643 39024410 40336824 40717972
43001 40717972 41729213 43598718 44840941 45133070 46063804 48103733 49254238 48387539
42993 48387539 47803436 50052673 53770196 55600151 55424091 56461015 60277739 65026922
42985 65026922 69322401 74690975 82766063 92710806 103113839 114161260 126198360 138335528
42977 138335528 150327309 163478226 177301592 187511497 190413735 187807121 184528863
42970 184528863 182507482 180518921 178497348 177785142 177064349 172172510 161293029 147583282
42962 147583282 135651800 127639497 123078435 119856577 114783164 106175255 96859230 91908621
42954 91908621 92550370 95114412 96583657 97375392 97240107 92932308 83233325 72807624
42946 72807624 67032386 65325857 63562760 61048529 60410629 61534402 60583831 55723537
42938 55723537 49918708 46919583 47503873 50697500 55723601 61127470 64257630 63551875
42930 63551875 60271980 56923303 54930693 54393710 54856834 55687141 56690644 58574489
42922 58574489 61689649 64545652 65334408 64915647 66170817 70061471 74614112 78439447
42914 78439447 82688328 88241832 93497273 97058807 100827113 108093941 119637292 133657919
42906 133657919 148570417 163911866 179473650 195712215 214268472 235633257 256524859
42899 256524859 272058570 281042098 287415375 296174976 309426776 326286428 344263801
42892 344263801 360001294 370855274 377110864 381003020 382193110 375884650 357468641
42885 357468641 328205672 294402802 261492289 230915632 202614456 177968454 158811612
42878 158811612 144842120 133724214 123688712 114956891 108269268 102742648 96134200
42871 96134200 87538063 79072056 73689768 71240099 68182005 62191591 55714978 53048985
42863 53048985 54493880 55769483 53624294 49782130 48099603 49480722 51234951 50513181
42855 50513181 46899704 42205847 38915316 38318842 39242741 39297730 38057096 37622676 38969246
42846 38969246 39755433 37997249 36054622 37584602 41525563 43135646 41087775 39292538
42838 39292538 40536863 42532461 42603623 42555345 45449055 50222175 53517808 55470868 59798149
42829 59798149 68511796 79853968 91542927 103075472 114199850 123504147 129495015
42822 129495015 131667480 130021346 124617999 115833812 104436381 91922057 81210347
42815 81210347 75181430 72916608 69376988 61415142 52433944 47880478 47637476 46990778
42807 46990778 44209629 42128874 41880287 40437074 36272462 32623408 32143805 32223649 29159665
42798 29159665 23976213 20386121 19245407 18778019 18554422 19325562 19898069 18047305 14471204
42789 14471204 12617169 14218744 17504439 20183615 22117748 24608261 28509768 33139882
42781 33139882 36043340 34538656 28883376 23016074 20553730 21043579 21847545 22239757
42773 22239757 23153128 24147585 23781765 22444000 21705844 21131092 18976597 16179579 16222734
42764 16222734 20165591 24777309 26750030 26250619 25252565 24853586 25470720 27283050 28957801
42755 28957801 27979285 23851040 19414509 17716376 18961261 21323168 22913769 22172523
42747 22172523 18677517 14957168 15305839 21130508 29287971 36334126 42073476 47258550
42739 47258550 50695662 51577933 52484383 56526092 62812749 68294413 73274824 81173322
42731 81173322 92524312 102792744 107407009 106366440 102485020 97179681 89772760 79860856
42723 79860856 68821170 59083034 52329610 48070370 43998627 38389693 32079093 27492847
42715 27492847 26129393 27751978 31269673 35044076 37010883 36420727 35339970 36529206
42707 36529206 39698959 41778057 41194426 39750066 39437924 39555938 38523979 36848488
42699 36848488 36092341 35666558 32979406 27185183 21110135 18343806 19107311 20188656
42691 20188656 19033123 16739418 16104949 17564696 18930215 19260412 20653133 24758818
42683 24758818 29476239 31473241 30722729 29711350 28933408 26743519 23979628 24783559
42675 24783559 30859613 37944350 40717569 39227554 37592998 37794292 38056951 36940370
42667 36940370 35659402 35491854 35377111 33542949 30067236 26467439 23557553 20857826
42659 20857826 17764462 14438921 11627420 10170217 10683769 13219499 16886390 19943759
42651 19943759 20842442 19718717 18677981 19878265 23188639 26346441 27468062 26545573
42643 26545573 24413540 21684419 19423584 19271165 21237921 22416052 20051356 15684804
42635 15684804 14000851 16952002 20992656 21524375 18818977 17675906 21419590 27955831
42627 27955831 32524436 33234165 32387241 32443740 32542120 30447828 26826839 25065118 26441381
42618 26441381 27936577 26443247 23290744 22227969 24012907 25865991 26177901 26800581
42610 26800581 29668497 33551612 35872410 36218457 36241343 36941505 37751089 37913718 37254541
42601 37254541 35570942 32492975 28301117 24147027 21090522 19229215 17939932 16808463
42593 16808463 16211857 16879846 18751239 20525463 20805534 19482028 17391175 14950577
42585 14950577 12167009 9774392 8853893 9060893 8860513 8141485 8761820 11307048 13229872
42576 13229872 12345777 10836034 12946207 18928604 24036076 24272840 20966724 18456820
42568 18456820 18896255 20807347 21702082 20511159 17743342 14551729 11849559 9694257
42560 9694257 7412035 4641307 2150021 1292614 2737954 5965696 9843941 13337542
42552 13337542 15658197 16189463 14840573 12653300 11508689 12451970 14383984 15271385
42544 15271385 14719450 14219226 14563692 14619509 13643750 13090023 14241967 15408278 14027679
42535 14027679 10866236 9218960 10010856 10874444 10760905 12041194 16153232 20081160
42527 20081160 20017426 16781631 14707883 16105059 19485385 22714107 25224946 27022651
42519 27022651 27791498 27556514 26727277 25287437 23286411 21984054 22808007 25064315 26354351
42510 26354351 25547725 23792811 22288906 20703249 18385248 15712103 13495841 12145526
42502 12145526 11931551 12981074 14549975 15414859 15448144 15729682 16770326 17896800 18773462
42493 18773462 19978718 21295569 20974830 17991934 14013607 11769101 11970030 12866383
42485 12866383 12513118 10712756 8951526 8875714 10655706 12896769 14605724 16668672
42477 16668672 20096402 23308103 23379918 20420280 18430511 20634197 25720946 29913673
42469 29913673 31008777 29062347 25028434 20648902 18204925 18356623 19333332 19870732
42461 19870732 21280699 24476792 26850901 25345526 21588447 20366971 23077437 26103329
42453 26103329 26255082 24641033 23923509 24376883 24385027 23168528 21523155 20804563 21866593
42444 21866593 23930383 24318150 20943358 15440315 12027359 12739195 15642145 18262166
42436 18262166 20394098 22329167 22716036 20385607 16944640 15364917 16425819 18021064
42428 18021064 17729062 15167471 12172882 11145949 12636435 14458709 14227398 12624522
42420 12624522 12386510 14019850 15047977 14229959 13621838 14860406 16294301 16243335 16512494
42411 16512494 19415264 23209995 24242539 22571531 21615307 22599385 23328307 22884284 23564797
42402 23564797 26621360 29410121 29154897 27310350 27573585 30710970 33769319 34174381
42394 34174381 32676300 31754922 32352018 33268177 33677670 35043828 39218983 44913795 48176318
42385 48176318 47545276 46878979 51001219 59886401 69853503 79879963 93768325 115859048
42377 115859048 146943043 183930977 219938216 244253294 246979252 227281452 195253235
42370 195253235 163119311 135921751 112385772 91952909 76816854 67732760 61801095
42363 61801095 55539601 47997711 40159914 33222247 28314019 26243178 26258280 25984429
42355 25984429 23702640 20315740 18284249 18728421 20071447 19638370 16453733 12355259
42347 12355259 10262301 11424373 14527841 17197987 17806628 16093488 13129387 10951923
42339 10951923 11215026 13632076 16428922 18537725 20307743 21805591 21923360 19997087
42331 19997087 16974979 14035950 11398406 9455020 9268319 10302006 9515497 5193134
42323 5193134 329944 -771313 1487578 2747862 1393697 804986 3824118 8411636
42315 8411636 11019275 11706335 13046413 15426767 16434003 14600415 11303771 8648929
42307 8648929 7321736 7072856 7832875 9447663 11105832 11859091 11506998 10595504 9688787
42298 9688787 8853275 7803158 6473348 5366350 5119343 5680883 6247070 6245041 6120957
42289 6120957 6826567 8595392 10468585 11136747 10298878 9121698 9020052 9874894 10091812
42280 10091812 8961603 8219800 10067199 13932967 16657396 16144841 13564398 11539275
42272 11539275 11461032 13175630 15882222 18240244 18706809 17111513 15273400 15042528 16456774
42263 16456774 18708515 21641465 24675423 25439830 21945648 15869741 11290095 9908137
42255 9908137 9776628 9169601 9041069 10328566 11289095 9743697 6347587 3261184 823010
42246 823010 -1708989 -2902800 -78135 5998669 10589618 10848595 9783738 12102272
42238 12102272 17770483 22348746 22859180 20482904 17478802 14387220 11430559 10279222
42230 10279222 12253403 15775126 17594246 16437976 14136176 13170186 14193556 16018774
42222 16018774 17089784 16761216 15780602 15584650 16618991 17598911 17149766 15765085 14962642
42213 14962642 14743402 13536693 10990293 9014365 9039107 9823203 9563451 8956286 10037722
42204 10037722 12535547 13820743 12850166 11840367 12793753 14207936 13232310 10191500
42196 10191500 8699707 11056701 15333811 17865651 17354962 15320166 13310723 11346849
42188 11346849 9218855 7731571 7567459 7745002 6676909 4763327 4520514 7403081
42180 7403081 11489750 13445491 12271905 9870063 8107081 6903016 5713493 5371383
42172 5371383 7063411 10138729 12384385 12511465 11368221 10627160 11188403 12974237 15260163
42163 15260163 16802304 16548942 14853996 13348314 13057371 13278977 12883212 11932283 11123988
42154 11123988 10323096 8891797 7178968 6363305 6738241 7308079 7289742 6921597 6519548
42145 6519548 5918154 5324922 5499320 6308618 6272607 4630541 2845272 2646956 3362740
42136 3362740 2994611 1694805 2099592 5560665 9738944 11247231 9746097 7967730
42128 7967730 7965570 8797292 8423922 6858819 6223878 7721194 9754917 9978919 8591133
42119 8591133 8132912 9811116 11570506 10870329 8232926 6503370 7207137 9351755 11612620
42110 11612620 13771526 15579224 16005273 14624110 12491238 10636219 8745257 6390532
42102 6390532 4553844 4566610 6130492 7702057 8493833 8901747 9273211 9597175 10346310
42093 10346310 12185862 14473039 15330691 14032769 12472433 13169148 15987087 17810634
42085 17810634 15991497 11719280 9126192 10633039 13824854 14012384 9847979 5087695
42077 5087695 4158444 7143126 10269101 10509872 8257050 5838375 4952322 5722352 7074096
42068 7074096 7760011 7845938 9090208 12768901 17319337 19683679 19100733 17707804 16838149
42059 16838149 14999216 11193385 8335752 10503632 17136088 22663401 22711018 18799690
42051 18799690 15752591 15857782 17173163 16891849 14551186 11620408 9366181 8132455
42043 8132455 7955837 8525160 8518494 6367412 2516799 7644 1541587 6309144 11040235
42034 11040235 14099257 16971706 21372791 26736725 31702839 36375789 41072672 43796162
42026 43796162 41526308 34287968 25918094 20174360 17704005 17345694 18283752 19487839
42018 19487839 18908354 15675715 12405389 12851339 17014600 20604119 20065071 16457992
42010 16457992 13275036 11851908 10672603 8612182 6897466 7242912 9229661 10628775
42002 10628775 10133248 8968821 9450772 12260955 15656974 17470936 17373665 16649239 16124129
41993 16124129 15407127 14501113 14993289 18295422 22883188 24711993 21236338 14503747
41985 14503747 9438668 9100791 12230254 15439644 16849955 16792610 15662945 12907318
41977 12907318 8900341 6293585 7459249 10821310 11902702 8835138 4965971 4444953
41969 4444953 6690815 7557688 5356765 2927273 3141478 4918251 5407458 4443696 4528860
41960 4528860 6861789 9456721 9658071 7256734 4493039 3594564 4684009 5787809
41952 5787809 4870854 2184941 343574 1498144 4799857 7571051 8675237 9294327
41944 9294327 10216441 10248064 8612601 7484777 9896832 15296283 19324488 18749399 15001547
41935 15001547 11747061 10411848 9782949 9000274 8584611 8548302 7901416 6881945 7569441
41926 7569441 10780175 14008293 14413899 12743467 12123315 13689223 15806156 17284793
41918 17284793 18621728 19653795 18781552 15771697 13000265 12241016 12107235 10558515
41910 10558515 8303522 7435728 7802675 7234549 5025859 2959954 2725774 4029055 5528912
41901 5528912 6408530 6917603 8229850 11376460 15419720 17596008 16639081 14802625 14535159
41892 14535159 14248499 10383315 3494080 -972926 1084689 7857311 14205739 16537669
41884 16537669 14209980 8651084 2840303 -110934 451881 2603618 4901614 7597883
41876 7597883 10054308 9856222 6546563 3754565 4860288 8323489 10161704 9537638
41868 9537638 8651161 8141303 6336704 3186008 1607376 3969191 9452285 15531133
41860 15531133 20138968 22039123 21162646 19156634 17833520 16813279 14600868 11984916
41852 11984916 11729174 14246309 16295463 15252500 12271295 9694305 7701089 5620490
41844 5620490 4610986 6430090 10530647 14550501 16916163 17145055 14767927 10496864
41836 10496864 7788961 10235606 16887023 22511194 23316042 20552547 17687921 16055541
41828 16055541 14758702 13252308 11930703 10799755 9549012 8930194 10235861 12857176
41820 12857176 13988070 11954193 8707854 7418456 8251565 8599579 7494714 7203336
41812 7203336 9128475 10507195 7880908 2621309 -274287 1119751 3472120 3701031
41804 3701031 3447156 5775865 9816444 11852955 10700664 8815897 8054367 7205319 4696982
41795 4696982 1670874 931236 3798849 8927794 13572217 15497405 14404289 12003462
41787 12003462 10091438 8374371 5216219 927832 -1150311 1738487 7760603 11811425
41779 11811425 11122756 8249611 7647345 10133312 12115067 10339868 5958976 2819398
41771 2819398 2576859 3192749 2348167 599556 191773 1977235 4813278 7290684 8798269
41762 8798269 9377169 9723120 10894816 12846949 13796550 12387009 9840945 8279954 7574112
41753 7574112 6135962 4470380 4986129 7820837 9994171 9968244 9882356 11172537 11150355
41744 11150355 7344163 2900948 3282279 8496875 13096896 14038855 14027600 15754134 17181356
41735 17181356 15384539 11910566 10777058 12884158 15726505 17606465 18892384 19539548
41727 19539548 18602345 16580244 15471225 15743565 15691952 14771918 15186568 18586568 23108372
41718 23108372 25646110 25760199 25313597 25161787 24454795 22935049 21723093 21448533 21395466
41709 21395466 21170550 21733590 23852429 26635109 28581555 29311946 29373159 29097265 28696511
41700 28696511 28865543 30007109 31111729 30700130 28938639 27601058 27677251 28279398 28505273
41691 28505273 29138083 31382226 34740849 37464202 38627555 38344154 36218627 31529042
41683 31529042 25544652 21833695 22699424 26220301 28457642 28179454 27702409 29062151
41675 29062151 31245915 32031787 31029881 29505963 28140260 26673988 25542746 26102939
41667 26102939 28613934 31160176 31495427 29394395 26445701 24034279 22501129 22100679
41659 22100679 23544349 26944042 30876881 33359750 33631177 32307566 29887954 26106022
41651 26106022 21227878 17030338 15278718 15442807 15166649 13328678 11579758 12203633
41643 12203633 15294641 18883988 21168367 21597530 20346965 18114453 16316694 16018722
41635 16018722 16344652 15252815 12399179 9946180 9779443 11249688 12827275 14673305
41627 14673305 17680294 20699859 21102841 18403940 15295942 14254127 14789608 15170792
41619 15170792 15324170 16351711 18096427 19047465 18449473 17023556 15684581 14882100 15100517
41610 15100517 16525006 18124656 18597157 18420318 19252692 20939751 21297273 19930028 19873666
41601 19873666 23222112 26911677 25915991 19969050 13978871 11644774 11843078 12270217
41593 12270217 13416888 16584933 20151691 20855478 18172365 14981558 13940549 15118656
41585 15118656 17281227 19658100 21884853 23527391 24336943 24286050 23270174 21645206
41577 21645206 20878756 22246239 24635361 25165543 22681210 19274371 17379352 16650722
41569 16650722 15191423 12982681 12154771 13853025 16574371 18224582 18457493 17970033
41561 17970033 16551589 13484462 9758280 8206129 10489600 14738993 17220026 16093092
41553 16093092 12758876 9835658 8880410 9995201 12252548 13901375 13301036 10670366
41545 10670366 8312382 8274108 10289477 12695680 14543091 15691901 15558981 13400480
41537 13400480 9811212 6550092 4619061 3593363 3009816 3215409 4427839 6050256
41529 6050256 7562888 9279979 11529999 13644397 14442402 13500359 11535352 9651951
41521 9651951 8419489 7714586 7554103 8825831 12254526 16337097 17810009 15648520
41513 15648520 13522084 16062405 22924922 28777783 29424488 25757585 21133814 17297279
41505 17297279 14305020 12484325 12407449 13785819 15860495 18269479 20605644 22107904
41497 22107904 22815851 23976722 26212244 28356224 29210117 29190830 28914955 27556305 24433940
41488 24433940 21085598 19612070 19659427 19207951 17918479 17449511 18550657 20114295 21445673
41479 21445673 23317819 25947478 27710234 27124005 25080023 23924687 24688904 25954229
41471 25954229 25438314 22499714 18979191 17173682 16920526 15690403 12266231 9197193
41463 9197193 10177569 15603374 22206466 26711093 28358269 28080528 26886483 25368330
41455 25368330 23610927 21297508 18617711 16800326 16845749 18190584 19651585 20989479
41447 20989479 22222340 22285955 20326221 17883927 17746634 20639858 24709337 28005627
41439 28005627 29749993 29677533 28292481 27370203 27826868 27469067 23571946 17416424 13122469
41430 13122469 12001444 11692590 11299575 13108265 17705335 21577996 21992105 20586206
41422 20586206 19363958 16826139 11765908 7639539 8432964 12146504 13207404 10375735
41414 10375735 7668314 7861224 9657011 11538536 13875688 16071129 15773557 12873513
41406 12873513 10898404 12122000 13993666 12971790 9808354 8214819 9528106 11459788
41398 11459788 11741388 10661437 9792720 10003955 11245424 13022303 14390764 14242916 12303495
41389 12303495 9648861 7923775 8171678 10468429 14168733 17928464 19755937 18123466
41381 18123466 13673455 9202296 7112932 7265676 8166566 9576384 12335955 15847852
41373 15847852 17817242 17082744 14887179 12583132 10067619 7699876 7647357 11224488
41365 11224488 16282875 19443150 20022600 19783451 19754101 19523089 18943943 18163527 16425057
41356 16425057 13268886 10641313 11228847 14619559 17663358 18911622 19988069 21867742
41348 21867742 22688799 20893456 18306295 17997219 20395638 23377454 25293051 26131253
41340 26131253 26174740 25243497 23496494 21809566 20732000 19475101 16579821 11929583
41332 11929583 7794233 7002832 9818239 13571698 15846163 16721100 17079437 16614991 15426747
41323 15426747 15822486 19575463 24363311 26330458 25856721 26974305 30614619 32650609
41315 32650609 30389576 27090067 27079126 29424417 30175859 28941772 29044239 31650370 33731372
41306 33731372 32721407 30155522 29037475 29538883 29257486 26918469 23973756 22325798
41298 22325798 21843396 21126294 19983003 19447486 19092100 16438827 10726811 5645646 5560269
41289 5560269 9585533 12476341 11648973 10115113 11405822 14784480 17476314 18929171
41281 18929171 20232649 21332169 21743259 22667496 25360390 28095221 27702333 24086968
41273 24086968 20667952 20010446 21141422 21629214 20457001 18235720 16184445 15770555
41265 15770555 18240245 23454847 29392205 33261055 33444194 30949717 29018733 30193567
41257 30193567 33170282 33777433 30038115 24911947 22555190 23134744 23383392 21477936
41249 21477936 18995138 18128583 19160874 21119576 23192819 24857917 25815659 26268556
41241 26268556 26429503 25777307 23828569 21462842 20151509 19889663 19316593 18053888 17457936
41232 17457936 18585096 20674395 22255846 22711384 22082506 20320926 17778438 16045513
41224 16045513 17167942 21455908 26406712 28687198 27682811 26280649 27011304 28222009
41216 28222009 26272584 21430348 18501232 20223852 22999592 21869762 17584485 15314188
41208 15314188 17457295 21298848 23583603 23982760 23493815 22465126 21401557 21452158 22783932
41199 22783932 23967386 23825468 22612481 20931035 18920651 16918734 15541913 14832051
41191 14832051 14571391 15226517 16882526 17610781 15287286 11193189 9299297 11377935
41183 11377935 15140451 17806630 18962494 18978853 17353874 14235728 11325834 9560608
41175 9560608 7928162 6294102 7188017 12375377 19262755 23373157 23559064 22390539
41167 22390539 21953125 21747223 20882080 20090155 20463463 21304599 20492245 17108629 13106795
41158 13106795 11619016 13446039 16145032 17215241 16878059 16322747 14812820 11234496
41150 11234496 7483862 6633883 7714629 6431228 2207790 280041 4284344 10335543
41142 10335543 11908860 8191739 4068622 3442069 5932683 9085502 10667241 9486301
41134 9486301 6795625 6275382 9908358 14440297 14687311 9992143 4731191 2722462
41126 2722462 3909895 6476936 9180228 10928934 10721152 9189438 8343988 8741722 8429428
41117 8429428 5744772 2067507 715071 3432659 8460653 12148121 12743264 12421584
41109 12421584 14441534 18178761 19023296 14359356 7510720 3686699 3736646 4422303 3474503
41100 3474503 1422131 -792705 -2913907 -4116207 -3191577 -192892 3806955 8017114
41092 8017114 11258937 11445703 8452217 6130389 7971414 11712500 12260779 9446918
41084 9446918 8191948 10517061 12315950 9863950 5297130 3033773 3942794 5752703
41076 5752703 6926168 7689925 8783274 10839425 13609795 15078648 13402796 10140754
41068 10140754 8713542 9141081 8011779 4868899 4294977 9171345 15830802 19178693
41060 19178693 19237962 18950602 18549195 16452829 13552581 12053843 11297495 8900679 5248107
41051 5248107 2959397 2404534 1455909 -492606 -1713923 -1430670 -846584 -733676 -673289
41042 -673289 -740472 -1426429 -1922140 -828274 1617447 4194941 6912880 10032021 11710736
41033 11710736 9793079 5687536 3363949 4408662 6794962 8371920 8709646 7775260
41025 7775260 5952585 5273210 7378186 10314983 10723217 9033811 8690081 10300521 11087605
41016 11087605 10630488 12025788 15725133 17314187 14176583 9950069 9013829 10290320
41008 10290320 10189798 8539342 7613002 7701308 7648380 8135171 10781511 15063497 18947486
40999 18947486 21262387 21099541 17029657 9909377 4298628 3622709 5753677 6748384
40991 6748384 6672247 7561354 7905569 4591321 -755561 -3020690 -1072436 1458266 3126392
40982 3126392 6526531 11857525 14520882 11945587 7946541 6909021 7650233 6741608
40974 6741608 4559726 3918106 5033797 5889120 6111886 6877580 7937458 7912868 6813720
40965 6813720 5557490 3854109 1236555 -722946 -105953 2053297 2986521 2287469 1972997
40956 1972997 2711335 2980693 2257276 2255593 4317820 7885536 12167393 17041601 21532334
40947 21532334 23602809 22582902 20078028 17550919 14730879 11399820 9008985 9228197
40939 9228197 12174930 17004551 22646161 26826373 26365983 20664099 13816419 10963361
40931 10963361 12868023 16069384 18131818 20348130 24521172 29165826 30757626 28103899
40923 28103899 23875431 21653246 22597737 25487189 28926053 32184431 34169066 33341961
40915 33341961 29663081 25596759 23834732 24373490 24987804 24247174 22698222 21223934
40907 21223934 19912701 18944709 19016236 20044478 20651693 19842065 18246894 16940185 16080473
40898 16080473 15664410 16517672 19169792 22417849 24407640 24874927 25173955 26236938 27459091
40889 27459091 27536962 25766426 22752238 20253694 19647623 19995225 18738222 15326119 12823463
40880 12823463 14135391 17653950 19023085 16828269 13880566 12587428 11902067 10160473
40872 10160473 8520066 9391956 12751231 16131917 17737823 17789181 17048948 15704900 13984073
40863 13984073 12664294 12456146 13394849 14959739 16377951 16950032 16623690 16160960 16289474
40854 16289474 16863736 17234110 16987940 15731267 12787665 8300241 4400063 3824344 6897647
40845 6897647 10914006 13049315 12919524 11598030 9331242 5828804 2349937 1434989
40837 1434989 3708301 6317474 5969700 2972547 859734 2111647 5680245 9078615
40829 9078615 11428009 13431050 15418966 16830619 17157484 16173469 13608237 9913354
40821 9913354 7058016 6964193 9080659 11138540 12540573 15032522 19191291 22303120
40813 22303120 21464042 17486098 13908867 13018309 14519458 17113180 19185181 18666971
40805 18666971 14979285 11202822 11553407 15959739 19719212 19648162 17900218 17849475 18822084
40796 18822084 17937147 15477502 14720703 16785249 19212477 20282828 21503001 24386900
40788 24386900 27477673 28603934 28124219 27688448 27174563 25221702 22007060 19270655
40780 19270655 18007220 18083591 19617690 22483899 24700217 23849976 20470884 17669235
40772 17669235 16769314 15787629 13223786 10788450 10549398 11482367 11201605 9722695 9127933
40763 9127933 10400210 12821042 15731368 18532749 19562399 17704410 15098466 15451746
40755 15451746 19005494 21692569 20409741 16960964 15289813 16544466 18643957 19507200
40747 19507200 18756675 16706695 13478975 9530597 6155271 4844506 5963178 7963372
40739 7963372 8432191 6711963 5055648 5968249 8787723 10700502 11058634 12215127 15279787
40730 15279787 17673594 16744162 13723145 11666767 10909725 9306954 6227097 3417588
40722 3417588 1846478 327516 -1950609 -3550816 -2536679 1114716 5617186 8987201
40714 8987201 10154167 9515174 8889266 10032583 12739720 15125612 15949503 15687306 15053850
40705 15053850 13679824 11044856 7942522 6115609 6626948 8969867 11492734 12454257
40697 12454257 11074140 7994787 4733788 2616907 2086531 2558298 2804881 2249014 2330773
40688 2330773 5517556 11868259 17555069 18496624 15031550 11221451 9739338 9506519
40680 9506519 8637205 7452148 7431622 8828748 10731953 12500708 13923805 14600610 14111236
40671 14111236 12412841 9720337 6750462 5169010 6323059 8939734 9722273 7327006
40663 7327006 4289943 3744802 5764986 8590107 11809543 15763805 18781599 18223630
40655 18223630 14604650 11869225 12423057 14046178 13296218 10393525 8756362 10320050
40647 10320050 13164376 14043027 12098176 9463485 8663931 10041720 11931255 13042486
40639 13042486 13905876 15480359 17031199 16704815 14414789 12907276 14945720 19838334
40631 19838334 23699451 23426575 20134673 18370935 21652452 28605470 33859152 33243679
40623 33243679 27831192 22239465 19484405 18837467 18568399 18712159 20093806 22386480
40615 22386480 24992572 28781400 34702384 40948644 43789381 41782917 37458836 34202381
40607 34202381 33067612 33386570 34673937 36381585 36991598 35207371 31737623 28662538
40599 28662538 27257082 27200847 27301044 26168982 23098090 19363806 17661709 19011009
40591 19011009 21435030 23252260 25984605 31412052 37192326 39108170 37299686 36281770
40583 36281770 38255327 40435870 40261524 39117648 38724515 37765185 35201300 33586274
40575 33586274 35389755 38712689 40527224 41682646 44234753 45923993 42681306 35736147
40567 35736147 30852011 30505056 31938275 33260643 35914147 39776268 41347545 39351629
40559 39351629 37475702 38611115 40449406 39859610 37657328 35412484 31266067 23471463
40551 23471463 15445673 12572729 15519415 20724718 25847226 30504888 33188909 32394964
40543 32394964 30330231 30794390 33284933 33638691 30870331 28723085 29278885 29562655 26696961
40534 26696961 22722007 21527112 23651989 26818969 29564881 31631513 32150712 30130323
40526 30130323 26352021 22986649 21489402 21786041 22836974 23136743 21550822 18611230
40518 18611230 16198455 15237516 14754886 13968947 13993466 16248453 20177235 23812863 25896755
40509 25896755 26345932 25375999 23412096 21448097 20427767 20465440 21283899 22881617 25036219
40500 25036219 26693918 26730201 25140055 23009548 21551438 21268973 21480758 20671109 18231212
40491 18231212 15816117 15613093 17129086 17500997 15532077 13280623 12519096 11986331 10207338
40482 10207338 8942064 10828675 14750368 16839501 15882457 14653009 15578047 18052973
40474 18052973 20795780 23795124 26363777 26095962 22320952 18659597 19061253 22137823
40466 22137823 22589220 18461937 14065473 14436580 19173337 23789808 25854108 27203510
40458 27203510 30028373 33165025 33702782 30982018 27130928 23961998 21333786 19166709
40450 19166709 19040500 21848079 24932942 24269668 19898223 16728012 18512868 22956314
40442 22956314 24916154 23084923 20684695 20094599 20159599 19511850 19149775 19699346 18991556
40433 18991556 15505945 12299625 13572469 17953517 19407422 15529003 10965133 10732967
40425 10732967 13624959 15199723 14714433 15227168 17942031 20392187 20536826 19421952
40417 19421952 18726831 18168618 16790987 15074890 14211894 14318240 14635366 14738015 14416214
40408 14416214 12949408 9709654 5444117 2143975 1406681 3130029 5751028 7640611
40400 7640611 8406453 8898817 9854323 10759295 10437804 8626108 6492393 5586715 6540564
40391 6540564 8585388 10004922 9393675 6943264 4179614 2090364 217614 -1748465
40383 -1748465 -2468586 -446382 3445738 6446917 6875560 5389495 3504390 2373497
40375 2373497 3001090 5831095 9516557 11611225 11351627 10643200 11508098 13577980 14976061
40366 14976061 14803064 13718941 12548489 11316145 9748025 8250591 8015941 9728006
40358 9728006 12041339 12239753 9327870 5765391 4784659 6423681 7801828 7100463 5408281
40349 5408281 4461304 4539310 5264158 6665523 8390064 9270298 8883654 8571084 9833397
40340 9833397 12367627 14503578 15100453 14506648 14062477 14782924 16029619 15809032 13315611
40331 13315611 10681903 10783953 13694287 17012483 19357612 21421428 23648314 25224326
40323 25224326 25636734 25011062 22771860 18467417 13998448 12020065 11839548 10376291
40315 10376291 7717285 7453808 10175859 11514010 9318602 7941477 11319132 16018089
40307 16018089 16384022 13485086 13018511 16192158 18885959 19304535 20320690 23366509
40299 23366509 25412660 23955124 20922742 19554086 20402705 22096206 23478509 23584449
40291 23584449 21709040 18664699 16195626 14728581 13687046 13823478 16335347 19507047
40283 19507047 19578602 15801663 11576163 9687055 9580307 10363003 12879455 16902471 19497743
40274 19497743 18674806 16266520 14931772 14515051 13609723 12581806 12530186 12893082 12395710
40265 12395710 10943895 8639479 4775651 159676 -1485801 2428784 8990047 12571733
40257 12571733 11502207 9043319 7991442 7565516 6450590 5980543 8184918 12027972
40249 12027972 13773949 11273695 6669886 4116273 5245754 7878036 9393968 10011042
40241 10011042 11385562 13061298 12799430 10585410 9677131 12340316 16454024 18056733
40233 18056733 15974448 12198495 8612921 5300557 1983222 -446394 -545115 1834761
40225 1834761 4722700 5689539 4815361 5060969 8318671 12068026 12387199 9891660 9450684
40216 9450684 13376199 18358628 20769746 21504322 22752461 22987063 19250739 12903838
40208 12903838 8746178 8415391 8389956 5482437 1389945 282010 3778943 9840182
40200 9840182 15485296 19235674 21325466 22600163 23521928 24088971 24436531 24999809 25893004
40191 25893004 26622606 26655513 25755931 23677821 20359873 16637828 13798764 12132091 10900373
40182 10900373 9852009 9409800 9201707 8187565 6734385 6581546 7944343 8773898 8006675
40173 8006675 7309425 8114792 9232946 9348748 9630448 11344146 12751243 11266432 7460092
40164 7460092 4204259 2874044 2947973 4190549 6328078 7516974 6320487 4707079
40156 4707079 5902371 9422653 11415108 10146261 8052016 7670705 8393887 8404541 7574893
40147 7574893 7050269 7327900 7731197 7087921 4931785 2881322 4005346 9161595 14809243
40138 14809243 16674985 14995829 13668848 14722914 16536405 17386337 17516346 17150640
40130 17150640 15584674 13308333 12256887 12628054 11900110 8542166 4661287 3373271
40122 3373271 5104808 7877180 9972247 11182409 12472598 15167975 19488576 23547613
40114 23547613 24917090 23152378 19465113 14566247 9053585 5254339 5329433 7253696
40106 7253696 6271527 1495989 -2345624 -1375325 2570935 5765702 8068054 11402281
40098 11402281 15079293 16302244 14339617 11039237 7575058 3393757 -1516793 -5527149
40090 -5527149 -7093464 -6318411 -4428324 -2351703 122057 3878339 8647396 11832791
40082 11832791 10649764 5873571 1881955 2125938 5840062 9829557 11884107 11616766
40074 11616766 9737247 7798266 7354745 8316357 9217018 9493614 9807814 9910371 8714259
40065 8714259 7094217 7463706 9247740 8327260 3375540 -679673 970171 5804527
40057 5804527 7292843 3865042 274004 490950 3235296 5071850 4797359 3744387
40049 3744387 3745677 5577569 8335842 10357141 11435768 13070906 15506852 16359182 14029551
40040 14029551 10572574 8706804 7805963 5835480 3573562 3309298 4550005 4938566
40032 4938566 4741535 6385961 9819499 12439735 13658288 15241581 16697856 14903393
40024 14903393 9498486 4255085 1447247 -720688 -2875181 -1335050 6089695 14754299
40016 14754299 18103993 15817322 12799998 11487884 9588787 5278350 594037 -1389423
40008 -1389423 -101972 2802499 5353399 6139828 4941342 3318398 3372856 5259135 6923834
39999 6923834 6854512 6060827 6505243 8274889 9396553 8431208 6320142 5051178 4957825
39990 4957825 4379842 2233708 -188221 -887060 212357 1626557 2797103 4536371
39982 4536371 6971749 8732508 8699499 7254531 5338012 3578665 2827422 4058737 6914809
39973 6914809 9644467 11372066 13156315 15800914 17986866 18071607 16777411 16364376 17476026
39964 17476026 18328454 17131594 14218481 11478793 10281498 10218506 9853533 8848238 8990991
39955 8990991 12110032 16971601 19871661 19139816 17441334 17994530 19740935 18653778
39947 18653778 13656838 8791972 8498864 12309010 15550168 14498480 9623247 4269683
39939 4269683 1587880 2852807 7281884 12404359 15360555 15279042 14441032 15904169 19703458
39930 19703458 22744476 23123043 22924241 25076982 28615169 29576768 26521062 22544427
39922 22544427 20924867 21101599 20755906 20141063 21684757 25609219 28454809 26895828
39914 26895828 21562638 15986465 12730636 11847674 12472793 13964212 14999142 13507577
39906 13507577 9291928 5688274 6280087 10022584 12085909 10191126 7488626 7567843
39898 7567843 9146419 8455370 5160073 2472640 2034268 2209702 1679112 1320106 1538718
39889 1538718 806221 -1517721 -3373659 -2855227 -847341 1078840 3480351 7352023
39881 7352023 10984540 11303115 8068568 4418522 2933805 2964684 2486029 1294884 1327953
39872 1327953 4096187 8507546 11693473 12056485 10844824 9990670 9133431 6472293 2483278
39863 2483278 545423 2787423 7052593 9557111 9355700 8434536 8190839 7863408 6541999
39854 6541999 5068713 5094338 6820189 8343899 7468371 4178161 964088 227283 1734915
39845 1734915 3420481 4184952 4518523 4637879 3975002 2889250 2809012 3650967 2961863
39836 2961863 -830406 -5642555 -7853437 -6335762 -2926513 354792 2939645 4858385
39828 4858385 5802805 5553414 4779968 4914685 6811594 9315415 9936246 7839117 5300045
39819 5300045 4771228 5546492 5567941 5552314 8008609 12340338 14757263 13753058 11811493
39810 11811493 10586534 8704556 6194624 6345563 10016187 12561644 10555821 7552641
39802 7552641 8181138 10162777 8439814 4689455 5491032 11743430 17075871 17582811 16535644
39793 16535644 17573994 19270191 19400486 19560807 21830048 24498604 24808882 23469236
39785 23469236 23308306 25307078 28476975 31896247 34571773 34910245 32547141 29498639
39777 29498639 27785577 27097253 26101267 24607777 23159928 21962405 21404927 22214501 24199661
39768 24199661 26456751 29339277 33897141 38565284 39291116 34604545 28056369 23807981
39760 23807981 22121766 20979577 19574828 17957076 15633457 13079009 12536120 14745247
39752 14745247 16890030 16374866 14469949 13267972 11331455 6194390 -394817 -3919111
39744 -3919111 -3150692 -1000793 277090 997303 1265453 176373 -1540875 -1449815 991268
39735 991268 3468553 4280650 4234753 4416307 4758769 5730851 8721788 13356561 16671940
39726 16671940 16438614 13597732 10430034 8266269 7920417 9917656 12633140 12424233
39718 12424233 7845360 2217955 -178428 718301 1634517 1109227 1140623 3598501 7173406
39709 7173406 8753527 6756140 2551146 -768241 -873283 1811866 4370918 4156024
39701 4156024 1439631 -1019389 -929984 1542798 4654886 7140153 8887706 9967769
39693 9967769 9863727 8233837 6099807 5246131 5927782 6068136 3890008 852019 304374
39684 304374 2971911 5542132 4851923 2109367 1210429 3489933 6153179 6197427 4128309
39675 4128309 2782611 3625714 5562733 6937633 7388948 7667409 8639052 10664876 13036928
39666 13036928 13770047 11098202 5952513 1987377 1910158 4236481 4952961 2259924 -1590238
39657 -1590238 -3269732 -1946780 462143 1475262 -52072 -3190896 -5370023 -4287519
39649 -4287519 -147339 4408527 6935090 7142297 6073763 4495980 2819439 1574649
39641 1574649 855309 -134703 -1985975 -3915383 -4517028 -3367997 -1241078 904401 2600673
39632 2600673 4026827 5952129 8840940 11521931 11719538 8745268 4745580 2280153
39624 2280153 1567402 1301012 1192643 1920607 2930955 2180620 -1402681 -6175035 -8880515
39615 -8880515 -7191145 -1537236 4922509 8548522 8201082 5813649 3813693 2832328
39607 2832328 2283366 1697539 459511 -2280697 -5993964 -8463187 -8718583 -8745464 -10181331
39598 -10181331 -10957234 -8204304 -3446799 -1354645 -3381262 -5993548 -5718269 -2824635
39590 -2824635 805294 4321725 6963207 7181548 4694653 1635620 -12440 -748331
39582 -748331 -2077353 -4138047 -6001689 -7071827 -7209002 -6667857 -6489269 -7392135 -7813980
39573 -7813980 -5141479 312579 4868375 6166350 5907818 6431451 7099418 6270370 4668723
39564 4668723 4089952 4237740 3525396 2070464 1468325 2221883 3456319 4627256 5787338
39555 5787338 6815184 7786012 9081975 9855178 8060061 3785575 613806 1255605 3634660
39546 3634660 4094528 2717866 2084116 2256303 1046836 -1464190 -2803960 -2323162 -1563294
39537 -1563294 -470353 2436163 5682549 5293322 1004010 -2334122 -1532285 720857
39529 720857 693663 -1183192 -2716170 -3915383 -5119632 -4216018 348671 5974779 9095193
39520 9095193 10094417 11320014 12057440 9858110 5686890 3053304 2337531 624336 -2475832
39511 -2475832 -3575014 -1428563 255742 -1695056 -5070719 -5821008 -3964599 -2797456
39503 -2797456 -3628111 -4396262 -3263683 -1171499 -340061 -1561114 -3512016 -4305379 -3536789
39494 -3536789 -2664292 -2997557 -3742948 -3061752 -714253 1834042 3696275 4930999 4548951
39485 4548951 806569 -5440133 -10124798 -10427981 -7949531 -5770158 -4361195 -2515261
39477 -2515261 -442208 717432 1095460 1127317 -334448 -3877989 -6532364 -4531107 1171393
39468 1171393 5767888 7167755 7862470 9446945 9528670 6335697 2840795 3004683 6095634
39459 6095634 8005996 6900389 4520496 2655701 1239457 -165949 -1466005 -2849638
39451 -2849638 -4542325 -5469214 -3877229 248208 4618972 6823234 6241723 3976729
39443 3976729 1935854 1749765 3351364 4659401 3771530 1397063 49761 948938 2825884
39434 2825884 3743242 3046586 1515662 458838 594713 1241658 1097391 356889 874337
39425 874337 3080251 4207041 1595567 -3288640 -6462430 -6236414 -3920828 -656169
39417 -656169 3106820 5309410 3549076 -410770 -1211493 3190067 8358347 9198781 6027546
39408 6027546 2470264 115767 -1732199 -3210551 -4153328 -5670115 -8246820 -9479496
39400 -9479496 -6956605 -2499284 -253449 -1261209 -3376851 -6017948 -10799709 -16839985
39392 -16839985 -19617407 -16549080 -10783538 -7190382 -6651232 -6543747 -5360608 -4422134
39384 -4422134 -5382260 -7718743 -8945285 -6900185 -2156077 1835766 1899893 -1488297 -5037692
39375 -5037692 -6705646 -7331942 -8236151 -9397748 -10659771 -12382568 -13614426 -11857018
39367 -11857018 -6586715 -1261527 387991 -1185461 -2719141 -2694198 -1942399 -632898
39359 -632898 2170884 5788368 7661149 6717606 4740734 3405695 2120927 175207
39351 175207 -1016848 76708 2112499 2274434 324625 -959645 205459 1962475
39343 1962475 1134669 -2927229 -7910421 -11332174 -12637792 -12649444 -12008972 -10660097 -8370316
39334 -8370316 -5241198 -1854065 746677 1445456 69172 -1869775 -2189465 -494262
39326 -494262 803726 -973194 -5036263 -7221690 -4821442 -394684 951111 -2082291
39318 -2082291 -5370409 -4846894 -1583431 376045 -264927 -1211326 -982666 -981103 -2210922
39309 -2210922 -2779066 -815521 1957321 2169515 -587571 -3701821 -5807366 -8357174
39301 -8357174 -12243818 -15249144 -14499680 -10188962 -5269986 -2033036 -329778 1013815
39293 1013815 2298743 2965672 2914799 3028882 3962753 4633784 2803648 -2200888 -7920781
39284 -7920781 -10878110 -10060719 -7462262 -5501027 -5070803 -5894137 -7157097 -7429443 -5509809
39275 -5509809 -2125715 402487 881508 396009 72620 -690212 -2527747 -4253291 -4588720
39266 -4588720 -4546589 -5724343 -6885043 -5032917 -168983 3746453 3719887 1360109 -71788
39257 -71788 -369995 -1790389 -4821917 -7312188 -7850080 -7464769 -7140373 -5971100 -3481186
39248 -3481186 -1983041 -4028528 -8083341 -9469411 -6218484 -1746900 -451616 -2410158
39240 -2410158 -4206457 -3771352 -2175146 -1025820 -391628 182170 402185 3035 -284988
39231 -284988 423356 1836079 2652423 1845991 -365567 -2421332 -2410721 61224 3071631
39222 3071631 4365601 3984050 3637362 3651303 2576752 393090 -231605 2501278 6479830
39213 6479830 8276500 7536863 6497125 6063164 5139303 3706623 3690423 5983474 8963709
39204 8963709 11089791 12899418 15005494 16051383 14734489 12541592 12050795 13100329
39196 13100329 13119984 11291109 9808892 10142847 10385618 8100149 4202753 1735276 1531539
39187 1531539 1573041 723486 606139 2684485 5433104 6183736 4722472 3251608 3257097
39178 3257097 4101698 4637749 4613791 4110021 2830394 600735 -2109801 -4581113 -6339212
39169 -6339212 -7190240 -7226235 -6753374 -5851270 -4375486 -2813933 -2303615 -2972974 -3363029
39160 -3363029 -2781682 -2860757 -4725748 -6082797 -4318170 -1584044 -2520401 -6605914 -7608957
39151 -7608957 -2530363 3498363 4359347 929957 -2152686 -4076993 -6687429 -8029507
39143 -8029507 -3721439 5067979 11002565 9673500 4648891 1373294 193216 -1735568
39135 -1735568 -4931481 -7480995 -8653069 -9533712 -10744917 -11599208 -11073525 -8470836 -4021545
39126 -4021545 255230 1573426 -682476 -4223503 -6732320 -7792637 -7281011 -4342530
39118 -4342530 354695 3671843 3687464 2624399 3632394 6165188 7400652 7206109 8463979
39109 8463979 12487208 16849399 18314129 16067926 11847607 8518764 8433020 11298308
39101 11298308 13544432 11562906 5783558 22251 -3078950 -4100082 -4419215 -4063651
39093 -4063651 -2660409 -622667 1535294 3702928 5459228 6359532 7411111 10442518
39085 10442518 15076640 17994230 16473360 11473490 6141332 2450492 443152 -400819
39077 -400819 -480010 -13517 1508327 5064518 10160239 14001944 14095805 11241546 8580203
39068 8580203 7897911 8108126 7243810 4689528 1304987 -1600382 -3065484 -2923404 -1732283
39059 -1732283 26927 2504505 5786251 8997733 10849793 10955332 9978778 8674798
39051 8674798 7458635 6703648 6656952 7161843 8183716 10309051 13662551 16515332 16487362
39042 16487362 13667301 11245918 12046704 15220523 17426625 16735305 14138478 11363613
39034 11363613 8597043 5050625 987868 -1849975 -1970110 184305 2514845 3109050
39026 3109050 1706384 -471318 -1988416 -2150968 -1028175 911002 2980693 4510517
39018 4510517 5385723 6245840 7603221 8666363 7689742 4014986 -665744 -3817712 -4613393
39009 -4613393 -4085136 -2877815 -344200 3417087 6139714 5731161 3314586 1888610
39001 1888610 2014773 1107774 -2230901 -5424970 -5248018 -2456867 -904776 -2674799 -6166533
38992 -6166533 -8715931 -8953000 -6523898 -1956409 2313118 3093839 374185 -1470329
38984 -1470329 1536744 7907337 12543637 13145115 12341573 13219166 15314366 16475553 16743677
38975 16743677 18037231 20685547 22739008 23208971 23997850 27280514 32138462 35404569
38967 35404569 35358853 32945175 29436836 24939304 20084674 17305145 18343794 21196327
38959 21196327 21693823 18369869 14106917 12559896 14497722 18204463 21742321 23731209
38951 23731209 23483458 21961576 21459937 22641487 22911856 19775442 15031622 13108430
38943 13108430 15355161 18665183 20212478 20692175 21548176 21773410 19994373 17969922
38935 17969922 18962490 23100123 27015037 28240217 27678909 27246035 27250105 27166855 27245766
38926 27245766 27854077 28295861 27748148 26756915 26505771 27040022 27506717 27815092 28489040
38917 28489040 28796208 26872395 22699676 19480540 20299017 24062160 26699348 26365284
38909 26365284 25314670 25927234 27238205 27316087 27120169 28812679 30962873 29303700 23269084
38900 23269084 18276401 19187295 24106792 27615633 28175898 28652488 30541596 31996997
38892 31996997 32048315 32714522 35204624 37226791 36327247 33419744 30641293 28024591 25191989
38883 25191989 24316113 27551290 32390296 33646703 30383636 27215405 27842963 30900986
38875 30900986 33816403 37078289 41618908 44723061 42678180 36500035 31230132 29675238
38867 29675238 30344029 31857256 35460161 41471244 46608009 47687149 45973428 45057384
38859 45057384 45840091 46497411 46339904 46361807 46222744 44203620 40832995 39194253 40095868
38850 40095868 39944843 35795437 30182503 27940595 29607256 31169959 29848750 27021628
38842 27021628 25172121 24797024 25243171 26221607 27221684 27381331 27423075 30053415 36606097
38833 36606097 44408764 49385900 50602064 50367257 50316202 49606833 47318154 44533756 42913463
38824 42913463 42647658 43273342 45572595 50870328 58584056 66108280 71533474 75127917
38816 75127917 77566005 78284457 76964813 75335056 75302421 75765940 73798960 69360239 66200786
38807 66200786 66790894 68734182 68380930 66167441 65523258 67483447 69620206 70390827 71502303
38798 71502303 75009054 80472826 86287329 91915360 97347638 101757871 104201724 104825043
38790 104825043 104293405 102693524 99682113 94969564 88375359 80603067 74100501 71210504
38782 71210504 70795825 68946672 64304326 60293801 60083995 61660390 60824992 57378255
38774 57378255 54752369 54367609 54338845 54011373 55680934 60120829 63661353 62312091 56837900
38765 56837900 51258827 47713058 45466584 44159187 44780486 46701961 46420130 41304003
38757 41304003 33503680 28136919 27722741 30063602 31846483 32435665 32926608 33086511 31493769
38748 31493769 28217263 25009481 22563851 19763376 16327225 13949200 13497814 13137964
38740 13137964 11109218 8738288 8463553 10023902 11033084 10717481 10713107 12327276 15085185
38731 15085185 17923738 19926389 19992205 17748877 14835639 13429747 13503879 13366768 12664383
38722 12664383 12530747 12759801 11532996 8634498 6421310 6505273 7604585 7825984 7118400
38713 7118400 6338370 5852838 6293463 8642354 12014312 13286891 10854693 7248794 6102014
38704 6102014 7760585 9779808 10585126 10556878 10334652 10211127 10872768 12858796 15243728
38695 15243728 16138323 14455142 10494594 5572188 2010227 2301748 6617814 11810954
38687 11810954 14408336 14017028 12476092 10693161 8272551 5569926 3798571 3035719
38679 3035719 2003664 98820 -1766818 -2367361 -945308 2812575 7890102 11306067
38671 11306067 10425081 6229517 2578012 1874858 3098817 4364026 5445599 6922829
38663 6922829 8484957 9249152 8730368 6755048 3561889 746262 819780 4618958 9871706
38654 9871706 13339774 13907978 12902032 12055590 12015631 12347764 12116683 10593305 7954277
38645 7954277 5257068 3555925 3197973 3782479 4198059 2934894 -534044 -4562200 -6761832
38636 -6761832 -7011223 -7642795 -9869499 -11516639 -9768593 -5157830 -1076401 154340
38628 154340 -1055474 -3464824 -6242168 -7809072 -5941199 -902950 3071615 1947713
38620 1947713 -2866476 -5902838 -4525137 -1850348 -1647910 -3000105 -2632093 -731069
38612 -731069 -701555 -3285097 -4776473 -2538468 808390 1103672 -1540581 -3439173 -2711243
38603 -2711243 -1105281 -639609 -920637 -417604 1196261 2673530 2428129 74484 -2728751
38594 -2728751 -3526316 -1959126 -533236 -1355064 -3196762 -3472605 -2053264 -876843 -523002
38585 -523002 154074 1204894 1269364 515753 1221530 4481201 8447046 10652120 10161335
38576 10161335 7001574 1941862 -2395630 -3016319 -603207 448963 -2244729 -5801756
38568 -5801756 -6635400 -5800081 -6886919 -10344050 -13135721 -13240336 -11553237 -9627420 -8055315
38559 -8055315 -6967240 -5877476 -3103376 2488743 8997758 12641945 11707660 8007799
38551 8007799 4597351 3449924 4817407 6919671 6577206 2298293 -3276545 -6043329
38543 -6043329 -5438979 -4467855 -4757362 -4517924 -2268340 315095 1013562 271676 -295944
38534 -295944 -876397 -2550453 -4490423 -4672821 -3311430 -3322523 -6522199 -10587393 -10839107
38525 -10839107 -4961698 4309629 11245672 12041402 7822840 2766361 -276674 -1562785
38517 -1562785 -2403107 -3051106 -3274267 -3637359 -4927291 -6816665 -8051279 -7752035 -6074991
38508 -6074991 -4022310 -2898448 -3233150 -3916578 -3369189 -1968063 -1927970 -3899766 -5255447
38499 -5255447 -3378016 520660 2884494 2393441 833255 -312659 -1630580 -3659901
38491 -3659901 -5355298 -5870826 -6170160 -7455833 -9221682 -10287906 -10841571 -11906119 -13242217
38482 -13242217 -13217095 -10805476 -6823115 -3172478 -1402927 -1681639 -2562757 -2186035 -336661
38473 -336661 1261394 1423024 1357342 2710737 4465153 3698109 -500919 -5597256 -8481996
38464 -8481996 -8272078 -5864234 -2483434 355285 1013809 -653882 -2722015 -3444056 -3331066
38455 -3331066 -3918520 -5378154 -6671793 -7259779 -7130571 -5778775 -2883252 310753 1970581
38446 1970581 1893140 1167170 -69935 -2514702 -5306808 -6115386 -4403100 -2548409 -2568793
38437 -2568793 -3494979 -3351977 -2157233 -1301544 -1195548 -1331279 -1816106 -3056905 -4490838
38428 -4490838 -5299041 -5899919 -7058330 -7987733 -7317030 -5803440 -5884332 -8094443 -10070045
38419 -10070045 -10109589 -9716628 -10815371 -11850245 -9245774 -2805524 2661308 2427259 -2619270
38410 -2619270 -7102687 -7418337 -5150654 -3897457 -4489945 -4839646 -3420634 -829432 1894394
38401 1894394 4376376 5924417 5465227 3389448 1687364 1103896 -79310 -2968625
38393 -2968625 -5615338 -5736625 -4312996 -3846933 -4160495 -3016595 -413141 1181967 1215770
38384 1215770 2223866 5385787 7914731 6745488 2526254 -1950827 -5224048 -7020087
$$ [...]
##END NTUPLES=NMR SPECTRUM
##END=
