##TITLE=31Pdec_DE-107k_TFA
CDCl3, 64 sc
 3.9.2025
##JCAMPDX= 6.0         $$ Bruker NMR JCAMP-DX V2.0
##DATA TYPE= NMR SPECTRUM
##DATA CLASS= NTUPLES
##ORIGIN= UXNMR, Bruker Analytische Messtechnik GmbH
##OWNER= root
$$ XWIN-NMR		Version 3.5
$$ Wed Sep  3 14:31:35 2025 Russian Standard Time (UT+4h)  she@DPX200
##.OBSERVE FREQUENCY= 81.013821
##.OBSERVE NUCLEUS= ^31P
##.ACQUISITION MODE= SIMULTANEOUS
##.ACQUISITION SCHEME= undefined
##.AVERAGES= 64
##.DIGITISER RES= 17
##SPECTROMETER/DATA SYSTEM= spect
##.PULSE SEQUENCE= zgpg30
##.SOLVENT NAME= CDCl3
##.SHIFT REFERENCE= (INTERNAL, CDCl3, 0, 198.062)
##AUDIT TRAIL= $$ (NUMBER, WHEN, WHO, WHERE, WHAT)
$$ ##TITLE= Audit trail, XWIN-NMR		Version 3.5
$$ ##JCAMPDX= 5.01
$$ ##ORIGIN= Bruker BioSpin GmbH
$$ ##OWNER= she
$$ F:/spectra/data/she/nmr/P31/2/pdata/1/auditp.txt
$$ ##AUDIT TRAIL=  $$ (NUMBER, WHEN, WHO, WHERE, WHAT)
(   1,<2025-09-03 14:30:15.03 +0400>,<she>,<DPX200>,
      <created by zg, POWCHK disabled, PULCHK disabled
       configuration hash MD5:
       00 E9 B6 7A A2 85 ED C7 34 08 36 98 17 FE 4E 26
       data hash MD5: 32K
       93 E8 DB B9 0E F3 05 FC 12 E4 70 DE 15 11 32 9E>)
(   2,<2025-09-03 14:30:17.48 +0400>,<she>,<DPX200>,
      <Start of raw data processing
       efp BC_mod = 2 LB = 1.5 FT_mod = 6 PKNL = 1 PHC0 = 1390.471 PHC1 = 149.4999 SI = 64K 
       data hash MD5: 64K
       C3 33 4B E1 39 42 CB 4D F2 76 91 03 53 E4 B6 F3>)
(   3,<2025-09-03 14:30:49.92 +0400>,<she>,<DPX200>,
      <pk PHC0 = 29.13443 PHC1 = 0 
       data hash MD5: 64K
       71 AA EF 46 2D 36 C6 C9 D6 F9 4C 9D 78 8A BC 4F>)
(   4,<2025-09-03 14:30:57.28 +0400>,<she>,<DPX200>,
      <abs ABSG = 5 
       data hash MD5: 64K
       BE 36 4A B1 1A E5 57 DC 3C E3 74 7D BB 28 A1 07>)
$$ ##END=
$$ 
$$ hash MD5
$$ 22 12 C0 C5 79 9C 60 19 5A 5D 28 A9 34 49 8B 66
##$RELAX= 
##$RELAX= 
##$RELAX= 
##$RELAX= 
##$RELAX= 
##$RELAX= 
##$RELAX= 
##$RELAX= 
$$ Bruker specific parameters
$$ --------------------------
##$DU= <F:/spectra>
##$EXPNO= 2
##$NAME= <P31>
##$PROCNO= 1
##$TYPE= <nmr>
##$USER= <she>
##$AMP= (0..31)
100 100 100 100 100 100 100 100 100 100 100 100 100 100 100 100 100 100 
100 100 100 100 100 100 100 100 100 100 100 100 100 100 
##$AQSEQ= 0
##$AQ_mod= 1
##$AUNM= <au_zg>
##$AUTOPOS= <>
##$BF1= 81.014009
##$BF2= 200.13
##$BF3= 200.13
##$BF4= 200.13
##$BF5= 200.13
##$BF6= 200.13
##$BF7= 200.13
##$BF8= 200.13
##$BYTORDA= 1
##$CFDGTYP= 0
##$CFRGTYP= 5
##$CHEMSTR= <none>
##$CNST= (0..31)
1 1 145 1 1 1 1 1 1 1 1 1 1 1 1 1 1 1 1 1 1 1 1 1 1 1 1 1 1 1 1 1 
##$CPDPRG= <waltz16>
##$CPDPRG1= <>
##$CPDPRG2= <waltz16>
##$CPDPRG3= <>
##$CPDPRG4= <mlev>
##$CPDPRG5= <mlev>
##$CPDPRG6= <mlev>
##$CPDPRG7= <mlev>
##$CPDPRG8= <mlev>
##$CPDPRGB= <>
##$CPDPRGT= <>
##$D= (0..31)
0 1 0 0 0 0 0 0 0 0.06 0 0.03 2e-05 3e-06 0 0 0.0002 0 0 0 0 0 0 0 0 0 
0 0 0 0 0 0 
##$DATE= 1756895414
##$DBL= (0..7)
120 120 120 11 120 120 24 19 
##$DBP= (0..7)
150 150 150 150 150 150 150 150 
##$DBP07= 0
##$DBPNAM0= <>
##$DBPNAM1= <>
$$ [...]
##$SUBNAM3= <"">
##$SUBNAM4= <"">
##$SUBNAM5= <"">
##$SUBNAM6= <"">
##$SUBNAM7= <"">
##$SUBNAM8= <"">
##$SUBNAM9= <"">
##$SW= 400.765351723535
##$SWIBOX= (0..15)
0 1 3 0 0 0 0 0 0 0 0 0 0 0 0 0 
##$SW_h= 32467.5324675325
##$TD= 32768
##$TD0= 1
##$TE= 0
##$TE2= 300
##$TE3= 300
##$TEG= 300
##$TL= (0..7)
0 120 53 12 22 120 120 120 
##$TP= (0..7)
150 150 150 150 150 150 150 150 
##$TP07= 0
##$TPNAME0= <>
##$TPNAME1= <>
##$TPNAME2= <>
##$TPNAME3= <>
##$TPNAME4= <>
##$TPNAME5= <>
##$TPNAME6= <>
##$TPNAME7= <>
##$TPOAL= (0..7)
0.5 0.5 0.5 0.5 0.5 0.5 0.5 0.5 
##$TPOFFS= (0..7)
0 0 0 0 0 0 0 0 
##$TUNHIN= 0
##$TUNHOUT= 0
##$TUNXOUT= 0
##$USERA1= <user>
##$USERA2= <user>
##$USERA3= <user>
##$USERA4= <user>
##$USERA5= <user>
##$V9= 5
##$VALIST= <valist>
##$VCLIST= <CCCCCCCCCCCCCCC>
##$VD= 0
##$VDLIST= <DDDDDDDDDDDDDDD>
##$VPLIST= <PPPPPPPPPPPPPPP>
##$VTLIST= <TTTTTTTTTTTTTTT>
##$WBST= 1024
##$WBSW= 4
##$XGAIN= (0..3)
0 0 0 0 
##$XL= 0
##$YL= 0
##$YMAX_a= 28150
##$YMIN_a= -13002
##$ZGOPTNS= <>
##$ZL1= 120
##$ZL2= 120
##$ZL3= 120
##$ZL4= 120
##$ABSF1= 198.0616
##$ABSF2= -202.7028
##$ABSG= 5
##$ABSL= 3
##$ALPHA= 0
##$AQORDER= 0
##$ASSFAC= 0
##$ASSFACI= 0
##$ASSFACX= 0
##$ASSWID= 0
##$AUNMP= <proc_1d>
##$AZFE= 0.1
##$AZFW= 0.5
##$BCFW= 0
##$BC_mod= 2
##$BYTORDP= 0
##$COROFFS= 0
##$CY= -3
##$DATMOD= 1
##$DC= 0
##$DFILT= <>
##$DTYPP= 0
##$F1P= 0
##$F2P= 0
##$FCOR= 1
##$FTSIZE= 65536
##$FT_mod= 6
##$GAMMA= 0
##$GB= 0
##$INTBC= 1
##$INTSCL= 9.790993e-09
##$ISEN= 30
##$LB= 1.5
##$LEV0= 0
##$LPBIN= 0
##$MAXI= 10000
##$MC2= 0
##$MEAN= 0
##$ME_mod= 0
##$MI= 50
##$NCOEF= 0
##$NC_proc= -9
##$NLEV= 6
##$NOISF1= 182.463
##$NOISF2= 159.3651
##$NSP= 0
##$NTH_PI= 0
##$NZP= 0
##$OFFSET= 198.0616
##$PC= 4
##$PHC0= 1419.605
##$PHC1= 149.4999
##$PH_mod= 1
##$PKNL= yes
##$PPARMOD= 0
##$PSCAL= 0
##$PSIGN= 0
##$REVERSE= no
##$SF= 81.0140089999434
##$SI= 65536
##$SIGF1= 159.3651
##$SIGF2= -187.1042
##$SINO= 113.3802
##$SIOLD= 16384
##$SREGLST= <1H.CDCl3>
##$SSB= 0
##$STSI= 65536
##$STSR= 0
##$SW_p= 32467.5324675325
##$SYMM= 0
##$S_DEV= 0
##$TDeff= 32768
##$TDoff= 0
##$TI= <>
##$TILT= no
##$TM1= 0
##$TM2= 0
##$TOPLEV= 0
##$USERP1= <user>
##$USERP2= <user>
##$USERP3= <user>
##$USERP4= <user>
##$USERP5= <user>
##$WDW= 1
##$XDIM= 65536
##$YMAX_p= 441043577
##$YMIN_p= -314306922
$$ End of Bruker specific parameters
$$ ---------------------------------
##NTUPLES= NMR SPECTRUM
##VAR_NAME=  FREQUENCY,     SPECTRUM/REAL,   SPECTRUM/IMAG
##SYMBOL=    X,             R,               I
##VAR_TYPE=  INDEPENDENT,   DEPENDENT,       DEPENDENT
##VAR_FORM=  AFFN,          ASDF,            ASDF
##VAR_DIM=   65536,         65536,           65536
##UNITS=     HZ,            ARBITRARY UNITS, ARBITRARY UNITS
##FACTOR=    0.49542278885378, 1,            1
##FIRST=     16045.7642231865, 0,            0
##LAST=      -16421.768244346, 0,            0
##MIN=       -16421.768244346, -314306922,   0
##MAX=       16045.7642231865, 441043577,    0
$$ Real data points
##PAGE= N=1
##DATA TABLE= (X++(R..R)), XYDATA
$$ [...]
7393A2734337k184689m999056p253804m821896R12271M644001M198146J927966
7385E157276L62653n1740K66367O60815L06553l31387N96181K864524K506832
7376A2338074l179522j0156557j1208321n347451K01992o60278m694239l965900
7368b6672202K690167P581346M926867p33468j111939L621447N491742J415135
7360b790905j994921P85403N350365M805602P17299o53249N61640r19446m733444
7351A128344m501592R62299M788972K849795n25266j089453j354949l884014m745238
7342f371102o1166O027304O881168L361817J473480K377150J687096k144257n217290
7333H014200m561726j979767l59373n6549j20867p6089O20686K550394M700138
$$ y = [12734337, 10549648, 5550592, -1703212, -6525108, -5612837, -968836, 3229310, 5157276, 5519929, 5468189, 5734556, 6395371, 6701924, 6370537, 6966718, 9831242, 12338074, 9158552, -998005, -12206326, -17553777, -17351785, -18012063, -22706302, -26672202, -23982035, -16400689, -11473822, -12207290, -13319229, -9697782, -4206040, -2790905, -4785826, -4000423, 1349942, 6155544, 6872843, 6219594, 6781234, 5861788, 1128344, -3373248, -2410949, 2378023, 5227818, 4702552, 3613099, 2258150, -1625864, -6371102, -6432268, -404964, 6476204, 9838021, 11311501, 13688651, 15375747, 13231490, 8014200, 3452474, 1472707, 1113334, 1056785, 935918, 859829, 1480515, 4030909, 8731047]
7324H731047M413952O54o838204j1261562q743339m5659P626912P350868O79789
7315A914458m315400l665154j483738j874656k589188k61099L258913M524883
7307d490981M153458L915758K293799j582076l502226P5454N166593N626574K316680
7298A3973033J60181p67190l500455o313031n171605k080109j979481l029330
7290h707987M3028M181080J360161n805215m934501O247678J3931680Q270864
7282A4586788k474707o031647l666945l338755m166015k46377N515937M467287
7274D645566k828539o466782k443135K156695J138730k237839j986625J779211
7266f242718M656944M569317L197007K842678L908644M638815L021783l98204
$$ y = [8731047, 13144999, 13145653, 6307449, -4954113, -13697452, -13743111, -6116199, 1234669, 1914458, -2400942, -6066096, -7549834, -9424490, -12013678, -12274777, -9015864, -4490981, -337523, 3578235, 5872034, 4289958, 787732, 863186, 6029779, 11656353, 13973033, 14133214, 13366024, 9865569, 3552538, -1619067, -3699176, -5678657, -8707987, -8664959, -4483879, -3123718, -8928933, -13863434, -7615756, 6315924, 14586788, 12112081, 6080434, 2413489, -925266, -5091281, -5337658, 178279, 4645566, 1817027, -4649755, -7092890, -4936195, -3797465, -6035304, -8021929, -6242718, -1585774, 2983543, 6180550, 9023228, 12931872, 17570687, 20592470, 20194266]
7258B0194266k706540k663334k443150l570737l873980j256262K140989K914197
7250H735449J275714m30323j838543l685649n001817m585811l058023n87454M050689
7241e125768Q927233Q233759R25260n053948l576711o6611k091455n386317o74667
7232c889225Q512073Q621150k280881r491268l135492P490312Q527882P33357
7224A5087908n098045m739365k535166j018348J580659M694693M587291P80421
7216A3340048k667820l114566k020711j157943j38480J323669J739479k67104
7208G036572l816404o053808m317558R77002N307411M005300j811172n781587
7200d454244m128474j2770J826663J419766J476954J890032M58496k369927l398527
$$ y = [20194266, 17487726, 14824392, 12381242, 8810505, 4936525, 3680263, 5821252, 8735449, 10011163, 9580840, 7742297, 4056648, -945169, -5530980, -8589003, -9176457, -5125768, 3801465, 12035224, 12960484, 7906536, 4329825, 4263214, 2171759, -3214558, -3889225, 4622848, 13243998, 10963117, 1471849, -1663643, 5826669, 14354551, 15087908, 9989863, 5250498, 2715332, 1696984, 3277643, 7972336, 12559627, 13340048, 10672228, 7557662, 5536951, 4379008, 4240528, 5564197, 7303676, 7036572, 3220168, -2833640, -7151198, -6174196, -866785, 3138515, 1327343, -4454244, -8582718, -8595488, -6768825, -5349059, -3872105, -1982073, -1523577, -3893504, -7292031]
7191g292031r95152L179282O233474N868680J520548l932386n195984l35985N587116
7182D637562N871748N05405m138418l758701q39148k8800j768560k625549o62481
7173b806942J872727J868963l343n0024K679809M036388N75066m443958m910159
7164a181473p47695K035912N57254j086334J069730N135234P630325Q645969R000458
7155C1059380O498286l85847q046007j1207968q714687k977805L073921N623701
7147A4922974J266331o939226r604255k851827M732131L794897j987126k688088
7139F45811J242405M98667o055768q279694j162934O948350P511178L639693K313118
7130G300826K601830l68202n068834n590558j423912K031211J770207J82686K5067
$$ y = [-7292031, -8287183, -5107901, 1125573, 6994253, 8514801, 4582415, -613569, -949554, 4637562, 10509310, 11014715, 6876297, 3117596, 2278448, 2249648, 481088, -2144461, -2806942, -934215, 934748, 931405, 881381, 3561190, 7597578, 8172644, 3728686, -1181473, -1929168, 106744, 663998, -422336, 647394, 5782628, 13412953, 22058922, 31059380, 37557666, 37171819, 29125812, 17917844, 9203157, 6225352, 9299273, 14922974, 16189305, 9250079, -354176, -3206003, 1526128, 5321025, 3333899, 645811, 1888216, 2386883, -3668885, -11948579, -13111513, -6163163, 1348015, 4987708, 7300826, 9902656, 9534454, 4465620, -1124938, -2548850, -517639, 1252568, 1435254, 1460321]
7121A460321J105136K159801K429336J115887k013323n333724o538619m907599
7113a0522784j370466K513686M621308L296761m8527j372381J089633M288051
7105B495281M543871K007531j128705m148543o492666n385026R63676Q639745
7097A495164J0637004M880855l050540o111154l040669J272013J776603j071814
7089F787462k160234J236378M694081J797993o314710j0870918o546478J528579
7081i847847M931941K645017M23359J747747M117895L888524R69256j808414j847266
7072E220212O67003K228919o19158o084842p750663k686757L779020M649624J91839
7063d04803l539485l008512K39504L580335N214614L347213j680372n303048l595113
$$ y = [1460321, 2565457, 4725258, 7154594, 8270481, 6257158, 923434, -5615185, -10522784, -11893250, -9379564, -4758256, -1461495, -1510022, -2882403, -1792770, 2495281, 7039152, 9046683, 7917978, 3769435, -2723231, -8108257, -7144581, 1495164, 12132168, 17013023, 13962483, 7851329, 4810660, 6082673, 7859276, 6787462, 4627228, 5863606, 10557687, 12355680, 6040970, -4829948, -11376426, -9847847, -4915906, -2270889, -1847530, -99783, 4018112, 7906636, 8875892, 7067478, 5220212, 5887215, 8116134, 7496976, 1412134, -6338529, -9025286, -5246266, -596642, -404803, -3944288, -6952800, -6713296, -3132961, 2081653, 5428866, 3748494, -1554554, -5149667]
7054e149667P23692K317700J943477M383905Q142984N677026l891925j0693195
7046C453997p505699l32804P34293l932976n480794k34790O121820P571668M660575
7037E055290J371311k30638o90130j482231l665324o261990o111646j621129L800597
7028i835890M946846J544372j065086J328825O652049R098541N446186j690159
7020A6425684o086806l773184K361728M948468O30395n532049o672444l246574
7012i44782j480396l633356n089235k237144J868189K617882O63271k91770L7900
7003h489441j353370n063089p753645o803042l477142m27694J787555M188718
6995b7391150O553105O877375M056866K01449j085915Q38807K549822J561319
$$ y = [-5149667, -4425975, -2108275, -164798, 4219107, 12362091, 18039117, 14147192, 3453997, -4051702, -4384506, -3650213, -7583189, -13063983, -13298773, -7176953, 394715, 5055290, 6426601, 6195963, 5505833, 4023602, 358278, -5903712, -12015358, -13636487, -9835890, -4889044, -3344672, -4409758, -3080933, 3571116, 12669657, 18115843, 16425684, 10338878, 6565694, 8927422, 13875890, 14506285, 8974236, 2301792, -944782, -2425178, -6058534, -11147769, -13384913, -11516724, -8898842, -8235571, -8527341, -8489441, -9842811, -14905900, -22659545, -29462587, -32939729, -33367423, -31579868, -27391150, -20838045, -13960670, -9903804, -9702355, -10788270, -9949463, -7399641, -5838322]
6987e838322P21170M076772R131330Q548226J151081m547993j914983L770237
6979A5097518L094484l357003o745700m280440k404433m480796m962096j66508
6971h204974L810470Q98357m045540k890131J929245J486270l809983l820292
6963a4646578M350007R934235M418936m789891m704826M480698J0264017O006043
6955A5312641p90000o39010M604567N804842K25234n195458m350190k55693K08550
6946A4925483l641392o274832m821155k447790j766715m88047K941913M323548
6938B751013j57403o115311n980845k78094L142984R35794j979968j605732l65175
6929i652737p20619l26785K345420L684736J141660j556733p62278L43712k562836
$$ y = [-5838322, -5117152, -1040380, 8090950, 16639176, 17790257, 13242264, 11327281, 15097518, 18192002, 14834999, 8089299, 3808859, 1404426, -3076370, -8038466, -8204974, -4394504, -3496147, -7541687, -10431818, -8502573, -7016303, -10826286, -14646578, -10296571, -362336, 4056600, -733291, -5438117, -957419, 9306598, 15312641, 14522641, 13883631, 18488198, 24293040, 24518274, 19322816, 14972626, 14716933, 14925483, 11284091, 5009259, 188104, -2259686, -4026401, -4514448, -1572535, 2751013, 2593610, -3521701, -9502546, -9780640, -6637656, -5701862, -7681830, -9287562, -9652737, -10373356, -10700141, -8354721, -4669985, -3528325, -5085058, -5847336, -5503624, -8066460]
6920h066460o618989n939191j182363J912989J516372N88616N13075O86175L085627
6911a3504149R776943J6216764J4721039N555257k486172l986462k574784k854826
6903B0863610l708070k851541j878672k637656l314555k026591m65963n87400
6895C393162j210896r18619q80694k084617l188519l403158l630739k765272K093070
6886a2596282Q925695J0074602K655570n535624n908522l79250L083374K119033
6878B438596M21420l28777j530324k297231k38872K863406K596202r11642l145762
6869a32984k385740j026784L1799K211758M263765K770282j491756l785747l026511
6860b571918k823314l650890j148770N136823Q561746N168920K89742J94141K681937
$$ y = [-8066460, -14685449, -20624640, -21807003, -19894014, -18377642, -17789026, -17275951, -16589776, -13504149, -3727206, 12489558, 27210597, 32765854, 30279682, 26293220, 23718436, 20863610, 17155540, 14303999, 12425327, 9787671, 6473116, 4446525, 3980562, 3393162, 2182266, 1263647, 382953, -1701664, -4890183, -8293341, -11924080, -14689352, -12596282, -3670587, 6404015, 9059585, 3523961, -2384561, -2763811, 319563, 2438596, 2860016, 2531239, 1000915, -1296316, -1535188, 1328218, 3924420, 3012778, -132984, -2518724, -3545508, -3513709, -1301951, 2961814, 5732096, 4240340, 454593, -2571918, -5395232, -9046122, -10194892, -5058069, 3503677, 8672597, 8962339, 9156480, 11838417]
6851A1838417K027690j198489k013505K82238J961191J546905M14973j842981
6843A3016439o345741r983563p991697j679337K480325K218672J931114M444812
6835a908976O544367N340944L377019L546129L602305K87201m497791o321454
6827I969744m655292k360311p03650Q61078J616472P36286L04917K662243N605429
6818A4036916M938369J224052j081782r97805j754048l686334l029253K47416
6810I897531M67025m070306o336987j361615M392399K428682l604297l140763
6802a328331L919772O350492m05341o496940l021564M215627M201505k474086
6794D961134n785400k211348J132322j345748n679092n281720m1521N150446P055232
$$ y = [11838417, 13866107, 12667618, 10654113, 10936351, 12897542, 14444447, 14859420, 13016439, 6670698, -3312865, -11304562, -12983899, -10503574, -8284902, -6353788, -1908976, 4635391, 9976335, 13353354, 16899483, 20501788, 20788989, 16291198, 9969744, 5314452, 2954141, 2250491, 3111569, 4728041, 5464327, 5769244, 8431487, 14036916, 18975285, 20199337, 19117555, 18119750, 16365702, 12679368, 9650115, 9897531, 10364556, 6294250, -42737, -1404352, 2988047, 5416729, 1812432, -1328331, 2591441, 8941933, 8536592, 2039652, -981912, 3233715, 7435220, 4961134, -824266, -3035614, -1903292, -3249040, -8928132, -14209852, -14251373, -9100927, -2045695]
6785b045695N667680J900576k468292l975079m73236M967692O427966K514313
6777A2515925j300554J54084M239985L695265l005727q747435p179170j268597
6769h96224J348210j009159l163903j756521R28607K435039L659171M827419L362823
6760I735462r79169l705979k436594j664665n362697q542887l059983R594333
6752f422179J8069370J4431006K579495p544472r944088n806594n95203O67737
6744E435072k227674m359539j720148L128149M371281R93657k315402j930853
6736A374543J014622L617336L883485N57517n343093q781774n372754J656131
6728g393987M303892O20005k764751o81719L634262M511593J671741j487486l231432
$$ y = [-2045695, 3621985, 5522561, 3054269, -920810, -1394046, 3573646, 10001612, 12515925, 11215371, 11369455, 15609440, 19304705, 16298978, 7551543, 372373, -896224, 451986, -557173, -3721076, -5477597, -4548990, -2113951, 1545220, 6372639, 9735462, 8756293, 5050314, 2613720, 949055, -4413642, -12956529, -16016512, -6422179, 11647191, 26078197, 28657692, 21113220, 11169132, 5362538, 4767335, 5435072, 3207398, -1152141, -2872289, 255860, 4627141, 5620798, 3305396, 1374543, 2389165, 6006501, 9889986, 10447503, 5104410, -3677364, -9050118, -7393987, -3090095, -2470090, -5234841, -5916560, -2282298, 2229295, 3901036, 2413550, -817882]
6719h17882l414780j569005J487445L171006L030006L682821N429262M444660
6711A5443533l29091l455362q02586L393262K711214k002152n210071n358323
6703D390424m632857k957498P30575L243655O37705m036300l907170R53456L298954
6694b279056j78335m720397n762401m284107k017865J762842N942271O495326
6686e041722K992028L48640R08119Q69757j725741k165691K451355O115510K344792
6677G097047m837477o146705m44911M814663N016568K690275P48716j241272k996268
6668D700636k153876J046310K731921R10075k059700l601671l390716j107478
6660b924499L323727O379583L547790k936182n056614m51172L597468J657431
$$ y = [-817882, -4232662, -5801667, -4314222, -1143216, 1886790, 5569611, 10998873, 15443533, 15114442, 11659080, 10856494, 14249756, 16960970, 14958818, 9748747, 4390424, -242433, -3199931, -2469356, 774299, 1412004, -2624296, -6531466, -5578010, -2279056, -2457391, -7177788, -12940189, -17224296, -19242161, -17479319, -11537048, -5041722, -2049694, -1701054, -792935, 76822, -1648919, -3814610, -1363255, 4752255, 7097047, 2259570, -3887135, -4332046, 482617, 5499185, 8189460, 8938176, 7696904, 4700636, 2546760, 3593070, 6324991, 7235066, 5175366, 1573695, -1817021, -2924499, 399228, 6778811, 10326601, 7390419, 2333805, 1882633, 5480101, 7137532]
6652G137532j192108J501791N869593L925280k423284l798830J282074M024093
6644A6326141K5792l780520j301747K354330m55367p198019r271306n271706j871202
6635a0443604k526922l090457P8825L977297L922074O50112q78106J943086O343580
6626b4115P349457L063524l145646o014904m152104j072419K26762J207749M120237
6617A558541P040059O361223K593083o61950k573304n132674p569883o089437
6609d474342l97303M396487M463756J785638m8575n89538p29749q4746R43682
6600E265310M0468k923889l977977p20149L159485K920572l46170k135059j602063
6591c19472j589663l051015m112338l934292l186422j262328K614807N864524
$$ y = [7137532, 5945424, 7447215, 13316808, 17242088, 14818804, 11019974, 12302048, 16326141, 16351933, 12571413, 11269666, 13623996, 13168629, 5970610, -3300696, -8572402, -10443604, -12970526, -16060983, -15982158, -12004861, -8082787, -7432675, -8310781, -6367695, -24115, 7325342, 10388866, 7243220, 1228316, -2923788, -3996207, -3769445, -2561696, 1558541, 8598600, 14959823, 17552906, 16890956, 14317652, 9184978, 1615095, -4474342, -4871645, -475158, 3988598, 5774236, 5725661, 5136123, 4406374, 4321628, 5265310, 5305778, 2381889, -1596088, -2316237, 843248, 3763820, 3417650, 1282591, -319472, -1909135, -4960150, -9072488, -13006780, -16193202, -17455530, -14840723, -8976199]
6583h976199M832086J015274L56471N007392R928725R603151M677084k82295k748550
6574B3413139l426891l551243l503652l058145j361364K176291N714579N425232
6566B1827946J11996n865351o831162k734770N83619j227809n552215o623919
6558f311665l588224j594869l993919o658425l436889M223224P735974K494668
6550a1130125n504279o812662L45526R098915J2341388R048600L136287r97891
6542I525759j667393n26337l02432j416877j807382m35051J128151J513516J326886
6533G338840P23330j610241m920475n389476j839004R74557j176474n163584m743525
6524a5806052P41938O640271R737946R700505N980183r12739o551236o872362
$$ y = [-8976199, -4144113, -3128839, -2772368, 2235024, 12163749, 21766900, 26443984, 26161689, 23413139, 19986248, 16435005, 12931353, 9873208, 8511844, 10688135, 16402714, 21827946, 21939942, 16074591, 9243429, 6508659, 7092278, 5864469, 312254, -6311665, -9899889, -11494758, -15488677, -22147102, -25583991, -21360767, -13624793, -11130125, -16634404, -23447066, -23101540, -14002625, -1661237, 7387363, 10523650, 9525759, 7858366, 7332029, 7029597, 5612720, 3805338, 3370287, 4498438, 6011954, 7338840, 8062170, 6451929, 1531454, -3858022, -5697026, -4722469, -5898943, -11062527, -15806052, -15064114, -8423843, 1314103, 11014608, 16994791, 16082052, 9530816, 2658454]
6516B658454m153576l047874k492718J550684O880346O924166J681828j877807
6508H123503j274778j436513m205290m244434Q92058N241015L818021K8305j262682
6499E679205r82437j086766L33095L511205L542259j308318m618147j835797J653082
6490D887381O7441k366101J96595L183810p54590p250398o086764J438731M394294
6481b289601O07197n10721M855415Q226156L535328l216713m900766l848669m687871
6472b230245n164598j956600J092499j067234n176392m233549J430759N146005
6464a2159355M151852J954971J204280M75485j483930l438750m505685n372065
6456a9173197n839222m381980q93606K856713N943968Q679177R806745O623275
$$ y = [2658454, -1495122, -4542996, -7035714, -5485030, 1395316, 8319482, 10001310, 8123503, 6848725, 5412212, 1206922, -3037512, -2145454, 3095561, 6913582, 6941887, 5679205, 4696768, 3610002, 3943097, 7454302, 10996561, 9688243, 5070096, 3234299, 4887381, 4954822, 2588721, 2785316, 5969126, 5214536, -2035862, -8122626, -6683895, -2289601, -1682404, -2193125, 2662290, 10888446, 14423774, 11207061, 6306295, 2457626, -2230245, -7394843, -9351443, -8258944, -9326178, -14502570, -18736119, -17305360, -12159355, -8007503, -6052532, -4848252, -4372767, -5856697, -9295447, -13801132, -19173197, -25012419, -29394399, -30288005, -27431292, -21487324, -12808147, -3001402, 3621873]
6448C621873m11276o009335n869918k559557k087242m929846m749235K007389
6440b0987147R311769Q946444K384934j028287K168182M827444J069479m172855
6432B519963l242970K012289L677461J52837l104971l626802m139708m766837
6424a0518738j830204L719959N004711k34813n029783l364688J386651L011025
6416g855880J761099J553497K475851K057674P18854L50171N5282j579834k495002
6407b958288n53297J547442K75082j999768m22303L582100L734685q35215l492147
6398a121709k6291N129472N671735K034958n93868k22674K8557k561003n993722
6389B345455n956667j528184K918847K355577k794233o723385m841473J372379
$$ y = [3621873, 3210597, -2798738, -8668656, -11228213, -13315455, -18245301, -22994536, -20987147, -11675378, -2728934, -344000, -1372287, 795895, 5623339, 6692818, 2519963, -723007, 1289282, 4966743, 5119580, 2014609, -1612193, -5751901, -10518738, -12348942, -8628983, -3624272, -3859085, -8888868, -12253556, -10866905, -7855880, -6094781, -4541284, -2065433, -7759, 711095, 1061266, 1116548, -463286, -2958288, -3511585, -1964143, -1689061, -3688829, -4111132, -529032, 3205653, 2370438, -1121709, -1148000, 3981472, 9653207, 11688165, 11094297, 10871623, 10900180, 8339177, 2345455, -3611212, -5139396, -2220549, 135028, -2659205, -9382590, -14224063, -12851684]
6381a2851684O975798R043619P938468M942161J012355k851090n792935p187018
6373A229674n877926j125316M629664O613148L541276N8509N06051K725477J779828
6364A4080385k170381m278082k431374L17047Q84255l08224j512914j903081j031906
6355A645725Q45605J554612o49484l232994j662605L602080O411644L058683k544569
6346I028697m508180k882802k518864n550085q454459o649046K63696Q288427
6338a2982616J2662313J1254909N516242q23074m071904k919607J87377N15418
6330I339058m072726r441471q901446j684016N162225N402041J176432j183734
6322d203637n7021J215041R83541P82989P98923o22261k542487j860185Q71328
$$ y = [-12851684, -5875886, 3167733, 11106201, 16048362, 17060717, 14209627, 8416692, 1229674, -4648252, -5773568, -1143904, 5469244, 9010520, 9069029, 9575080, 12300557, 14080385, 11910004, 7631922, 5200548, 5517595, 6401850, 6093626, 4580712, 2677631, 1645725, 2491330, 4045942, 3396458, 163464, -1499141, 2102939, 8514583, 11573266, 9028697, 4520517, 1637715, -881149, -6431234, -14885693, -21534739, -21271043, -12982616, -320303, 10934606, 16450848, 15627774, 11555870, 8636263, 8823640, 9339058, 5266332, -4175139, -13076585, -14760601, -9598376, -4196335, -3019903, -4203637, -4260658, -3045617, -2062076, -1279087, -480164, -1102425, -3644912, -5505097, -4633769]
6313d633769J481456m18478O0962M345947O029789l3877q797655j0987142n355194
6304a8307961P48351J732555p18010k284870j310189J404871M349344N648945
6296h736964M253751J537410l02961j360374l066250m490446l068175M72983J832542
6287a2928484l72399j502554K393090P420466O129686j546565o660148k531255
6279i598163O171063R231451L636858l801045n997984l047847R41321L663825
6271A199479M288822J334368m568727q256327n417333Q70843L926050K692255
6263c930570J472589J121388k051512p126066o501606K552862J1219654J0376778
6255G133517L260645m74058O70291J42827l900516n559419j979436J545537M99251
$$ y = [-4633769, -3152313, -3570791, -3509829, 836118, 6865907, 6832030, -1965625, -12952767, -18307961, -17559610, -15827055, -16545065, -18829935, -20140124, -18735253, -14385909, -8736964, -4483213, -2945803, -3248764, -4609138, -7675388, -12165834, -15234009, -14761026, -12928484, -13300883, -14803437, -12410347, -4989881, 1139805, -406760, -7066908, -9598163, -3427100, 5804351, 9441209, 5640164, -357820, -3405667, -2464346, 1199479, 5488301, 6822669, 2253942, -6002385, -11419718, -10548875, -6622825, -3930570, -2457981, -1336593, -3388105, -10514171, -17015777, -14462915, -3243261, 7133517, 10394162, 9920104, 10590395, 10733222, 6832706, 1273287, -706149, 839388, 1338639]
6246A338639j974963j479146K05978n51361j856483N82186N338325O441608K180584
6237A0225367k571470l504860j929098j211913j778292j932497j207211k72773
6229d182747J175695L816230O298457N914958K389677r98673j606691j261214
6221A1545692l466592p405295q165022m046744j0715p28794l063819m06754O628002
6212i120041R897737N397730o43114p21456L792936O330636N117853L291843J411752
6203B4755876k715303o952531n449263J477046N376703J631037l204020j835225
6195A3084320J799821p13521p175707o742078K866564J0307251O406348l386446
6187A6446552p988918n585340k451444j426862K45123L309484M474630K448955
$$ y = [1338639, -636324, -2115470, -1909492, -2460853, -4317336, -3735150, 1603175, 8044783, 10225367, 7653897, 4149037, 2219939, 1008026, -770266, -2702763, -3909974, -4182747, -3007052, 809178, 7107635, 13022593, 15412270, 14413597, 12806906, 11545692, 8079100, 673805, -7491217, -11537961, -11548676, -12277470, -15341289, -15748043, -9120041, 777696, 6175426, 5532312, 4810856, 8603792, 14934428, 20052281, 23344124, 24755876, 22040573, 15088042, 9638779, 11115825, 16492528, 18123565, 14919545, 13084320, 14884141, 14170620, 6994913, 252835, 3119399, 13426650, 19832998, 16446552, 8457634, 2872294, 420850, -1006012, -760889, 2548595, 7023225, 9472180]
6179I472180r1830j444108k545423k942218n22373L251908L207574j927252o325630
6170A32828m476637J787549O435336O214725K088580k945421n022523j944400
6162B270037K837594K554443l747532q736103o864918j842974P11374K479287
6154a0338792P145404J0626042O218679k584120m890599J370711O087853K435689
6146A6070867l743152m507835j315588K46495L27805J966544L302125O61139l333739
6137I674661k503679K857248N433698R47401o340418r148144m744867L222535
6129f01565P795632M381433l931422q246044l991426L173969N288080K642950
6121F511607Q47631M86723k312652o217564m858304J930598N986022L176845n02377
$$ y = [9472180, 9380350, 7936242, 5390819, 2448601, 1926228, 5178136, 8385710, 6458458, 132828, -4343809, -2556260, 3879076, 10093801, 12182381, 9236960, 4214437, 2270037, 5107631, 7662074, 3914542, -4821561, -11686479, -13529453, -12818079, -10338792, -3193388, 7432654, 13651333, 11067213, 6176614, 7547325, 13635178, 16070867, 12327715, 7819880, 6504292, 6750787, 7078592, 9045136, 12347261, 13008400, 9674661, 7170982, 10028230, 15461928, 16409329, 10068911, 920767, -3824100, -601565, 7194067, 11575500, 7644078, -601966, -4593392, -1419423, 3868657, 6511607, 7359238, 7845961, 5533309, -684255, -5542559, -3611961, 2374061, 5550906, 5048529]
6112E048529J57790P71787l718453q307828n064049L442771P397362M270991P80561
6103D779461R59470J629586Q98111K004800N534351N987750R00895l507013j750640
6094A7436771J463793j595169q826478j0755770m669103J665000J720721j079366
6086d639601L09529O132938R937100P030979n13766o641053p001336k401610J971020
6077D184200J349291l475299o603942l791245K185298M641675J110822l638378
6069d037578l435566J795059N874351L652607k869314o829260m547203M04054
6061i992850K112217j89057j895738p1863K256864N69923m392462p146177m349264
6052b3098407J428949N426326N986528M819954L682855K888158K453526K524818
$$ y = [5048529, 5206319, 5978106, 2259653, -6048175, -11112224, -7669453, -272091, 3998900, 4779461, 5738931, 7368517, 8266628, 10271428, 15805779, 21793529, 22694424, 19187411, 17436771, 18900564, 17305395, 8478917, -2276853, -6945956, -5280956, -3560235, -4639601, -4330072, 1802866, 11739966, 18770945, 18257179, 11616126, 4614790, 2213180, 4184200, 5533491, 2058192, -4545750, -8336995, -6151697, -1510022, -399200, -4037578, -7473144, -5678085, 196266, 3848873, 979559, -5849701, -10396904, -9992850, -7880633, -8069690, -9965428, -10037291, -7780427, -7210504, -11602966, -18749143, -23098407, -21669458, -16243132, -10256604, -5436650, -1753795, 1134363, 3587889, 6112707]
6044F112707K374594P92921j812812l277262k630117j600509j602931q21550K961716
6035D96757P366975O932355O48943n484585n920195k887450k669890o131884p518935
6026a5167909l093593L328185N544114K638329j141209k163047k92955K739194
6018g608891M988191M752289J924804j068493j711573o77437n88630j724429j683601
6009c397770K35707J344767l10034k837984l671479l510947m213084m483070j397877
6000b2241771M257403P971602P444465N160084L880638K947026J097318j85402
5992A0331363P19698J898559N78669j918688k054816l60327j170619n240604p320191
5983d536956l597081K239875L991438J485280o1520J852818L784861J798020l095012
$$ y = [6112707, 8487301, 9280222, 7467410, 4190148, 1560031, -40478, -1643409, -2464959, 496757, 7863732, 14796087, 15445030, 9960445, 4040250, 1152800, -1517090, -7648974, -15167909, -18261502, -14933317, -9389203, -6750874, -7892083, -10055130, -10348085, -7608891, -2620700, 2131589, 4056393, 2987900, 1276327, 598890, 10260, -1714169, -3397770, -3162063, -1817296, -2127330, -4965314, -8636793, -12147740, -16360824, -20843894, -22241771, -17984368, -10012766, -2568301, 2591783, 6472421, 9419447, 10516765, 10331363, 11051061, 12949620, 13528289, 11609601, 9554785, 9194458, 8023839, 2783235, -4536956, -8134037, -5894162, -1902724, -417444, -478964, 1373854, 5158715, 6956735, 3861723]
5974C861723o422576n419463j449669J895447K433092J390818J612738L623881
5966A525991M732767K935150n6244j503650j515933j433748m0295M442672R047136
5957A8133846P649147p08191r187431j1117779p320024l049125p47347Q23454
5949e523450K321920K407577J17750l711532p007404p195880k919435L369377
5941a8141077O560306M811986K155202K519627L752419J592692k500607k924582
5933b174034J123023M075833K665851P24123K422099N207346L857452j054915
5925A6846778l687210j480914J137949r83539o566345r363399n892459N68736
5917i420403M417181M495227M313447N847601O163879K091158m080666o857447
$$ y = [3861723, -2560853, -7980316, -9429985, -7534538, -5101446, -3710628, -2097890, 1525991, 6258758, 9193908, 9137664, 7634014, 6118081, 4684333, 4644038, 9086710, 18133846, 25782993, 25074802, 15887371, 4769592, -2550432, -5599557, -6346904, -5523450, -3201530, -793953, -676203, -4387735, -11395139, -18591019, -21510454, -18141077, -11580771, -6768785, -4613583, -2093956, 1658463, 3251155, 750548, -2174034, -1051011, 3024822, 5690673, 6414796, 8836895, 14044241, 17901693, 16846778, 13159568, 11678654, 12816603, 11833064, 5266719, -4096680, -9989139, -9420403, -5003222, -507995, 3805452, 9653053, 15816932, 17908090, 13827424, 6969977]
5909F969977m613643r45662J003733J856941K675637K103382p72924l498529l240081
5900A538831j057006j98114j152195j518027n45399n27277k663750m253186k174297
5891a2550420K249567M479879K793935M72822O95486J653065k44829l559567k717785
5882f727847L329242Q045805O003252O11358j496493n60564j784498n028662m269369
5873a877776J663427N504701J924456m953761q402878p561176m391220J673238
5865a6420989R422847J1530623L246826p566452q542091r8599M928764j5991o525771
5856a0040833m775693K871360P531821O478082L319743O5985l617448n554118
5848c721101k581116L266863N814327K723262j955758l954503l538478k834798
$$ y = [6969977, 2356334, 1410672, 2414405, 4271346, 6946983, 9050365, 8277441, 4778912, 1538831, 481825, 283711, -868484, -2386511, -2931910, -3459187, -6122937, -10376123, -12550420, -10300853, -5820974, -3027039, -2554217, -1858731, -205666, -450495, -4010062, -6727847, -3398605, 4647200, 10650452, 11261810, 9765317, 9204753, 7420255, 2391593, -1877776, -214349, 5290352, 7214808, 2261047, -6141831, -13703007, -18094227, -16420989, -6998142, 4532481, 7779307, 212855, -8329236, -8427835, -3499071, -3515062, -10040833, -14816526, -11945166, -4413345, 2064737, 5384480, 5450465, 1833017, -3721101, -6302217, -3035354, 2778973, 5502235, 3546477, -408026, -3946504, -6781302]
5840f781302j860213O39498M299740P012651P040389M300780q1879m930454r389981
5831B49229j1835922r430383j203972Q198036J1339569O645800J105475J275991
5823F343823M577250L864566j703983o011787n343735k448177p23693j03070k21503
5814a770309k123292m385369k731717L257218P693221O310608K516657J397215
5806A0164232K017325Q54769r81134l04621J124738r10531n104063o217258l946777
5797c303320k811965l117984j84700N763931P402926J690719m298342m124805
5789b983540j601322k958438n378945k015941N124987O812671M52081o236092
5781h784539o540355k454608R91152K610844L250076K429367M27237k34302J223241
$$ y = [-6781302, -8641515, -8002017, -3702277, 3310374, 10350763, 14651543, 14569664, 9639210, 249229, -11586693, -21017076, -22221048, -14023012, -2683443, 3962357, 5067832, 6343823, 10921073, 14785639, 13081656, 7069869, 1726134, -722043, -1445736, -1548806, -1770309, -3893601, -8278970, -11010687, -7753469, -60248, 6250360, 8767017, 10164232, 12181557, 13036326, 12055192, 11750571, 12875309, 11964778, 6860715, 643457, -3303320, -6115285, -9233269, -9417969, -3654038, 3748888, 5439607, 1141265, -2983540, -4584862, -7543300, -12922245, -14938186, -9813199, -3000528, -2548447, -8784539, -15324894, -17779502, -16788350, -14177506, -10927430, -8498063, -8070826, -8305128, -7081887]
5772g081887J655620r66117l383354j526569L156150N575751L722846Q4947k571244
5763a333857l417473k081929J560513N481859O061610J944683l890136o890329
5755b565059n296316j450828Q35489j3792k253624l343856k802162j623136K55294
5746a8257990L653842P169707P203635K539908k986414m409485j239674K516007
5738c810464L213077Q93241j853409k924546k285335r34940J225179N182958R426633
5729H132394Q835612N48853r763848j2461685o073202K36082p20142m202607j408750
5720a6877293O659207J0448831N819704q06770k799304k121522l846248o583935
5712a0107330m163904M244625J0867983Q244510j021374o486134k190478N865977
$$ y = [-7081887, -5426267, -6392384, -9775738, -11302307, -8146157, -2570406, 1152440, 1237387, -1333857, -4751330, -6833259, -5272746, 209113, 6270723, 8215406, 4325270, -2565059, -7861375, -9312203, -8476714, -8490506, -10744130, -14087986, -16890148, -18513284, -18257990, -14604148, -7434441, -230806, 2309102, -677312, -5086797, -6326471, -3810464, -597387, 295854, -1557555, -4482101, -6767436, -7702376, -6477197, -1294239, 8132394, 16968006, 17516859, 7753011, -4708674, -10781876, -10545794, -11265936, -15468543, -16877293, -10218086, 230745, 6050449, 5243679, 2444375, 322853, -3523395, -10107330, -14271234, -10026609, 841374, 9085884, 8064510, 1578376, -612102, 5253875]
5704E253875P086188l41502p680964p789863l806219k546167m019984l164248
5696a7008884Q89821L970553M259741L793533K462276k352964q463093q387295
5688b0836312J5907Q331545P943210J229728k835473r41666K335043K509898k54810
5679b502930l905950o777254o753873k235805N065853J0918009J2586142J0192127
5671A6586319M847265j757464o366883o045879j667458K727302M376289L796585
5663A6496076K651293J813694J407157P50749j372350m503647n688321l528679
5655H025972j667463m299252q915954q404006j049021O447082P743736M152427
5647B033521O46446j063993j861015j283129J147028K941311J592039r00051q56504
$$ y = [5253875, 12340063, 11998561, 4317597, -3472266, -7278485, -9824652, -13844636, -17008884, -16119063, -12148510, -7888769, -4095236, -1632960, -3985924, -12449017, -20836312, -20820405, -12488860, -4545650, -3315922, -6151395, -7093061, -4758018, -2248120, -2502930, -6408880, -13186134, -19940007, -22175812, -17109959, -6191950, 6394192, 16586319, 21433584, 19676120, 13309237, 7263358, 5595900, 8323202, 12699491, 16496076, 19147369, 20961063, 22368220, 23118969, 21746619, 17242972, 11554651, 8025972, 6358509, 2059257, -6856697, -15260703, -16309724, -9862642, -2118906, 2033521, 2679967, 1615974, -245041, -1528170, -381142, 2560169, 4152208, 3252157, 2395653]
5638B395653P63414l32446m341683o215538k964929K248855M968550M588295K817156
5629C927327P08248m64233J040851L851061L042146l016411q399810o785681m91661
5620f588163L070620K413023K887506O437593P569716K263716n041887p509000
5612E503124m625019n74132K505394M889489N686896L994679J936786J891729
5604B1208946K181155O2345k726711k617628q15051j192354k742944j305838J387654
5595A3439574j124093q061126r659753j803502N924515L470501n093598q282017
5587a1189499l694620J123590J582482O74426J233940J828726J364994J094107
5579e981854R45088l19449p72303K673427P323917O635239N89697k986642j44541
$$ y = [2395653, 3159067, 2826621, -1515062, -7730600, -10695529, -8446674, -3478124, 1110171, 3927327, 4635575, 4171342, 5212193, 9063254, 12105400, 9088989, 689179, -6096502, -6588163, -3517543, -1104520, 1782986, 8220579, 15790295, 18054011, 13012124, 5503124, 878105, 303973, 2809367, 7698856, 13385752, 17380431, 19317217, 21208946, 23390101, 23452446, 20725735, 18108107, 17293056, 16100702, 13357758, 12051920, 13439574, 12315481, 4254355, -5405398, -7208900, -1284385, 2186116, -2907482, -11189499, -14884119, -13760529, -12178047, -11503621, -10269681, -8440955, -7075961, -5981854, -5036766, -5356215, -6128518, -3455091, 3868826, 10504065, 11093762, 8107120, 7962579]
5570G962579L128080M89618n368002p788852n476345j655386J695782L592281
5562c420245J935591k960071o104448m367944j892453l350402n402459j845685
5554b7408116N360685Q118697M230121l29945j180949J4030J639248M878315Q287246
5545C609332P054887J043160l001001j280809J038245j500511n402673l814221
5537b253591K377517N609801K118519m245913p863820o401765p63668N683491
5529e739429Q202928M899957k65125j884389O7720J158053n74900k652634l005631
5520B06550k668245k864999k907639k085823q61703O51535K827280M538834L695597
5511E31387M98454k260373k681983j195291J489863M735537O033725K622637l591665
$$ y = [7962579, 11090659, 11580277, 6212275, -1576577, -7052922, -8708308, -7012526, -3420245, -1484654, -4444725, -10549173, -14917117, -16809570, -20159972, -25562431, -27408116, -22047431, -13928734, -9698613, -10028558, -11209507, -11195477, -9556229, -4677914, 3609332, 10664219, 11707379, 8706378, 7425569, 8463814, 6963303, 1560630, -2253591, 123926, 5733727, 7852246, 3606333, -4257487, -10659252, -11422920, -5739429, 2463499, 7363456, 7098331, 5213942, 5281662, 6439715, 5864815, 3212181, 206550, -2461695, -5326694, -8234333, -10320156, -11181859, -10530324, -7703044, -3164210, 531387, 1029841, -1230532, -3912515, -5107806, -3617943, 1117594, 7151319, 9773956, 6182291]
5502F182291o437108k975124K444669L958079J247464j757253k675745j997596
5494b010323l87161J919207L650859L196669P70136j775666k975412k498171p98531
5485i08393P92781P30116q16065j857498j318193k03999Q62443K876901N637705
5476E795798O334357L389378n06670j908197j202543q91262j329026j464075k018057
5467F199703m138968o085595n090440j803737P09664J688495K711112L655254
5459b154512K567759n62607l478723m847442m443002j222340M457919P819240
5451a863708M494775j751775k506507K959669N548626o39639r326446j0530072
5443a3615077l412735M266582O492630M108870J305153Q40328K202485K624023
$$ y = [6182291, -254817, -3229941, -785272, 3172807, 4420271, 2663018, -12727, -2010323, -2397484, -478277, 3172582, 6369251, 7139387, 5363721, 2388309, -109862, -908393, -115612, 614504, -201561, -2059059, -3377252, -3581251, -2718808, 158093, 5795798, 12130155, 15519533, 15012863, 13104666, 11902123, 11010861, 9681835, 8217760, 6199703, 2060735, -4024860, -9115300, -10919037, -10209373, -8520878, -5809766, -2154512, 413247, -149360, -3628083, -8475525, -12918527, -14140867, -9682948, -1863708, 2631067, 879292, -1627215, 1332454, 6881080, 6241441, -3085005, -13615077, -17027812, -12761230, -6268600, -2159730, -854577, -14249, 2188236, 4812259]
5435D812259Q08394m53882J571197L292632j599723j1046172j4271250o187961
5427b3074506M790344Q651597O845549O490277P700234N799577J843384P46897
5419A9793353J228460k135616p861885q999683n640210n039946p825041n717932
5411b2198500L242005Q782483M119479k609465j066149N448668O646122J504099
5403C868742k636791l079280l163314k971323O11112M961850L257220l635706
5395b787490o334617p86135N652489N722928J934663j65599j154211l652100m794382
5386f364454o24939N284644N606053N09140k282290Q20314M314983K482409k417499
5377G328361m351422k088786M90903O64837m61615j143676j602820k463133k574479
$$ y = [4812259, 5620653, 5166771, 6737968, 10030600, 8430877, -2615295, -16886545, -23074506, -18284162, -9632565, -2787016, 3703261, 11403495, 17203072, 19046456, 19793353, 21021813, 18886197, 11024312, 2024629, -3615581, -8655527, -16480568, -22198500, -18956495, -10174012, -6054533, -8663998, -9730147, -4281479, 2364643, 3868742, 1231951, -1847329, -5010643, -7981966, -7370854, -2409004, 848216, -2787490, -9122107, -9908242, -4255753, 1467175, 3401838, 3236239, 2082028, -1570072, -6364454, -6989393, -1704749, 3901304, 4410444, 2128154, 2948468, 7263451, 9745860, 7328361, 2976939, 888153, 1379056, 2043893, 1582278, 438602, -1164218, -3627351, -6201830]
5368f201830k44311L529058M726422P89423m946993n739780L30244O857799O453935
5359E553967p5031n485011o030149m845106m931013m296232q39668K661052K688734
5350a5598457P52283L88885J049680J27637r14299J567971O098430O936687K908888
5341C317705n70059L0482J442812k64583l638012n227540m828557l735492j352898
5332a4826142K576960N273333M373138J925291J480181L165652M680676M950767
5324A3599856L847631R11340k415802k250623K221390N683624L471805j558965
5316B3510256l846862l645847m624484n632111k442472L248687M477784m95889
5308A0549062n400763n238351k050057L69031J420641J188016j214983m181692
$$ y = [-6201830, -6446141, -2917083, 1809339, 2598762, -2348231, -8088011, -7757767, -899968, 5553967, 5478936, -6075, -6036224, -10881330, -15812343, -20108575, -20948243, -18287191, -15598457, -14846174, -14457289, -13407609, -13279972, -14194271, -12626300, -6527870, 408817, 3317705, 2747646, 2778128, 4220940, 3956357, 318345, -4909195, -9737752, -13473244, -14826142, -12249182, -6975849, -2602711, -677420, 802761, 3968413, 8649089, 13599856, 17447487, 18358827, 15943025, 13692402, 15913792, 21597416, 25069221, 23510256, 19663394, 16017547, 11393063, 5760952, 3318480, 6567167, 11044951, 10549062, 5148299, -90052, -2140109, -1771078, -350437, 837579, -377404, -4559096]
5300d559096l764523K11622L243254L409747L733346M937476K781869l406745
5292F586950o574343k146522L608858K450058l367240n341561k067678K22320
5284f629158j031142j450784J584266M544353M261797K881079L350807M319981
5276A1831199K727474j170638m075529l710718j088504O48244o57286l549182
5268I55060m138318j040520K222639J723443j348908k331443O06525M614111O275539
5259G538128N029676K498460M12170p41655k044244m320552n537757k576359L104091
5250C361958N318491J554453k519614j368446J545796m88397n788265o374912
5242d758936q09711L611755K710427J209744L630111O837568O255092L400914
$$ y = [-4559096, -8323619, -8111997, -4868743, -1458996, 2274350, 7211826, 9993695, 6586950, 12607, -2133915, 1474943, 3925001, 557761, -4783800, -6851478, -6629158, -7660300, -9111084, -7526818, -2982465, 1279332, 4160411, 7511218, 11831199, 14558673, 13388035, 9312506, 5601788, 4513284, 5161528, 4504242, 955060, -3183258, -4223778, -2001139, -277696, -1626604, -3958047, -3351522, 1262589, 7538128, 12567804, 15066264, 15478434, 14736779, 12692535, 8371983, 2834226, 257867, 3361958, 8680449, 10234902, 7715288, 6346842, 7892638, 7404241, 1615976, -4758936, -5568647, -1956892, 753535, 1963279, 5593390, 12430958, 18686050, 22086964]
5234B2086964J785399J67649l900481p235845m533692K554911O068591K009527
5226A9003023m691395o704565k521725L183887N281628L033274L7425l38560O63192
5217A6946184j022447n526872p177446k232694M176348L688865l389695p316319
5209a854076j679249P840760J0973657N813551m34078k180437j436928j984352
5201A5058848k622083k5912M464381N733151K189379k151056l856797m462598
5193A4327313o478643q218423n987997J33005N861581P414607M235659j982561
5185I304541q104463r997195n607181J737793N713620L655229r60719l113694
5177g372069j346281K192938M591960L960382J36239m870053p866231o938101
$$ y = [22086964, 23872363, 24040012, 20139531, 12903686, 8369994, 10924905, 16993496, 19003023, 14311628, 7607063, 5085338, 8269225, 13550853, 16584127, 16621552, 16282992, 16946184, 15923737, 10396865, 3219419, 986725, 5163073, 8851938, 5462243, -1854076, -3533325, 4307435, 15281092, 21094643, 20660565, 18480128, 17043200, 15058848, 12436765, 12410853, 16875234, 22608385, 24797764, 22646708, 18789911, 14327313, 7848670, -369753, -6357750, -6224745, -363164, 7051443, 11287102, 9304541, 1200078, -8797117, -14404298, -12666505, -6952885, -3297656, -4258375, -7372069, -8718350, -6525412, -1933452, 2026930, 2163169, -2706884, -10573115, -17511216]
5169a7511216k863771J867868N027827O095423O446285P513115Q222136N654473
5161B0452140o03999o569250q213886n985693k736083P05964M567977O679212
5153H296382M458696l99735l606769m188109m250693l529411J37555M630884M400498
5144E949298o34059l465599l69476L312504K044284j133491n19284K435461K368195
5135I987833j58335J05816L332188L875724k36449m195070m448422l414502l578952
5126A269831k910902o0084J103498k451941n941363k331908O430838J0379701
5118E487670M757421l448590n040129k08275L579241K362116p96904k112557j577549
5109C002444l15211J707648L117835N95745n597684q952010m185188M560918Q000186
$$ y = [-17511216, -20374987, -18507119, -13479292, -7383869, -937584, 6575531, 14797667, 20452140, 19848141, 13278891, 5065005, -920688, -3656771, -2950807, 1617170, 8296382, 12755078, 12355343, 8748574, 4560465, 309772, -3219639, -3082084, 1548800, 5949298, 5315239, 1849640, 1480164, 4792668, 6836952, 5703461, 5184177, 7619638, 9987833, 9829498, 9935314, 13267502, 17143226, 16906777, 12711707, 8263285, 4848783, 1269831, -1641071, -1701155, -597657, -3049598, -8990961, -11322869, -4892031, 5487670, 10245091, 6796501, 1756372, 1548097, 5127338, 7489454, 6692550, 4579993, 3002444, 2687233, 4394881, 7512716, 8108461, 2510777, -6441233, -10626421, -6065503, 1934683]
5100A934683L588930j765956j432673L116676N960648M532316J179870r63212
5092A6151282j308466j654167l646480o110530n693520j541753K187866J286096
5084c29672k376544l534515j455607l24484j696531k145433K36279K585469K892296
5075f148742L461180N416284M927789m57445n878533m984854R03314M589662K343012
5066D171667k949301o483956n333868P96731Q212364R984638K835247p254231
5058C979291j0724033n578952J247515L541202K360435K147471M367742O811433
5050H152104O629302K765357k694421n148134j773616M329421O727779K994737
5042B1982529k964050o524458p348792p282578o127006k522591K133390L865320
$$ y = [1934683, 5523613, 3757657, 2324984, 5441660, 11402308, 15934624, 17114494, 16151282, 14842816, 13188649, 9542169, 3431639, -2261881, -3803634, -1615768, -329672, -2706216, -6240731, -7696338, -8020822, -9717353, -11862786, -11626507, -9041038, -6148742, -2687562, 2728722, 7656511, 7199066, 1320533, -3664321, -2761007, 1828655, 4171667, 1222366, -5261590, -10595458, -9798727, -1586363, 8398275, 11233522, 3979291, -6744742, -12323694, -11076179, -7534977, -5174542, -3027071, 1340671, 8152104, 14781406, 17546763, 14852342, 9704208, 7930592, 12260013, 18987792, 21982529, 19018479, 12494021, 5145229, -2137349, -8264355, -10786946, -8653556, -4788236]
5034d788236R12849l609388n080920k412682J503640L651988L463837J669538
5026d689374j141872l775915m217398j892632J195297L060873L785606L474834
5018d200581Q60145l294900m259220R72042Q091546J0290157P006896K848654
5010A8314739l44313m012747o683978m771564J04781J907978p42086l256345l402379
5001b885914l164841j833268L386873Q511537N380628l958826p309257j367279
4993c240347K166179l558953q294087k665318M727663K097369m634565k293113
4985a5695172O205171P051956o45576m653196j270076R40802n36904J949131Q996182
4976B342318R721251J64271q596396p502832j961103j31457l97329J520330L018732
$$ y = [-4788236, -3875387, -7484775, -12565695, -14978377, -13474737, -9822749, -6358912, -4689374, -5831246, -9607161, -13824559, -15717191, -14521894, -11461021, -7675415, -4200581, -3340436, -6635336, -10894556, -9922514, -1830968, 8459189, 15466085, 18314739, 17970426, 13957679, 7273701, 2502137, 2606918, 4514896, 3772810, 516465, -2885914, -6050755, -7884023, -4497150, 4014387, 9395015, 5436189, -1873068, -3240347, -1074168, -4633121, -12927208, -15592526, -10864863, -8767494, -13402059, -15695172, -9490001, -2438045, -3083621, -7736817, -9006893, -8066091, -8602995, -6653864, 2342318, 12063569, 12227840, 3631444, -3871388, -5832491, -5963948, -6361277, -4840947, -1822215]
4967a822215Q51560r77817K130498O835302P141432L256602p70263l565424n338103
4958G741572m659659j131117K280571L063234J989038L27919j522425j778327
4950F310806R41271L131394K73621m521452l694722K176087M177456o42336m612148
4941C539977k377258J233497Q05852j189680p44704P50432R76406J100331J518532
4932E613385R213k602948k166913R74332J939134Q28190K818551P055019O468779
4923B0936742R86871j233610J352293R61756l760708m020204K075022M351845
4915B1650007j146199m932463k526484k734997q517038q279920K179834Q223505
4907C916245J035869n342180J591997J0062810N247497m227422k993494L644856
$$ y = [-1822215, -970655, -1948472, 182026, 7017328, 14158760, 17415362, 16645099, 13079675, 7741572, 3081913, 1950796, 4231367, 7294601, 9283639, 9611558, 8089133, 6310806, 7252077, 10383471, 10657092, 6135640, 2440918, 4617005, 8794461, 8152125, 3539977, 1162719, 2396216, 3202068, 2012388, 1267684, 2018116, 2994522, 4094853, 5613385, 5622598, 3019650, 852737, 1827069, 3766203, 4594393, 7412944, 14467963, 20936742, 21923613, 20690003, 22042296, 23004052, 19243344, 15223140, 17298162, 21650007, 20503808, 15571345, 13044861, 10309864, 1792826, -6487094, -4307260, 3916245, 4952114, -390066, 1201931, 11264741, 16512238, 12284816, 9291322, 12936178]
4899A2936178K662092o83494M861217J1060122L999801p410944m805013O656127
4891B9276086P270681k569718n737209k66423J200963j635156N80430L394347
4883C1514001k317847n722219O796883J9787603J1652855k133891O207072K1599081
4875H7383538J3784808J0662175O5692241J42088751J21432064k7981887j73420821
4868B39640869j77125381p1449011N196328j5317k1032889p446364J0270819P18776
4860b1242170j1221625L73673J4442694O797359n885112r89357R010790L881812
4852d831936o436938l007485P148328O720416n73330j145836J990894j435597
4844a571484o462505k470633N532722N521788q68064m010221l587588m036804
$$ y = [12936178, 15598270, 14914776, 19775993, 30836115, 34835916, 27424972, 22619959, 29276086, 36546767, 33977049, 28239840, 27973417, 29174380, 27539224, 28119654, 31514001, 29196154, 23473935, 30270818, 50058421, 61711276, 59577385, 65784457, 87383538, 101168346, 111830521, 177522762, 319611513, 441043577, 413061690, 239640869, 62515488, -8933523, -3737195, -3752512, -24785401, -32231765, -21960946, -21242170, -32463795, -32090122, -17647428, -10850069, -16735181, -17724538, -8713748, -4831936, -11268874, -14276359, -7128031, -407615, -980945, -2126781, -135887, -1571484, -8033989, -10504622, -4971900, 549888, -318176, -4328397, -7915985, -11952789]
4836a1952789k110089N153963R311566L221191l997874o65707P298837O534401
4828A2793499j046882l272017L22770l77080o158744p297962j736187J473600
4820e299003j776987m846097k807010Q29392K216220K216421J300633k015528
4812a0181959n801221n285908l85790L717097M364736L900878L976852L090457
4804b604858M65644k253013l529159k890267m31525J814002N98603l350006m635143
4795a6815722j269606J536528K31821m97509L681719P892477N994358J646532
4787B400598J658915L195236r33344p501022o271189K479977O796154J345609
4779C170934n095312m370279m07376j94835k112566n39551L717197M858283J092378
$$ y = [-11952789, -14062878, -8908915, 402651, 3623842, -374032, -1039739, 6259098, 12793499, 11746617, 8474600, 8797370, 8420290, 2261546, -5036416, -6772603, -5299003, -7075990, -11922087, -14729097, -13899705, -11683485, -9467064, -8166431, -10181959, -15983180, -21269088, -21654878, -17937781, -13573045, -9672167, -5695315, -2604858, -2139214, -4392227, -7921386, -10811653, -11243178, -9429176, -8830573, -12180579, -16815722, -18085328, -16548800, -16316979, -16814488, -13132769, -5240292, 754066, 2400598, 4059513, 7254749, 6321405, -1179617, -7450806, -4970829, 1825325, 3170934, -1924378, -6294657, -6702033, -6896868, -9009434, -9548985, -5831788, -973505, 118873]
4770A18873l415581m355506j359831K923279N522469N356758L690905K039617
4762A0520983L70014j459423k327589k203351l510518o783033p543268k117003
4754a5053188N604733Q612953O355312L988621L378832J616822j694722k743492
4746A0065871l12172J916890J485418J41670p13484k203927m102312m036165k226150
4737A5639j968611l753337l969569j272500Q14497k20293k070007j814419L14359
4728a3924241L051930N636047N847748J314813n603553q961448o754818k632686
4720b2026208O29330L507745M719614J121973n057532o324519n82172N562994
4712a8448775P735715R786084J3746463J2735631K069243r696001j0743835k504461
$$ y = [118873, -3296708, -7652214, -9012045, -6088766, -566297, 4790461, 8481366, 10520983, 10890997, 9431574, 7103985, 4900634, 1390116, -5392917, -12936185, -15053188, -9448455, -835502, 5519810, 9508431, 12887263, 14504085, 12809363, 10065871, 9753699, 11670589, 13156007, 13297677, 12584193, 10380266, 6277954, 2241789, 15639, -1952972, -5706309, -9675878, -10948378, -10133881, -10354174, -12424181, -14238600, -13924241, -10872311, -5236264, 611484, 1926297, -3677256, -12638704, -19393522, -22026208, -21396878, -17889133, -13169519, -12047546, -17105078, -23429597, -24011769, -18448775, -10713060, -926976, 12819487, 25555118, 27624361, 17928360, 7184525, 4680064]
4704D680064L599616K776271K30750m42924j843658m840748n295755j584609J516216
4695a204777k54478m734434o995397n131821n20087M374766O991868O335921M585494
4686C447055M545806N404434L926789k57974l903778m871162m416915m379242
4678e04987m790731m519675k232360K534630P152287O692930J63512o260606o384854
4669h149854k107146O58176J571104M347086P206506L854755m681093q225044
4661e525510j600341O705786N637017l875971j1333551j0157755l180346L215484
4653b0115187N387722L689691J179398Q72608K420983K745341J010255R2627J290913
4644a425649J236746k725155p253335p029630j781961M423500Q679103J0071069
$$ y = [4680064, 8279680, 11055951, 11286701, 10843777, 9000119, 4159371, -1136384, -2720993, -1204777, -1459255, -6193689, -13189086, -18320907, -18840994, -14466228, -7474360, -1138439, 3447055, 7992861, 13397295, 17324084, 17066110, 13162332, 8291170, 3874255, -504987, -5295718, -9815393, -12047753, -9513123, -2360836, 4332094, 4495606, -1765000, -8149854, -10257000, -9598824, -8027720, -3680634, 3525872, 7380627, 2699534, -5525510, -7125851, -420065, 5216952, 1340981, -9992570, -20150325, -23330671, -20115187, -14727465, -11037774, -9858376, -8985768, -6564785, -3819444, -2809189, -2716562, -1425649, -188903, -2914058, -10167393, -17197023, -18978984, -14555484, -5876381, 4194688]
4636D194688P314068N59468n540255n746892j388161R05438j708151m629615k663152
4627h702564K999517O667529M667041j807727q489066j0920876p037293R27581
4619b1695858P292522P389917K025251l016106k735624J857766N313305M584252
4611A015425K091111N79865j809826p137388j0769328n847746N018925J0419959
4603f439003N683733J05452K973469R305953P924266j074429p093597n298938
4595F086906j568331o79068J28334K836824L225211j192758n123191l266668J307352
4586A754611K260582r84407m757094p518250q905963o188503J586186Q378195
4578a4374643P092245k93816m891240k650316K250304N516343P399055Q111248
$$ y = [4194688, 11508756, 12068224, 6527969, 781077, -607084, 298354, -1409797, -6039412, -8702564, -5703047, 964482, 5631523, 3823796, -4665270, -15586146, -22623439, -21695858, -14403336, -7013419, -4988168, -8004274, -10739898, -8882132, -3568827, 1015425, 3106536, 3686401, 1876575, -5260813, -16030141, -21877887, -16858962, -6439003, -755270, -649818, 2323651, 11629604, 19553870, 18479441, 11385844, 6086906, 4518575, 3839507, 3967841, 6804665, 10029876, 8837118, 3713927, 447259, 1754611, 4015193, 3030786, -1726308, -9244558, -18150521, -24339024, -22752838, -14374643, -7282398, -7576214, -12467454, -15117770, -12867466, -7351123, 47932, 8159180]
4570H159180N392034m51571m596720m283331k768668l149756k852953R50592M426614
4561H25421J982538l889711m692284J745748P463261N207435k198937o869364
4553d25893o157297l441491j313818P51304K732162L071963J975353J570536J831152
4544E93971L15584k685921l040975Q03684M420877L810683J432483J479233K517295
4535I646914N19437l073326l042657N25918J783313j486146m723858m661233l895943
4526h407581m484896l470797Q20799L813182J621745j688177j75480M146482M576293
4517c248430O98991j281610J245195L818513K831189Q58633J633113M140300M581007
4508A5276901J688572j946146k637687O24889L994116J778935n903131j0740080
$$ y = [8159180, 13551214, 13099643, 8502923, 4219592, 1450924, -1698832, -4551785, -3601193, 825421, 2807959, -1081752, -5774036, -4028288, 3434973, 8642408, 6443471, -425893, -6583190, -10024681, -11338499, -10587195, -7855033, -4783070, -2807717, -1237181, 593971, 909555, -1776366, -4817341, -4013657, 407220, 4217903, 5650386, 7129619, 9646914, 10166351, 7093025, 4050368, 4576286, 6359599, 4873453, 149595, -4511638, -8407581, -12892477, -16363274, -15542475, -11729293, -10107548, -11795725, -11971205, -7824723, -3248430, -2549439, -3831049, -2585854, 1232659, 4063848, 4922481, 6555594, 10695894, 15276901, 16965473, 15019327, 12381640, 13006529, 17000645, 18779580, 12876449, 2136369]
4500B136369n833091M095923P975246L263728j415495K18143L334997N59914o684661
4491G651073j0848634q611696l219223J478432M497248O038930O189287N292062
4483H467479L332054m35412n388521q225379n921018N54847O813969Q624214M599891
4474A2422124k592015p048465m541799J984521M865212J328807k948150k332489
4466A137746Q84866J148817j410715k157798l8854J372050M74337j53126J107866
4457B365189K167508J089765q25917j437136o65085K81470N84717j54360j813425
4448A592726l062697k255004P01948M439531P550749Q605081O048143L57117m773211
4439A9204383o028285m451176l309357l234444k605720j468289j162110r13677
$$ y = [2136369, -3696722, 399201, 8374447, 11638175, 10222680, 10440823, 13775820, 14335734, 7651073, -3197561, -11809257, -15028480, -13550048, -9052800, -3013870, 3175417, 8467479, 11799533, 11364121, 5975600, -2249779, -8170797, -7615950, -801981, 7822233, 12422124, 9830109, 2781644, -1760155, 224366, 5089578, 6418385, 3470235, 1137746, 2022612, 3171429, 1760714, -397084, -435938, 936112, 1410449, 1257323, 2365189, 4532697, 5622462, 4796545, 3359409, 2694324, 2975794, 3560511, 3406151, 1592726, -1469971, -3724975, -3023027, 1416504, 8967253, 17572334, 23620477, 23977594, 19204383, 13176098, 8724922, 5415565, 2181121, -424599, -1892888, -3054998, -3968675]
4431c968675Q78602K503425R24676k163274j719479K401804M373263J415603j898796
4422B747149j325101O12183J2988j389342J55673L294990L657816R09234j473690
4413G201900j990929j845126j156261N62287R92956k581133p363691o846109K28196
4404a2797910P296600Q245084M332429O05188j099442k424032m024776m362160
4396d229019k546390J10622J850417K460615K879442L297301K543113P8281k025842
4387D418540j134349J461559R03294m364455q840367o614381K19199M323855L225547
4378f401558J306025J585256J589661n24973j492484J510416N163040M515997
4370G251380K94891k899132l491830l339015k786294l35390L138929M386544K386009
$$ y = [-3968675, -3090073, -586648, 338028, -1825246, -3544725, -1142921, 3230342, 4645945, 2747149, 1422048, 2034231, 2047219, 657877, 813550, 4108540, 7766356, 8675590, 7201900, 5210971, 3365845, 2209584, 2771871, 3764827, 1183694, -6179997, -13026106, -12797910, -5501310, 2743774, 7076203, 7681391, 6581949, 4157917, 133141, -4229019, -6775409, -6664787, -4814370, -2353755, 525687, 3822988, 6366101, 6444382, 4418540, 3284191, 4745750, 5649044, 1284589, -7555778, -14170159, -13950960, -9627105, -6401558, -5095533, -3510277, -1920616, -2445589, -3938073, -2427657, 2735383, 7251380, 7546271, 4647139, 1155309, -2183706, -4970000, -5305390, -2166461, 2220083, 4606092]
4361D606092o31329k802177l779870k595593J401450N288120M878312J159481
4353G524486l86561J649247K079095k049818n646656l468824O52230q38672o946606
4344g432079q731889k599166M076718L489584j916714l846913R0867M340241M226907
4335h302444J798926J382311K882448K459922j497408n953387o957306l791756
4327a7978694J162350M936218N461446K448327j459261j873183K604367P644584
4319B946154P759986L110691j172758k239645k396129l940989n131596l580175
4311d644461n23162J170879J069801O26638M78755P48568K050646L670790K870034
4302G518488j183276m941594m972599k591920o14539J665849N550051P499705
$$ y = [4606092, 3974763, 1172586, -2607284, -5202877, -3801427, 1486693, 6365005, 7524486, 7137925, 8787172, 10866267, 8816449, 3169793, -299031, 353199, -485473, -7432079, -16163968, -18763134, -14686416, -11196832, -13113546, -16960459, -16869592, -12529351, -8302444, -6503518, -5121207, -2238759, 221163, -1276245, -7229632, -14186938, -17978694, -16816344, -11880126, -6418680, -3970353, -5429614, -7302797, -4698430, 2946154, 10706140, 13816831, 12644073, 10404428, 8008299, 4067310, -1064286, -4644461, -5167623, -3996744, -2926943, -2300305, -1821550, -1072982, 977664, 4648454, 7518488, 6335212, 1393618, -3578981, -6170901, -6785440, -5119591, 430460, 7930165]
4294G930165K843258n840123j0203741o505874P77979O037449P654530N520780
4286H214423j93709n893379o232721j747288N95195k471841n234162j736814N166831
4277i533465Q278396N684946J060697k506164m092054k830178R01914L787897
4269G51989L231870J285022J331982K636357J909650j332024m615046o167599
4261i67799n461735k125877K166834L081408r62078m965919l586400P70171J286501
4252a0764894l202746p085985o404989k826826J077502N036896Q251751Q170110
4244g749181M357964L49841m16776J517675L030144K120506m59604k336979k361448
4235a947858k416792m479236n675769n67265R489843J4670309R084488r9492k467354
$$ y = [7930165, 10773423, 4933300, -5270441, -11776315, -10998336, -4960887, 2693643, 8214423, 8020714, 2127335, -4105386, -5852674, -5257479, -7729320, -12963482, -14700296, -9533465, -1255069, 4429877, 5490574, 2984410, -1107644, -3937822, -3035908, 751989, 3983859, 5268881, 6600863, 9237220, 11146870, 9814846, 5199800, -967799, -6429534, -8555411, -6388577, -3307169, -4269247, -9235166, -12821566, -12051395, -10764894, -13967640, -21053625, -27458614, -30285440, -29207938, -24171042, -15919291, -7749181, -3391217, -3041376, -3458152, -1940477, 1089667, 3210173, 2750569, 413590, -1947858, -4364650, -8843886, -14519655, -15086920, -5597077, 9073232, 18157720, 18058228, 15590874]
4226A5590874R80289J288279l358478o017927l808992j909443l094429l197378
4218c527205l83191K31456l888501o638402k853890K731487K976261m56092p90796
4209a2598873K533322L897248J315394q78368M63974K782351K431028J3380r76066
4200a016610J110039M388410N850580M348811J026532k411277m684825m536986
4192D074674j632426J507369J357701j470919k521481q14571q81249m010811l742144
4183h133857L635032J0163798O746843k157060n007739q96711J362165k46483
4175E465988P84223M468777K432228n917291r676001l959579K241724J670572
4167b489359q21302l58355j253793n698251o092225J238116O440818J347049o297301
$$ y = [15590874, 16571163, 17859442, 14500964, 8483037, 4674045, 2764602, -329827, -3527205, -3910396, -3678940, -7567441, -14205843, -17059733, -14328246, -11351985, -11808077, -12598873, -10065551, -6168303, -4852909, -5731277, -5267303, -2484952, -53924, -40544, -1016610, 93429, 4481839, 10332419, 14681230, 15707762, 13296485, 8611660, 4074674, 2442248, 3949617, 5307318, 3836399, 1314918, 500347, -380902, -4391713, -8133857, -4498825, 5664973, 12411816, 10254756, 5247017, 4350306, 5712471, 5465988, 6250211, 10718988, 13151216, 7233925, -2442076, -6401655, -4159931, -2489359, -3310661, -3669016, -4922809, -10621060, -16713285, -15475169, -9034351, -7687302, -13984603]
4158a3984603n284676K003116O384484O490172N421726K117142l068949m103652
4150d025240q65861k847089j0749865j0528590O30926K467233j4844467k8313428
4142f9076381k1442176k1845581n7238591r0401629n4302564M5104110J18027580
4135a51175232J02786412L9596692L098197N087629O406609o745059j0732831
4128a1677583L193523J2817112M690941o481707o233727l76145K054809L561428
4120A548651O771848O002149j038299o819863o218657l646439k780037j45347
4112f325994N997052J0026693P140156k20436p000081r920003o583352K019529
4104d866436Q002227M120226n064416q260748l286092J726730K441172K690969
$$ y = [-13984603, -19269279, -17266163, -10881679, -4391507, 1030219, 3147361, 78412, -4025240, -4891101, -7738190, -18488055, -29016645, -28385719, -25918486, -40762953, -69076381, -90518557, -112364138, -169602729, -260004358, -314306922, -269202812, -151175232, -48388820, -8792128, -5693931, -606302, 5800307, -944752, -11677583, -8484060, 4333052, 9023993, 2542286, -3691441, -4067586, -2012777, 1548651, 8320499, 14322648, 13284349, 6464486, 245829, -3400610, -6180647, -6325994, -328942, 9697751, 16837907, 16617471, 9617390, -302613, -6885965, -4866436, 3135791, 7256017, 2191601, -6069147, -9355239, -7628509, -5187337, -2496368]
4096b496368M092929K752650j478416l232605j703228k077002m388373k053061
4088a0583474N014039P353858J134858m573227k079718L361495L626385N28466
4080C782682L94526L029481M267281L836075L229313P78196m277190p582060o037741
4071A420563l630872m541154n472942j897491K820257K505218j226978j760408
4063a1783807J328192J972177k151918o147893n026545R79084Q171438J2020604
4055f38668Q801069p38563r681169j0984980m991278K108053N877462O256887
4047c991187M422248J433472p67312p80237L27933J139498K238196L637688K538067
4038A0198366k367837o860279o212712k232892k15502o70764O7654J994843P21186
$$ y = [-2496368, 1596561, 4349211, 2870795, -361810, -2065038, -4142040, -8530413, -10583474, -5569435, 1784423, 2919281, -1653946, -3733664, -372169, 3254216, 3782682, 4177208, 7206689, 11473970, 15310045, 18539358, 19317554, 15040364, 7458304, 1420563, -2210309, -6751463, -12224405, -14121896, -11301639, -8796421, -10023399, -11783807, -10455615, -8483438, -10635356, -16783249, -21809794, -20830710, -12659272, -638668, 8162401, 7423838, -2257331, -13242311, -18233589, -16125536, -10248074, -3991187, 431061, 1864533, 1097221, 316984, 644917, 1784415, 4022611, 7660299, 10198366, 7830529, 970250, -5242462, -7475354, -7690856, -8361620, -8293966, -6299123, -5577937]
4029e577937m667536q823365p083047r47381M984128P957413P620851M951180
4021a585694K032528M67556n45424k265388l173531j104647K056655K295534R6392
4012a726019J04482L366323N405866L911682K584182L918388L615611k439618
4004A8740897r473260q751654j2633P262216N800016j283853o145695n961750
3996A74284l893412k788572j859994L24665K579566K579490M82422p66089J045234
3987b122406M820325P721859Q254158O718886L499685j246854o101301q396170
3979A3148182o758651k827645K81670O68908j442098m385696n965006m807365
3971a2087701j967979l54010j173379j677634J572911P304210R906208O366278
$$ y = [-5577937, -10245473, -19068838, -26151885, -27099266, -22115138, -14157725, -6536874, -1585694, 446834, 914390, 368966, -1896422, -5069953, -6174600, -4117945, -1822411, -1726019, -1621537, 1744786, 7150652, 11062334, 13646516, 17564904, 21180515, 18740897, 9267637, 515983, 503350, 7765566, 13565582, 12281729, 6136034, 174284, -3719128, -6507700, -8367694, -8043029, -5463463, -2883973, -2401551, -3167640, -2122406, 2697919, 10419778, 18673936, 25392822, 28892507, 27645653, 21544352, 13148182, 6389531, 3561886, 3843556, 4512464, 3070366, -1315330, -7280336, -12087701, -14055680, -14409690, -15583069, -17260703, -15687792, -8383582, 1522626, 7888904]
3963G888904N80698j487073O68956K579976K061282J734804L160396K868012k274620
3954A7781335q709931r902844n336030j168204j759796m843569o031437m019158
3946b3989634K33906N486847R031393P242319N38200n068684m761283q31611J580218
3937a0538329J940756L042018M478356L161443k06147j136075J200315K122448
3929D064785q62043l723340k592796k05006r96005l096924j017061M990042Q151817
3920D713469M448255k345180o591251p401262o685060m464826j93019L611474
3912a4907400L724922J527879J523400M256008N149562J904317j186513O98523
3904B690698N662817P702297M748330K60831k296382k803273k502797k265859
$$ y = [7888904, 8469602, 6982529, 7651485, 10231461, 12292743, 14027547, 17187943, 20055955, 17781335, 9071404, -831440, -6167470, -7335674, -9095470, -13939039, -19970476, -23989634, -23755728, -18268881, -9237488, -1995169, -1456969, -6525653, -11286936, -12118547, -10538329, -8597573, -5555555, -1077199, 2084244, 1878097, 742022, 1942337, 4064785, 3202742, -520598, -3113394, -3318400, -4314405, -7411329, -8428390, -3438348, 4713469, 9161724, 6816544, 225293, -7175969, -13861029, -18325855, -18518874, -14907400, -11182478, -9654599, -8131199, -3875191, 1274371, 3178688, 1992175, 2690698, 8353515, 16055812, 20804142, 21064973, 18768591, 15965318, 13462521, 11196662]
3896A1196662l273131o209335q991885q184295l607439J104038L419444M554103
3888i991838O021872O559630M494623Q21744k277159m212868n256771m608904
3880h449671j430394L004622N922409N516906K174568j920071m160177l804195
3872c146003k908406l374909l694512j318827K402250L629784K339201K296079
3864c775343L934424L074475j126078l221314j46049L317870K690499J371389
3856F119873L603413N491300J408293m889187n284056r46698m04752m596584n098225
3847d596623Q45712M612356J57482n926800m976821N71267K394683l47788j043330
3838h309862L263946P998657Q167820M221883J81186j009711J34340N23461j665727
$$ y = [11196662, 7923531, 1714196, -7277689, -15461984, -19069423, -17965385, -14545941, -9991838, -3969966, 2589664, 7084287, 7906031, 5628872, 1416004, -3840767, -8449671, -9880065, -6875443, -953034, 4563872, 6738440, 4818369, 658192, -3146003, -6054409, -9429318, -13123830, -14442657, -12040407, -8410623, -6071422, -3775343, 159081, 3233556, 2107478, -1113836, -1259885, 2057985, 4748484, 6119873, 9723286, 15214586, 16622879, 11733692, 6449636, 5502938, 5098186, 501602, -4596623, -3750911, 861445, 1018927, -4907873, -9884694, -9313427, -6918744, -7266532, -8309862, -5045916, 2952741, 11120561, 15342444, 15523630, 14513919, 14648259, 15171720, 13505993]
3829A3505993l975499k943162k89874j281368n719516o413733L7770O698778N726745
3820E346134l52830l093367l18032L119783M501967N707132P063253N793810J508363
3811B9276213k510505m593020o239515p546553o195282k319560M51283M54289
3803G77350N3451O44454K29119j887415k548770J32287K951515K221462q81420
3794A692033k830475k988591l114941l807845m459587m833436l990211J02601
3786b4230452O857401J1307283R740543N137331K875097K725349K10216m730174
3778I892594o328718j730379L959246M326341k45836m447412n391566m347332
3770d313062k613036K77927L977224O188930N542174L833931L881197N738122
$$ y = [13505993, 9530494, 6587332, 6297458, 5016090, -703426, -7117159, -7079389, -380611, 5346134, 4993304, 1899937, 1581905, 4701688, 9203655, 14910787, 21974040, 27767850, 29276213, 26765708, 22172688, 15933173, 8386620, 2191338, -128222, 323061, 777350, 830801, 1475255, 1704374, -183041, -2731811, -2599524, 351991, 2573453, 1692033, -1138442, -4127033, -7241974, -11049819, -15509406, -20342842, -24333053, -24230452, -17373051, -6065768, 3674775, 8812106, 11687203, 14412552, 14622768, 9892594, 3563876, 1833497, 5792743, 10119084, 9873248, 5425836, 34270, -4313062, -6926098, -6648171, -2670947, 3517983, 9060157, 12894088, 16775285, 22513407]
3762B2513407O191806K310814m765104j0106193r701344m694159J52190K107141
3754D008558K599915L054615J592398l271867p793701o321960O51249O124428
3746F43635N384749J136021j936871l391918m594493m070485k80271L446233K519756
3737a143644j214540j227979L822345P757565O137471K410947J739544L247497
3729B1529206K538856j234032n037187o537629n236088j074829M058364N319983
3721A4326644J98628o116627n731127J423963O945702M850338j568921n582353
3713H746247n197782k544488R56769M491402N349478J478227l957789n017984
3705D304080p43659L264988K495845o77494j353360O31667J642028Q37591R54073
$$ y = [22513407, 28705213, 31016027, 26250923, 16144730, 6443386, 1749227, 1901417, 4008558, 6608473, 9663088, 11255486, 7983619, 189918, -6132042, -5480793, 643635, 6028384, 7164405, 5227534, 1835616, -2758877, -6829362, -7109633, -3663400, -1143644, -2358184, -3586163, 236182, 7993747, 14131218, 16542165, 18281709, 21529206, 24068062, 22834030, 17796843, 11259214, 6023126, 4948297, 9006661, 14326644, 14525272, 8408645, 2677518, 4101481, 11047183, 15897521, 14328600, 8746247, 3548465, 1003977, 1960746, 6452148, 11801626, 13279853, 9322064, 4304080, 3560421, 6825409, 9321254, 8643760, 7290400, 7922067, 9564095, 10401686, 11355759]
3696A1355759K256216J002679l636460n986520j625686M951567O279043L019044
3688A7615642J831942L144774L5706q740883j3949945r150187o18957K953802
3680f878106L348785O285318Q320781K383646o845512o778641L304090R698026
3672A2838387M848493k287120k272784N23518j610598n399073l895614l61225
3664B383984k269629o599104m408910K563393L647672k410799m600033J932721
3656i760705P527626L887093k774442k492092L041895N105340K273263N74027
3648G382005K283758L324522J081473k264070m355754n123843m580433k806392
3640e058734j851256l201951l893817M7826O510629Q828414N034688M72454l37260
$$ y = [11355759, 13611975, 14614654, 10978194, 4991674, 3365988, 8317555, 14596598, 17615642, 19447584, 22592358, 22628064, 13887181, -62764, -9212951, -9831908, -6878106, -3529321, 2755997, 11076778, 13460424, 6614912, -163729, 3140361, 12838387, 17686880, 15399760, 13126976, 13650494, 12039896, 6640823, 2745209, 2383984, 114355, -6484749, -10893659, -8330266, -4682594, -7093393, -11693426, -9760705, -2233079, 1654014, -1120428, -3612520, -570625, 4534715, 6807978, 7382005, 9665763, 12990285, 14071758, 11807688, 7451934, 2328091, -2252342, -5058734, -6909990, -10111941, -14005758, -13957932, -7447303, 1381111, 6415799, 6888253, 6550993]
3631F550993M24447j252809m429125m948222j835150J408030J365929j576648
3623d292555m141066l840464j599852l28988n40309Q47969N231083P894531L389250
3614B619599n008459p001409J169009J0060167Q580492j238807p103515l096741
3606a019664L111081J851095n055937p388315r96619O684758P148331K113882
3598F448612p7037K935113M618621K46958n480731n558981j104310J081713r77498
3589B132460k841013k000084j121471j775420j197851K158569N180348N185116
3581E720654L691740K115140j183307n737045o197133n0355O312211N450385n86945
3572I535345m119243l406432l018018m362922l885560q56829N75620j344249k988190
$$ y = [6550993, 6975440, 5722631, 1293506, -3654716, -5489866, -4081836, -2715907, -4292555, -8433621, -12274085, -13873937, -14202925, -14743234, -13895265, -8664182, -769651, 2619599, -2388860, -9390269, -8221260, 1838907, 10419399, 9180592, 2077077, -1019664, 2091417, 3942512, -1113425, -8501740, -9498359, -2813601, 4334730, 6448612, 6371575, 9306688, 13925309, 14172267, 8691536, 3132555, 2028245, 3109958, 2132460, -708553, -2708637, -3830108, -5605528, -6803379, -4644810, 535538, 5720654, 9412394, 11527534, 10344227, 4607182, -1589951, -1640306, 4671905, 10122290, 9535345, 5416102, 2009670, -1008348, -5371270, -9256830, -10113659, -9538039, -10882288, -13870478]
3563a3870478j467181J675425M456727O875114P854288N160081J69414k445605
3555H407785j528358p48470j745192j999264j205002k630451n342688l020093
3547i811733M871937Q707990K218132o598760o422795R41911M461820O10920l678770
3538d699348l244653l71966J868944L546272M211572K601163Q20849K069359L861924
3529A0664116Q16481n394993p091132k818548L68858o85454j93066M753647P055666
3520G475575J528373m422597j548227N801379N853399k049546o362376r35420
3512E340560O558207O588441k9912o122044q242976p807417o062765l011657K32230
3503a2557333J856651J766885J345264J222070Q23516l46441k068417l533439
$$ y = [-13870478, -15337659, -13662234, -9205507, -2330393, 5523895, 10683976, 10853390, 8407785, 6879427, 6130957, 4385765, 2386501, 1181499, -1448952, -6791640, -9811733, -4939796, 3768194, 5986326, -612434, -7035229, -6093318, -1631498, -1020578, -4699348, -7944001, -8315967, -6447023, -2900751, 1310821, 3911984, 4732833, 6802192, 10664116, 11480597, 6085604, -1005528, -3824076, -3455218, -4140672, -4333738, 419909, 7475575, 9003948, 4581351, 3033124, 8834503, 14687902, 12638356, 6275980, 5340560, 11898767, 18487208, 18457296, 12335252, 4092276, -3715141, -9777906, -12789563, -12557333, -10700682, -8933797, -7588533, -6366463, -5542947, -5889388, -7957805, -11491244]
3495a1491244l492769j194970K150223L846956K482328n23504k676155k797593
3487a3696728j176908J385995L676754M243351K809601J007304N32247R10328
3479c08056K48368j956171l949831l812506j389605K059077N008597O039186M387276
3470F326335J171515r95590r75007p02589k038752l068447m88365M474574O276543
3461I980217K539001k287661l220260j387648q53467j730435j324215l37483k149179
3452g71130o053269o946284k896642K131680M707206N947892O919923N385666
3444H425042O23649l285309l319302k594388m758618o993316m431862J036495
3436a5297609K840934m11740l271388j740655K150657M715177M895312L439765
$$ y = [-11491244, -14984013, -16178983, -14028760, -10181804, -7699476, -8222980, -10899135, -13696728, -14873636, -13487641, -9810887, -5567536, -2757935, -1750631, -1218384, -308056, -59688, -2015859, -5965690, -9778196, -11167801, -9108724, -4100127, 1939059, 6326335, 7497850, 6502260, 5527253, 4824664, 2785912, -282535, -770900, 3703674, 9980217, 12519218, 10231557, 7011297, 5623649, 4770182, 3039747, 1715532, 1378049, -771130, -6824399, -13770683, -16667325, -14535645, -9828439, -3880547, 3039376, 8425042, 9048691, 5763382, 2444080, -150308, -4908926, -11902242, -16334104, -15297609, -12456675, -12868415, -16139803, -17880458, -15729801, -11014624, -6119312, -2679547]
3428b679547J890687K788266O767089R349676N345301l142329q247834o768608
3420E302701l485854k539427j769279J151157K990183L96036l484524l609188
3412e048195j232280j536048m767427n671561j624516L797009O220463N377726
3404d484829L300674Q41306k122828m761386n263475k576817K066926N498410
3396g502019N432279L121181J652084J484355L59698j719972j395451J985156
3388C417311L541868M2999l948738k505675K004118K273070k402057n205525k765117
3379e547746R5185j442342n419530p453595o790329m895075k267045L96664J719025
3370c1604788K780767O414016J0902977R817327J997272l936972p62903O325745
$$ y = [-2679547, -788860, 1999406, 8766495, 18116171, 23461472, 20319143, 12071309, 5302701, 1816847, -722580, -2491859, -1340702, 1649481, 2045517, -1439007, -5048195, -6280475, -7816523, -12583950, -18255511, -19880027, -16083018, -9862555, -4484829, -1184155, -342849, -2465677, -7227063, -12490538, -15067355, -13000429, -7502019, -2069740, 1051441, 2703525, 4187880, 4547578, 2827606, 1432155, 3417311, 6959179, 7002178, 3053440, 547765, 2551883, 4824953, 2422896, -2782629, -5547746, -5452561, -6894903, -12314433, -19768028, -26558357, -31453432, -33720477, -33323813, -31604788, -28824021, -22410005, -11507028, -1689701, 307571, -3629401, -4392304, 1933441]
3362A933441O820762k74158o315451n821820j533712K724124O190492P274971
3354A0998649L306647l381582n918155k599340R687k608649n469031k067480M962127
3345b767127P389816K867551l061902n186076l698650j432470l30185q70149j896461
3336h985653j209173J249946K037023r63852l992945j842919M124141P157786
3328b425646M429437L73385l66267J207991J752890R92923J006207K549333M604607
3319A4124860N916470N171469J424960l943971p462772p446805o014378n743884
3311c974051o258554n877402m575395l008321l70057M087568Q507313R916931
3303a551968P651432L501814m46912k455403j499156O18098k60561m712470o624921
$$ y = [1933441, 8754203, 8480045, 2164594, -3657226, -5190938, -2466814, 3723678, 10998649, 14305296, 10923714, 5005559, 2406219, 2415906, -192743, -5661774, -7729254, -2767127, 4622689, 7490240, 4428338, -757738, -4456388, -5888858, -6219043, -7089192, -8985653, -10194826, -8944880, -6907857, -7871709, -11864654, -13707573, -9583432, -2425646, 2003791, 2377176, 2010909, 3218900, 4971790, 5964713, 6970920, 9520253, 14124860, 20041330, 25212799, 26637759, 22693788, 15231016, 7784211, 1769833, -3974051, -10232605, -16110007, -20685402, -23693723, -24063780, -19976212, -11468899, -1551968, 6099464, 9601278, 9154366, 6698963, 5199807, 5817905, 5557344, 844874, -5780047]
3294e780047r33669P103905P006588j970500q214282l362680N952063P591222
3286G392600M34185n809515n009230r36971J174263J811247K914173K511994j373171
3277C109575n021456k757765M655423J0029379Q471982K476981k605650n043650
3269A3314819o716039q559745q655702n105635N76844M121539K914928p91878
3261h900869k212098L00125L386356L299121O16824j442856j833111j857824j172183
3252i816515K622318R080027J2618534P837697l723594j3983700j5455446p586405
3244a8407084L141464Q876845P076673K082629m40652J07446K39027j245856j650647
3235b20155J76122J148442q50789k978819k297930j249358l376276n997014l257659
$$ y = [-5780047, -6713716, 390189, 7396777, 5426277, -2788005, -6150685, -198622, 7392600, 7826785, 2017270, -2991960, -3928931, -2754668, -943421, 1970752, 4482746, 3109575, -1911881, -4669646, -14223, 10015156, 18487138, 20964119, 18358469, 13314819, 6598780, -1960965, -10616667, -15722302, -15145458, -11023919, -8108991, -8900869, -11112967, -10812842, -7426486, -4127365, -3510541, -4953397, -6786508, -8644332, -9816515, -7194197, 1885830, 14504364, 22342061, 18618467, 4634767, -10820679, -18407084, -15265620, -6388775, 687898, 2770527, 2329875, 2437321, 2676348, 1430492, -220155, -44033, 1104409, 253620, -2725199, -5023129, -6272487, -9648763, -15645777, -18903436]
3226a8903436M039638P970929M281562j774394k997731O74200L927064L676779
3218H94611J214131j337674l117149l637976k470008J1312K779111M743885M682606
3209C762849J852846k394707m976958m255226j839092l75272p28163k038246l005977
3200a3997946k166058J470667O705275J0184019R186688L754845l750329r573610
3192A813551r690781l277399M429376O309806J769177k461657j492561J762970
3184h37518K323161O73141N72938K456264L564880K752488R97031j377539m141015
3175F983831n239001l181016k6147J497931K166261L907240N426601M491285K404521
3166A8431506J261159r82217o650301j1424303q624116j3920N315159L676141
$$ y = [-18903436, -14863798, -6892869, -2611307, -4385701, -7383432, -6709232, -2782168, 894611, 2108742, 771068, -2346081, -5984057, -8454065, -8442753, -5663642, -919757, 3762849, 5615695, 3220988, -1755970, -6011196, -7850288, -8225560, -8953723, -10991969, -13997946, -16164004, -14693337, -7988062, 2195957, 11382645, 15137490, 11387161, 1813551, -7877230, -11154629, -6725253, -415447, 1353730, -1107927, -2600488, -837518, 1485643, 2158784, 2731722, 5187986, 8752866, 11505354, 12502385, 11124846, 6983831, 1744830, -1436186, -1462333, 35598, 2201859, 6109099, 11535700, 16026985, 18431506, 19692665, 18710448, 12060147, 635844, -7988272, -8002192, -2687033, 989108]
3158I89108P91419J366143K519976Q44781j345400j351122j409057l553900m478789
3149e626841j012919L668823M846434L531797L440854L999610K123401j537974
3141A3433185l675141l679978k936236r35278K712787M617910J796582k076726
3133I257105p50350N017827Q019059M814370k30091j826181J65544K383526J722816
3124B8573625k782145q263523r079594l698923J287060l59621m139967q50459
3116F86453P812216R732274O90453q191766o787523n37404n46659o142690p511024
3107a0795670k038381K612189J437843j369656r62489P10967k78797k909099l367725
3098a6960818j086424J135371J510600R31933R29307J914581L286044M179926
$$ y = [989108, 1780527, 3146670, 5666646, 6511427, 5166027, 3814905, 2405848, -1148052, -5626841, -6639760, -2970937, 1875497, 5407294, 8848148, 12847758, 14971159, 13433185, 9758044, 6078066, 3141830, 2206552, 4919339, 9537249, 11333831, 9257105, 8506755, 13524582, 21543641, 26358011, 26127920, 24301739, 24467283, 26850809, 28573625, 25791480, 17527957, 8448363, 4749440, 6036500, 5676879, 1536912, 686453, 8498669, 18230943, 18921396, 10729630, 3942107, 3404703, 2858044, -3284646, -10795670, -12834051, -10221862, -8784019, -10153675, -11116164, -10405197, -10683994, -13593093, -16960818, -18047242, -16911871, -15401271, -14469338, -13540031, -11625450, -8339406, -4159480]
3090d159480M100617L108784J355223j058559l215032l373953j190190Q98653
3082c533937M00570j569325j574791J136790L279618J954080j613148m000528
3074e520671l660713j476775J535386M810350O556142M021055k599397p701903
3066d036526m982032M181129J0016240N282966m901449q826706l432593K198771
3058d500200N92269l487337j559933M548096N400755j220774p050815o079101
3050a3357040k395818j808195k551631J68985N170395P103407M784684K026534
3042h58679J383783K027610L060836M226338L713883M0755l719115k526454K736899
3033A0085856M875820J74703n708618n090886J548560O720551N549849K18198
$$ y = [-4159480, -58863, 3049921, 4405144, 3346585, 131553, -3242400, -4432590, -3533937, -3133367, -4702692, -6277483, -5140693, -1861075, 93005, -1520143, -5520671, -9181384, -10658159, -9122773, -4312423, 2243719, 6264774, 3665377, -4036526, -9018558, -4837429, 5178811, 10461777, 5560328, -3266378, -6698971, -4500200, -3907931, -7395268, -8955201, -4407105, 993650, -227124, -7277939, -13357040, -15752858, -17561053, -20112684, -19943699, -14773304, -7669897, -2885213, -858679, 525104, 2552714, 5613550, 9839888, 13553771, 13594526, 9875411, 7348957, 10085856, 14961676, 15136379, 9427761, 4336875, 5885435, 12605986, 18155835, 18374033]
3025A8374033m634363o957917o915263m831966j739179j15549j433425l295192
3017a1548821j442856M514110R319589P924948J972494k300157k425078k353605
3009C660624n288166p799978m910420J630240N418947M857014M651522P031510
3001I251293P615595K992158k998865n127334m667028n766832p043089l752575
2993i496677K734638N123379J208434k091650R79212O195651N620853r13757o088714
2984C271369n364091j753632n4465o75631r92862r3780K11098j666401m648068
2975a1766463n652975k467212L866423R526222J0984415P549323J194346m979670
2967H254409p871483n880068r35928K242433J110176j253066k34071L224620L284718
$$ y = [18374033, 13739670, 6781753, -133510, -4965476, -6704655, -6820204, -8253629, -11548821, -12991677, -8477567, 842022, 8766970, 10739464, 8439307, 6014229, 3660624, -1627542, -9427520, -14337940, -12707700, -7288753, -2431739, 2219783, 9251293, 16866888, 19859046, 16860181, 11732847, 7065819, 1298987, -5744102, -9496677, -6762039, -1638660, -430226, -2521876, -1542664, 4652987, 10273840, 9360083, 3271369, -2092722, -3846354, -3900819, -4576450, -5569312, -5663092, -5451994, -7118395, -11766463, -17419438, -19886650, -16020227, -6494005, 4490410, 12039733, 13234079, 8254409, 382926, -5497142, -6433070, -4190637, -3080461, -4333527, -4567598, -1342978, 1941740]
2958A941740j915919n973767k187663O688622J1352177Q041211K591556J013109
2950B1551066J205564j908133o785973p032175j861567J811153l68085l564959
2942C046891j366112M165033N483038O23857m438208m492876j018290J932849
2934C936182L353298M221878L955855J205371l026963n605354m488375o02812
2926B949080L159339M319840K830337Q32350l03291j838710m764600o330433l195541
2917b341629K105295K720289k752439o906777l379868M057710O983623L846983
2909D333187L04513l62961q50388l421542n676575m830494k040219r9280J20934
2900a2522825r90062l008281m028217j108387N043841Q492300M812981k109518
$$ y = [1941740, 25821, -5947946, -8135609, -1446987, 9905190, 17946401, 20537957, 21551066, 22756630, 20848497, 14062524, 7030349, 5168782, 6979935, 6611850, 3046891, 1680779, 5845812, 11328850, 11952707, 7514499, 3021623, 2003333, 3936182, 7289480, 11511358, 15467213, 16672584, 13645621, 8040267, 3551892, 2949080, 6108419, 10428259, 13258596, 14090946, 13787655, 11948945, 7184345, 853912, -2341629, -236334, 2483955, -268484, -7175261, -10555129, -6497419, 486204, 4333187, 4637700, 4274739, 3424351, 2809, -5673766, -10504260, -12544479, -12643759, -12522825, -13512887, -16521168, -20549385, -21657772, -16613931, -8121631, -3308650, -5418168]
2892e418168l969851J453319P362237O629143N35552l398197q72689M561657O650127
2883A3533130M067664J040607R73053J939324j30354n399999r689249r853781
2875c519605p178565m625171k830434n64768K155339L708392L563668L368466
2867e922678M457842N458081L708548j113946n879744o920536l557657J461479
2859h308611M386246L126033j291486m993734m263852O6459K393475r52067n680074
2850a5517611m142181L591361Q098937K892905n816850o507581K658498J1668770
2842c073752J1353794L316920m040368n319235j679896K602074M277450K630680
2834A0067667j154319n388623q345603p720863j928904O405667J0685143P351442
$$ y = [-5418168, -9388019, -7934700, -572463, 6056680, 6592232, 3194035, 2321346, 6883003, 13533130, 17600794, 18641401, 19614454, 21553778, 21423424, 16023425, 6334176, -3519605, -10698170, -15323341, -18153775, -18718543, -16563204, -12854812, -9291144, -5922678, -1464836, 3993245, 7701793, 6587847, 708103, -6212433, -9770090, -8308611, -3922365, -796332, -2087818, -7081552, -11345404, -11278945, -8885470, -9837537, -15517611, -19659792, -16068431, -7969494, -5076589, -10893439, -17401020, -14742522, -3073752, 8280042, 11596962, 7556594, 2237359, 557463, 3159537, 7436987, 10067667, 8913348, 3524725, -4820878, -12541741, -14470645, -8064978, 2620165, 9971607]
2826I971607J006141j412679j35722j103442n600119p815111m248607Q32362K543907
2817e961663K296277L137071L180597m62435m628959l524503K324855O592960
2809B954200O092720L548076J398924j320071m563137n133743j683359K182056
2801C475666K855097J731045K094890L462975K681374o95661l831672n083409
2793F690305n541101n576311l364242J262521M396631K727425j018553j354532
2785a777857J624659K102177j749723l429208K060046Q475124N649759n087661
2777G867316j1090812n456387L849205N718345J39898m805664n055123k855201
2769a1688423m6771L723379O903242O346569K172844k137887m435471m839879
$$ y = [9971607, 10977748, 9565069, 9429347, 8325905, 2725786, -5089325, -9337932, -8505570, -5961663, -3665386, -528315, 2652282, 2189847, -2439112, -5963615, -3638760, 2954200, 9046920, 12594996, 13993920, 12673849, 8110712, 2976969, 1293610, 3475666, 6330763, 8061808, 10156698, 13619673, 16301047, 15605386, 11773714, 6690305, 1149204, -4427107, -7791349, -6528828, -2132197, 595228, -423325, -1777857, -153198, 1948979, 199256, -3229952, -1169906, 7305218, 12954977, 7867316, -3223496, -8679883, -4830678, 887667, 1027565, -3778099, -8833222, -11688423, -11735194, -8011815, -1108573, 5237996, 7410840, 5272953, 837482, -4002397]
2761d002397l030915Q22995L447928J983637n60290R99975N324169N933432J476108
2752A2394642k508018l229084m243373o805731n811626R24385O739081N675403
2744C135679J707019J334799K545389l21179m904732l963791J633264L238723
2736D405171j654320n308302k080321L387973M183342O21695k693689l944872
2728c083323l647903j442662K093491L729464J758225r60420j558565j424490
2720d536183k245998j634596K441376O185527M757183K60584j217076Q42159J352643
2711F205619j151785k048580J337868N300286N660259L181867O21954j366865
2703A7740623k972362l691682m181719n776463o426582k000262N870043Q925746
$$ y = [-4002397, -7033312, -6210317, -2762389, -778752, -1339042, -339067, 4985102, 10918534, 12394642, 9886624, 6657540, 2414167, -4391564, -10203190, -9278805, -2539724, 3135679, 4842698, 6177497, 8722886, 8401707, 3496975, -466816, 1166448, 4405171, 2750851, -2557451, -4637772, -1249799, 2933543, 3555238, 861549, -3083323, -6731226, -8173888, -6080397, -2350933, -592708, -1553128, -3111693, -4536183, -6782181, -8416777, -5975401, 210126, 4967309, 5227893, 4010817, 4852976, 6205619, 5053834, 3005254, 4343122, 9643408, 15303667, 18485534, 19107488, 17740623, 14768261, 11076579, 6894860, 1118397, -5308185, -7308447, -1438404, 7487342]
2695G487342L473515k932103j729132M228010N500647J49545m993593n808979
2687E375252n418134o517707o634592l336415J519534N004548N963884L368735
2679f74895k903236q189873n999359K519399P941319M902118n83028n69421L386142
2670a70834M060091j60591m323360n012555l398497j316016M90294Q38624p63881
2661i756725k133988j314046j60138j131966k328283m14695L177011M344617L321534
2652f396679L603290M603319K150019l174982n157537j294579L397727M544903
2644B275481M227807N102547M590948j2689n070112m990447n35231K495136J388478
2635I471918j239428k462645k261721j929508k278588l204608l029041M65352
$$ y = [7487342, 10960857, 8028754, 6299622, 10527632, 16028279, 16177824, 11184231, 5375252, -42882, -6560589, -13195181, -16531596, -15012062, -10007514, -4043630, -674895, -3578131, -11768004, -17767363, -15247964, -7306645, -2404527, -2987555, -3556976, -170834, 3889257, 3728666, -594694, -5607249, -9005746, -10321762, -9831468, -8992844, -9756725, -11890713, -13204759, -13364897, -14496863, -16825146, -17239841, -14062830, -9718213, -6396679, -2793389, 1809930, 3959949, 784967, -4372570, -5667149, -2269422, 2275481, 6503288, 11605835, 16196783, 16184094, 11113982, 6123535, 5588304, 8083440, 9471918, 8232490, 5769845, 3508124, 1578616, -699972, -3904580, -6933621, -6468269]
2627f468269O147519Q675573M704355j723257l771567p01544J913449L95340k895147
2618F276452m041433k186299J432368N495450Q045426O877737K369823k231732
2610B2037792m694431n686124n678633l196782J440155L703960J93911n103727
2602C016121m427976L473859J0587807Q955637J08026p156363o984299k074692
2594E498120O43291j975705o307664o401819r00621N014561N352020N19151l145485
2585a704151j531019K178168K589198j86173j508473L22469K061681J372300J97710
2576C791710N27722Q21285n77320j817228p70420Q33955L99704o12312P92332
2567C389428L231934K608296q49109k487617p10805P25106n55388j681295j35929
$$ y = [-6468269, -320750, 8354823, 13059178, 11335921, 7564354, 6862810, 8776259, 9171599, 6276452, 2235019, 48720, 1481088, 6976538, 15021964, 21899701, 24269524, 22037792, 17343361, 11657237, 5978604, 2781822, 4221977, 7925937, 8119848, 3016121, -1411855, 2062004, 12649811, 21605448, 21713474, 14557111, 7572812, 5498120, 6141411, 4165706, -2141958, -8543777, -9444398, -4429837, 922183, 1441334, -1704151, -3235170, -1057002, 1532196, 1346023, -162450, 160019, 2221700, 3594000, 3791710, 4319432, 5140717, 4563397, 2746169, 1975749, 2809704, 3209408, 2597096, 3389428, 6621362, 9229658, 8380549, 5892932, 5182127, 5907233, 5351845, 3670550, 3534621]
2558C534621J509461M86075l61210L037567P853691O643036j808372r144366p456357
2549D294146O13408N078549P04350p211778r684527m460291K149418L074037j965161
2540g407849p279106p786841l164256L456121Q553565R819191O871025J773094
2532D834944j888014j572189K199238O182579O780439K960669k483095n303882
2524A1710689m136264j582896m76929q50012j757611l573736n917197n682084
2516a2266040j033129M116055M259567M75957o09978L326615O832280N158781
2508A0260108J268460O70415K907085K876648j054426m868599m969788k810951
2500D278952j980501k833715k337815R49087M034211L412133N01188j13255K119749
$$ y = [3534621, 5044082, 5530157, 5168947, 8206514, 16060205, 22703241, 20894869, 11750503, 4294146, 4907554, 9986103, 10690453, 3478675, -6205852, -10666143, -8516725, -5442688, -7407849, -14686955, -22473796, -25638052, -22181931, -13628366, -3809175, 3061850, 4834944, 2946930, 1374741, 3573979, 9756558, 16536997, 19497666, 17014571, 11710689, 7574425, 5991529, 5514600, 4664588, 2906977, -666759, -6583956, -12266040, -13299169, -9183114, -4923547, -4447590, -5057568, -1730953, 5101327, 10260108, 11528568, 12198983, 15106068, 17982716, 16928290, 12059691, 7089903, 4278952, 2298451, -535264, -2873079, -1923992, 2110219, 5522352, 6023540, 5910285, 8030034]
2491H030034K671091k07951j757507J227169L701851q6157o516682p890898m791358
2482e620408l919763n388937k969888K839870L866338j121020k994361J795516
2474a3512653M067816k068326p672557l318249N056419O399121K424738K012574
2466f611117M031577N18987o434692o227758K126459P608913M660719J26725j66680
2457c66867L91713j246771j161243K822082N094436J310957m001404m865957k407384
2448d430438m15249J495349M471884N610306K593577j152724j462633J16939j91293
2439F635718k049850k847433k433467j500173J280169N860438P903137M135630
2431A6984169k207386n881423o666188p176519o726325l087624J694620L226617
$$ y = [8030034, 10701125, 10493174, 8735667, 9962836, 13664687, 13578530, 7061848, -829050, -5620408, -9540171, -14929108, -17898996, -15059126, -11192788, -12313808, -15308169, -13512653, -9444837, -11513163, -19185720, -22503969, -17447550, -11048429, -8623691, -6611117, -2579540, -2060553, -8495245, -14723003, -12596544, -4987631, -326912, -200187, -366867, 24846, -1221925, -2383168, 438914, 5533350, 6844307, 2842903, -2023054, -4430438, -4845687, -3350338, 1121546, 6731852, 9325429, 8172705, 6710072, 6827011, 6635718, 4585868, 1738435, -695032, -2195205, -915036, 4945402, 12848539, 16984169, 14776783, 8895360, 2229172, -4947347, -11673672, -14761296, -13066676, -9840059]
2423i840059J669981J233339K892290K819612r86155m851165m110242R25375N364019
2414d883005N045899Q38767k053594K87388N271726O071702K71252o122705n731569
2405a004139Q10724N531853K743479m571983q518390m991388K236764O074133
2397a688947M100101M56853p10826p58685k735434n039391l906452n25732N66394
2388a0242119l05250J499203N433042M890390j458535n612090k159390L187860
2380d766889L004917n32082r86185J192879J065934j227040j663775l00727J25678
2371d087290J224213O013107J0540447P636779j031262n731949k715012J198118
2363A3047151L77336j719798l75156K041225R87846k289234l417857k101816j493254
$$ y = [-9840059, -8170078, -6936739, -4044449, -1224837, -2210992, -7062157, -11172399, -10247024, -4883005, 162894, 1001661, -1051933, -764545, 4507181, 10578883, 10850135, 4727430, -1004139, -193415, 5338438, 8081917, 3509934, -5008456, -9999844, -7763080, -1688947, 2411154, 2868007, 2157181, 1398496, -1336938, -6376329, -10282781, -10808513, -10242119, -10547369, -9048166, -3615124, 1275266, -183269, -5795359, -7954749, -4766889, -1761972, -2294054, -3280239, -2087360, -1021426, -2248466, -3912241, -4212968, -4087290, -2863077, 3150030, 13690477, 21327256, 20295994, 14564045, 11849033, 13047151, 13424487, 11704689, 11329533, 13370758, 14358604, 12069370, 8651513, 6549697, 5056443]
2354E056443k525991l383130l389935l623352m093604l301272p62746J884343
$$ y = [5056443, 2530452, -852678, -4242613, -7865965, -11959569, -15260841, -16023587, -14139244]
$$ [...]
##END NTUPLES=NMR SPECTRUM
##END=
