##TITLE=31Pdec_DE-107_rm3h
, 64 sc
 28.8.2025
##JCAMPDX= 6.0         $$ Bruker NMR JCAMP-DX V2.0
##DATA TYPE= NMR SPECTRUM
##DATA CLASS= NTUPLES
##ORIGIN= UXNMR, Bruker Analytische Messtechnik GmbH
##OWNER= root
$$ XWIN-NMR		Version 3.5
$$ Thu Aug 28 14:28:47 2025 Russian Standard Time (UT+4h)  she@DPX200
##.OBSERVE FREQUENCY= 81.013821
##.OBSERVE NUCLEUS= ^31P
##.ACQUISITION MODE= SIMULTANEOUS
##.ACQUISITION SCHEME= undefined
##.AVERAGES= 64
##.DIGITISER RES= 17
##SPECTROMETER/DATA SYSTEM= spect
##.PULSE SEQUENCE= zgpg30
##.SOLVENT NAME= CDCl3
##.SHIFT REFERENCE= (INTERNAL, CDCl3, 0, 198.062)
##AUDIT TRAIL= $$ (NUMBER, WHEN, WHO, WHERE, WHAT)
$$ ##TITLE= Audit trail, XWIN-NMR		Version 3.5
$$ ##JCAMPDX= 5.01
$$ ##ORIGIN= Bruker BioSpin GmbH
$$ ##OWNER= she
$$ F:/spectra/data/she/nmr/P31/2/pdata/1/auditp.txt
$$ ##AUDIT TRAIL=  $$ (NUMBER, WHEN, WHO, WHERE, WHAT)
(   1,<2025-08-28 14:26:53.03 +0400>,<she>,<DPX200>,
      <created by zg, POWCHK disabled, PULCHK disabled
       configuration hash MD5:
       00 E9 B6 7A A2 85 ED C7 34 08 36 98 17 FE 4E 26
       data hash MD5: 32K
       65 56 35 32 6D 99 CA E9 FC A0 5F 30 6E 64 31 3B>)
(   2,<2025-08-28 14:26:56.04 +0400>,<she>,<DPX200>,
      <Start of raw data processing
       efp BC_mod = 2 LB = 1.5 FT_mod = 6 PKNL = 1 PHC0 = 1591.787 PHC1 = -446.9 SI = 64K 
       data hash MD5: 64K
       85 93 9C 4B 10 4C 0E 7D 62 4D 26 63 C1 C0 4C 31>)
(   3,<2025-08-28 14:27:37.92 +0400>,<she>,<DPX200>,
      <pk PHC0 = -257.54 PHC1 = 692.4 
       data hash MD5: 64K
       E1 AD BD 68 2A FD 09 C8 81 38 4B 7C D4 6B 73 80>)
(   4,<2025-08-28 14:28:11.34 +0400>,<she>,<DPX200>,
      <pk PHC0 = -24.71757 PHC1 = 64 
       data hash MD5: 64K
       C8 BC FB ED 4D 60 A3 BF 94 7E AC D2 DD 53 C1 04>)
$$ ##END=
$$ 
$$ hash MD5
$$ 20 D4 E6 B2 67 B4 51 17 BE 2E 5B 1C C5 BE C2 01
##$RELAX= 
##$RELAX= 
##$RELAX= 
##$RELAX= 
##$RELAX= 
##$RELAX= 
##$RELAX= 
##$RELAX= 
$$ Bruker specific parameters
$$ --------------------------
##$DU= <F:/spectra>
##$EXPNO= 2
##$NAME= <P31>
##$PROCNO= 1
##$TYPE= <nmr>
##$USER= <she>
##$AMP= (0..31)
100 100 100 100 100 100 100 100 100 100 100 100 100 100 100 100 100 100 
100 100 100 100 100 100 100 100 100 100 100 100 100 100 
##$AQSEQ= 0
##$AQ_mod= 1
##$AUNM= <au_zg>
##$AUTOPOS= <>
##$BF1= 81.014009
##$BF2= 200.13
##$BF3= 200.13
##$BF4= 200.13
##$BF5= 200.13
##$BF6= 200.13
##$BF7= 200.13
##$BF8= 200.13
##$BYTORDA= 1
##$CFDGTYP= 0
##$CFRGTYP= 5
##$CHEMSTR= <none>
##$CNST= (0..31)
1 1 145 1 1 1 1 1 1 1 1 1 1 1 1 1 1 1 1 1 1 1 1 1 1 1 1 1 1 1 1 1 
##$CPDPRG= <waltz16>
##$CPDPRG1= <>
##$CPDPRG2= <waltz16>
##$CPDPRG3= <>
##$CPDPRG4= <mlev>
##$CPDPRG5= <mlev>
##$CPDPRG6= <mlev>
##$CPDPRG7= <mlev>
##$CPDPRG8= <mlev>
##$CPDPRGB= <>
##$CPDPRGT= <>
##$D= (0..31)
0 1 0 0 0 0 0 0 0 0.06 0 0.03 2e-05 3e-06 0 0 0.0002 0 0 0 0 0 0 0 0 0 
0 0 0 0 0 0 
##$DATE= 1756376812
##$DBL= (0..7)
120 120 120 11 120 120 24 19 
##$DBP= (0..7)
150 150 150 150 150 150 150 150 
##$DBP07= 0
##$DBPNAM0= <>
$$ [...]
##$SUBNAM2= <"">
##$SUBNAM3= <"">
##$SUBNAM4= <"">
##$SUBNAM5= <"">
##$SUBNAM6= <"">
##$SUBNAM7= <"">
##$SUBNAM8= <"">
##$SUBNAM9= <"">
##$SW= 400.765351723535
##$SWIBOX= (0..15)
0 1 3 0 0 0 0 0 0 0 0 0 0 0 0 0 
##$SW_h= 32467.5324675325
##$TD= 32768
##$TD0= 1
##$TE= 0
##$TE2= 300
##$TE3= 300
##$TEG= 300
##$TL= (0..7)
0 120 53 12 22 120 120 120 
##$TP= (0..7)
150 150 150 150 150 150 150 150 
##$TP07= 0
##$TPNAME0= <>
##$TPNAME1= <>
##$TPNAME2= <>
##$TPNAME3= <>
##$TPNAME4= <>
##$TPNAME5= <>
##$TPNAME6= <>
##$TPNAME7= <>
##$TPOAL= (0..7)
0.5 0.5 0.5 0.5 0.5 0.5 0.5 0.5 
##$TPOFFS= (0..7)
0 0 0 0 0 0 0 0 
##$TUNHIN= 0
##$TUNHOUT= 0
##$TUNXOUT= 0
##$USERA1= <user>
##$USERA2= <user>
##$USERA3= <user>
##$USERA4= <user>
##$USERA5= <user>
##$V9= 5
##$VALIST= <valist>
##$VCLIST= <CCCCCCCCCCCCCCC>
##$VD= 0
##$VDLIST= <DDDDDDDDDDDDDDD>
##$VPLIST= <PPPPPPPPPPPPPPP>
##$VTLIST= <TTTTTTTTTTTTTTT>
##$WBST= 1024
##$WBSW= 4
##$XGAIN= (0..3)
0 0 0 0 
##$XL= 0
##$YL= 0
##$YMAX_a= 30644
##$YMIN_a= -42968
##$ZGOPTNS= <>
##$ZL1= 120
##$ZL2= 120
##$ZL3= 120
##$ZL4= 120
##$ABSF1= 0
##$ABSF2= 0
##$ABSG= 0
##$ABSL= 0
##$ALPHA= 0
##$AQORDER= 0
##$ASSFAC= 0
##$ASSFACI= 0
##$ASSFACX= 0
##$ASSWID= 0
##$AUNMP= <proc_1d>
##$AZFE= 0.1
##$AZFW= 0.5
##$BCFW= 0
##$BC_mod= 2
##$BYTORDP= 0
##$COROFFS= 0
##$CY= -3
##$DATMOD= 1
##$DC= 0
##$DFILT= <>
##$DTYPP= 0
##$F1P= 0
##$F2P= 0
##$FCOR= 1
##$FTSIZE= 65536
##$FT_mod= 6
##$GAMMA= 0
##$GB= 0
##$INTBC= 1
##$INTSCL= 9.790993e-09
##$ISEN= 30
##$LB= 1.5
##$LEV0= 0
##$LPBIN= 0
##$MAXI= 10000
##$MC2= 0
##$MEAN= 0
##$ME_mod= 0
##$MI= 50
##$NCOEF= 0
##$NC_proc= -8
##$NLEV= 6
##$NOISF1= 182.463
##$NOISF2= 159.3651
##$NSP= 0
##$NTH_PI= 0
##$NZP= 0
##$OFFSET= 198.0616
##$PC= 4
##$PHC0= 1309.529
##$PHC1= 309.5
##$PH_mod= 1
##$PKNL= yes
##$PPARMOD= 0
##$PSCAL= 0
##$PSIGN= 0
##$REVERSE= no
##$SF= 81.0140089999434
##$SI= 65536
##$SIGF1= 159.3651
##$SIGF2= -187.1042
##$SINO= 113.3802
##$SIOLD= 16384
##$SREGLST= <1H.CDCl3>
##$SSB= 0
##$STSI= 65536
##$STSR= 0
##$SW_p= 32467.5324675325
##$SYMM= 0
##$S_DEV= 0
##$TDeff= 32768
##$TDoff= 0
##$TI= <>
##$TILT= no
##$TM1= 0
##$TM2= 0
##$TOPLEV= 0
##$USERP1= <user>
##$USERP2= <user>
##$USERP3= <user>
##$USERP4= <user>
##$USERP5= <user>
##$WDW= 1
##$XDIM= 65536
##$YMAX_p= 477704591
##$YMIN_p= -118837820
$$ End of Bruker specific parameters
$$ ---------------------------------
##NTUPLES= NMR SPECTRUM
##VAR_NAME=  FREQUENCY,     SPECTRUM/REAL,   SPECTRUM/IMAG
##SYMBOL=    X,             R,               I
##VAR_TYPE=  INDEPENDENT,   DEPENDENT,       DEPENDENT
##VAR_FORM=  AFFN,          ASDF,            ASDF
##VAR_DIM=   65536,         65536,           65536
##UNITS=     HZ,            ARBITRARY UNITS, ARBITRARY UNITS
##FACTOR=    0.49542278885378, 1,            1
##FIRST=     16045.7642231865, 0,            0
##LAST=      -16421.768244346, 0,            0
##MIN=       -16421.768244346, -118837820,   0
##MAX=       16045.7642231865, 477704591,    0
$$ Real data points
##PAGE= N=1
##DATA TABLE= (X++(R..R)), XYDATA
$$ [...]
44904A4806469K72166J595622J931575R67251o51930k276012l673700m328121
44896H643320k919470J145228N527849O340362L086384J25887Q03721K125881
44888B4879162r14545o883486q821635m190164J291470J925815n98880j571329
44880E116408q50001j265549k189283m03820L359100M176291J68513m264686m148645
44871c01672J25690M286146N394203L896526J927765J018420Q76738n6221k262051
44862A4905544l760302k448121N65188J910753L14122k002310k640390j791203
44854E053281r89674q28080q62770o45813j42330J45040n67857k083878k743936
44845c666017j600508k57750m81496q50422J254681M755801N693447L390632J729480
$$ y = [14806469, 15078635, 16674257, 18605832, 19573083, 18921153, 16645141, 12971441, 8643320, 5723850, 6869078, 12396927, 18737289, 21823673, 21949560, 22753281, 24879162, 23964617, 17081131, 8259496, 4069332, 5360802, 7286617, 6687737, 5116408, 4266407, 3000858, 811575, 407755, 3766855, 7943146, 8111659, 3846973, -301672, -175982, 4110164, 9504367, 13400893, 15328658, 16347078, 17223816, 17167595, 14905544, 11145242, 8697121, 9262309, 11173062, 11487184, 9484874, 6844484, 5053281, 4063607, 3235527, 2372757, 1726944, 1584614, 1729654, 1161797, -922081, -3666017, -5266525, -5524275, -6005771, -6856193, -5601512, -845711, 4847736, 8238368, 9967848]
44836I967848K779230L230883j10530m716572n789887l010479j79194L60692n39552
44827A992439j634953k441938k142122m06405J033758M67942n88331O80933L537592
44818D98915M202339J603931q97115p21761K51649p11133k478171j734052J843294
44809A857896M807611M332776J411631q87766j077300j98529L44233O30805J342346
44800A2563703J965165J306780l47052j294073j069794j204679k396949k913772
44792F609329j399679N92501J016868O37837J320393K393662J817688J00702l31636
44783A2757665O69089Q64971k55139q02421k98025m35525j216992k25206K764929
44774A3823346M273085K321070l97792j074908j032940k219940k696372J62392
$$ y = [9967848, 12747078, 15977961, 15867431, 11150859, 5360972, 2350493, 2171299, 2531991, 1992439, 357486, -2084452, -4226574, -4632979, -3599221, -3131279, -3719610, -3038677, 498915, 4701254, 6305185, 5408070, 4686309, 4937958, 4226825, 1748654, 14602, 1857896, 6665507, 10998283, 12409914, 11522148, 10444848, 10246319, 10590552, 11221357, 12563703, 14528868, 15835648, 15488596, 14194523, 13124729, 11920050, 9523101, 6609329, 5209650, 5802151, 6819019, 7456856, 8777249, 11170911, 12988599, 13089301, 12757665, 13426754, 14291725, 14036586, 13234165, 12936140, 12500615, 11283623, 11058417, 13823346, 18096431, 20417501, 20019709, 18944801, 17911861, 15691921, 12995549, 13157941]
44766A3157941M119031M321772K36393l746467m377183k656578r42491k93146
44758I819272r28446k347468k693952p10632J632259J352711p45313r33099J372187
44749E817519K312937k12468k861969j887924J131939J780393q62858l573302
44741A644267l744444j956721n7226J005231J287509J419902K143484L197421
44733D939423L082713J089275j127477j492356m42250j49053j137550j652135
44725C110590n69166R63356J477854J244693J382787J945235K016875J329891
44717A2902115Q64372J585638K783394K151796j615587o158557o875227k340101
44709C297843K961747L533342j52889k406230k07826K977834K753177L6364j035026
$$ y = [13157941, 17276972, 21598744, 21835137, 18088670, 13711487, 11054909, 10112418, 9819272, 8890826, 6543358, 3849406, 3138774, 4771033, 6123744, 5378431, 4445332, 5817519, 8130456, 7917988, 5056019, 3168095, 4300034, 6080427, 5217569, 1644267, -2100177, -4056898, -4114124, -3108893, -1821384, -401482, 1742002, 4939423, 8022136, 9111411, 7983934, 6491578, 6049328, 5900275, 4762725, 3110590, 2541424, 3504780, 4982634, 6227327, 7610114, 9555349, 11572224, 12902115, 13766487, 15352125, 18135519, 20287315, 18671728, 12513171, 5637944, 3297843, 6259590, 9792932, 9640043, 7233813, 7025987, 10003821, 12756998, 12793362, 11758336]
44700A1758336O15290K219452J828523M88369k68253k82714K54714J204804J405297
44691A9223818l46457k686766k720946n45014K03101k113255m017208j912840
44683E084433K238602L566448J147986j363386j449871n42318o63504j283922
44675F734468q01634P55814J753637P67718k018836m489383m045601n42712K943165
44666A056636L803353L238699L690085M288354K370725j115323k130472n9691
44658A5142366Q56369j686000m242431l334714r65887p31510j723868q03467J335974
44649C846832J318865p65308j243571J053200K953386K069018J38158j08043J270373
44640A0532910K117646Q88224k027035m237935k828494K158773O252486N165130
$$ y = [11758336, 12373626, 14593078, 16421601, 16909970, 16641717, 16359003, 16613717, 17818521, 19223818, 18877361, 16190595, 13469649, 12924635, 13127736, 11014481, 6997273, 5084433, 7323035, 10889483, 12037469, 10674083, 9224212, 8681894, 8018390, 6734468, 5932834, 6688648, 8442285, 9210003, 7191167, 2701784, -1343817, -1886529, 1056636, 4859989, 8098688, 11788773, 16077127, 18447852, 17332529, 15202057, 15142366, 15998735, 14312735, 10070304, 6735590, 5769703, 5038193, 3314325, 2510858, 3846832, 5165697, 4400389, 3156818, 4210018, 7163404, 9232422, 9370580, 9262537, 10532910, 12650556, 13538780, 11511745, 7273810, 4445316, 6604089, 12856575, 18021705]
44632A8021705M30511k670572k470632k248803l815504m394241j804136J449140
44624B497468K216892J501765J810647K402323J048019j280503j581296J25357
44616H740672Q02156n46579j350066K55323K526122K725947O07055j925801l162111
44607H672718k539222m15246J988555L030394J945976l79399k240391k581536
44599G481849j608092j92881J155387K553629L801594L743895J613798j206467
44591A7342712k308290j429374p94682j639438k346532j274397N03179J040060
44583I093238L57579o31597k303338m747832n505425k337752K345547L514109
44575b15471K63378k904584k346217M92241K454613L102836L605640L703911K445926
$$ y = [18021705, 18452216, 15781644, 13311012, 11062209, 7246705, 2852464, 1048328, 2497468, 4714360, 6216125, 8026772, 10429095, 11477114, 10196611, 8615315, 8740672, 9542828, 8996249, 7646183, 7901506, 10427628, 13153575, 13760630, 11834829, 8672718, 6133496, 5718250, 7706805, 10737199, 12683175, 12303776, 10063385, 7481849, 5873757, 5680876, 6836263, 9389892, 13191486, 16935381, 18549179, 17342712, 15034422, 13605048, 12810366, 11170928, 8824396, 7549999, 8053178, 9093238, 9450817, 8819220, 6515882, 1768050, -3737375, -6075127, -3729580, -215471, 47907, -2856677, -5202894, -4710653, -2256040, 846796, 4452436, 8156347, 10602273]
44566A0602273N10082n51895n13430j23812M70519J229526J148040l93352j901480
44557A0476471j311511J068887K764335K070053m36874k844662l216545p68558
44549G801596K843177M279357K168963r13408j863914j183348j288472j993126
44541I850825j121733R23837J264087l93062j043859L8567l97972l275017l787156
44532B058517J530734P956823Q132566K288418k797964l919870m182848n355823
44524E710553m323731K49360L656929J823148k031591k237990P95951K068340
44516E710969J75336j368862n53908N27932L22226N84340K674092M440039L129673
44507A5641837o27695l712335m137176k431432m05934M97968L38502M73573J473945
$$ y = [10602273, 11112355, 10560460, 10047030, 9923218, 10393737, 11623263, 12771303, 12377951, 10476471, 9164960, 10233847, 12998182, 15068235, 14631361, 11786699, 8570154, 7801596, 10644773, 14924130, 17093093, 16179685, 14315771, 13132423, 11843951, 9850825, 8729092, 9652929, 10917016, 10523954, 9480095, 9518662, 9120690, 5845673, 2058517, 3589251, 11546074, 19678640, 21967058, 19169094, 15249224, 11066376, 5710553, 1386822, 1636182, 5293111, 7116259, 5084668, 2846678, 3642629, 5710969, 5886305, 4517443, 3963535, 4491467, 4813693, 5398033, 8072125, 12512164, 15641837, 15014142, 11301807, 7164631, 4733199, 4327265, 4825233, 5163735, 5637308, 7111253]
44498G111253J748965j38886k435982k022133Q16265K412986J031426r96601j452778
44489F074515j208309j308890m46765K045066L542081J684495j559500k699528
44481F123165j808301j265554r15722J398963N022255O345374L923929K70072
44473A9094181k079789l070899k995779j259840J301593J966197K9470j309349
44465A1675785O38210L601776L060911j490914n654246n587880k238685O76340
44457D681297J413275J369807J791720J207194k233016o610636p126085k219288
44449g725732L532123M836923K302988P80982K286380M146111L971199K592023
44441A6722997J195273p42902k935978l025100l06471J961432Q81951j528466
$$ y = [7111253, 8860218, 8721332, 6285350, 4263217, 5079482, 7492468, 8523894, 7527293, 6074515, 4866206, 3557316, 3110551, 5155617, 8697698, 10382193, 8822693, 6123165, 4314864, 3049310, 2133588, 3532551, 8554806, 14900180, 18824109, 19094181, 17014392, 13943493, 10947714, 9687874, 10989467, 12955664, 12985134, 11675785, 12313995, 15915771, 18976682, 17485768, 11831522, 6243642, 4004957, 4681297, 6094572, 7464379, 9256099, 10463293, 8230277, 1619641, -5506444, -7725732, -4193609, 643314, 2946302, 3727284, 6013664, 10159775, 14130974, 16722997, 17918270, 17175368, 14239390, 11214290, 10907819, 12869251, 13751202, 12222736]
44433A2222736j378585R63376J507981r46093k822181j168999K004725K753216
44425A3136176O42216j199398p90524L33055P2513q06878l4457K085257K387021
44416A5824981n50964l660457l173333K41981K593807K027174L24079q61727k017966
44407A0747575l268152l022205p99021J120997Q17186m90477o65804K05410Q90859
44398E536368J451728K374850K751915J643946Q4173m49675l91183p87064j001906
44389A1213152j63382M19697q60176k610889k127773K23262J505638Q63104M41499
44380H904132J513691K858843L500985L992519M190170K768177J24500j037414
44372B6815603M08114J936996R00135j895400l869826m169914l639053k729940
$$ y = [12222736, 10844151, 11807527, 13315508, 12369415, 9547234, 8378235, 10382960, 13136176, 13778392, 12578994, 11788470, 12121525, 12194038, 11387160, 11352703, 13437960, 15824981, 15274017, 11613560, 8440227, 8682208, 11276015, 13303189, 13627268, 12765541, 10747575, 7479423, 4457218, 3658197, 4779194, 5596380, 5105903, 4440099, 4645509, 5536368, 6988096, 9362946, 12114861, 13758807, 13842980, 13393305, 13002122, 12215058, 11213152, 11049770, 11469467, 10609291, 7998402, 5870629, 6093891, 7599529, 8462633, 8904132, 10417823, 13276666, 16777651, 20770170, 24960340, 27728517, 27853017, 26815603, 27223717, 29160713, 30060848, 28165448, 24295622, 20125708, 16486655, 13756715]
44364A3756715j422901l77502m28048j263087j713223j050086N58290K251337
44356A0311495K750673J334883j063400k666407k926402k616534j907871j70670
44348C045767J993578K632881J205725m47008q24263n55719n28597l93096j84095
44339E945173j088882k890709l022657m28673J858137Q40826j598181j394878
44331a779844J387706K834878J487303L28763J514245K715781R03026k593082
44323F798776l477548j47004M228370N475501K953825k72339j181377J57158J507034
44314A6042396J602607J217904J303143J591216J585577J552362J697360J547932
44306B8140497R52337M12896k98997k128054m309138m102396o60558K930110L577110
$$ y = [13756715, 12333814, 11956312, 11528264, 10265177, 8551954, 7501868, 8060158, 10311495, 13062168, 14397051, 13333651, 10667244, 7740842, 5124308, 3216437, 3045767, 5039345, 7672226, 8877951, 8430943, 7606680, 7050961, 6522364, 6129268, 5945173, 4856291, 1965582, -1057075, -1485748, 372389, 1213215, -384966, -1779844, -392138, 2442740, 3930043, 4258806, 5773051, 8488832, 9391858, 6798776, 3321228, 3174224, 7402594, 12878095, 15831920, 15559581, 14378204, 14535362, 16042396, 17645003, 18862907, 20166050, 21757266, 23342843, 24895205, 26592565, 28140497, 29092834, 29505730, 29206733, 27078679, 22769541, 18667145, 18006587, 20936697, 24513807]
44297B4513807J991638J03801k664783o770878q578012m322776K855488N621300
44289A2749585K616681J41344K143154M472292K313221j906918k730499j20498
44281A9678362J453763J81118j795600k994919l789601l488696p40637K839777
44273A1343567L497350P35506j498665k73358K509512L202261J085678j536519
44265A9065332k335712q51612J486696K581093J925822J597188L425838N556020
44257C2450665M376425P7431k851291j816445L72227K72720q91284O6549K379306
44248C4436303K194456j192411l961915l399162j552981j615951l180987l419102
44240A8308250j587392N5027m15899k161312k800851r78029K507903N284861N008384
$$ y = [24513807, 26505445, 26609246, 23944463, 17173585, 8595573, 4272797, 7128285, 12749585, 15366266, 15507610, 17650764, 22123056, 24436277, 22529359, 19798860, 19678362, 21132125, 21313243, 19517643, 16522724, 12733123, 9244427, 8503790, 11343567, 14840917, 15576423, 14077758, 13804400, 16313912, 19516173, 20601851, 19065332, 16729620, 15878008, 17364704, 19945797, 21871619, 23468807, 26894645, 32450665, 36827090, 36904521, 34053230, 32236785, 32609012, 32881732, 31990448, 32056997, 34436303, 36630759, 35438348, 31476433, 28077271, 26524290, 24908339, 21727352, 18308250, 16720858, 16775885, 16359986, 14198674, 11397823, 10419794, 12927697, 18212558, 23220942]
44231B3220942J366686l034276m580672k240706J121695J842025k58250j684099
44223A5753345K35922L681774M417328J236613k324246k478566M2241J434764
44215B1999175L30636o08185P87036K542617J487563j666631l070311j357483
44207B0444417M05178o64039l197428l909893k198487k05567O51472R05549J211004
44198A3442206J413035J443420J392600P50952p17099j597155m39109J318885
44190A7007735N83838k781082n283091m701810k846943j851010o41976K277038
44182A762699M924351M185008Q20404j329448p18920N29434O11499K49518L32000
44173A1366545K32925l62428k81633J073875K204283J422044q75466k856705l210429
$$ y = [23220942, 24587628, 21553352, 16972680, 14731974, 15853669, 17695694, 17437444, 15753345, 15989267, 19671041, 24088369, 25324982, 23000736, 20522170, 20564411, 21999175, 22329811, 21721626, 22508662, 25051279, 26538842, 24872211, 21801900, 20444417, 20849595, 20185556, 16988128, 13078235, 10879748, 10674181, 11325653, 12231202, 13442206, 14855241, 16298661, 17691261, 18442213, 17725114, 16127959, 15688850, 17007735, 17591573, 14810491, 9527400, 4825590, 1978647, 127637, -514339, 1762699, 6687050, 10872058, 11692462, 10363014, 9644094, 10173528, 10785027, 11034545, 11366545, 11599470, 11237042, 10955409, 12029284, 14233567, 15655611, 14780145, 11923440, 8713011]
44164H713011j791020O21475K597804L060632K406383J727411J017728m43625
44156A7909799k103921k502632j752404j416171j543282m15731J962000K991915
44148A3129573J519176j26334o7609N1656j388725k167768L32271L852362L812179
44139A8946781K87360k043076j027688L10263o24446j889367p80905J459684J700687
44130A6339293j87367j442282o47132O11598L08437j536459l236628l303143j708910
44121E197407K39966J329457J812501K820996M342392M866095L621558K040438
44113B6270810J897904K781018K756471J228966k97667n46531l04245j098435
44105C2688291k713502l217793j678755J57683j18033k268455l463022j998910
$$ y = [8713011, 6921991, 7543466, 10141270, 13201902, 15608285, 17335696, 18353424, 17909799, 15805878, 13303246, 11550842, 10134671, 8591389, 8175658, 10137658, 13129573, 14648749, 14522415, 14454806, 14506462, 13117737, 10949969, 11282240, 15134602, 18946781, 19234141, 17191065, 16163377, 16473640, 15849194, 13959827, 13178922, 14638606, 16339293, 16151926, 14709644, 14062512, 14674110, 14982547, 13446088, 10209460, 6906317, 5197407, 5437373, 6766830, 8579331, 11400327, 15742719, 20608814, 24230372, 26270810, 28168714, 30949732, 33706203, 34935169, 34637502, 34090971, 33786726, 32688291, 29974789, 26756996, 25078241, 25235924, 25117891, 22849436, 19386414, 17387504]
44097A7387504L75505Q76244o33233j865687j393943N9258J477236K751724L496926
44088B2531534K442070p33238l958978m527900k089489R25347J854662L63707
44080A6807715j508085j633304j4705J517610J781028J562285J917595K234431
44072B2664570J323541l08435j044708o95626n30442p83788k06181J520070K986031
44063B4925032L322891L204584K787240R85277j813141k652161J88559M025292
44055C4973573M871411K531546Q7459q15549j314100k151080k090469l25858J753068
44046C7520001K419972J774501R23363J07307j132576k469061k598203p22360
44038C5822944K133133L546917J836659j932238m539051l886303j379379k21388
$$ y = [17387504, 17763009, 18639253, 18006020, 16140333, 14746390, 14805648, 16282884, 19034608, 22531534, 24973604, 24240366, 20281388, 15753488, 13663999, 14589346, 16444008, 16807715, 15299630, 13666326, 13651621, 15169231, 16950259, 18512544, 20430139, 22664570, 23988111, 23679676, 22634968, 21939342, 21408900, 20625112, 20418931, 21939001, 24925032, 28247923, 31452507, 34239747, 35225024, 33411883, 30759722, 30948281, 34973573, 39844984, 42376530, 42463989, 41648440, 40334340, 38183260, 36092791, 35766933, 37520001, 39939973, 41714474, 42637837, 42745144, 41612568, 39143507, 36545304, 35822944, 37956077, 41502994, 43339653, 41407415, 36868364, 32982061, 31602682, 31381294]
44030C1381294j572877l477325l698276k438648j538003j742844j896954r10157
44022A4106210M25005M40502q40583j377846n209J482005O41786j800443k533009
44013A0538418k76175K407417K945197K315682K931369M435695M027070O33598
44005B9958271l279595m435016k103446J457988L178301J855438p61356j813989
43997B4056596n20417J227421J664229J130096N89346J266m95082L48052K625423
43988C0626930L710377J430273k396955m245763l665230k841185k283250n53746
43980A9781451J834967K131783j34764j751072l75908K321535L615522L236121
43972C0659635K216281O16657j524290k833348k340646j272358j272460j970256
$$ y = [31381294, 29808417, 26331092, 22632816, 20194168, 18656165, 16913321, 15016367, 14106210, 14531215, 14971717, 14131134, 12753288, 12748079, 14230084, 14871870, 13071427, 10538418, 10262243, 12669660, 15614857, 17930539, 20861908, 25297603, 29324673, 29958271, 26678676, 22243660, 20140214, 21598202, 24776503, 26631941, 25870585, 24056596, 23536179, 24763600, 26427829, 27557925, 28147271, 28148537, 27653455, 28001507, 30626930, 34337307, 35767580, 33370625, 29124862, 25459632, 22618447, 20335197, 19781451, 21616418, 23748201, 23613437, 21862365, 21486457, 23807992, 27423514, 30659635, 32875916, 33492573, 31968283, 29134935, 26794289, 25521931, 24249471, 22279215]
43964B2279215j983570j253494o46135k9282J546384L998485N693453M794169
43956C4399225R77721l580132n227003k334956K257650M150953K680298R09584
43948C4233340L99358m73619k102023j825476J084336K684444K55248k535420
43940C1720188r91832K817667L226871L29691k18307L171716N144676K139721
43932D7340391j808828j537654J475262K285357M80419J19834K935400O176532
43924E7466713P406468P665051Q719975R891907R242283O457238L263919J722478
43916A11836032K700612N164345O488442M480235k08594m553443o732201q204956
43908A10970472j1108117j4542688j5338617j2398843q308335n960167n294841
$$ y = [22279215, 20295645, 19042151, 18396016, 18366734, 19913118, 23911603, 29605056, 34399225, 35376946, 31796814, 26569811, 24234855, 26492505, 30643458, 33323756, 34233340, 34632698, 34159079, 32057056, 30231580, 31315916, 34000360, 34255608, 31720188, 30728356, 33546023, 36772894, 37102585, 36884278, 40055994, 45200670, 47340391, 45531563, 43993909, 45469171, 47754528, 48234947, 48354781, 51290181, 57466713, 64873181, 72538232, 81258207, 91150114, 100392397, 106849635, 110113554, 111836032, 114536644, 119700989, 126189431, 130669666, 130461072, 125907629, 119175428, 110970472, 99862355, 85319667, 69981050, 57582207, 49273872, 43313705, 38018864]
43901C8018864m558045l317078k470706k169376j750007j438890k114380l220454
43893A6979928k827852l75532K201178K811682J489083j72134o44312Q16571L606703
43884B3885315N426868M105516M91136k042726j730011l33977o7526o01747n56654
43875B8576194j04458k30146p74442j004260j012654j026918n76498K14400P3438
43866B4134656j047070q81475J781494M489233M396629K426659J317413J191414
43858C7808953M67676k15233R75412K808250K043477j146050k980070j975842
43850C7786573j011291k213946l542900k381823M88663K533277K698959J324631
43842C5682143r61127k758637k531079j120996j352214l773152n339304l935579
$$ y = [38018864, 33460819, 30143741, 27673035, 25503659, 23753652, 22314762, 20200382, 16979928, 14152076, 13776544, 15977722, 18789404, 20278487, 20106353, 19462041, 20278612, 23885315, 29312183, 33417699, 33908835, 31866109, 30136098, 29802121, 29734595, 29132848, 28576194, 28471736, 28241590, 27467148, 26462888, 25450234, 24423316, 23846818, 24061218, 24134656, 23087586, 22206111, 23987605, 28476838, 32873467, 35300126, 36617539, 37808953, 38276629, 38061396, 39036808, 41845058, 43888535, 42742485, 39762415, 37786573, 36775282, 34561336, 31018436, 28636613, 29125276, 31658553, 34357512, 35682143, 34721016, 31962379, 29431300, 28310304, 26958090, 23184938, 17845634, 13910055]
43834A3910055j501874o01085n41442M67883J613351J038526m65279m43404J444935
43825A4921666L334088M107840L949169K625070j46451k855701l175762j005765
43817B1754154J294113J854616R93892L4646j07526Q29126K322636L169817K713566
43808C4859040J801829J699554K427803K908878K152907k84778l898983o416341
43800C5249909m889646Q25187O822254R007814P254001M304059K050940R82618
43792F1607136J835186M816103P764045Q092853O606183O500685Q095358P456576
43784A12774125J651326o794229j2468820j2926676j0454543q650452q577085
43777E4553646q377235o050336k202211L34612k02696k231835k590173k12508
$$ y = [13910055, 12408181, 11807096, 11265654, 11733537, 13346888, 14385414, 13920135, 13476731, 14921666, 18255754, 22363594, 26312763, 28937833, 28791382, 25935681, 22759919, 21754154, 23048267, 24902883, 25896775, 25931421, 25823895, 26653021, 28975657, 32145474, 34859040, 36660869, 38360423, 40788226, 43697104, 45850011, 45565233, 41666250, 35249909, 30360263, 31185450, 38007704, 47015518, 54269519, 58573578, 60624518, 61607136, 63442322, 68258425, 76022470, 84115323, 90721506, 97222191, 105317549, 112774125, 114425451, 107631222, 95162402, 82235726, 71781183, 63130731, 54553646, 46176411, 40126075, 37923864, 38258476, 38055780, 35823945, 33233772, 33021264]
43769C3021264K744500L294143O25956k976524l986330j165473K530712K928504
43761C7016752L522j737425N09885L654598L268151L08721l56407K758498O056110
43752E1482405O822844O908566Q784839J1120185J0840124P753610M589265L185761
43744A11487599K709826J601776j93956j472261j720861k208236m546248q160341
43736I7497298j0352489r725013q268096q437644r278813p823113l832281m33629
43728C9346220J85248q87614j869444k662596l574705l929646l417035l081435
43720B0108993l532314l563931j815357J376138M651916O757286O311710K472196
43712C2766637k889450n676777m081440j052092l59885j686705j914189j35946
$$ y = [33021264, 35765764, 39059907, 39685863, 36709339, 32723009, 31557536, 34088248, 37016752, 37020274, 35282849, 35792734, 39447332, 42715483, 43024204, 42667797, 45426295, 51482405, 58305249, 65213815, 73998654, 85118839, 95958963, 103712573, 108301838, 111487599, 114197425, 115799201, 115605245, 114132984, 112412123, 110203887, 105657639, 97497298, 87144809, 77419796, 69151700, 60714056, 51435243, 43612130, 39779849, 39346220, 39531468, 38643854, 36774410, 34111814, 30537109, 26607463, 23190428, 20108993, 16576679, 13012748, 11197391, 12573529, 17225445, 23982731, 30294441, 32766637, 29877187, 24200410, 20118970, 19066878, 18706993, 17020288, 15106099, 14970153]
43704A4970153J401868J125626K67871N13914J382869J027108j219525l863578
43696A5606306m601613k518007R02992L189691L454001L004904L238299L948916
43688B6225489M344274M546280M903814M707105L078365P04890q06763j221229
43680D6482225j893913l388386m106664k167479J821952M779349M293607J394761
43672D7215452n30515L11552K270360K978887K547201K389667K136242N26185
43664E9845031j097915J42526L331359L469516j296225n866894n119599j636954
43656E1770845j818697o060367q346719n579629j710543r00658j511259j186K941606
43647B8783393M094075L187704K621814K871701K195493P57181J204017M156858
$$ y = [14970153, 16372021, 17497647, 17765518, 18279432, 19662301, 20689409, 19469884, 15606306, 11004693, 8486686, 9389678, 12579369, 16033370, 19038274, 22276573, 26225489, 30569763, 35116043, 40019857, 44726962, 47805327, 48510217, 47703454, 46482225, 44588312, 41199926, 37093262, 34925783, 36747735, 41527084, 45820691, 47215452, 46684937, 46996489, 49266849, 52245736, 54792937, 57182604, 59318846, 59845031, 58747116, 58889642, 62221001, 65690517, 64394292, 58527398, 53407799, 51770845, 49952148, 43891781, 35545062, 29965433, 28254890, 27354232, 25842973, 25841787, 28783393, 32877468, 36065172, 38686986, 41558687, 43754180, 44511361, 45715378, 49872236]
43639D9872236O246336M386236q2740l310577l535055j992965k77014J310813
43631E2617270L031737M739263N669666M601601R19218l690739n834860m277562
43623E7775594k085921k718028m906588m515760j262078L29523k078854m560801
43615C5977087k575740K269062M636124K746250m29899k085337j914567j18419
43607C8504561L075963N714923N405658K814857Q64875K48499q78120k490658
43599E3260558k078654M89165J680282k15880k266127k010407j605510l687668
43591D3565759o434237o510165m341642k602822j643227m14115K179j773924l406752
43582A6441054j374675L009292M699172K214586m46132Q8889K398917L331702
$$ y = [49872236, 56118572, 60504808, 60422068, 57111491, 53576436, 51583471, 51306457, 52617270, 55649007, 60388270, 66057936, 70659537, 71578755, 67888016, 62053156, 57775594, 55689673, 52971645, 48065057, 43549297, 42287219, 42616742, 40537888, 35977087, 33401347, 35670409, 40306533, 43052783, 42622884, 40537547, 38622980, 38504561, 41580524, 47295447, 52701105, 55515962, 56380837, 56629336, 55751216, 53260558, 51181904, 51671069, 53351351, 53135471, 50869344, 48858937, 47253427, 43565759, 37131522, 30621357, 26279715, 23676893, 22033666, 21619551, 21621730, 19847806, 16441054, 15066379, 18075671, 22774843, 24989429, 24543297, 24632186, 27031103, 30362805]
43574C0362805J996326m46794k265133j602207J921869N484164N682213L280410
43566D4413653K228033L532343L901228J604395m14649N12702K340322J739650
43558E9857677q31894k587502k755625k381932j505950L95559K386953L356013
43550E5933299M316736O725956R412128R966893Q552141P514995P533143O856588
43542A16811879M306296M27101m331966r765627j3873490j3742659r762596o353079
43534F3715859o598942q149071o702060k147010J463779J576944j9519n92457
43526D2547523k27513n63323j387312q06013J574329L804345M337167L821543
43518E3100746L391608K856201J827303J192562J806951K809172L071339L392431
$$ y = [30362805, 32359131, 31912337, 29647204, 28044997, 29966866, 35451030, 41133243, 44413653, 46641686, 50174029, 54075257, 55679652, 55265003, 55777705, 58118027, 59857677, 59025783, 56438281, 53682656, 51300724, 49794774, 50190333, 52577286, 55933299, 60250035, 66975991, 76388119, 86355012, 94907153, 102422148, 109955291, 116811879, 121118175, 121545276, 117213310, 107447683, 93574193, 79831534, 70068938, 63715859, 57116917, 48967846, 42265786, 40118776, 41582555, 43159499, 43139980, 42547523, 42320010, 41756687, 40369375, 39563362, 41137691, 44942036, 49279203, 53100746, 56492354, 59348555, 61175858, 62368420, 64175371, 66984543, 70055882, 73448313]
43510G3448313N099316P180809P434693O338920P006282J0793160J5546133J8982844
43502A51830470K1187575K2553174K1824962J7964718J1894454M654845m077416
43495B47832782j3604083k0410853k1453263j7986973j3744113j0551360q224732
43488A41857405p336999q661976j0343454r077932m567120J9687K552852M211070
43480A08653533O481715Q623915R565420J0150945J1703110J3732142J4650483
43473A83561263J3782619J1374150P460071J970011m521820j0944620j6125633
43466A86556041j8729786j7953772j4985320j2570283j2100314j2138578j0879275
43459H7198713q902858p962659p933414o943503m388229j990732j498094k714745
$$ y = [73448313, 78547629, 85728438, 93163131, 99502051, 106508333, 117301493, 132847626, 151830470, 173018045, 195571219, 217396181, 235360899, 247255353, 251910198, 247832782, 234228699, 213817846, 192364583, 174377610, 160633497, 150082137, 141857405, 134520406, 125858430, 115514976, 106437044, 101869924, 101889611, 104442463, 108653533, 115135248, 123759163, 133324583, 143475528, 155178638, 168910780, 183561263, 197343882, 208718032, 216178103, 218148114, 213626294, 202681674, 186556041, 167826255, 149872483, 134887163, 122316880, 110216566, 98077988, 87198713, 78295855, 70333196, 62399782, 55456279, 51068050, 49077318, 47579224, 44864479]
43451D4864479m280616n191691m993854l590993j653902m05386k46083k87766
43443B4214188J09151K88845k20538k31509J405821L218991K443129p97039k882230
43434B7548809j343788J825386L116962K135491J122628J028782P65647J4392
43426C6214309q5018N06158J75851j277959j530108O52298K769423J826770j160493
43417C8091231k393377m56088K049042K092151m07951l139513l961674k564302
43409B9309519n45566J9375j162333k028641p78307J459149K005293L82476j113614
43400B7547351p62986N53453J402871K101109L599161N277647N553433M265741
43392D9537780K931049K537633K373875J537163N73405O29705J427343J320828
$$ y = [44864479, 40583863, 35392172, 30398318, 26807325, 25153423, 24748037, 24501954, 24214188, 24323339, 24612184, 24391646, 24160137, 25565958, 28784949, 31228078, 30431039, 27548809, 26205021, 28030407, 31147369, 33282860, 34405488, 35434270, 36199917, 36214309, 36129291, 36635449, 36811300, 35533341, 34003233, 34655531, 37424954, 39251724, 38091231, 35697854, 35241766, 37290808, 39382959, 38975008, 35835495, 31873821, 29309519, 28763953, 28783328, 27620995, 25592354, 24814047, 26273196, 28278489, 28660965, 27547351, 26784365, 27337818, 28740689, 30841798, 34440959, 39718606, 45272039, 49537780, 52468829, 55006462, 57380337, 58917500, 59490905, 60120610, 61547953, 62868781]
43384F2868781l17750j897832j775094q60886j486371l716404m707214k703262
43376D5403968q9571o50275m439742p342126o029087j893513P32846m93243l619799
43367B1579458m900731l014200k86638M04957p43742r59765J196373L923619M703640
43358B1902971L282526J164264n79581j707353k060981j817248j653452j449995
43350A7081151M2378K792934M176014K189905j180939k345859r71706L16391L64221
43341B2464490L40180M90043k11816q51744R60548M378119N205001K280581k18024
43332C4837378N49571J406403r89804l555682j471652L150293L738135l59736
43324C7304906k617925M64171M153915L258365j58753r67243R33597J671855M89217
$$ y = [62868781, 62551031, 60653199, 58878105, 58017219, 56530848, 52814444, 48107230, 45403968, 45314397, 44664122, 40224380, 32882254, 26853167, 24959654, 25692500, 25199257, 21579458, 16678727, 13664527, 13377889, 13782846, 13039104, 12079339, 13275712, 17199331, 21902971, 25185497, 26349761, 25770180, 24062827, 22001846, 20184598, 18531146, 17081151, 17123529, 19916463, 24092477, 26282382, 25101443, 22755584, 21783878, 22100269, 22464490, 22804670, 23294713, 23082897, 22231153, 23191701, 27569820, 32774821, 35055402, 34837378, 35386949, 36793352, 35803548, 32247866, 30776214, 33926507, 37664642, 37304906, 34686981, 35151152, 39305067, 42563432, 42404679, 41437436, 42371033, 44042888, 44532105]
43315D4532105O40755L447361N878298N171809K672391J434707K034596K383255
43307F8195277O43055k822350n842809o273418m051653j605272j414170l132505
43299D3696155m124289k803958j36034K228894L649614L939204K952280J554700
43291E0956566J225969J625369M60338k742556m832398l309195o12327j034279
43283D1737487m412032o435233m993082k486882j264993n23125P92416J461788
43275B3876344N64228l25853M653j8010j511849k049583N68983L531308K445564
43266B7085785j491990k619166P65148L957688L166187P53160O79536K441414
43258C4737762K952069J911738J529583K254183K439394J839474K058664L175389
$$ y = [44532105, 45172860, 48620221, 54498519, 59670328, 62342719, 63777426, 65812022, 68195277, 68838332, 66015982, 60173173, 53899755, 49848102, 48242830, 46828660, 43696155, 39571866, 36767908, 36631874, 38860768, 42510382, 46449586, 49401866, 50956566, 52182535, 53807904, 54268242, 51525686, 46693288, 43384093, 42771766, 41737487, 37325455, 30890222, 25897140, 23410258, 22145265, 21622140, 22414556, 23876344, 24440572, 24114719, 24119372, 24101362, 22589513, 20539930, 21108913, 24640221, 27085785, 25593795, 22974629, 23739777, 27697465, 30863652, 31616812, 32296348, 34737762, 37689831, 39601569, 41131152, 43385335, 45824729, 47664203, 49722867, 52898256]
43250E2898256K941937M26635k009029k018565p72306j069373k914962l382264
43242D4100329j072154J451250R46819k089615m029281k697784L73145K426694
43234C9409403K522115J432894O9193q10328m47533J021448K311158K765631L435539
43225E1709520N091094O334675N502255L427464K091477J293583o86626l443369
43217G1320073m443839l031339j530473j497152j612948n82587M81786L47334
43209E9450855J19707J278551K869471K854430J247252k2173L04524J894579L833990
43200G3831186N229553N433199M826033M849787O498386R498231J3334574J7717874
43192A41218823K1544326K3255229K3087089K2881688K2564830J9321903J1970527
$$ y = [52898256, 55840193, 56266828, 54257799, 52239234, 51466928, 50397555, 47482593, 44100329, 43028175, 44479425, 45426244, 43336629, 39307348, 36609564, 36982709, 39409403, 41931518, 43364412, 43433605, 42623277, 42175744, 43197192, 45508350, 48273981, 51709520, 56800614, 63135289, 68637544, 72065008, 74156485, 75450068, 74763442, 71320073, 66876234, 63844895, 62314422, 60817270, 59204322, 58621735, 59103521, 59450855, 59570562, 60849113, 63718584, 66573014, 67820266, 67798093, 68102617, 69997196, 73831186, 79060739, 84493938, 89319971, 94169758, 100668144, 110166375, 123500949, 141218823, 162763149, 186018378, 209105467, 231987155, 254551985, 273873888, 285844415]
43185B85844415L449458l447341j0020081j7943693k4087624k3783830j8288462
43178A91722842j4060977j4227746j5245045j3289123r846773q635738r995864
43171A06421576j1122788j0162426p676673n019195l176019k666232l112194l163384
43163F0322665j840766J94649J270744M29256j669036l294386l166540j727074
43155E0519512n38714j64913L35043J160825P11516j599715l230129j898850J91070
43146D5485645r36686m528675n382241j415176K969248K942438n40562k958877
43138C5635114k181578K84301K155706K139256K57005j617237r78282J806437
43130C7500722L004533N49291k453714j893998J484521L617532L175712K385607
$$ y = [285844415, 289293873, 285846532, 275826451, 257882758, 233795134, 210011304, 191722842, 177661865, 163434119, 148189074, 134899951, 125053178, 116417440, 106421576, 95298788, 85136362, 77459689, 72440494, 69264475, 66598243, 63486049, 60322665, 58481899, 58676548, 59947292, 60376548, 58707512, 55413126, 52246586, 50519512, 49980798, 49815885, 50150928, 51311753, 52023269, 50423554, 47193425, 45294575, 45485645, 44548959, 40020284, 34638043, 33222867, 36192115, 39134553, 38593991, 35635114, 33453536, 33737837, 35893543, 38032799, 38289804, 36672567, 35694285, 37500722, 40505255, 41054546, 38600832, 36706834, 38191355, 41808887, 44984599, 47370206]
43122D7370206K395847J781356J15156n40399J137429L834756O048749P833576
43114F9976676R021501Q513389O921712P153658J0132756J2348516J0458524O473552
43106A41000284N153213P477961J0312096J2150907J5290311K1325797K7747508
43099B40458077L0724735K8940778K3011437J3323471O79518j2399756k3230374
43092C01507886l0879361l4873805l3610095k6631390j7355448j0401159o521886
43085A41234742l257847m64940j363462o936569j2889752j4526691j2128571r092976
43077H0573934o938372m978627l279122k663732k427410r70926J387635K715516
43069F3418896K604306K675026L706845M524603M432357M814897P122650J0314573
$$ y = [47370206, 49766053, 51547409, 51662565, 51122166, 52259595, 56094351, 62143100, 69976676, 78998177, 87511566, 94433278, 101586936, 111719692, 124068208, 134526732, 141000284, 146153497, 153631458, 163943554, 176094461, 191384772, 212710569, 240458077, 271182812, 300123590, 323135027, 336458498, 337138016, 324738260, 301507886, 270628525, 235754720, 202144625, 175513235, 158157787, 147756628, 141234742, 137976895, 137511955, 136148493, 129211924, 116322172, 101795481, 89666910, 80573934, 73635562, 68656935, 65377813, 62714081, 60286671, 59315745, 60703380, 63418896, 66023202, 68698228, 72405073, 76929676, 81362033, 86176930, 93299580, 103614153]
43061A03614153J1394905Q361516K368889l099669n624652o310167p764232r773197
43053I3167546r332337n824176l119851m171593o270518n143313j609927J21176
43045E7817007n88312m68459J353754J801115n82091l151655l676793l178009
43037D9326557k713787j449445K32690j13497k366665k439527J577105N730593
43029D7784024O092421M685507N397862P127605N974010K310690N54650K520889
43021H2447658N349059N851513L263724j949389q265795j2169069j0814129o174423
43013E7539149l363008m301144o009761n651936m062612l128213k490646o75725
43005B7856104K186526M336061M302617K185912l14410j147599p0680Q13200k22109
$$ y = [103614153, 115009058, 123370574, 125739463, 122639794, 117015142, 110704975, 102940743, 93167546, 83835209, 78011033, 74891182, 70719589, 64449071, 59305758, 57695831, 57817007, 57228695, 56760236, 58113990, 59915105, 59333014, 56181359, 52504566, 49326557, 46612770, 45163325, 45396015, 45282518, 42915853, 40476326, 42053431, 47784024, 53876445, 58561952, 63959814, 71087419, 77061429, 79372119, 79926769, 82447658, 87796717, 93648230, 96911954, 94962565, 86696770, 74527701, 63713572, 57539149, 54176141, 49874997, 43865236, 38213300, 34150688, 31022475, 28531829, 27856104, 30042630, 34378691, 38681308, 40867220, 40552810, 39405211, 39334531, 40147731, 39925622]
42996C9925622j965229j947901P7899K250134L535553M329038M493422L283292
42988E3981830J443480J197908L549340P010531R152096Q253535M034119j553151
42980H7069688m920412m267891j893237j138314j968001k073831j309564j600590
42972F7897848k767783k215073O26807L001694L077605K492285L297694M869069
42964H0280146N232645L512644J43526l469426n066378l564334j315288j756298
42956G3997237m442763n399477l023468l08417q0128j386053k207900k557255
42948E4591776k936662k630413j592121j408540k451129k720219j392052n79248
42940C8881392j414700j526398Q78083L380373K940011N09682j209357k164925
$$ y = [39925622, 37960393, 36012492, 36090391, 38340525, 41876078, 46205116, 50698538, 53981830, 55425310, 56623218, 60172558, 67183089, 76335185, 84588720, 88622839, 87069688, 82149276, 77881385, 75988148, 74849834, 72881833, 70808002, 69498438, 67897848, 65130065, 62914992, 63541799, 66543493, 69621098, 72113383, 75411077, 80280146, 85512791, 89025435, 89168961, 85699535, 80633157, 77068823, 75753535, 73997237, 69554474, 64154997, 61131529, 60823112, 60742984, 59356931, 57149031, 54591776, 51655114, 49024701, 47432580, 46024040, 43572911, 40852692, 39460640, 38881392, 37466692, 35940294, 36818377, 40198750, 43138761, 43648443, 42439086, 40274161]
42932D0274161l551188m267992k758377o63377n52441j262356L60083L836800
42924C1415313N289065L141129m7928j564168j231011j27640N52000m17612k652462
42915C4356686l179317J5656M281604N436153L729533K877582L894064M406300
42907E5818261L982732N087401P781733Q388972N256624J462468l80862j812150
42899H5585179m363850n770149l854344r57263n27594j652398j015985J379844
42891F8823440K627047K195634K685229N109924P028495O436177M897773N389042
42883A05192761Q552151J2249969J4046874J3525450J2660854J4026245J8081621
42876A98335925K2350438K3854912K2046850J8618621J4894235J0574754N091423
$$ y = [40274161, 36722973, 32454981, 29696604, 29033227, 28480786, 27218430, 27578513, 31415313, 36704378, 39845507, 39797579, 38233411, 37002400, 36874760, 37426760, 37009148, 34356686, 31177369, 31193025, 35474629, 40910782, 44640315, 47517897, 51411961, 55818261, 59800993, 64888394, 72670127, 81059099, 86315723, 87778191, 87397329, 85585179, 81221329, 75451180, 71596836, 70639573, 70111979, 68459581, 67443596, 68823440, 71450487, 73646121, 76331350, 81441274, 88469769, 94905946, 99803719, 105192761, 113744912, 125994881, 140041755, 153567205, 166228059, 180254304, 198335925, 220686363, 244541275, 266588125, 285206746, 300100981, 310675735, 315767158]
42869C15767158q55951n615981q004412q013094o239553l110793P06972L171601
42861B87805947J487393m843715j2403393j7154307j9073737k1291763k4471510
42854A90054915k4911161j9736031j1643881o144517n333828o578271o554542
42847A09152684m458910j559523N38014J150080J349493L252968P247314J0626820
42839A27298940J0808067R479233J1255521J7731842K4806918K6899851K2479939
42832B50760311J4375924N708480k937926j2318552k1641855k7830248k8110016
42825A78006118k3216142j7288221j4048836j3494430j2857629j0266862o640274
42818H0193724m333472m764815p135282q783321p258932k993178M98391J81273
$$ y = [315767158, 314911207, 309295226, 301290814, 293277720, 287038167, 283927374, 284634346, 287805947, 289293340, 284449625, 272046232, 254891925, 235818188, 214526425, 190054915, 165143754, 145407723, 133763842, 127619325, 122285497, 115707226, 109152684, 104693774, 103134251, 103672265, 104822345, 106171838, 109424806, 116672120, 127298940, 138107007, 147586240, 158841761, 176573603, 201380521, 228280372, 250760311, 265136235, 270844715, 267906789, 255588237, 233946382, 206116134, 178006118, 154789976, 137501755, 123452919, 109958489, 97100860, 86833998, 80193724, 75860252, 71095437, 63960155, 55176834, 47917902, 44924724, 45423115, 45604388]
42810D5604388l010801n371043m717871k091167M91244K022357K054495M33521
42802C5415123j535709j519856P99459K575301J379070j280900k114537r25628
42794C2792323p41915k945619m893639l600510J50724L084463L552028K476608
42786B9874463R51845q83261k494081k581853r65736O12376O43059j98477k73511
42777B4684824P76229K171771L522362M702117M757747K745014k98645j886065
42769D1175354j019552P64539J748923K044898K552543L253382L629276L869701
42761E8019064M548887N627508O557244O778437N482527J814250l650605q357036
42753G6820276r908033q437022o037904m399683l873635m106020m356305l742385
$$ y = [45604388, 42593587, 37222544, 32504673, 30413506, 30904750, 32927107, 34981602, 35415123, 33879414, 32359558, 33159017, 35734318, 37113388, 35832488, 33717951, 32792323, 32050408, 29104789, 24211150, 20610640, 20761364, 23845827, 27397855, 29874463, 30826308, 29943047, 27448966, 24867113, 23901377, 24513753, 25156812, 24958335, 24684824, 25461053, 27632824, 31155186, 35857303, 40615050, 43360064, 43061419, 41175354, 40155802, 40920341, 42669264, 44714162, 47266705, 50520087, 54149363, 58019064, 62567951, 68195459, 74752703, 81531140, 87013667, 88827917, 85177312, 76820276, 66912243, 58475221, 52437317, 48037634, 44163999, 40057979, 35701674, 31959289]
42745C1959289k405474j852586k812168l496420j821203J141267K139078J69700
42737B3021483k362154l284162k995254k261932k57306L362613O445615O780068
42729B8448971N288614M394567M130644K651756L99580P05780N195067J0840808
42721F2055787J3152632J0907233O305394J618861k552972o179211q688472r361154
42713F7258098q103107n767139m053950m458006o417638p157943m749210r46682
42705B5604423P33107k85432j005933M81472K186731J734000M29975R95988K634783
42696C3509114K004026r68091k086755R47357M705288M732777J617239n45899
42688D3915056o6540J196227J715248J920730J968004J117695K065N69013K633230
$$ y = [31959289, 29553815, 27701229, 24889061, 21392641, 19571438, 20712705, 22851783, 23021483, 20659329, 17375167, 14379913, 12117981, 11860675, 15223288, 21668903, 28448971, 33737585, 38132152, 42262796, 44914552, 45314132, 46019912, 51214979, 62055787, 75208419, 86115652, 92421046, 94039907, 91486935, 85307724, 76619252, 67258098, 59154991, 53387852, 49333902, 44875896, 38458258, 31300315, 26551105, 25604423, 26337530, 26052098, 25046165, 25527637, 27714368, 29448368, 29878343, 30874331, 33509114, 35513140, 34545049, 32458294, 33405651, 38110939, 42843716, 44460955, 43915056, 43848516, 45044743, 46759991, 48680721, 50648725, 51766420, 51768485, 52337498, 54970728]
42679E4970728L180531P02025k208917k655395j747852k504826m888478n923576
42671C8924240m231967j571135K95349J622087K839566K956896J147303j481095
42663D0501244k952654k441564m68848J954156L576429L255196J087907j349300
42655D3162566k678257l116484l560539l951762l428214j698355M72627J856172
42647B7057754J442229p84604l157551l269642n60172K676655L819431K792612
42639C0016712J407908P21378N28067P62309J482345J737495M87065j288923j502978
42630C4351378l06865k17810k109041l519177k483321q17323j304513l179915
42622B0413413l140384k34057K823463L332551J600947j27981k74870Q90081J693663
$$ y = [54970728, 58151259, 58853284, 56644367, 53988972, 52241120, 49736294, 44847816, 38924240, 34692273, 33121138, 33416487, 35038574, 37878140, 40835036, 41982339, 40501244, 37548590, 35107026, 34638178, 36592334, 40168763, 43423959, 44511866, 43162566, 40484309, 37367825, 33807286, 29855524, 26427310, 24728955, 25201582, 27057754, 28499983, 27715379, 24557828, 21288186, 20728014, 23404669, 27224100, 30016712, 31424620, 32145998, 32674065, 33436374, 34918719, 36656214, 37143279, 35854356, 34351378, 34044513, 33826703, 31717662, 28198485, 25715164, 24897841, 23593328, 20413413, 17273029, 17038972, 19862435, 23194986, 24795933, 24667952, 24393082, 25283163, 26976826]
42613B6976826P63332r50669o57280K482651N190514L868366k70966k692092j889157
42604C2821525r42433k139066l526529k520725N7300J925920K931043L931422
42596C2538457L978848J865483n09120K84121M184819P091117O040618K734262
42588E8208605R24139J908562L711856L793183J697581n68399m24252K785978
42580G2037253P287528J1077690J3873710J6086321J6807579J4411345Q926452
42573A60507878K423468k889086n798531n735478k984994O79587L236858M738540
42565A54178242P035279J0710223J3573792J2932212Q469757K277952l324671
42558B05852786p567285j1295055j5470774j9392703k0852213j8632544j4102464
$$ y = [26976826, 27740158, 26789489, 26132209, 28614860, 33805374, 37673740, 37402774, 34710682, 32821525, 31879092, 29740026, 26213497, 23692772, 23750072, 25675992, 28607035, 32538457, 36517305, 38382788, 37873668, 38157789, 42342608, 49433725, 55474343, 58208605, 59132744, 61041306, 64753162, 68546345, 70243926, 69675527, 69251275, 72037253, 79324781, 90402471, 104276181, 120362502, 137170081, 151581426, 160507878, 162931346, 160042260, 154243729, 148508251, 145523257, 146202844, 149439702, 154178242, 161213521, 171923744, 185497536, 198429748, 206899505, 209177457, 205852786, 198285501, 186990446, 171519672, 152126969, 131274756, 112642212, 98539748]
42551I8539748r385892m957401n79995K458497K475151L87029j023894r80295
42543H6932948j270262k602325l296882k574183k241872l485152m585462l919422
42535F2957388k967861l831582n473690n144137k440367O02613K655094L826232
42527E0183690L828112K006526p54408k331551j859135l39640J164758K279937
42519E4178289K381808Q02106j736688l440937l474110k359395m15799K514972
42511D8450246N536222O696067N346450L247836K508833L358481M663261N817186
42503H5624582P239306R330396J1646522J3335379J4369825J6080948J9827014
42496A77453972K4997684K9195689L0796166L0318295K8712568K5682729K0878671
$$ y = [98539748, 89153856, 84196455, 83616460, 86074957, 88550108, 88937137, 87913243, 86932948, 85662686, 83060361, 79763479, 77189296, 74947424, 71462272, 66876810, 62957388, 59989527, 56157945, 50684255, 45540118, 43099751, 43702364, 46357458, 50183690, 54011802, 56018328, 55263920, 52932369, 51073234, 50733594, 51898352, 54178289, 56560097, 57362203, 55625515, 52184578, 48710468, 46351073, 45935274, 48450246, 53986468, 60682535, 66028985, 69276821, 71785654, 75144135, 79807396, 85624582, 92863888, 102194284, 113840806, 127176185, 141546010, 157626958, 177453972, 202451656, 231647345, 262443511, 292761806, 321474374, 347157103, 368035774]
42489C68035774J5550773J1578112R769266J0261384J3059608J6446498J6639923
42482D61341338J1721859M641394p81757n877171j5366294k9612370m2528392
42475C83538607m8268940m6833710m1877812l6087232l0432673k5391444k0819607
42468A33827189j6117433j1696913q758389p170693n737532m777573n492624o448596
42460F7627436m577364p09849M25521k307914l955665j619798J74175k825525
42452E2231017o343516l844760K217613L482411j186900m070100r96375K710645
42444D4200035J575640j829641k495224j212421j749631l567964l129240n13828
42436C1277726O22051q52243j977054n43069K060208L579131L771335L616668
$$ y = [368035774, 383586547, 395164659, 404933925, 415195309, 428254917, 444701415, 461341338, 473063197, 477704591, 476922834, 471045663, 455679369, 426066999, 383538607, 335269667, 288435957, 246558145, 210470913, 180038240, 154646796, 133827189, 117709756, 106012843, 97254454, 90083761, 84346229, 79568656, 74076032, 67627436, 63050072, 62340223, 62765744, 60457830, 56502165, 54882367, 55056542, 52231017, 45887501, 42042741, 44260354, 47742765, 46555865, 42485765, 41489390, 44200035, 45775675, 43946034, 41450810, 40238389, 38488758, 34920794, 31791554, 31277726, 31899777, 31047534, 29070480, 28527411, 30587619, 34166750, 37938085, 41554753]
42428D1554753L599388L746705M228718N224702O684767Q307558R494874R857420
42420I2698885J0128599J1598848J3993242J5131617J3658723J0725167P596073
42413A75531154L126365m166556j2380743j7188954j6767584j3791783j1914717
42406A02447182j1738425j1114651q522353n133544l461434m328701n725582n175732
42398D7246760k755827o37923M5923Q4841j68079j643415m089259n193567l822201
42389B9067253j923122j237265m55743J705474K920196M35565l666957m618233
42381B2227168j862378L87331l38148j864018j828460r99581n62600K88396J926687
42372A7374397K490142Q73670r21301p52347M88465R41995R59498J673912K166414
$$ y = [41554753, 45154141, 48900846, 53129564, 58354266, 65039033, 73346591, 82841465, 92698885, 102827484, 114426332, 128419574, 143551191, 157209914, 167935081, 175531154, 178657519, 174490963, 162110220, 144921266, 128153682, 114361899, 102447182, 90708757, 79594106, 71071753, 65938209, 62476775, 58148074, 52422492, 47246760, 44490933, 43853010, 43898933, 43983774, 43815695, 42172280, 38083021, 32889454, 29067253, 27144131, 25906866, 25451123, 27156597, 30076793, 30512358, 26845401, 22227168, 20364790, 20752121, 20413973, 18549955, 16721495, 15721914, 15159314, 15447710, 17374397, 19864539, 20738209, 19816908, 19064561, 19553026, 20495021, 21454519, 23128431, 25294845]
42363B5294845Q90138j238213j916091r61230k83483p58035j390001j494930j710644
42354A6432356k540530l223251k386858N99892M500158O319586L985619m94934
42346B3192038k493653n11137J754187Q31676j467414j145150J835463L939044
42338B5935054L466640K075725J376120J311896J826232L047997L739490K487759
42330D5266913O05254R85060L837088O385661P061605P125231P830531Q934405
42322H8031748J0325983J1965196J1827777P454083K80551n245111p786707j0308817
42314A06544703j3868993j4942101j1471967p089629n714472n768313l915755
42307D3773473j296396j223031l017041l202927j469054n44421q78074k18987
$$ y = [25294845, 26184983, 24946770, 23030679, 22069449, 21785966, 21027931, 19637930, 18143000, 16432356, 13891826, 10668575, 8281717, 8881609, 13381767, 19701353, 23686972, 23192038, 20698385, 20187248, 21941435, 22773111, 21305697, 20160547, 21996010, 25935054, 29401694, 31477419, 32853539, 34165435, 35991667, 39039664, 42779154, 45266913, 45872167, 46857227, 50694315, 57079976, 64141581, 71266812, 79097343, 88031748, 98357731, 110322927, 122150704, 129604787, 129885338, 124640227, 116853520, 106544703, 92675710, 77733609, 66261642, 59172013, 53457541, 47689228, 43773473, 42477077, 41254046, 38237005, 35034078, 33565024, 33020603, 32142529, 31923542]
42299C1923542J563621J721261p26119l364550m128765l462461k248632o52954
42291B0624943N48168M34897K6605J006635K402229J804662j77563m94950J057302
42282B7232928J305094q44121k845597l593997n201578p647915o706846o32448
42274A065520N450191O127060L258314K344640M127815N021346M120757M140785
42266C5656428N666804N739667L106518N09006J24303K05359j693947m672883
42258D4641255n891246m567231k589948j688172j478090n83308R82910J395233
42250C0221403m47801k681206k465040j07459J269013P75053J220065L708952
42242C1492980M388137J50337n283296n740095j416221J863081J564344J095776
$$ y = [31923542, 33487163, 35208424, 34482305, 31117755, 26988990, 23526529, 21277897, 20624943, 21173111, 21608008, 21634613, 22641248, 25043477, 26848139, 26670576, 26175626, 27232928, 28538022, 27693901, 24848304, 21254307, 16052729, 8404814, 1697968, 1065520, 6515711, 12642771, 15901085, 18245725, 22373540, 27394886, 31515643, 35656428, 41323232, 47062899, 50169417, 50678423, 50802726, 51008085, 49314138, 44641255, 38750009, 34182778, 31592830, 29904658, 28426568, 27843260, 28826170, 30221403, 29773602, 27092396, 24627356, 24519897, 25788910, 26563963, 27784028, 31492980, 35881117, 36031454, 30748158, 25008063, 23591842, 25454923, 27019267, 28115043]
42234B8115043K958020M724177L779176J426154k65239j828785l870633m526301
42226C0511612k411527O05320K311156L218951M073877L184979m17238l709697
42218C7367433l442015j285838j182069k953342k918693k57619J665882O98055
42210B7691794j290563j904836j229094j66120J341600K973513L239399J631823
42202C2287516l5166K32167K256517M308238M977157L847156J398393j252806
42194D8019172l299832m897451o036272n545359k858509M2305P78471J15736N53914
42185B6872175J733690Q23046k110751l217789r45516R87951o13742l152850k382829
42176A7993385Q16409K069425L60924j184281q67800m37186j103146j497281q54601
$$ y = [28115043, 31073063, 35797240, 39576416, 41002570, 40737331, 38908546, 35037913, 30511612, 28100085, 28705405, 31016561, 34235512, 38309389, 41494368, 41077130, 37367433, 33925418, 32639580, 31457511, 28504169, 25585476, 25327857, 26993739, 27691794, 26401231, 24496395, 23267301, 23101181, 24442781, 27416294, 30655693, 32287516, 32252350, 32484517, 34741034, 39049272, 44026429, 47873585, 49271978, 48019172, 44719340, 39821889, 33785617, 28240258, 25381749, 25424054, 26202525, 26318261, 26872175, 28605865, 29428911, 27318160, 24100371, 23154855, 24142806, 23529064, 20376214, 17993385, 18809794, 20879219, 21240143, 20055862, 19188062, 18750876, 17647730, 16150449, 15295848]
42167A5295848q77088k595274l955304k587099Q36654L831024N155968M915844
42159B0020573L082735j5326k671176l257173k185713q34394O24873K356504K752210
42150A9873113J04632l620479m013664m53226K060445k67802m030948l188270
42142F463801J843188M384793J151723l136827l078789k96413J75493j669749
42134E837220j237076K620285N359586L670992J17474j294400n09496L49453J112103
42125A6026141K516748L140904J102749k188157l409456k016154m54701N3694
42117A4771768P51709K145969K735480J814474Q32550Q12152P44598k04459j035140
42108B3369101q52343n33406r26211j115311j90821P36542J74241j173229j322700
$$ y = [15295848, 14418760, 11823486, 7868182, 5281083, 6117737, 9948761, 15104729, 20020573, 23103308, 23087982, 20416806, 17159633, 14973920, 14139526, 14764399, 17120903, 19873113, 19977745, 16357266, 12343602, 11890376, 13950821, 13683019, 9652071, 6463801, 8306989, 12691782, 13843505, 10706678, 7627889, 7331476, 7506969, 5837220, 4600144, 7220429, 12580015, 16251007, 16368481, 15074081, 14564585, 14914038, 16026141, 18542889, 21683793, 22786542, 20598385, 17188929, 15172775, 14718074, 14771768, 15523477, 17669446, 20404926, 22219400, 23051950, 23864102, 24608700, 24404241, 23369101, 22516758, 21983352, 21057141, 19941830, 19751009, 20487551, 20661792, 19488563, 18165863]
42099A8165863J68489J874920K400684J251387j411613m333398n157350k652059
42091A0306923J261408L277952K467321R23096P20834J612319J968231Q96484
42083B3434568r53103k070561j482623J47390J134281Q44196L87075O83268J054540
42074B3179031Q17100Q54077J835514K177120K36428k279464k016889J085789
42066B5888706L575896L473526K300058J394541k55003k811994l663915j402495
42058B8499320J065225O37855j031146m85511J445635J122596j150887j126770
42050B8976317J878813K809060j227815n379549l476621K840087O145660L201332
42042C5767284j712801l589616k559039j524398j393519j151879o35689n89769
$$ y = [18165863, 18334352, 20209272, 22609956, 23861343, 22449730, 18116332, 12958982, 10306923, 11568331, 14846283, 17313604, 18236700, 18957534, 20569853, 22538084, 23434568, 22481465, 20410904, 18928281, 19075671, 20209952, 21054148, 21441223, 22124491, 23179031, 23996131, 24850208, 26685722, 28862842, 29099270, 26819806, 24802917, 25888706, 29464602, 32938128, 35238186, 36632727, 36377724, 33565730, 29901815, 28499320, 29564545, 30202400, 29171254, 28685743, 30131378, 31253974, 30103087, 28976317, 30855130, 33664190, 32436375, 27056826, 23580205, 26420292, 32565952, 35767284, 34054483, 30464867, 27905828, 26381430, 24987911, 23836032, 23200343, 22610574]
42034B2610574p99870l36050N53706M56068j187505l184036l791188k124501J270653
42025A3467851M339129M507015J159461k894374l847462j156558J822238J966022
42017A9363322k4857j039430L31892K291563K235922k64712l143612m191216l474624
42008A2084248l027156l844228l994810j099736L609089N824422L530465k08503
42000A2873791j365300l4841Q55404M58703M99686J350822J186319k10850j84075
41991A5429659K473945M773851L653203P05529l17495O50943L04016k091509k856367
41982B2725775O77728N852811Q002722O319187M009376L445998L660827L029837
41974E7724261K533863M978962J1450075J9663448K6305040L0538513L4161489
$$ y = [22610574, 21810704, 21474654, 22028360, 22484428, 21296923, 18112887, 14321699, 12197198, 13467851, 17806980, 22313995, 23473456, 20579082, 16731620, 15575062, 17397300, 19363322, 19338465, 18299035, 18630927, 20922490, 23158412, 22893700, 19750088, 15558872, 12084248, 9057092, 5212864, 1218054, 118318, 3727407, 9551829, 13082294, 12873791, 11508491, 11473650, 12329054, 12787757, 13287443, 14638265, 15824584, 15613734, 15429659, 17903604, 22677455, 26330658, 27036187, 26718692, 27369635, 27673651, 25582142, 22725775, 23403503, 29256314, 37259036, 43578223, 47587599, 51033597, 54694424, 57724261, 60258124, 65237086, 76687161, 96350609, 122655649, 153194162, 187355651]
41967A87355651L7655190L6943677K6025815L900935k1930550m0253891m4927213
41960A84769614l8916508l0083704k3687945j9150945j3524599o877397k851754
41953D9676762l612847o052776n177759p06348K509443J297524j585532j982021
41945C4366446m41741m96209k452748l061124j186247M04087r7169q39155l10956
41936B5885184k66864j869473k350006N76461L633398K181692k056087k969525
41928B2764780N24697K962913J401315j63854J457790K237301k396569q498282
41920B0290091q026684p84216M914789L954294L72729m57826K97303j104130l534857
41911A5921493k890297O53335K642404J327439j66908L82914O47618j794205m555766
$$ y = [187355651, 225010841, 261954518, 287980333, 291881268, 269950718, 229696827, 184769614, 145853106, 115769402, 92081457, 72930512, 59405913, 52528516, 49676762, 46063915, 40011139, 34833380, 34127032, 36636475, 37933999, 36348467, 34366446, 33924705, 33428496, 30975748, 27914624, 26728377, 27132464, 27035295, 26196140, 25885184, 25618320, 23748847, 21398841, 21975302, 25608700, 27790392, 25734305, 22764780, 23289477, 26252390, 27653705, 27489851, 28947641, 31184942, 28788373, 20290091, 12263407, 11479191, 16393980, 20348274, 20721003, 20263177, 20560480, 19456350, 15921493, 13031196, 13684531, 16326935, 17654374, 17487466, 17870380, 18517998, 16723793, 12168027]
41902A2168027l436916J138914M210168K881524j66914r33743N05199R97668n75585
41893A6788342j929912j264958J4081j87731j229649q91294R52009K140590J665144
41884A6056622R95664J278369J275950m36184k649011k767504l48288K236055
41876A5641673K665602J034140p60243j101279j1353R48022J48369k201366l820555
41867A2543010k692632N06082L008989K949391J121540k55113K4559J075549J040716
41858A9322091o92612k460354k051233M64824K566603K326212N26301q98925j217086
41849A7885821o90310M73394J439104N98198j742837k081827J804786O167728
41841B3854057N021221j409405o276388n292939k025074j709379l790975m174311
$$ y = [12168027, 8731111, 9870025, 14080193, 16961717, 16794803, 15861060, 16366259, 17363927, 16788342, 14858430, 13593472, 13607553, 13419822, 12190173, 11298879, 12250888, 14391478, 16056622, 17052286, 18330655, 19606605, 19170421, 16521410, 13753906, 13405618, 15641673, 18307275, 19341415, 18581172, 17479893, 17468540, 18416562, 18564931, 16363565, 12543010, 9850378, 10356460, 13365449, 16314840, 17436380, 17181267, 17205826, 18281375, 19322091, 18629479, 16169125, 14117892, 14582716, 17149319, 19475531, 20001832, 19102907, 17885821, 17195511, 17668905, 19108009, 19706207, 17963370, 15881543, 17686329, 23854057, 28875278, 27465873, 21189485, 15896546, 13871472, 12162093, 8371118, 4196807]
41833D196807j868779Q52808K960060M890910N410192K826379q87675j633410
41825A6747292O96855J878590P2252j399858K57320K904972L367261K258148J702143
41816B8484975J103639j027709l078673k288491L86765J440395M48851M42259
41808B5912011K262737K684652k21365l293025k465517J300263L012262j45180
41800B9046838n598983q283651n650034L1660L770728K648641j228641l275964
41792A1460594j858187L13727M84901o11020q28771k09161k68870r18797o45296
41783F919120O34858J320322Q59173N33104R71628Q61356q83848l144247l889322
41774D182144k483748J36211K674619M058651L680443J974018J96363r57465j788289
$$ y = [4196807, 2328028, 3180836, 6140896, 11031806, 16441998, 19268377, 18380702, 16747292, 17444147, 19322737, 19394989, 17995131, 18252451, 21157423, 24524684, 26782832, 28484975, 29588614, 28560905, 25482232, 23193741, 23580506, 25020901, 25469752, 25912011, 28174748, 30859400, 30638035, 27345010, 24879493, 26179756, 29192018, 29046838, 23447855, 15164204, 9514170, 9545830, 13316558, 15965199, 14736558, 11460594, 9602407, 9916134, 10401035, 9790015, 8961244, 8752083, 8483213, 7564416, 6919120, 7553978, 8874300, 9733473, 10266577, 11238205, 12099561, 11215713, 8071466, 4182144, 1698396, 1834607, 4509226, 8567877, 12248320, 14222338, 14418701, 13461236, 11672947]
41765A1672947k153608q23715K546614N753639N986795L189384O8944j252506
41757B4988494j295330j689575k805339l596603l164092j844802q71554j067765
41749H653434j774249j414166M45818K163082K051578Q18154N17196J247462Q46420
41740A3554729j492343l292608k031091J112599K732878J645322k79172j389318
41732A0560996j930592k047407o32062K388356M546732L683115J160112P756M71227
41723A8208233n7500k499352m171103k738032J3945N29030j440347k491023l37884
41714E015967L066111L934964R74911l434188n619189l706924Q25661M134101
41706E191414L347343l61851k707836j005596K750445M417642K609436k09036
$$ y = [11672947, 9519339, 8695624, 11242238, 16995877, 22982672, 26172056, 26241000, 24988494, 23693164, 22003589, 19198250, 15601647, 12437555, 10592753, 9721199, 8653434, 6879185, 5465019, 5910837, 8073919, 10125497, 10943651, 11460847, 12708309, 13554729, 12062386, 8769778, 6738687, 7851286, 10584164, 12229486, 11950314, 10560996, 8630404, 6582997, 5950935, 8339291, 12886023, 16569138, 17729250, 17737006, 18208233, 18150733, 15651381, 11480278, 8742246, 8756191, 9285221, 7844874, 5353851, 5015967, 8082078, 12017042, 12991953, 9557765, 3938576, 231652, 1057313, 5191414, 8538757, 8176906, 5469070, 4463474, 7213919, 11631561, 14240997, 14031961]
41698A4031961j128066K30548K188493K874062J135999k788146o437175o326426
41690C781250j685866L677126N091817K457054Q7935Q99856K951744K962544J158780
41681B1382240K13863N22257k86625k810699l977055j405902K599001L875922
41673B0113002J852263n60758j718007k578506l071691q80857M098769P033771
41665B4287986L359760m386088q441756m898099J899151N075093L027830k97321
41657A9626556j354976o46343m07654r01469n14821J196190K302993J016522j616819
41648A8700179k835098j726922j79172P8266l04598j40228j77470j689183l465783
41639H259991k786074M71272L115157K902352J429123J370312K460901K149282
$$ y = [14031961, 12903895, 13134443, 15322936, 18196998, 19332997, 16544851, 10107676, 3781250, 2095384, 5772510, 10864327, 13321381, 13409316, 14309172, 17260916, 20223460, 21382240, 21596103, 22118360, 21831735, 19021036, 15043981, 13638079, 16237080, 20113002, 21965265, 21404507, 19686500, 17107994, 14036303, 13155446, 17254215, 24287986, 27647746, 23261658, 14819902, 9921803, 11820954, 16896047, 19923877, 19626556, 18271580, 17625237, 17217583, 16316114, 15801293, 16997483, 19300476, 20316998, 18700179, 15865081, 14138159, 13958987, 14037253, 13732655, 13592427, 13414957, 11725774, 8259991, 5473917, 5945189, 9060346, 11962698, 13391821, 14762133, 17223034, 19372316]
41631A9372316m42790l011949k705497O71275M320380N091400K589540m37372
41623B5447303j249282j16828R89092J946438M208366O838971O173040J206762
41615D5443862l642073m009137j566529j087928l188596m141397k347452o15762
41607B4844988j357340l324184m293619l694419j403518K632170O030156M845971
41599B4280205q19321n306254m332345n59851R64438J02502K33299J710654J663448
41590A7936775l98962j595172o22931M88039L13455o8349l0779n72914j384458
41581A4064704m21951K058567K758336O48238o87425J260071L419558J913649
41573B5013747j584410k554978o80655M32719m94264j138331l65756K09944k807
$$ y = [19372316, 18929526, 15917577, 13212080, 13883355, 18203735, 23295135, 25884675, 25447303, 24198021, 24081193, 25070285, 27016723, 31225089, 38064060, 44237100, 45443862, 41801789, 37792652, 36226123, 35138195, 31949599, 27808202, 25460750, 24844988, 23487648, 20163464, 15869845, 12175426, 10771908, 13404078, 19434234, 24280205, 23460884, 18154630, 13822285, 13262434, 14226872, 14329374, 14562673, 16273327, 17936775, 17537813, 15942641, 15319710, 15807749, 16121204, 16052855, 16022076, 15449162, 14064704, 13642753, 15701320, 18459656, 19107894, 18420469, 19680540, 23100098, 25013747, 23429337, 20874359, 20193704, 20626423, 20132159, 18993828, 18628072, 18838016, 18835209]
41564A8835209N19928J675472R48730j976031l613343j926254L10204K19104l22988
41555A4670031J730095M637629M114035M24600j605753r822J465703m35622l341823
41546B1649073l182150n42919M86917j388900l149529k375972n39197j72789j158491
41537I626043j711701j523640j655194j959751j003378J187979K458336J588469
41529G007163L43528R88460K910973L469518J644546r17699k393294k613142k112065
41520H327988r00864J038512L036626M277199M485463L706663K073501J24688
41512B6169776j319924j892043j702861p02568R93025K146237J201101j475341
41504B3417402l529609l537453k688235k654520l121074k772476j719322j325351
$$ y = [18835209, 19355137, 21030609, 21979339, 20003308, 16389965, 14463711, 14773915, 14993019, 14670031, 16400126, 21037755, 25151790, 25576390, 23970637, 23960815, 25426518, 24990896, 21649073, 18466923, 17924004, 18410921, 17022021, 13872492, 11496520, 10957323, 10784534, 9626043, 7914342, 6390702, 4735508, 2775757, 1772379, 2960358, 5418694, 7007163, 7350691, 8339151, 11250124, 14719642, 16364188, 15446489, 13053195, 10440053, 8327988, 7427124, 8465636, 11502262, 15779461, 20264924, 23971587, 26045088, 26169776, 24849852, 22957809, 21254948, 20552380, 21545405, 23691642, 24892743, 23417402, 19887793, 16350340, 13662105, 11007585, 7886511, 5114035, 3394713, 2069362]
41496B069362k033695k729975k176031j50704K651293N085537O102994N386447
41488A4205228L309096L12793k871722m559789l364156n77828O60093m33766j035969
41479E643980Q71373L186360L075886J511131J316904K291061J909084L4166r25429
41470A8914516l79128k42450r73047q04990K56978l28216k863647l709436p04930
41461I165650K993797L369902J169072j27836J36630j46331j379450j440403O60337
41452A4401368L120341L896190L053592K077776K025320K618688K551301R11942
41444C4656518j395993k518262k232688k175507k889787k685259o95021J089238
41436B1153239P03360q31171j585162j792246k279064j808847P15371K928965
$$ y = [2069362, 35667, -2694308, -4870339, -5021043, -2369750, 2715787, 8818781, 14205228, 17514324, 17827117, 14955395, 10395606, 7031450, 6453622, 7113715, 6679949, 5643980, 6515353, 9701713, 12777599, 14288730, 15605634, 17896695, 19805779, 19839945, 18914516, 18535388, 18292938, 17319891, 16514901, 16771879, 16443663, 13580016, 9870580, 9165650, 12159447, 15529349, 16698421, 16570585, 16707215, 16560884, 15181434, 13741031, 14401368, 17521709, 21417899, 24471491, 26549267, 28574587, 31193275, 33744576, 34656518, 33260525, 30742263, 28509575, 26334068, 23444281, 20759022, 20064001, 21153239, 21856599, 21025428, 19440266, 17648020, 15368956, 13560109, 14275480, 17204445]
41428A7204445J718579j576058k674520q08720M69293p52601k273337k382007
41420H925074k671796m104087m003441j17028M888349O392767L910155J130677
41412A4350670N20758P21619m02572k341240k725136p48088J347692Q87993j338066
41403A0273630j360697K540374O274829M566858j501000n113066k487929K560312
41395A5753311M380884K389864k46083j835024k684849k377869k38270K239214
41387A7381178K603163Q58350q02991j237039r57847j57190J241659K019667R54757
41378B1903707n73265j90396J351367Q90674j962694l800761k549805k70188O89729
41369A5488368J083795K182198K768025J463683l45914r16944j404368l364829
$$ y = [17204445, 18923024, 17346966, 14672446, 13863726, 14333019, 13580418, 11307081, 8925074, 6253278, 2149191, -1854250, -1971278, 2917071, 9309838, 13219993, 14350670, 14871428, 15593047, 15190475, 12849235, 10124099, 9376011, 10723703, 11611696, 10273630, 8912933, 11453307, 17728136, 22294994, 20793994, 15680928, 13192999, 15753311, 20134195, 22524059, 22277976, 20442952, 17758103, 15380234, 15141964, 17381178, 19984341, 20842691, 20039700, 18802661, 17844814, 17687624, 18929283, 20948950, 21903707, 21330442, 21140046, 22491413, 23382087, 21419393, 17618632, 15068827, 14798639, 15488368, 16572163, 18754361, 21522386, 22986069, 22640155, 21723211, 20318843, 16954014]
41361A6954014m794112k706980J305020K541566K30190j401850j352J476329K21617
41352A3824442j732205j446958l27998j354629l324345k471653J074929L008942
41344G250525J303168j087581j037378O79192J677020J495805J023477N63549
41336A1867777K23446M83772R45231K76664j298690j552381J42129J042593r41558
41327A1188983l546077l191982j68133K171956K355482J940586K226032K580468
41319A5557315J974255M2646k964553n371166m341505M31630M503874L499403
41311A3331899o63747k212555K62567K552381K175925J888218L908842N341125
41303B6584655K777855j722857l055985J59210M241968M968479J415937l681060
$$ y = [16954014, 12159902, 9452922, 10757942, 13299508, 13529698, 12127848, 12126496, 13602825, 13824442, 12092237, 10645279, 10317281, 8962652, 5638307, 3166654, 4241583, 7250525, 8553693, 7466112, 6428734, 7107926, 8784946, 10280751, 11304228, 11867777, 12091223, 12574995, 13520226, 13796890, 12498200, 10945819, 11087948, 12130541, 11188983, 7642906, 4450924, 4282791, 6454747, 8810229, 10750815, 12976847, 15557315, 17531570, 17574216, 14609663, 9238497, 4896992, 5328622, 9832496, 13331899, 12668152, 10455597, 10718164, 13270545, 15446470, 17334688, 21243530, 26584655, 29362510, 27639653, 24583668, 24742878, 28984846, 33953325, 35369262, 31688202]
41295C1688202o031145l666562K64882O45145k752621m560384j544317K683960
41287A6727160L503373K061239J978767K388281j73960m472496n215555j265844
41279A5530965K248062J503521r45976r34373J207267K250235J340509N92029
41271B2792239J444888K889298L211474J999313K00485j107744j720672k073464
41263B7635817k217974j775442j085006j135714j686652j078191Q91446J867564
41255B1415848O44631j75586J816298M043551K174751k793770n305685l295186
41247A8524852p55293r97884j946523o43559J464319J262596o38161j045080O30314
41238A5855581J828722J085844j62288l40086n660m84978j564590j613684J61254
$$ y = [31688202, 25657057, 21990495, 22255377, 22900522, 20147901, 15587517, 14043200, 16727160, 20230533, 22291772, 24270539, 26658820, 26484860, 22012364, 16796809, 15530965, 17779027, 19282548, 18336572, 17402199, 18609466, 20859701, 22200210, 22792239, 24237127, 27126425, 30337899, 32337212, 32537697, 31429953, 29709281, 27635817, 25417843, 23642401, 22557395, 21421681, 19735029, 18656838, 19548284, 21415848, 22060479, 21884893, 23701191, 27744742, 29919493, 27125723, 21820038, 18524852, 17769559, 16771675, 14825152, 14181593, 15645912, 16908508, 16270347, 15225267, 15855581, 17684303, 18770147, 18607859, 18267773, 18262113, 17777135, 16212545, 14598861, 14760115]
41229A4760115K181556J933156p00003k550448r86204K194599K907136N52743
41221B0292650j204438l1977J815861J499473J2915k9175R97053M82071j978510
41212B1855923l920735l683896k204654q72165J72388R57584Q47199j10712l88785
41203A2652147J041938K613018J590948k157330n098272l829252N42032L298681
41195A0653910J736756j644831k644044o04260J703232K447428K434537K535322
41187A6618050K101571Q06769r6901L58151J244726J159474O6103j225419k273780
41178A8758744k777966k175468m11344J576499K685369K379946O98189j393876
41170A9340093j974980j49132K139487K244082N86183j45991N17184K95777j358638
$$ y = [14760115, 16941671, 18874827, 18174824, 15624376, 14638172, 16832771, 19739907, 20292650, 19088212, 19056235, 20872096, 22371569, 22384484, 22355309, 23352362, 23834433, 21855923, 17935188, 14251292, 12046638, 11174473, 11346861, 12304445, 13151644, 13040932, 12652147, 13694085, 16307103, 17898051, 15740721, 10642449, 6813197, 7355229, 10653910, 12390666, 10745835, 8101791, 7497531, 9200763, 11648191, 14082728, 16618050, 18719621, 19526390, 19429489, 19787640, 21032366, 22191840, 22257943, 21032524, 18758744, 15980778, 13805310, 13393966, 14970465, 17655834, 20035780, 20733969, 19340093, 17365113, 17215981, 19355468, 21599550, 22185733, 22039742, 22556926, 22852703, 21494065]
41161B1494065j856312q34J579453P13205p97403o25592K7563r24986k154877
41152A7454282r59347J928786L185963J727682m08676j340733p62109J100593
41144B1926441L191231L065749n18823m971571o424523m363854j337987R07023
41136A1473686K146539J644379j028180l568531k971660r9216J176334l53487
41128H419864j910107j680756j450590k878813m327206l427778n80864K025502
41120e810748L297848L554057L234818K706976K515793K797966K892918J939411
41112A7129039m47044l639538n467754l412942K024936O289167N417945R88770
41104A8882579k062816j747524j02720J353169L271711N178077M655067J442190
$$ y = [21494065, 19637753, 19636919, 21216372, 21929577, 21132174, 20506582, 20534145, 19609159, 17454282, 16494935, 18423721, 21609684, 23337366, 22928690, 21587957, 20825848, 21926441, 25117672, 28183421, 27664598, 22693027, 16268504, 11904650, 10566663, 11473686, 13620225, 15264604, 14236424, 10667893, 7696233, 7597017, 8773351, 8419864, 6509757, 4829001, 3378411, 499598, -3827608, -7255386, -7836250, -5810748, -2512900, 1041157, 4275975, 6982951, 9498744, 12296710, 15189628, 17129039, 16681995, 13042457, 7574703, 4161761, 6186697, 12475864, 17893809, 18882579, 16819763, 15072239, 14969519, 16322688, 19594399, 24772476, 29427543, 30869733]
41096C0869733j049803m36137J087016J00381l172178n520629m869376k007458
41088A5001549P39188J399876l6233j304154m40325J286078J066535q67222j349542
41079A5495750M68822J533452N0207j393254l44788J151418P4989k173505j845090
41070A3018001J013388K446949M90219k167370k117902N09059K732937K386703
41062A8311984K75045j010145k35799Q87188J24078j752602j841652L53377J948535
41053A7060009J238901L24471J248766K261856P80439j991969k739190j141098
41045A7042185j6077q54967k207046k456802j579226J8289K051437L439676K892562
41036A8330031Q74661o61210q21189n62095p01295o32722M52210K129511L086744
$$ y = [30869733, 29819930, 29383793, 30470809, 30571190, 27399012, 21878383, 17009007, 15001549, 15740737, 17140613, 17104380, 15800226, 15359901, 16645979, 17712514, 16845292, 15495750, 15964572, 17498024, 17548231, 16154977, 15810189, 16961607, 17036596, 14863091, 13018001, 14031389, 16478338, 16968557, 14801187, 12683285, 13192344, 15925281, 18311984, 18587029, 17576884, 17341085, 18228273, 18352351, 16599749, 14758097, 15111474, 17060009, 18298910, 18623381, 19872147, 22134003, 22914442, 20922473, 18183283, 17042185, 17026108, 16171141, 13964095, 11507293, 9928067, 9946356, 11997793, 15437469, 18330031, 19204692, 18543482, 17722293, 17160198, 16458903, 15826181, 16278391, 18407902, 21494646]
41027B1494646K464001P45392n55103n09318p0945p66472k113345k116322p22958
41018A7849576l21215j603582j780460P96808K931617Q95302l468708m945359
41010A0353979k255029R88147K304007K902513L536565K274566j448490m060105
41002A4596153k167538K338697M411038K187477j230738k151957m34062J313479
40994A8862549J443458J029696J778282L047045K295528j183596m536726m698855
40986A8037381k368561q25102j451331k522243k236774p52097J068950K795634
40978A1745857L590760K163025j229927m046534l983781j486458J145541K414894
40970A0313377K472429J909646Q92267l84195j210752r85138j74793M8575n06189
$$ y = [21494646, 23958647, 24704039, 24148936, 23639618, 23568673, 22802201, 20688856, 18572534, 17849576, 17528361, 15924779, 14144319, 14941127, 17872744, 18768046, 15299338, 10353979, 8098950, 9087097, 11391104, 14293617, 17830182, 20104748, 18656258, 14596153, 12428615, 14767312, 19178350, 21365827, 20135089, 17983132, 17549070, 18862549, 20306007, 21335703, 23113985, 26161030, 28456558, 27272962, 22736236, 18037381, 15668820, 14843718, 13392387, 10870144, 8633370, 7881273, 8950223, 11745857, 15336617, 17499642, 16269715, 12223181, 8239400, 6752942, 7898483, 10313377, 12785806, 14695452, 15587719, 15203524, 13992772, 13007634, 12832841, 12881416, 12375227]
40961A2375227n01451Q54106J913310M94342k509994l567394j038302K805792
40953A0825636M999454M872116K959153k78428l046759k502106J086419L121018
40945B2036503N85757l290184l689672j115999N33832P37140K075435M271293
40937B2144105M049680J119754r58410p41580p62604k107187k086180N45300K581480
40928B3784358J404644p67959q04948L10958k68184k297263l011820j271726J410039
40919A8488099K929203K022159r41483l342392k424987P49741J876616o33458
40911A8723498l097715j918189J463731L499601L590263L161297K226920M08118
40903B8057524o21458N72801J954255P64972j778739k426327j506096k229287
$$ y = [12375227, 11873776, 12727882, 14641192, 15135534, 12625540, 9058146, 8019844, 10825636, 15825090, 20697206, 23656359, 23377931, 20331172, 17829066, 18915485, 22036503, 22622260, 19332076, 15642404, 14526405, 15060237, 15797377, 17872812, 22144105, 26193785, 27313539, 26355129, 25613549, 24850945, 22743758, 20657578, 21202878, 23784358, 25189002, 24421043, 23616095, 23927053, 23658869, 21361606, 18349786, 17078060, 18488099, 21417302, 23439461, 22497978, 19155586, 16730599, 17480340, 19356956, 18723498, 15625783, 13707594, 15171325, 18670926, 22261189, 25422486, 27649406, 28057524, 27436066, 28008867, 29963122, 30728094, 28949355, 26523028, 25016932, 22787645]
40895B2787645m620522m761199j076827K755472L115510J358864Q86005J674604
40887B2119552Q76575k034688l800633j824207J910277L054168M21598k583715
40879A8138927k613162o36370R3697j058191j892214j476993j217501j443839
40871G894354m12953J964401K791950P13999j289451l44722J784941J816062K89568
40862A5208149J08916J422239J923824J281015J308916K096338J709995j24229
40854B4935163j427627j329973q87534k75560J578230L927362L989611R92605
40846C1502277k217293k906340j612310m43965k58084p04739j336162j552590
40838B0470794q51343R0546n3038j183549j819085j570979j643498k223931j508836
$$ y = [22787645, 18167123, 13405924, 12329097, 15084569, 18200079, 19558943, 20444948, 22119552, 22996127, 20961439, 17160806, 15336599, 17246876, 20301044, 20722642, 18138927, 15525765, 14889395, 14983092, 13924901, 12032687, 10555694, 9338193, 7894354, 7481401, 9445802, 12237752, 12951751, 11662300, 11317578, 13102519, 14918581, 15208149, 15317065, 16739304, 18663128, 19944143, 21253059, 23349397, 25059392, 24935163, 23507536, 22177563, 21290029, 21014469, 22592699, 26520061, 30509672, 31502277, 29284984, 26378644, 24766334, 24322369, 24064285, 23359546, 22023384, 20470794, 19619451, 19709997, 19656959, 18473410, 16654325, 15083346, 13439848, 11215917, 9707081]
40829I707081J384166M227847M035964P26313k822117l861963k076149P90598
40821A2111740K846078L521521L278024K241921J16956k334908l290708k332951
40813A6157673j287540j199940m35688K063007L753325J968916j181378j403658
40805A8434717J098585J946128l75194k349578j244368J181744K307105K116173
40797B3115312J297786l90731j863310n62621K965236M035201M16035l459475
40789B5553433k551651J474406L255526J753158M53835Q24862O47629j037024
40781C0374174j961603p93942M26142l06610j927052k508827k341882k720117
40773A8240283l032599j330076K380492N123911L972654n24767m660422n335837
$$ y = [9707081, 11091247, 15319094, 19355058, 20081371, 17259254, 13397291, 11321142, 12111740, 14957818, 18479339, 21757363, 23999284, 24116240, 21781332, 18490624, 16157673, 14870133, 13670193, 13234505, 15297512, 19050837, 21019753, 19838375, 18434717, 19533302, 21479430, 21104236, 18754658, 17510290, 18692034, 20999139, 23115312, 24413098, 24022367, 22159057, 21596436, 24561672, 28596873, 29012908, 25553433, 23001782, 24476188, 27731714, 29484872, 29938707, 30763569, 31411198, 30374174, 28412571, 27618629, 28044771, 27738161, 25811109, 23302282, 20960400, 18240283, 15207684, 13877608, 16258100, 21382011, 25354665, 24829898, 20169476, 14833639]
40765A4833639k895135Q4383J868808K354364J662849k2329j290279m17097J977108
40756A8156311L258724K469593J412869J132285P9141k438244l763856j633564
40748A8673259J674218K133589m18544k654123k783495j919583r43915N44889
40740A4306295J975019J662720l60290j925149j780965q32333N4061J032584J609449
40731A5741391P11261p03545R4042L278791N030794K492144j926201l657280j994334
40722A9067063l84538j351943l614165m416674k829174j54188J741536J963342
40714A0021259J120714N77945Q28020Q79939j79562j563330j809341j108957j097049
40705G669638k034546j851868Q28123L900399L870226N10174k487473k125513
$$ y = [14833639, 11938504, 12022887, 13891695, 16246059, 17908908, 17886579, 16596300, 16179203, 18156311, 21415035, 23884628, 25297497, 26429782, 26508923, 24070679, 20306823, 18673259, 20347477, 22481066, 22062522, 19408399, 16624904, 14705321, 13761406, 14306295, 16281314, 17944034, 17583744, 15658595, 13877630, 13045297, 13099358, 14131942, 15741391, 16452652, 15749107, 15843149, 19121940, 24152734, 26644878, 24718677, 21061397, 19067063, 18682525, 17330582, 13716417, 9299743, 6470569, 6316381, 8057917, 10021259, 11141973, 11719918, 12547938, 13427877, 13248315, 11684985, 9875644, 8766687, 7669638, 5635092, 3783224, 4611347, 8511746, 12381972, 12892146, 10404673, 8279160]
40697H279160K62231J200633l58488k390462l034210k426159j260492M73696K598791
40688C344700M133588M470085M024899L068676J264206q12980j288162M57720
40680A8662732K106799J026255k164557m323432l657434j353472L93073O03130
40672A1293094j00020k15604J304096L554430M098163J929795q44845j710055
40664A9309054j131446j243221j931215r24370K129798M455148L963369K003307
40656B6630424R42428Q29320J33025j442735k658853k696953j995089j329285
40648A8412282j048395j089263j098193p53563l73413p04814j646147j891734
40640I806760o47119Q81388P72198j040548k549458k178480n46497P65850J425499
$$ y = [8279160, 8541391, 9742024, 9383536, 6993074, 3958864, 1532705, 272213, 745909, 3344700, 7478288, 11948373, 15973272, 19041948, 20306154, 19493174, 18205012, 18662732, 20769531, 21795786, 19631229, 15307797, 11650363, 10296891, 10689964, 11293094, 11193074, 10977470, 12281566, 15835996, 19934159, 21863954, 21019109, 19309054, 18177608, 16934387, 15003172, 14078802, 16208600, 20663748, 24627117, 26630424, 27572852, 28402172, 28535197, 27092462, 24433609, 21736656, 19741567, 18412282, 17363887, 16274624, 15176431, 14422868, 14049455, 13344641, 11698494, 9806760, 9159641, 10041029, 10813227, 9772679, 7223221, 5044741, 4498244, 5264094, 6689593]
40631F689593K339700L639109L882838J990204p62264j844758n12959J382453
40623A6803916J908620J224709N43460j5362j251290k997221l764312k545304
40615I907216j72236J516226J539454N97830J15981N49865R20402L32385n63832
40606A4743291o06443k86072j275185l509328m542577k779789K13274J901774
40598C858945J903593J451173J040432M67125K90161J271498K766571L312994
40590A6362492K472544P91067j315871l130681l061695n08461K342987K673428
40582A6625810N94047j359569j790654j446956j195029j272571k159098l749190
40574D246790l955583q56554L700014N407412K877391p77827k210060j261808
$$ y = [6689593, 9029293, 12668402, 16551240, 18541444, 17779180, 15934422, 15421463, 16803916, 18712536, 19937245, 20480705, 20465343, 19214053, 16216832, 12452520, 9907216, 9734980, 11251206, 12790660, 13388490, 13504471, 14054336, 14974738, 15307123, 14743291, 14136848, 13850776, 12575591, 9066263, 4523686, 1743897, 1957171, 3858945, 5762538, 7213711, 8254143, 8721268, 9011429, 10282927, 13049498, 16362492, 18835036, 19626103, 18310232, 15179551, 12117856, 11609395, 13952382, 16625810, 17219857, 15860288, 14069634, 12622678, 11427649, 10155078, 7995980, 4246790, 291207, -565347, 3134667, 8542079, 11419470, 10641643, 8431583, 7169775]
40566G169775L49386J319380J085233M6439j65906J207144J909684m37146l560189
40557H923800k630922K284599N332112L067187q24584j509522L77673J400564
40549A6420907J066036R67345Q88616j09951o93955O11978J821507N6683l359584
40540A7669582m393629k280096j23986K94905N44653J972185L466549L643219
40532B0793382K669764J163765o11849j947936j962809j016975k97126r4524n1964
40523A8643728n52495j913760k842343j954194l04464l2142j027251j465089j002278
40514G549712n42591N24911L320904N921377M836999O71341j731775j42602J891415
40505B2299691P01413k244449l372399k304443j031207p4748J159370J722737
$$ y = [7169775, 7519161, 8838541, 9923774, 9970213, 9804307, 11011451, 12921135, 12483989, 8923800, 6292878, 8577477, 13909589, 16976776, 16152192, 14642670, 15020343, 16420907, 17486943, 18454288, 19342904, 19232953, 18538998, 19150976, 20972483, 21029166, 17669582, 13275953, 10995857, 10871871, 11166776, 11711429, 13683614, 17150163, 20793382, 23463146, 24626911, 24015062, 22067126, 20104317, 19087342, 18790216, 18695692, 18643728, 18091233, 16177473, 13335130, 11380936, 11076472, 11044330, 10017079, 8551990, 7549712, 7007121, 7532032, 10852936, 16774313, 21611312, 22282653, 20550878, 20408276, 22299691, 23001104, 20756655, 17384256, 15079813, 14048606, 13973858, 15133228, 16855965]
40497A6855965K64763j842666j718183O85652K264598J322133j0276Q75651L042343
40488B1739980L136947N7530l166626k872162O62818L417655K553739k38460j347710
40479B3943711p9998R05058l60001k592554l125270r46853K466725M303329K521402
40470B7035549j797908m436257k242000K614687M697726J937891k105887l332133
40462B2371668j952072q22350j065731j390669n86779J058230K247897J619613
40454B1479807r90712l671702m094130k554211j649595k262848k137548J69429
40446D288490K233916R25851k876827n085924l215444J272234M711803M167853
40438F421952j48427m195913l452696J607137N262022L501916r70583k999040
$$ y = [16855965, 17120728, 15278062, 13559879, 14245531, 16510129, 17832262, 17821986, 18697637, 21739980, 24876927, 24934457, 21767831, 18895669, 19558487, 22976142, 25529881, 25291421, 23943711, 23863713, 24768771, 24408770, 21816216, 18690946, 17744093, 20210818, 24514147, 27035549, 25237641, 20801384, 18559384, 21174071, 25871797, 27809688, 25703801, 22371668, 20419596, 19597246, 18531515, 17140846, 16554067, 17612297, 19860194, 21479807, 20489095, 16817393, 12723263, 10169052, 8519457, 6256609, 4119061, 4288490, 6522406, 7448257, 4571430, -514494, -3729938, -2457704, 2254099, 6421952, 6273525, 2077612, -1375084, 232053, 5494075, 8995991, 8025408, 5026368]
40430E026368j769420l8934J252701L144746M455517K371608k258616m602481
40422G581489k198880J881249L740124L349485K780316K606202K279926J951541
40414B3971452J717458O01617j817337l995731m207926k625489m25069J792121
40406A5011096L440724L356469J325874j033327k334584l047066l641548k746347
40398A0331291P48244M884779O282019M179263R61600j019242j450091j194225
40390B3723638j094644j562749k079733j408325N39121J754408N90776j575498
40382A8886994k072738p81923j27o47016j131748m20796K31644l59995j255665
40373A2448630r58472N11537K242875L670487M099528K579141l49555k227016
$$ y = [5026368, 3256948, 3218014, 4470715, 7615461, 12070978, 14442586, 12183970, 7581489, 5382609, 7263858, 11003982, 14353467, 17133783, 19739985, 22019911, 23971452, 25688910, 26290527, 24473190, 20477459, 16269533, 13644044, 13218975, 15011096, 18451820, 21808289, 23134163, 22100836, 19766252, 16719186, 13077638, 10331291, 11079535, 15964314, 22246333, 26425596, 27387196, 26367954, 24917863, 23723638, 22628994, 21066245, 18986512, 17578187, 18117308, 19871716, 20462492, 18886994, 16814256, 16032333, 16032206, 15385190, 14253442, 13832646, 14064290, 13704295, 12448630, 11490158, 12001695, 14244570, 17915057, 22014585, 24593726, 24244171, 22017155]
40365B2017155j625944k71115m36935j464412j132354L68886N99554j008644j949466
40356A5096725m23010J937815K496305J113166l87187j142574j851435k783517
40348A4056288k787110p54930K609173M960662M313743R73931k643816m440829
40340A6287112m573867m333751l684759j519591J602660L090422J788988L9536
40332H696750N64164K601854L234771J766457M13710P21260J546490J163270m11705
40323B0297021j958359k589681k088188q21518J63865Q379o71627n27167K82916
40314A2095641J21207j409137k495270j705790O3653J230849J508712J145955
40306A0555820k9818j371239j093132R21052J889130J14756j702697l82338K128503
$$ y = [22017155, 20391211, 20120096, 19683161, 18218749, 17086395, 17455281, 18054835, 17046191, 15096725, 14673715, 16611530, 19107835, 20221001, 19833814, 18691240, 16839805, 14056288, 11269178, 10514248, 13123421, 18084083, 22397826, 23371757, 20727941, 16287112, 11713245, 7379494, 3694735, 2175144, 3777804, 6868226, 8657214, 8696750, 9260914, 11862768, 15097539, 16863996, 17277706, 17998966, 19545456, 20708726, 20297021, 18338662, 15748981, 13660793, 12839275, 13003140, 13011519, 12339892, 11812725, 12095641, 12216848, 10807711, 8312441, 6606651, 6670304, 7901153, 9409865, 10555820, 10526002, 9154763, 8061631, 8982683, 10871813, 10986569, 9283872, 8901534, 11030037]
40297A1030037J392266j912321k243500J922633M821386J897607l030457l497686
40289A0379965L8403J776179q480j116645P93872K383824O81319j778087j199303
40280A1951047J374311K029444O7642j707584j843236j730496k298682k452697
40272E389749j448067k28557M71813J212257K110484J966041K45716j614705k003792
40263F100939r89961M34351J604255J896500P55294r88017j376840m0786R65966
40254H361701K92477n66611Q9256J276288J271332P29745J157303J642147K68463
40245A4522101k025177k366960m94203R37012O94440K75165M19476j91661j700653
40236A0069540j867390K72514K362871K106017K96218j079329j389279n85130
$$ y = [11030037, 12422303, 10509982, 8266482, 10189115, 15010501, 16908108, 13877651, 10379965, 10418368, 12194547, 12186067, 11069422, 11863294, 14247118, 14928437, 13150350, 11951047, 13325358, 15354802, 15422444, 13714860, 11871624, 10141128, 7842446, 5389749, 3941682, 3713125, 4184938, 5397195, 7507679, 9473720, 9719436, 8104731, 6100939, 5110978, 5545329, 7149584, 9046084, 9801378, 8813361, 7436521, 7395735, 8361701, 8654178, 8087567, 8176823, 9453111, 10724443, 11454188, 12611491, 14253638, 14522101, 12496924, 10129964, 9635761, 10572773, 11267213, 11542378, 11961854, 11770193, 10069540, 8202150, 8474664, 10837535, 12943552, 13239770, 12160441, 10771162, 10186032]
40228A0186032J455137L206132K033872j577251l379229j251975J536019J774480
40220A3983217J353632K939319M201263J717898k034966j993257O06972k76331
40212B0497747m963353o417613j278532M261198L496608j284345l208188p93273
40204A0310249J858415K414980K349553K446431J308504j066695k173386p68025
40196A6680026J025778P98716r21146j934294j536309r82525j326744j963641
40188I839861j512808L46770K359577L113886K609922J940068J688305J428451
40180B1814032P47676j03309o69961o33682K42824J644254K428595J960588J364801
40171B8795818J948217K772874J857161l69572j430030r74996j543761l933362
$$ y = [10186032, 11641169, 14847301, 16881173, 15303922, 11924693, 10672718, 12208737, 13983217, 15336849, 18276168, 22477431, 24195329, 22160363, 20167106, 20774078, 20497747, 15534394, 9116781, 7838249, 12099447, 15596055, 14311710, 11103522, 10310249, 12168664, 14583644, 16933197, 19379628, 20688132, 19621437, 17448051, 16680026, 17705804, 18504520, 17583374, 15649080, 14112771, 13130246, 11803502, 9839861, 8327053, 8673823, 11033400, 14147286, 16757208, 18697276, 20385581, 21814032, 22561708, 22458399, 21788438, 21154756, 21397580, 23041834, 25470429, 27431017, 28795818, 30744035, 33516909, 35374070, 35004498, 33574468, 32599472, 31055711, 27122349]
40163B7122349m926567j907636K757391M772773L576212J984742J435770Q03422
40155C5618456m64094j116617m56138M10283L64622k84859o78011n18191l8290
40146C2837161K25397l17252j449534j948522j214987m31650q07032j368274j87055
40137B5338252K547325M400989L632838Q45066k210211m072253l903922j874911
40129B4703173N42029J743431J598361J124054Q97805P59562O51706O21342L64687
40120C3006150j86194l64494R9108K65780m51850r89826n02855l18473j835250
40111B8722096l505421k645590K74578K109234J749155J294092K035338K316850
40103C2350332N86188j945850l161347k678159j434503k90240Q686q39327j578792
$$ y = [27122349, 22195782, 20288146, 23045537, 27818310, 31394522, 33379264, 34815034, 35618456, 35154362, 34037745, 33581607, 33991890, 34356512, 34071653, 33393642, 32875451, 32837161, 33062558, 32745306, 31295772, 29347250, 28132263, 27700613, 26893581, 25525307, 25338252, 27885577, 32286566, 35919404, 36764470, 34554259, 30482006, 26578084, 24703173, 25245202, 26988633, 28586994, 29711048, 30608853, 31368415, 32020121, 32641463, 33006150, 32819956, 32455462, 32554570, 32820350, 32368500, 31378674, 30875819, 30557346, 28722096, 25216675, 22571085, 22845663, 24954897, 26704052, 27998144, 30033482, 32350332, 32936520, 30990670, 27829323, 25151164, 23716661, 23426421, 23435107, 22595780, 21016988]
40094B1016988m43565J895820K502752K71847k364636l064856k561883k408110
40086A4844357k190754j264672j050462k658881l802132j466528L004870M904122
40078A0319920K426971j115776k141852j082734l75304m66026l4735J046657J395666
40069I972787N74839k17646l56333q34882k052940k213993J50420L070115L140142
40060A1232509N73033o36457J478158L800244K850739j9366j025284L66384J517957
40051B0137917J149256J85438j162272l297878m482873k284910J873586L743587
40043A5861851K551185J960398L573756M179422J629736j106319p94183J197302
40035B9053148K273847L058935M594353M713290J733975j374194j460426r29870
$$ y = [21016988, 20573423, 22469243, 24971995, 25243842, 22879206, 19814350, 17252467, 14844357, 12653603, 11388931, 10338469, 7679588, 3877456, 2410928, 5415798, 10319920, 12746891, 11631115, 9489263, 8406529, 8031225, 7565199, 7530464, 8577121, 9972787, 10547626, 10329980, 9973647, 9138765, 7085825, 4871832, 5022252, 8092367, 11232509, 11805542, 11169085, 12647243, 16447487, 19298226, 19278860, 18253576, 18619960, 20137917, 21287173, 21472611, 20310339, 17012461, 12529588, 10244678, 12118264, 15861851, 18413036, 20373434, 23947190, 28126612, 29756348, 28650029, 27855846, 29053148, 31326995, 34385930, 38980283, 43693573, 45427548, 44053354, 42592928, 41663058]
40027D1663058l424552o410288m849227o53441o38407m906894n565764O13855
40019A5828340O056266L424133l438553n542198j504112K246129J828746J8329
40011A8917080Q9579J099076Q59930k13303l60971N91254J342762J024466j50885
40002B3198988j406609j865462j079352M27116J529334J571878O90912p35245
$$ y = [41663058, 38238506, 31828218, 26978991, 26325550, 25687143, 20780249, 15214485, 15828340, 21884606, 25308739, 21870186, 16327988, 14823876, 17070005, 18898751, 18917080, 19006659, 20105735, 20965665, 20752362, 20391391, 20982645, 22325407, 23349873, 23198988, 21792379, 19926917, 18847565, 19274681, 20804015, 22375893, 23066805, 22331560]
$$ [...]
##END NTUPLES=NMR SPECTRUM
##END=
