##TITLE=31Pdec_DE-107_oil_TFA
CDCl3, 64 sc
 29.8.2025
##JCAMPDX= 6.0         $$ Bruker NMR JCAMP-DX V2.0
##DATA TYPE= NMR SPECTRUM
##DATA CLASS= NTUPLES
##ORIGIN= UXNMR, Bruker Analytische Messtechnik GmbH
##OWNER= root
$$ XWIN-NMR		Version 3.5
$$ Fri Aug 29 15:30:51 2025 Russian Standard Time (UT+4h)  she@DPX200
##.OBSERVE FREQUENCY= 81.013821
##.OBSERVE NUCLEUS= ^31P
##.ACQUISITION MODE= SIMULTANEOUS
##.ACQUISITION SCHEME= undefined
##.AVERAGES= 64
##.DIGITISER RES= 17
##SPECTROMETER/DATA SYSTEM= spect
##.PULSE SEQUENCE= zgpg30
##.SOLVENT NAME= CDCl3
##.SHIFT REFERENCE= (INTERNAL, CDCl3, 0, 198.062)
##AUDIT TRAIL= $$ (NUMBER, WHEN, WHO, WHERE, WHAT)
$$ ##TITLE= Audit trail, XWIN-NMR		Version 3.5
$$ ##JCAMPDX= 5.01
$$ ##ORIGIN= Bruker BioSpin GmbH
$$ ##OWNER= she
$$ F:/spectra/data/she/nmr/P31/2/pdata/1/auditp.txt
$$ ##AUDIT TRAIL=  $$ (NUMBER, WHEN, WHO, WHERE, WHAT)
(   1,<2025-08-29 15:29:45.48 +0400>,<she>,<DPX200>,
      <created by zg, POWCHK disabled, PULCHK disabled
       configuration hash MD5:
       00 E9 B6 7A A2 85 ED C7 34 08 36 98 17 FE 4E 26
       data hash MD5: 32K
       A7 8D 3D 3E 4E 6D D4 8D 24 6E 3C D3 C4 F4 5F 02>)
(   2,<2025-08-29 15:29:47.95 +0400>,<she>,<DPX200>,
      <Start of raw data processing
       efp BC_mod = 2 LB = 1.5 FT_mod = 6 PKNL = 1 PHC0 = 1309.529 PHC1 = 309.5 SI = 64K 
       data hash MD5: 64K
       E1 87 34 1B 4A 92 1D 79 7A 88 5D 98 86 AB 77 4B>)
(   3,<2025-08-29 15:30:05.79 +0400>,<she>,<DPX200>,
      <pk PHC0 = 42.06337 PHC1 = 0 
       data hash MD5: 64K
       56 F5 4C 1D FE 77 52 28 14 2F FB 87 0A 58 C5 8E>)
$$ ##END=
$$ 
$$ hash MD5
$$ 7B 5C 1C 1F F2 3C D2 FC D6 6E 39 58 E5 D8 A2 21
##$RELAX= 
##$RELAX= 
##$RELAX= 
##$RELAX= 
##$RELAX= 
##$RELAX= 
##$RELAX= 
##$RELAX= 
$$ Bruker specific parameters
$$ --------------------------
##$DU= <F:/spectra>
##$EXPNO= 2
##$NAME= <P31>
##$PROCNO= 1
##$TYPE= <nmr>
##$USER= <she>
##$AMP= (0..31)
100 100 100 100 100 100 100 100 100 100 100 100 100 100 100 100 100 100 
100 100 100 100 100 100 100 100 100 100 100 100 100 100 
##$AQSEQ= 0
##$AQ_mod= 1
##$AUNM= <au_zg>
##$AUTOPOS= <>
##$BF1= 81.014009
##$BF2= 200.13
##$BF3= 200.13
##$BF4= 200.13
##$BF5= 200.13
##$BF6= 200.13
##$BF7= 200.13
##$BF8= 200.13
##$BYTORDA= 1
##$CFDGTYP= 0
##$CFRGTYP= 5
##$CHEMSTR= <none>
##$CNST= (0..31)
1 1 145 1 1 1 1 1 1 1 1 1 1 1 1 1 1 1 1 1 1 1 1 1 1 1 1 1 1 1 1 1 
##$CPDPRG= <waltz16>
##$CPDPRG1= <>
##$CPDPRG2= <waltz16>
##$CPDPRG3= <>
##$CPDPRG4= <mlev>
##$CPDPRG5= <mlev>
##$CPDPRG6= <mlev>
##$CPDPRG7= <mlev>
##$CPDPRG8= <mlev>
##$CPDPRGB= <>
##$CPDPRGT= <>
##$D= (0..31)
0 1 0 0 0 0 0 0 0 0.06 0 0.03 2e-05 3e-06 0 0 0.0002 0 0 0 0 0 0 0 0 0 
0 0 0 0 0 0 
##$DATE= 1756466984
##$DBL= (0..7)
120 120 120 11 120 120 24 19 
##$DBP= (0..7)
150 150 150 150 150 150 150 150 
##$DBP07= 0
##$DBPNAM0= <>
##$DBPNAM1= <>
##$DBPNAM2= <>
##$DBPNAM3= <>
##$DBPNAM4= <>
##$DBPNAM5= <>
##$DBPNAM6= <>
##$DBPNAM7= <>
##$DBPOAL= (0..7)
0.5 0.5 0.5 0.5 0.5 0.5 0.5 0.5 
##$DBPOFFS= (0..7)
$$ [...]
##$SUBNAM2= <"">
##$SUBNAM3= <"">
##$SUBNAM4= <"">
##$SUBNAM5= <"">
##$SUBNAM6= <"">
##$SUBNAM7= <"">
##$SUBNAM8= <"">
##$SUBNAM9= <"">
##$SW= 400.765351723535
##$SWIBOX= (0..15)
0 1 3 0 0 0 0 0 0 0 0 0 0 0 0 0 
##$SW_h= 32467.5324675325
##$TD= 32768
##$TD0= 1
##$TE= 0
##$TE2= 300
##$TE3= 300
##$TEG= 300
##$TL= (0..7)
0 120 53 12 22 120 120 120 
##$TP= (0..7)
150 150 150 150 150 150 150 150 
##$TP07= 0
##$TPNAME0= <>
##$TPNAME1= <>
##$TPNAME2= <>
##$TPNAME3= <>
##$TPNAME4= <>
##$TPNAME5= <>
##$TPNAME6= <>
##$TPNAME7= <>
##$TPOAL= (0..7)
0.5 0.5 0.5 0.5 0.5 0.5 0.5 0.5 
##$TPOFFS= (0..7)
0 0 0 0 0 0 0 0 
##$TUNHIN= 0
##$TUNHOUT= 0
##$TUNXOUT= 0
##$USERA1= <user>
##$USERA2= <user>
##$USERA3= <user>
##$USERA4= <user>
##$USERA5= <user>
##$V9= 5
##$VALIST= <valist>
##$VCLIST= <CCCCCCCCCCCCCCC>
##$VD= 0
##$VDLIST= <DDDDDDDDDDDDDDD>
##$VPLIST= <PPPPPPPPPPPPPPP>
##$VTLIST= <TTTTTTTTTTTTTTT>
##$WBST= 1024
##$WBSW= 4
##$XGAIN= (0..3)
0 0 0 0 
##$XL= 0
##$YL= 0
##$YMAX_a= 3587
##$YMIN_a= -22029
##$ZGOPTNS= <>
##$ZL1= 120
##$ZL2= 120
##$ZL3= 120
##$ZL4= 120
##$ABSF1= 0
##$ABSF2= 0
##$ABSG= 0
##$ABSL= 0
##$ALPHA= 0
##$AQORDER= 0
##$ASSFAC= 0
##$ASSFACI= 0
##$ASSFACX= 0
##$ASSWID= 0
##$AUNMP= <proc_1d>
##$AZFE= 0.1
##$AZFW= 0.5
##$BCFW= 0
##$BC_mod= 2
##$BYTORDP= 0
##$COROFFS= 0
##$CY= -3
##$DATMOD= 1
##$DC= 0
##$DFILT= <>
##$DTYPP= 0
##$F1P= 0
##$F2P= 0
##$FCOR= 1
##$FTSIZE= 65536
##$FT_mod= 6
##$GAMMA= 0
##$GB= 0
##$INTBC= 1
##$INTSCL= 9.790993e-09
##$ISEN= 30
##$LB= 1.5
##$LEV0= 0
##$LPBIN= 0
##$MAXI= 10000
##$MC2= 0
##$MEAN= 0
##$ME_mod= 0
##$MI= 50
##$NCOEF= 0
##$NC_proc= -9
##$NLEV= 6
##$NOISF1= 182.463
##$NOISF2= 159.3651
##$NSP= 0
##$NTH_PI= 0
##$NZP= 0
##$OFFSET= 198.0616
##$PC= 4
##$PHC0= 1351.592
##$PHC1= 309.5
##$PH_mod= 1
##$PKNL= yes
##$PPARMOD= 0
##$PSCAL= 0
##$PSIGN= 0
##$REVERSE= no
##$SF= 81.0140089999434
##$SI= 65536
##$SIGF1= 159.3651
##$SIGF2= -187.1042
##$SINO= 113.3802
##$SIOLD= 16384
##$SREGLST= <1H.CDCl3>
##$SSB= 0
##$STSI= 65536
##$STSR= 0
##$SW_p= 32467.5324675325
##$SYMM= 0
##$S_DEV= 0
##$TDeff= 32768
##$TDoff= 0
##$TI= <>
##$TILT= no
##$TM1= 0
##$TM2= 0
##$TOPLEV= 0
##$USERP1= <user>
##$USERP2= <user>
##$USERP3= <user>
##$USERP4= <user>
##$USERP5= <user>
##$WDW= 1
##$XDIM= 65536
##$YMAX_p= 110819611
##$YMIN_p= -480853739
$$ End of Bruker specific parameters
$$ ---------------------------------
##NTUPLES= NMR SPECTRUM
##VAR_NAME=  FREQUENCY,     SPECTRUM/REAL,   SPECTRUM/IMAG
##SYMBOL=    X,             R,               I
##VAR_TYPE=  INDEPENDENT,   DEPENDENT,       DEPENDENT
##VAR_FORM=  AFFN,          ASDF,            ASDF
##VAR_DIM=   65536,         65536,           65536
##UNITS=     HZ,            ARBITRARY UNITS, ARBITRARY UNITS
##FACTOR=    0.49542278885378, 1,            1
##FIRST=     16045.7642231865, 0,            0
##LAST=      -16421.768244346, 0,            0
##MIN=       -16421.768244346, -480853739,   0
##MAX=       16045.7642231865, 110819611,    0
$$ Real data points
##PAGE= N=1
##DATA TABLE= (X++(R..R)), XYDATA
$$ [...]
##PAGE= N=2
##DATA TABLE= (X++(I..I)), XYDATA
7350d1382613j5175639K507245J4599259R780946K260537P605513J7551740J4796851
7342A2543839K07373j1207831j2170873o161772L188377J1840115J1976427J927919
7334A2143574p487549p849635n523334p479235o071344O499336J8960537J5071198
7326A8263548k38592q285018n006298j928991k533341P12789O512882M245542
7318A1742521m144694l636992P126059J0121324k358876j2850191n973576P655031
7310G680606J0220478M062880K067863K537051n529811j8451551k0293893q333178
7302b6039555K744396M018191K341084K965626o57748j1108054j5839084m521966
7294d6097110J2642770J8036790J1392787O358031O176672N37028j1564466j4423334
$$ y = [-41382613, -56558252, -54051007, -39451748, -29670802, -27410265, -19804752, -2253012, 12543839, 12751212, 1543381, -10627492, -16789264, -13600887, -1760772, 10215655, 12143574, 4656025, -3193610, -8716944, -16196179, -22267523, -15768187, 3192350, 18263548, 18024956, 9739938, 4733640, 2804649, 271308, 984097, 7496979, 11742521, 7597827, 3960835, 11086894, 21208218, 18849342, 5999151, 25575, 7680606, 17901084, 21963964, 24031827, 26568878, 21039067, 2587516, -17706377, -26039555, -23295159, -19276968, -16935884, -13970258, -14628006, -25736060, -41575144, -46097110, -33454340, -15417550, -4024763, 2333268, 8509940, 9046968, -2517498, -16940832]
7286a6940832l36567J3629975Q620978o239718n765092J3140383K5519344J4273069
7278D5901540o842607j6085124j3893038j4890872k0269187j7230907l012541
7271d6322736R028254J0201285P691518R015712R221783L283638Q1318J0279737
7263A2480509K5646499K5140666K693710k2728021k9293699j6448446j118729
7256c627511M462031L221361K953073L849371R54991m663451m439778N462531
7248H172618J5564681J3188047M19q205340j810029R936167J2261668M569232
7240E3677463k223198m026311p326045j4282430j6699632r776154j113179J343905
7232d25581J125173L878646M670255l164916j2429025r834921K840298J0219742
$$ y = [-16940832, -17277399, -3647424, 4973554, -1266164, -7031256, 6109127, 31628471, 45901540, 39058933, 22973809, 9080771, -5810101, -26079288, -43310195, -46322736, -37294482, -27093197, -19401679, -10385967, -1164184, 2119454, 2200772, 12480509, 38127008, 63267674, 65961384, 43233363, 13939664, -2508782, -3627511, 834520, 4055881, 7008954, 10858325, 11813316, 7149865, 2710087, 8172618, 23737299, 36925346, 36925765, 28720425, 26910396, 36846563, 49108231, 53677463, 51454265, 47427954, 40101909, 25819479, 9119847, -656307, -1769486, -425581, 699592, 4578238, 9248493, 6083577, -6345448, -16180369, -13340071, -3120329]
7224c120329O548392K482265N406024Q037435L324097l028032m108700l979775
7216A1561377p499687q451583m75330Q614724P452242m4135r94003N371287P864586
7207B3399478K550878l092495n221149q421796j3650357j4684663r515817l318346
7199c1954267K397980J1175147J9425358J6728977L386030n935639l105411J859747
7191A3977922j324090o446571l431534L064639J911907m495326l437216P337645
7183G157376J5275041J0514222k028554j0219910q023787L52006O066974N283819
7175B4377187M105550J0184772J8507878J3741088q149179k9327053l0141507
7168C298736j3442982J216298K736560l405881q817265j1265927j0025895l846873
$$ y = [-3120329, 3428063, 5910328, 11316352, 19353787, 22677884, 19649852, 15541152, 11561377, 4061690, -4389893, -4865223, 3749501, 11201743, 11157608, 10163605, 15534892, 23399478, 25950356, 22857861, 17636712, 9214916, -4435441, -19120104, -28635921, -31954267, -29556287, -18381140, 1044218, 17773195, 21159225, 15223586, 12118175, 13977922, 12653832, 6207261, 2775727, 5840366, 7752273, 3256947, -180269, 7157376, 22432417, 32946639, 30918085, 20698175, 12674388, 13026394, 19093368, 24377187, 28482737, 38667509, 57175387, 70916475, 62767296, 33440243, 3298736, -10144246, -8927948, -6191388, -9597269, -18414534, -29680461, -39706356, -43553229]
7160d3553229L710333N997840L266625L247767Q928983J3012300Q417476j396295
7152A631800o831740l299619N099593J0383789P239349k733385j1772256j2826883
7144a3109352o457828N23905K807122R90519r21158k613L246719N388870L532954
7135d000862j066481m728134o487459p673496o431796Q67508J0941697J4238827
7127d340196Q570499M048943Q072111J3218220Q608621l302312j1140955j0691377
7119A3043554o406015j195038M566137P176198L698691m85521J330378N279530
7111B7007914K876821m070007o649948m535275n157113q710624q359659n010870
7103a2608761o330470r783537l376471J2664958K1527728J3954702J898602k47189
$$ y = [-43553229, -39842896, -33845056, -30578431, -27330664, -18401681, -5389381, 3028095, 1631800, -5199940, -8499559, -3399966, 6983823, 14223172, 11489787, -282469, -13109352, -19567180, -19043275, -16236153, -15245634, -16166792, -16169405, -12922686, -7533816, -4000862, -5067343, -9795477, -16282936, -23956432, -30388228, -29520720, -18579023, -4340196, 4230303, 8279246, 16351357, 29569577, 38178198, 34875886, 23734931, 13043554, 6637539, 5442501, 10008638, 17184836, 20883527, 20398006, 21728384, 27007914, 29884735, 25814728, 19164780, 14629505, 9472392, 761768, -7597891, -12608761, -18939231, -28722768, -32099239, -19434281, 2093447, 16048149, 17946751, 17699562]
7095A7699562N141697P544658M402152q99200p088473j2149725j1506735o670225
7087c526289n981910r893437p287941N353877J4416428R580175M87077k44425
7079B903555K406115j409100m976293L545577J6399381J5040280K9021r741230
7071B4197306p200936m688375q620760q382584J919137R905628M555697n523799
7063F161314o076867J858573P732737R301810J1106594J0995616K360952j1579939
7055C1860790j8216581j2277950k780203O2670k409356k380724J711044M133608
7047b96702K353937J821059P107965J2946689J0449085R56010m240081l54380
7039C0743582K910638l902834j4168187j3948920l110812L988315n15476p705953
$$ y = [17699562, 22841259, 30385917, 34788069, 33888869, 26800396, 14650671, 3143936, -3526289, -9508199, -19401636, -26689577, -21335700, -6919272, 2660903, 3147980, 2903555, 5309670, 3900570, -1075723, 2469854, 18869235, 33909515, 33938536, 24197306, 16996370, 12307995, 3687235, -4695349, -2776212, 7129416, 11685113, 6161314, 84447, 1943020, 9675757, 18977567, 30084161, 41079777, 43440729, 31860790, 13644209, 1366259, -1413944, -1351274, -3760630, -6141354, -4430310, -296702, 2057235, 3878294, 10986259, 23932948, 34382033, 35338043, 31097962, 30743582, 33654220, 29751386, 15583199, 1634279, -1476533, 2511782, 1996306, -5709647]
7031e709647o757844k66891K580570J326996L383219J0204167J3186001N307391
7023B3253962q808691j8086182j7708272j2813658r616656o901204K50932J0342756
7015d0087013J4961669J0080680K532822J277370O276535J0768244J0894683P293296
7007B3998286M99860p855181j1468162n550102L888443N850234J97502j905773
6999G655107M227865R118419M631584k909006l997658k293119p640551j6926153
6991h133512j5938387j909707Q754489K245069j2144365j3529109K303354J7392603
6983b0959565J6175387N494084K806188J0563960J3507991J905764j3541236j6505402
6975e52829p396782j193463n660416j2300352j0844758l427303J265085J628618
$$ y = [-5709647, -12467491, -12734382, -10153812, -8826816, -5443597, 4760570, 17946571, 23253962, 14445271, -3640911, -21349183, -34162841, -43779497, -50680701, -50429769, -40087013, -25125344, -15044664, -12511842, -11234472, -4957937, 5810307, 16704990, 23998286, 24498146, 16642965, 5174803, -375299, 3513144, 9363378, 9560880, 7655107, 11882972, 21001391, 25632975, 22723969, 18726311, 16433192, 8792641, -8133512, -24071899, -25981606, -17227117, -14982048, -27126413, -40655522, -38352168, -20959565, -4784178, 709906, 3516094, 14080054, 27588045, 29493809, 15952573, -552829, -7949611, -9143074, -14803490, -27103842, -37948600, -41375903, -40110818, -38482200]
6967c8482200L256740P920700J0298306P091710L299099N120504R630205P151992
6959A5287056n236880j7297654j6479559k839511J1430592J6273858J1881859
6952A3019761K470534r957711k1259973k2073851p949021J0604630J7417138R924296
6944g804197J096166J243285O265646P067746K757400j268931k702479k669343
6936C985293L6792P126631J3496444R771467m211827j4519096q616385O685730
6928A3755049J1600003l45902j2013856o383855P463673O182511j2459697k3865945
6920a6068019j1812784P778180J0787995r61366o908267m25832N982846N219863
6912f407384M587580P886573P574517Q56972k858601J680489O273594M564814
$$ y = [-38482200, -35225460, -27304760, -17006454, -9914744, -6615645, -1495141, 8135064, 15287056, 10050176, -7247478, -23727037, -26566548, -15135956, 1137902, 13019761, 15490295, 5532584, -15727389, -37801240, -45750261, -35145631, -17728493, -7804197, -6708031, -5464746, 800900, 7868646, 10626046, 9357115, 6654636, 3985293, 4022085, 11148716, 24645160, 34416627, 30204800, 15685704, 7069319, 13755049, 25355052, 25009150, 12995294, 6611439, 14075112, 20257623, 7797926, -16068019, -27880803, -20102623, -9314628, -10275994, -17184261, -17610093, -11627247, -6407384, -1819804, 6066769, 13641286, 14498258, 11639657, 13320146, 19593740, 24158554]
6904B4158554K500796M031030Q13446j1378223j9317701j0991452L025105M452685
6896b705760m107850m662320O244763J3258327Q292453J681680K785982O159804
6888B6947079M252615J84730p07331j147291m748718p266257m149099p8763j852735
6879A1434230o730983o803280j617815K245554K537021L859503Q233391J0286679
6871B3444300M803183n102591j0792850p918156j123231J732277r03879k813824
6863A325229P30260N382242L763804k825445n548006j608477J074227l397140
6855a103306q730374n780907L161246Q026058O247846M864092P144417O815447
6847B0644519p18825r327787j0282037m235729J247852K648175K413314K194340
$$ y = [24158554, 26659350, 30690380, 31503826, 20125603, 807902, -10183550, -7158445, -2705760, -6813610, -11475930, -5231167, 8027160, 16319613, 18001293, 20787275, 26947079, 31199694, 31384424, 30677093, 29529802, 24781084, 17514827, 13365728, 13286965, 11434230, 4703247, -2100033, -3717848, -1472294, 1064727, 4924230, 13157621, 23444300, 28247483, 23144892, 12352042, 4433886, 3310655, 5042932, 4139053, 1325229, 2055489, 7437731, 11201535, 8376090, 2828084, 1219607, 2293834, -1103306, -9833680, -15614587, -12453341, -4427283, 1820563, 6684655, 13829072, 20644519, 19925694, 10597907, 315870, -3919859, -2672007, -23832, 2389482, 4583822]
6839D583822J199876O96939L222120O636186N583504J94246l608313m518714q361160
6830E628506j5902350j7020268n085755R820912J2560736L577962l354546j641159
6822a1415962K150956K607772K690724L979571K337683j803527p82784O108472
6814E872905P421590k706602j2425304q935350J820998N411664J640096J782928
6806a17075P247574P584852N2793m509275O24889P407509N960891j705695p204713
6797A5341750p582178n745013m388720m113169l766592m16732O655173J1437790
6789G422309P160834k347119n244061K188952J0373552J0646120N910317K454251
6781C8565155q5147m016787o493331m899973l366302n980466q551445n308431
$$ y = [4583822, 5783698, 6480637, 9702757, 16338943, 21922447, 22116693, 18508380, 13989666, 5628506, -10273844, -27294112, -32379867, -22558955, -9998219, -6420257, -9774803, -11415962, -9265006, -6657234, -3966510, 13061, 2350744, 547217, -235567, 5872905, 13294495, 10587893, -1837411, -10772761, -8951763, -3540099, -1900003, -117075, 7130499, 14715351, 14768144, 10258869, 10883758, 18291267, 24252158, 22546463, 15341750, 7759572, 2014559, -2374161, -6487330, -10253922, -10670654, -4015481, 7422309, 14583143, 12236024, 6991963, 9180915, 19554467, 30200587, 36110904, 38565155, 38480008, 34463221, 27969890, 23069917, 19703615, 13723149, 5171704, -136727]
6773a36727N48981J878573K543K477177R521511J2101492N037040n469281r976690
6764A5984619o230636P77359N128040M341722K67063k856519k648098p74787L51740
6755A4340503J123626K361154J853926k408167p110277o836866k139884O97666
6747A881681j310679l938070k703018N44740J156881r78769j530539J491428M572551
6738h13794L719759M64328O340L571459N955596K564793l945553p363824o122179
6729a963075l570261j655849L85971J785882O82865j142078m29641L82734m003023
6720i526475j0396183q089158M887735J5971975J4643359O023149M63782j718922
6712A2259262n387244q187820n151009n57006k364187p658119o397920J679596
$$ y = [-136727, 412254, 2290827, 2293370, 4770547, 14292058, 26393550, 31430590, 25961309, 15984619, 9753983, 10531342, 15659382, 20001104, 20268167, 17411648, 14763550, 13988763, 14340503, 15464129, 17825283, 19679209, 17271042, 10160765, 3323899, 1184015, 1881681, 571002, -3367068, -6070086, -5525346, -4368465, -5347234, -6877773, -5386345, -813794, 2905965, 3370293, 3376633, 6948092, 12903688, 15468481, 11522928, 4159104, -1963075, -5533336, -7189185, -6803214, -5017332, -4334467, -5476545, -5906186, -5523452, -9526475, -19922658, -28011816, -23124081, -7152106, 7491253, 13514402, 13978184, 12259262, 6872018, -1315802, -6466811, -7023817, -9388004, -17046123, -23444043, -21764447]
6704b1764447O633975M849659L358741O125635Q263010O765452N353399M819571
6696B4404995j43050r471611j3757271p987990J11498K176295J051491L207225
6688d08418O984216O694897K818737L03373O68815J891887K241141m19114q028107
6679A2747427j6544040j7011574p547206K467759N570961N609482P328546O069222
6671a309423k170579q998878m784295M586943O078942M88203L7483O849413R735367
6662A0513176L825354k049236j823072j878329p484204j1588276n894284N608185
6654a0770686J2728910J2178008P137478k28567q105494j1681250q218625k388293
6646i348519j97905o85248M83723K664542K215347J95696R76652M354957N608494
$$ y = [-21764447, -15130472, -10280813, -6922072, -796437, 7466573, 14232025, 19585424, 24404995, 24261945, 14790334, 1033063, -6954927, -6843429, -4667134, -3615643, -408418, 6575798, 13270695, 16089432, 16392805, 17061620, 18953507, 21194648, 20775534, 12747427, -3796613, -20808187, -28355393, -25887634, -20316673, -14707191, -7378645, -1309423, -3480002, -12478880, -17263175, -12676232, -6597290, -6109087, -6071604, 777809, 10513176, 14338530, 12289294, 10466222, 8587893, 1103689, -10484587, -16378871, -10770686, 1958224, 14136232, 21273710, 21045143, 12939649, 1258399, -6960226, -9348519, -9546424, -10231672, -9747949, -7083407, -4868060, -4672364, -3695712, 659245, 6267739]
6637F267739L182399N66221K25188O58562Q9158j106764k142284k458367p50969
6628D530883K970321M890701J457333m123253m645561P87515M625582J493457
6620A1986978m198873n346773k547284j532619k696113n81733N550802Q167473
6612H801858K524966m626557m072806J693824J950807n083509q342972p46943
6604g901332R125451R414914K206952j237917J693339L111012m78612l134912
6596A2798895j459038o16400l816175n502191j335650L420488K913673O70002
6588G073604J913397K504510l848272j1875471j0352549q626O189450K021932
6580f382025l809164k150799L642398N021614J310142j396916k55818J547801
$$ y = [6267739, 9450138, 10016359, 10241547, 10900109, 10989267, 9882503, 7740219, 5281852, 4530883, 7501204, 12391905, 13849238, 9725985, 5080424, 5867939, 10493521, 11986978, 7788105, 2441332, -105952, -1638571, -4334684, -4916417, 634385, 8801858, 11326824, 6700267, 2627461, 4321285, 6272092, 1188583, -7154389, -7901332, 1224119, 10639033, 12845985, 11608068, 13301407, 16412419, 15933807, 12798895, 11339857, 10723457, 6907282, 1405091, 69441, 3489929, 6403602, 7073604, 8987001, 11491511, 7643239, -4232232, -14584781, -14593407, -8403957, -6382025, -10191189, -12341988, -8699590, -3677976, -2367834, -3764750, -4020568, -2472767]
6572b472767K60358m309272q939774r086257k936116M927957O972157K010586
6564a3573128k204240J485933J0478097J6051477J3804952O948156P96057k422827
6556C1364477l613147m352038m998754m743196l862607m958106r355380j2834472
6548a7353223r295353L40635P739449P911666N285052N456137O189825K516019
6540H790207l201443l975266M06495K460668j580983o303326n564832q11756K545345
6531g234891K670582J050249k035095o741873r760723o451493K168832Q679709
6523a7654703P889763L539515L156864P602627R935699N453805j370835l138632
6515A5414103K18122K152496n29480l817386l736518k394132l756389o987348
$$ y = [-2472767, -2212409, -6521681, -15461455, -24547712, -27483828, -22555871, -15583714, -13573128, -15777368, -14291435, -3813338, 12238139, 26043091, 32991247, 33787304, 31364477, 27751330, 23399292, 18400538, 13657342, 9794735, 4836629, -4518751, -17353223, -26648576, -26307941, -18568492, -10656826, -5371774, 84363, 6274188, 8790207, 5588764, 1613498, 2019993, 4480661, 2899678, -3403648, -8968480, -9780236, -7234891, -4564309, -3514060, -5549155, -12291028, -22051751, -28503244, -26334412, -17654703, -9764940, -6225425, -3068561, 4534066, 14469765, 19923570, 18552735, 15414103, 15632225, 17784721, 17255241, 13437855, 9701337, 7307205, 3550816, -3436532]
6507c436532p887813n138059j624267k46211q55722r64403J768848O702199R327254
6498b354706N634553j766244n361072k264305K124291K642784J583485K942080
6490C180866M451474K074235j188173P52741N842972N328192k953134j0807459
6482F681714j1205645o327957j411947K546571O083128P160596M563428J300545
6474I390433L76635L49210j504161m699911p127955p870618o015603n89629N698016
6465a1993583P184080K996859o00008P38419L196296K063507m17140l69391J94924
6456B993963j218669J24210Q577055J6236381J0605791n929191j6272322j1272388
6448C844830j320306L2049n566324p180496j914190L199018L492020J979603K502920
$$ y = [-3436532, -11324345, -16462404, -18086671, -18332882, -19188604, -20153007, -18384159, -11681960, -2354706, 3279847, 1513603, -3847469, -6111774, -3987483, -1344699, 238786, 3180866, 7632340, 9706575, 8518402, 9271143, 15114115, 20442307, 17489173, 6681714, -4523931, -10851888, -12263835, -9717264, -3634136, 3526460, 8089888, 9390433, 9767068, 10116278, 8612117, 3912206, -3215749, -11086367, -17101970, -17691599, -11993583, -4809503, -1812644, -2412652, -1674233, 1522063, 3585570, 3168430, 2799039, 2993963, 1775294, 1899504, 10476559, 26712940, 37318731, 31389540, 15117218, 3844830, 2524524, 2556573, -3009751, -10190247, -12104437, -8905419, -5413399, -3433796, -930876]
6439i30876M375732N131177L927909R45457l159482o154698n492069j853316P51938
6430b458228l49711l206619l706456m85085L553387M515062J844219j177652j560293
6421c031376k02416J48060l94566Q76548M062812N386374K865616k28096o06871
6412H876085o39445m431858j0065827j1052592n565354R58213L944494N608925
6404a2367359R660484J3892214J2709796N496179k123815n478064n466345n086259
6396A1236831m836958l556914j294375J001787K853281L145363k24093o466228
6388A858694r605238m729566L896123O356292R7030n957866l412125M378501P949711
6379H31556M848840P76949m89134j196983l150376l717365p50591L362432N324028
$$ y = [-930876, 3444856, 8576033, 12503942, 13449399, 10289917, 4135219, -1356850, -3210166, -2458228, -2807939, -6014558, -9721014, -10206099, -6652712, -2137650, -293431, -1471083, -3031376, -3233792, -3085732, -3480298, -2603750, 1459062, 6845436, 9711052, 9482956, 8876085, 8236640, 3804782, -6261045, -17313637, -22878991, -21920778, -17976284, -12367359, -2706875, 11185339, 23895135, 29391314, 27267499, 21789435, 16323090, 11236831, 6399873, 2842959, 1548584, 2550371, 5403652, 8549015, 8324922, 1858694, -7746544, -12476110, -8579987, -2223695, -2126665, -8084531, -11496656, -7118155, 831556, 5680396, 6457345, 5968211, 4771228, 1620852, -2096513, -2847104, 515328, 5839356]
6370E839356M867208K756283j306165n972437p067587k671510L164463N053855
6362D663466K575039p22165k095469n74580L851437Q337186P384093l94839p895545
6353A5128623p145873j0728M160474J000120m463907o184105m087546j195351
6345b798293R33955J464941n24751l298892k657795K213130O357441N452021J595200
6336H736957m21337J57926N82836l51502j516027k251916k523341j379690J578404
6327B612310M238657M507265L624089L733603L517204L35261m013926m436724
6319A4117739l3695M006082L499952L65120j419085j457896j812027k824439l025383
6310A1416368j577066J500364N778552Q849378O656681j194052q277733p846079
$$ y = [5839356, 10706564, 13462847, 12156682, 6184245, -883342, -3554852, -390389, 4663466, 7238505, 6516340, 4420871, 3846291, 7697728, 16034914, 23419007, 23024168, 15128623, 7982750, 7972022, 12132496, 13132616, 8668709, 2484604, -1602942, -2798293, -1864338, -399397, -924148, -4223040, -6880835, -4667705, 1689736, 7141757, 8736957, 8315620, 8473546, 9056382, 8704880, 7188853, 4936937, 2413596, 1033906, 2612310, 6850967, 11358232, 14982321, 18715924, 22233128, 22568389, 18554463, 14117739, 14084044, 18090126, 21590078, 21955198, 20536113, 19078217, 17266190, 14441751, 11416368, 9839302, 11339666, 17118218, 25967596, 32624277, 31430225, 23152492, 15306413]
6302A5306413j745430J935467L18873q16734K787746O193284L026911l223972
6294B3782558l339790L052785N408800k322451j1464327r897211J000820Q485113
6286A4706297N956724N3745j182323P16145O8667k621191k631982l28805j144936
6277A3592341o319853r938610o934468O05965P176918J0058359R564666O537847
6269B4343165K340998j204550m258704q709774j3183576j1909536k582158P693734
6261g470401R782544M205862n58083p26368q89938l716777m071090J785333P704849
6252F045931N632258j883901n236047j947015J269359P33721R14368M449745N763203
6243A5741622L97354o061804n782680o44148J784199R04501K350664N764437L597998
$$ y = [15306413, 13560983, 15496450, 15815323, 14998589, 17786335, 23979619, 27006530, 23782558, 20442768, 23495553, 28904353, 26581902, 15117575, 5220364, 6221184, 14706297, 20663021, 20716766, 19534443, 20250588, 20319255, 17698064, 15066082, 14737277, 13592341, 7272488, -2666122, -9600590, -8994625, -1817707, 8240652, 17805318, 24343165, 26684163, 25479613, 21220909, 12511135, -672441, -12581977, -15164135, -7470401, 2312143, 6518005, 5959922, 5233554, 4343616, 626839, -3444251, -1658918, 6045931, 11678189, 9794288, 4558241, 2611226, 3880585, 4614306, 5528674, 9978419, 15741622, 16138976, 10077172, 4294492, 3650344, 5434543, 6339044, 8689708, 14454145, 18052143]
6234A8052143n869595j3687410j2671629o979876m014075l523103j208869K399710
6226b7502704M228649N876539J0589796J5394483J4141184P340831J606734j58232
6218C1517280q00679j525900l37590J506987l81996n146765o360176k643963n72579
6209A5254619l488673n733066k972964l5497j689125l176013J413304P333808
6201F906393N745104j847990o072078m410361k976424m221054l551723L58954
6193a0069179J969278j156124l438287n50230L826649N148920N282156P286404
6185H299587Q541008N139353p86039l949110l470107k522173k580340k579160
6177F093019k047255j056322J200278M025494L532505k255469q214018o958827
$$ y = [18052143, 12182548, -1504862, -14176491, -21156367, -25170442, -28693545, -29902414, -27502704, -23274055, -17397516, -6807720, 8586763, 22727947, 30068778, 31675512, 31517280, 30716601, 29190701, 28853111, 30360098, 29978102, 24831337, 18471161, 15827198, 15254619, 11765946, 6032880, 3059916, 3024419, 1335294, -1840719, -427415, 6906393, 12651497, 10803507, 4731429, 321068, -2655356, -6876410, -10428133, -10069179, -8099901, -9256025, -12694312, -13244542, -9417893, -4268973, 1013183, 8299587, 16840595, 21979948, 21193909, 17244799, 13774692, 11252519, 8672179, 6093019, 4045764, 2989442, 4189720, 8215214, 11747719, 9492250, 1278232, -5680595]
6169e680595J414013Q823752Q903838L499648j343685k491960j118353N66042
6161A2572700J449300R55095j385406m511740n053657n93497N528716N856768
6153A4818279j833963r552645q072930Q76035P230079O508528L786400L011649
6145A6771432J001638m204095p160589l445857J904139J519169l206185n232923
6137b053271k657114N57599J876938J656528j45333k475930j401667L692498N851864
6128D902112K02914o195267l789325L606070M156498k483674m561328J782980
6120b379020O184593K095417k462021N39229N823968N480119K816396M480694
6112B2579375O659177J598555p165280q880132k614418J914386M20252n24694
$$ y = [-5680595, -4266582, 4557170, 13461008, 16960656, 15616971, 13125011, 12006658, 12572700, 14022000, 14977095, 13591689, 9079949, 4026292, 3432795, 8961511, 14818279, 12984316, 3431671, -4641259, -3765224, 3464855, 9973383, 13759783, 16771432, 17773070, 13568975, 6408386, 2962529, 4866668, 6385837, 3179652, -2053271, -4710385, -4152786, -2275848, -619320, -764653, -3240583, -4642250, -949752, 4902112, 5105026, -1090241, -4879566, -1273496, 2883002, 399328, -4162000, -2379020, 3805573, 5900990, 3438969, 3978198, 9802166, 15282285, 18098681, 22579375, 29238552, 30837107, 23671827, 14791695, 12177277, 14091663, 14511915, 13987221]
6104A3987221L657518P432332M452572k406349n715613l734665j174950k024662
6096A4473404n201700o648299m053636K96293J667365j176904l695531j475912
6088e814920L440801N703051M619327M212197N610747M755650p24097o823402
6080A4979354q064326m221791L97611K464689K119435J105359M16064k33385j298201
6071G664809j922979l39136L357393N995467M894271J866985R90255K423407J517155
6062B6447627m641305j2141137j3870339p445345K215054Q301864Q779166O797801
6054A4443386N382961L955716R86345k446368m519688o242621r094203j0120042
6046g654514m802565M668111R996594P740813L788588L872172N768964N224052
$$ y = [13987221, 17644739, 25077071, 29529643, 27123294, 21407681, 17673016, 16498066, 14473404, 9271704, 2623405, -1430231, -1133938, 533427, -643477, -4339008, -5814920, -2374119, 3328932, 7948259, 12160456, 17771203, 22526853, 21802756, 14979354, 6915028, 2693237, 3090848, 5555537, 7674972, 8780331, 9196395, 8963010, 7664809, 5741830, 5402694, 8760087, 14755554, 19649825, 21516810, 22507065, 24930472, 26447627, 21806322, 9665185, -4205154, -11650499, -9435445, -1133581, 7645585, 14443386, 19826347, 23782063, 24768408, 22322040, 17802352, 11559731, 2465528, -7654514, -12457079, -7788968, 2207626, 9948439, 13737027, 17609199, 23378163, 28602215]
6038B8602215L305318J971726j606081q660389j2067471n414694M772311O293289
6030A7196224j035091n757919k561520J586483P56099j540598r78997L73682K26834
6021H265197P89878K320121J66271o197112r067630l737951L497254N295219M015945
6012E347192M814537N027251K8119n732738m191065L020199P062632N818695N140791
6003B6335613O841403N604760r14243p778093j0468658r407375n488121J103327
5995E828613O059554L434297m113302n863515J890980R069940N772079l748145
5987A8330501q066387m362226O63689K320525K023833R41146k352204o522111
5979B976766o504857r71354L907412J887930m957401r017129o926215k823094
$$ y = [28602215, 31907533, 33879259, 32273178, 23612789, 11545318, 6130624, 10902935, 17196224, 16161133, 10403214, 7841694, 9428177, 10184276, 8643678, 7664681, 8038363, 8265197, 9055075, 11375196, 11541467, 5344355, -3723275, -7461226, -3963972, 1331247, 5347192, 10161729, 15188980, 15217099, 9484361, 5293296, 8313495, 15376127, 21194822, 26335613, 33177016, 38781776, 37867533, 30089440, 19620782, 10213407, 4725286, 5828613, 11888167, 15322464, 11209162, 5345647, 7236627, 16306567, 22078646, 18330501, 10264114, 5901888, 6565577, 8886102, 10909935, 11851081, 9498877, 2976766, -3528091, -4499445, -592033, 1295897, -3661504, -12678633, -19604848, -22427942]
5971b2427942j592161k246756k52116N252840R582089Q196293J993875m143865
5963e637743o330717l982194R44761N093979N631293L224593J795254L175677
5955C914903M028776J276904j671786P16902O377207O603469j780880j1022008
5947H443487j2237327n866106J337230N506875P181837O810129M196036J037080
5939A6409241p63215k499761o065966q885132o469449r6162L349637O83202l078354
5930g415959j997843K743565N249872K809603j815377m462250l136268J374305
5922f650352N859255O399656K067249l521632o133927n415027l424396l73124
5914a1192298M525254Q759881P933639K592285j023034M51764K526084K82397
$$ y = [-22427942, -24020103, -26266859, -26518975, -21266135, -11684046, -3487753, -1493878, -5637743, -11968460, -15950654, -15005893, -9911914, -4280621, -1056028, 739226, 3914903, 7943679, 9220583, 7548797, 8265699, 14642906, 21246375, 19465495, 8443487, -3793840, -9659946, -8322716, -2815841, 4365996, 11176125, 15372161, 16409241, 15646026, 13146265, 7080299, -1804833, -8274282, -8370444, -5020807, -4337605, -7415959, -9413802, -6670237, -1420365, 1389238, -426139, -4888389, -8024657, -6650352, -791097, 5608559, 7675808, 4154176, -1979751, -7394778, -10819174, -11192298, -6667044, 2092837, 10026476, 12618761, 11595727, 12047491, 14573575, 14855972]
5906A4855972l214163j737744L315938M251983q43920m935714l232889l25299
5898H134164j657724m178915k057241K825220M091098K190208L707071R180858
5890B2234739J0284957K042560r139771j3812496j0633366m901528m16127K256694
5882b084338K588732L92000k118284k512200j224152L82442K817561O046957O895902
5873A1184620L158708j748492k906774j076837q32691k768947l061148m36631
5865A511808J947624K022770J082913m3796j968471l110937m96109M518258O684967
5856A2149027M591314K381896K077024N53599l187393m720010k233117r70633
5848A0641707m313860p163962m819457j777233l263896m222331K308641J0230013
$$ y = [14855972, 11641809, 9904065, 13220003, 17471986, 16628066, 11692352, 8459463, 8134164, 6476440, 2297525, 240284, 3065504, 7156602, 9346810, 13053881, 22234739, 32519696, 34562256, 25422485, 11609989, 976623, -3924905, -4341032, -2084338, 504394, 896394, -1221890, -3734090, -4958242, -4575800, -1758239, 4288718, 11184620, 14343328, 12594836, 9688062, 8611225, 7778534, 5009587, 1948439, 1511808, 3459432, 5482202, 6565115, 6521319, 4552848, 1441911, 945802, 5464060, 12149027, 16740341, 19122237, 21199261, 21752860, 18565467, 13845457, 11612340, 10641707, 6327847, -836115, -5655572, -7432805, -10696701, -14919032, -12610391, -2380378]
5840b380378O960583o068819j3067854o206333M340259O921823L186141J01634
5832f212944j959641m781690m801682M08940M952915L519585J601689O502538
5824g70290J3214623J1088074J531195l570565m11181K437120k54597k888113
5816B0376266j279595q04827n801968j0289135p194379J74220L983861L789783
5808B954226M396413N894874M362795K90854j695142p46100m40890j753964j771303
5799A1491763L02451J744928J484172J137484L30756l103873p072105n833337
5791D82239N39433L511181k408390j0346791r417456L01844P888346O399822J066973
5782a982799L75051M177831N416689J351132k513001q67865L271005K453078m799116
$$ y = [-2380378, 4580205, -1488614, -14556468, -20762801, -16422542, -9500719, -6314578, -6212944, -8172585, -12954275, -17755957, -17347017, -12394102, -8874517, -7272828, -770290, 12444333, 23532407, 25063602, 21493037, 21081856, 23518976, 23264379, 20376266, 19096671, 18291844, 12489876, 2200741, -4993638, -4819418, -835557, 2954226, 7350639, 13245513, 17608308, 17899162, 16204020, 15457920, 15017030, 13263066, 11491763, 11794214, 13539142, 15023314, 16160798, 16491554, 13387681, 6315576, 482239, 1021672, 4532853, 2124463, -8222328, -17639784, -17337940, -9449594, -3049772, -1982799, -1607748, 2570083, 7986772, 9337904, 6824903, 5957038, 9228043, 11681121, 6882005]
5773F882005j1528055j1036561m785874N26819J555851Q85860J797645L820151
5765a1882159M544302L577478K749822L110349L374576J738746j513496l927309
5757A772309l543624j233125J91093q54231k990167l341458k70117N014171Q698347
5748C443198O856880l91410p219172p066138k69171N615232M617411q94863m440411
5739B51556l906344k206715q95227K186196P922777J2325162J0472084K690550
5731B8840039n042532o672561j564682N040331O910978K725064l052898n592362
5723B1591377m918986m400280n260746n208152k482676J304912L274447K441584
5715F341480n2358k386310k933957j048194K045747L945540L249849M91624k901422
$$ y = [6882005, -4646050, -15682611, -20468485, -19941666, -18385815, -17499955, -15702310, -11882159, -7337857, -3760379, -1010557, 2099792, 5474368, 7213114, 5699618, 1772309, -1771315, -3004440, -2813347, -3667578, -6657745, -9999203, -10269320, -5255149, 3443198, 10300078, 9908668, 2689496, -4376642, -4645813, 969419, 5586830, 4691967, 251556, -3654788, -5861503, -6756730, -4570534, 3352243, 15677405, 26149489, 28840039, 23797507, 17124946, 15560264, 20600595, 27511573, 30236637, 27183739, 21591377, 16672391, 12272111, 7011365, 1803213, -679463, 625449, 3899896, 6341480, 6289122, 3902812, 968855, -79339, 1966408, 5911948, 9161797, 9653421, 6751999]
5706F751999n341429n042937j328463L421544N128267K633202m66792p2165L322539
5697I005765N342771L055802j875839n356321n042573k084663N20543P51646j012866
5688C304265k862862l363734k726063k115126j903569r32905J868936N172197
5680c558861N905132L190213J42930k50569K88429j845165n309210m425590K011672
5671c851019P257450N262051q56413l322559k28059L264124K995974K82327j654830
5662I149046j593131l2241J914987K878463K586763K274093J792575j450891p303841
5653A0215823r611282l881415L830553L239607n042730r036018k256012P164432
5645e377042Q735437L802751Q82988J934335J262879l751593q114480o243634
$$ y = [6751999, 1410570, -3632367, -4960830, -1539286, 3588981, 6222183, 5755391, 5683226, 9005765, 14348536, 17404338, 15528499, 10172178, 5129605, 3044942, 3565485, 4317131, 3304265, 441403, -2922331, -5648394, -7763520, -9667089, -10599994, -8731058, -3558861, 2346271, 5536484, 5679414, 5428845, 5717274, 3872109, -1437101, -5862691, -3851019, 3406431, 8668482, 7812069, 4489510, 4261451, 7525575, 10521549, 10803876, 9149046, 7555915, 7523674, 9438661, 12317124, 14903887, 17177980, 18970555, 17519664, 10215823, 604541, -3276874, 553679, 3793286, -1249444, -10285462, -12541474, -5377042, 3358395, 7161146, 8044134, 9978469, 11241348, 7489755, -624725, -6868359]
5637f868359J097790Q107909R668243N445798j23160k404384j906710l146183
5629I870944p259546r297421n484902M80843K515649P00574k02787J084388J290189
5620f302069o88748j534999P12452K941203J218429l787115p448262n952113K47477
5611b0593745O626519Q333038N003290J243100Q86023K138444Q38131k817920
5603A656880m329415j415737L049883N180453M050864P65480l308333n912571
5595b62496m322390J242256O230210O110146J530207k565769k638455J72094K449497
5586G945300K484684Q96544j505695m481485o910024o800924m110653j804607
5578a4286860k098721l069330j557403J793376L668296L427352L420519M171686
$$ y = [-6868359, -5770569, 2337340, 12005583, 17451381, 17328221, 14923837, 13017127, 9870944, 2611398, -6686023, -12170925, -11690082, -9174433, -8473859, -8676646, -7592258, -6302069, -6990817, -8525816, -7813364, -4872161, -3653732, -7440847, -14889109, -20841222, -20593745, -13967226, -5634188, -630898, 612202, 1498225, 3636669, 4474800, 1656880, -2672535, -4088272, -1038389, 4142064, 8192928, 8958408, 5650075, -262496, -4584886, -3342630, 2887580, 8997726, 10527933, 7962164, 5323709, 5495803, 7945300, 10429984, 11326528, 9820833, 5339348, -1570676, -8371600, -12482253, -14286860, -16385581, -19454911, -21012314, -19218938, -15550642, -12123290, -8702771, -4531085]
5570d531085L567125J294914l46435q03544j683619k039929R97590N381179M774274
5561F610470r85322l412652J871843P305013M998029o71207q29729L051993K565615
5552B0504053k801446n572664l920295l999352p582533q242653k987249J871944
5544a2730195Q83510k482368k746077n89247Q64419J978985L606249L312328J01409
5535g800987j300781L336636J0064463J0735408L350289n709469r017321m888291
5527a230053K154597N648000K980733j955047l263115j31351L143790L632822
5519A0980376K141771o32401m783826p299201l944164K791020M338955j844800
5511A747730p388536m948216J210721K776088J71430N4115L399008M399448N41878
$$ y = [-4531085, -963960, 330954, -15481, -819025, -2502644, -4542573, -3544983, 1836196, 6610470, 5625148, 2212496, 4084339, 11389352, 16387381, 15716174, 14886445, 17938438, 20504053, 17702607, 12129943, 8209648, 4210296, -3372237, -11614890, -14602139, -12730195, -11846685, -14329053, -17075130, -17664377, -16799958, -14820973, -11214724, -7902396, -7800987, -9101768, -5765132, 4299331, 15034739, 18385028, 12675559, 3658238, -1230053, 924544, 6572544, 9553277, 7598230, 4335115, 4203764, 7347554, 10980376, 13122147, 12489746, 7705920, 406719, -3537445, -746425, 3592530, 1747730, -5640806, -10589022, -9378301, -6602213, -6430783, -6376668, -2977660, 1421788, 1963666]
5502A963666l450608k881544Q21751K877655R98329k510708l062390J380833P030541
5493C167525P806926L037105j641914k450837k016182l208981l740271j195656
5485b42285J496107J116821L86778K932766N774182L805537j099445k831229q29946
5476A0509286L59001k41851K46801Q99309k543432q735582j0261579m292323K991117
5467a1069253N130208K901280P86161R88828L170841N809003O193221K980378
5459A6890667p46931j340500q89995l632265o732811l009495N922077Q797393
5451A5258140J042945p071211n026134K792472M722254r16344n536465m476246
5443G89411k091470k519138l333889q45573L631363N868718M346783J539489O89453
$$ y = [1963666, -1486942, -4368486, -3546735, -669080, 329249, -2181459, -5243849, -3863016, 3167525, 10974451, 14011556, 12369642, 9918805, 7902623, 4693642, 953371, -242285, 1253822, 2370643, 2757421, 5690187, 11464369, 15269906, 14170461, 11339232, 10509286, 10868287, 10626436, 10873237, 11772546, 9229114, 493532, -9768047, -14060370, -11069253, -5939045, -3037765, -2251604, -1262776, 1908065, 7717068, 13910289, 16890667, 16143736, 14803236, 13913241, 10280976, 3548165, 538670, 6460747, 15258140, 16301085, 9229874, 4203740, 6996212, 11718466, 10802122, 5265657, 789411, -1302059, -3821197, -7155086, -8000659, -4369296, 1499422, 5846205, 7385694, 8075147]
5434H075147K335531L831314K557763n53567k295808j989141k117045l316081
5426F528113k554737J350726M238002K428226r16631l5112M437060N755053M13757
5417B1644457p003551r457680n155681J570919N411255N075008L555946L545077
5409A9185750L341970n63209o855184r118737m332017J859261K008690l324575
5401B201949o779239l992932J841101M988060L387102l77825j927931J033864
5393C74149N947148P246059K587355m226837q205827q597324o973386l257013
5385a5105676K175795N329487L017925j256872j606063J277482J752827q62492
5377e277587j334306J850409L644494J547076j00838J235700O86998n279813j0741566
$$ y = [8075147, 10410678, 14241992, 16799755, 16246188, 13950380, 11961239, 9844194, 6528113, 3973376, 5324102, 9562104, 11990330, 11073699, 11038587, 15475647, 21230700, 21644457, 14640906, 5183226, 27545, 1598464, 7009719, 12084727, 15640673, 19185750, 22527720, 21964511, 15109327, 5990590, 1658573, 3517834, 5526524, 2201949, -4577290, -8570222, -6729121, -1741061, 1646041, 1268216, -659715, 374149, 6321297, 13567356, 16154711, 11927874, 3722047, -4875277, -11848663, -15105676, -12929881, -7600394, -4582469, -5839341, -7445404, -6167922, -4415095, -5277587, -6611893, -4761484, -1116990, 430086, 329248, 1564948, 2251946, -3027867, -13769433]
5368a3769433q241502n76817L224309J258441k6192K660325M721106K121429k018814
5359a0647148k416153J202429M997924O211788N005510L074646K056367J913703
5351A1399066O42589k376081l473346R65938P274934O959695j622295r311317
5343A0459183p631158J57238M399437K042899j729327k920014k921694l044923
5335a188359j388442K518135N047518L613014P34792j88876Q0666o56072j187210
5326G385166P69533L214817J984266k106333l474708m20537J394302k718222q469978
5317b441694p844306q14897L785620L73165n331082m187331L335858P567203L200192
5308b357272l145217k162918N225588R371188M992396k778675o407490m985178
$$ y = [-13769433, -22010935, -22587752, -19363443, -18105002, -18131194, -15470869, -10749763, -8628334, -10647148, -13063301, -11860872, -6862948, -651160, 4354350, 7428996, 9485363, 11399066, 12041655, 9665574, 6192228, 7158166, 14433100, 21392795, 19770500, 10459183, 2828025, 2985263, 7384700, 9427599, 7698272, 4778258, 1856564, -1188359, -2576801, -58666, 4988852, 8601866, 9336658, 9147782, 9228448, 8572376, 7385166, 8154699, 11369516, 13353782, 11247449, 7772741, 7352204, 8746506, 6028284, -2441694, -10286000, -11100897, -7315277, -6942112, -12273194, -16460525, -13124667, -5557464, -2357272, -5502489, -7665407, -2439819, 6931369, 11923765, 9145090, 2737600, -2247578]
5300b247578k425918n44271J694432L772628L058811q58643m397156l855059L45059
5291e457695M059776L529671q66620m716754m271101j122286j38474k104229j905883
5282a2993595L396472Q409966O250086p30325l364873J348258O208158M535946
5274A3060093r06060k943200O48899O484219J0560768J0120418L843082n513600
5266C5354619j1189300r420570m307152j682010q12839K467724O618309N494676
5258B2523457j330440o459501n008473r88927j62206j779493j766406r1038J43314
5249E080287j493471k820148l462638m438347m148910J72999O656885R236633
5241D783290N389873n96112l951150n045411n946218n254545r44094L957884M048413
$$ y = [-2247578, -4673496, -5217767, -3523335, 249293, 3308104, 2449461, -1947695, -5802754, -5457695, -1397919, 2131752, 1265132, -3451622, -7722723, -8845009, -8983483, -11087712, -12993595, -9597123, -1187157, 5062929, 4332604, 967731, 2315989, 8524147, 13060093, 12154033, 9210833, 9859732, 16343951, 26904719, 37025137, 40868219, 35354619, 24165319, 14744749, 10437597, 8755587, 7942748, 10410472, 17028781, 22523457, 21193017, 14733516, 9725043, 8736116, 8573910, 6794417, 5028011, 4936973, 5080287, 3586816, 766668, -2695970, -7134317, -11283227, -11110228, -4453343, 4783290, 10173163, 9577051, 5625901, 580490, -5365728, -10620273, -11564367, -7606483, -3558070]
5232c558070k87650k678446q0990K629724L45755m096920l985845J378878O079719
5223d253845O284763M367417L438065K717307Q19634m47483P92547K340239R64584
5214A7023228k045226k498511K81450K716624K595989J480971R35500K03349j193249
5205A9500125k127779k574993l995872n303594k702368L555493O670068K083659
5197A5104739m949956o442277l449434l331818o492364m905765M175985J1878100
5189A587210R983695K470684j736164j934128l572937o786380o297285j835629
5181h120934M92785j332342j600305L262857Q197047P119281J470811l407192
5173F082008n720889o125442l377062L039291Q662247Q364362L496367m35897
$$ y = [-3558070, -3845720, -6524166, -6605156, -3975432, -3629677, -7726597, -11712442, -10333564, -4253845, 2030918, 6398335, 9836400, 12553707, 13373341, 12925858, 13718405, 16058644, 17023228, 14978002, 12479491, 12760941, 15477565, 18073554, 19554525, 20490025, 20693374, 19500125, 17372346, 14797353, 10801481, 5497887, 2795519, 6351012, 13021080, 15104739, 10154783, 3712506, 263072, -3068746, -9561110, -14466875, -10290890, 1587210, 11570905, 14041589, 12305425, 10371297, 6798360, 11980, -6285305, -8120934, -7628149, -8960491, -10560796, -7297939, 899108, 8018389, 9489200, 6082008, 361119, -5764323, -9141385, -6102094, 2560153, 10924515, 14420882, 13984985]
5165A3984985j828237l230188m546588k344819L277093O976862N427278J673589
5157A9389975j42360l92881j460632k995882l162447k525962l215807n005742
5149D88262n070237j789590K930172N494836M092993L67525k171350j735267q8882
5140B518462j23359k138385l841834l555371j591763J320869M721423P216203
5132D526245O943809M152832J379277P0784j107691l412183n324915m593726j909565
5123G24867m99402k008040m234146l724113q9555L340722L712305K456582L197741
5114B876961O280530Q054431O213512K741416l0902k892092o580109q505787o496859
5105A661101l024089j281639K93016M317838P784054N735231K19415j920319j807
$$ y = [13984985, 12156748, 8926560, 4379972, 2035153, 5312246, 12289108, 17716386, 19389975, 19247615, 18854734, 17394102, 14398220, 11235773, 8709811, 5494004, 488262, -4581975, -6371565, -3441393, 2053443, 6146436, 6513961, 4342611, 2607344, 2518462, 2395103, 256718, -3585116, -7140487, -8732250, -7411381, -2689958, 4526245, 11470054, 15622886, 17002163, 17072947, 15965256, 12553073, 7228158, 2634432, 724867, 225465, -1782575, -6016721, -9740834, -9830389, -6489667, -2777362, -320780, 2876961, 9157491, 17211922, 23425434, 26166850, 26135948, 23243856, 16663747, 8157960, 1661101, -1362988, -2644627, -2351611, 1966227, 9750281, 15485512, 15704927, 13784608, 13782801]
5096A3782801k39775m501065o827349l928368q37868j780988l037977m35872K918732
5087d887729K924297K397614N108264P033407K461153m537236m462772K713578
5079H750576O486733J112455o303935o431050j84329L981204J583307l572563
5071E422398n359885k287729K003409L635147K462590O78021j044277l377986
5063B131688m787309k274276K978251N108088J525019k691023k061518J374134
5055A303054K042056m69963k156284j822026j807842k631660k362524q72099J80313
5046h596975J180241L647898N935855M762926J038535o78510J041285K765956
5038A1097211J877039k26549j428860j642991j395892q60325q18987j800595k402771
$$ y = [13782801, 13543026, 9041961, 2214612, -1713756, -2551624, -4332612, -7370589, -7806461, -4887729, -1963432, 434182, 5542446, 12575853, 15037006, 10499770, 6036998, 8750576, 15237309, 16349764, 10045829, 3614779, 3430450, 7411654, 8994961, 5422398, 62513, -2225216, -221807, 3413340, 5875930, 6553951, 5509674, 2131688, -2655621, -4929897, -1951646, 3156442, 4681461, 1990438, -71080, 1303054, 3345110, 2875147, 718863, -1103163, -2911005, -5542665, -7905189, -8777288, -8596975, -7416734, -3768836, 2167019, 6929945, 7968480, 7289970, 8331255, 11097211, 12974250, 12747701, 11318841, 9675850, 8279958, 7419633, 6600646, 4800051, 2397280]
5029B397280j328508k70146j369252k963473k042934P4912n47469l439262l600814
5020a3089666J044883O756409R312833Q131823M611323M81542j861871j445523
5012A3941753j154268l897745o937149n184695L00294L279561K088306J513933
5004C949990L431420K910237k802190p733254m687683M640976J1618903J0318530
4996B1646929K067508p168615j1161160p479691J02449M655470L069202j421721
4988D310371l986082l046054j44638K111065J562636j257140k478208M80287M377332
4979A929569M105306K32433k211900j738397j522097k758584l162749k546248
4971g672667l324002m463767j845433L639946N477402J617511j754016Q4034L442470
$$ y = [2397280, 1068772, 798626, -570626, -3534099, -5577033, -5502121, -6049590, -9488852, -13089666, -12044783, -5288374, 4024459, 12156282, 16767605, 17249147, 15387276, 13941753, 12787485, 8889740, 1952591, -3232104, -2931810, 347751, 2436057, 3949990, 7381410, 10291647, 7489457, -243797, -4931480, -290504, 11328399, 21646929, 23714437, 16545822, 5384662, -2095029, -1992580, 2662890, 5732092, 4310371, 324289, -2721765, -2866403, -755338, 807298, -449842, -2928050, -2447763, 1929569, 6034875, 6267308, 4055408, 2317011, 794914, -1963670, -5126419, -7672667, -10996669, -15460436, -17305869, -13665923, -8188521, -6571010, -8325026, -8240992, -4798522]
4962d798522L023579j83890k309424k985222l798320m189767k812902p6497L092738
4953a5038227N934734O311410K786336j257688j065264J618712R25722k449687
4945b233952j475620M644359P755155L965499k93740k28801p40865n980239j0159728
4936d747932o992059o81061J039374j417092k891960k774849k825744j096778
4928b2388101L692137O338329J933903n228065p053386k805502J724312L052718
4920b0733655K081115L52794q48650o50203q37389l529891n235047o05773O418581
4911b3588118N694357j905078l246676N516522J0492871J940117r578490j0349926
4903b5024421l677988N8871J156851M138554M975517k04946m153708j072730Q65215
$$ y = [-4798522, -1774943, -1958833, -4268257, -7253479, -11051799, -15241566, -18054468, -18130965, -15038227, -9103493, -2792083, -5747, -1263435, -2328699, -709987, 215735, -2233952, -3709572, 934787, 8689942, 12655441, 12361701, 12132900, 11392035, 5411796, -4747932, -11739991, -12421052, -11381678, -12798770, -15690730, -18465579, -21291323, -22388101, -18695964, -12357635, -10423732, -15651797, -22705183, -25510685, -23786373, -20733655, -18652540, -18299746, -19148396, -19798599, -20635988, -24165879, -29400926, -30006699, -23588118, -17893761, -19798839, -23045515, -17528993, -7036122, -5096005, -14674495, -25024421, -28702409, -28643538, -27486687, -23348133, -18372616, -18577562, -22731270, -23804000, -22938785]
4894b2938785n260854r798619l404005L876977m65463q644239p640284l209349
4886e7484621n809050p392516J584778P730351k663126j3265579m979443M578345
4878g7700861q521818k3774174j0598754L664333k6319025n9583035K333408J53316496
4870d7183430K42550374J59986985r526327r7271491o4196886j2475487j4936759
4863A56946979l6132631k7149196m494463j225495p852449l304485J895033p961585
4855G0721708j8188851r364239O836989Q080321k322035o592686l474980l295469
4847D2400758n241234k015996K866469J683367k074851j052119J570304o20866
4839C7515832l992346k145866J824911K441553K403419M499326K658267o596500
$$ y = [-22938785, -28199639, -37998258, -41402263, -37525286, -37990749, -46634988, -54275272, -57484621, -63293671, -70686187, -69101409, -61371058, -64034184, -77299763, -82279206, -77700861, -86222679, -109996853, -120595607, -116931274, -143250299, -202833334, -200499926, -47183430, 195366944, 355353929, 345827602, 248556111, 184359225, 171883738, 156946979, 120814348, 93665152, 89170689, 87945194, 80092745, 76788260, 78683293, 70721708, 52532857, 43168618, 50005607, 58085928, 55763893, 49171207, 45696227, 42400758, 37159524, 35143528, 38009997, 39693364, 37618513, 36566394, 38136698, 37515832, 33523486, 31377620, 33202531, 35644084, 38047503, 42546829, 45205096, 38608596]
4831C8608596j3362827q226631J840599M787694K182924K507334L787689j341946
4823C0783432r063768q916221j490280L295533L102022L986979O158126L531320
4815C1387143k664964m024791j06393j28787o801942j0859079n948546J902022
4807B754663M840757L884048L373078K659824l37945l240042l001920j332398
4799I600065j083175q92468J631510M532437M394666K368720K224062L657669
4791B6433486K705836j135553l196720o97786K629705K057718r31860j213365
4783B6651461J493755J762436l023860q085258p865901l438223K21671J210074
4775H926155Q42963l91615k156533j761817K200741N432949L138349j675135j862108
$$ y = [38608596, 25245769, 17019138, 18859737, 23647431, 25830355, 28337689, 32125378, 30783432, 21719664, 12803443, 11313163, 14608696, 17710718, 21697697, 27855823, 31387143, 28722179, 24697388, 24590995, 24462208, 17660266, 6801187, 852641, 2754663, 7595420, 11479468, 14852546, 17512370, 17174425, 13934383, 10932463, 9600065, 8516890, 7624422, 9255932, 13788369, 18183035, 20551755, 22775817, 26433486, 29139322, 28003769, 24807049, 24109263, 26738968, 28796686, 27864826, 26651461, 28145216, 29907652, 26883792, 18798534, 10932633, 7494410, 7716081, 8926155, 9769118, 9377503, 7220970, 5459153, 7659894, 13092843, 16231192, 14556057, 12693949]
4766A2693949K666902N137854L504610L141045N980278N975805m06212p137888
4758C1556343p594375m018520k155206k161834j224061l80145j868825l215202
4750H938175p28119L414010L674885p21940n219314o082881l014961K440035P151795
4741I851685P338485L179767K0968J199355K854797K27656m549183o471157o105818
4732G546555p328626q931695o021761O73481M180095J322732k479985p94962N492415
4723f341751R781375P472065O46402m036696k232142K892461M236957K36705l002451
4714I652925j100490K088325J667787K78983K710247N795293K467613n439999
4706A8120684p772405q17896O858743O590778P11356k894129j932074j39763k2202
$$ y = [12693949, 15360851, 20498705, 24003315, 27144360, 33124638, 39100443, 38694231, 31556343, 23961968, 19943448, 17788242, 15626408, 14402347, 14022202, 12153377, 8938175, 8210056, 11624066, 15298951, 14577011, 9357697, 3274816, 259855, 2699890, 9851685, 17190170, 20369937, 20390905, 21590260, 24445057, 24672713, 20123530, 13652373, 7546555, 217929, -8713766, -14735527, -14062046, -9881951, -8559219, -11039204, -11834166, -6341751, 3439624, 10911689, 11558091, 7521395, 5289253, 8181714, 12418671, 12655376, 9652925, 8552435, 10640760, 12308547, 12587530, 15297777, 21093070, 23560683, 18120684, 10348279, 9530383, 16389126, 22979904, 23691260, 20797131, 18865057, 18725294, 18703092]
4697A8703092n39534p01702r87438j169100P538K327283L525943K134285n30691
4688B2769676k214217k475494k178208j056260J715585M236476K563515l151495
4680B0209578o606270l388020J863307J975126j313642j49699N601935O606753
4672B4799068j282860r581301r171508j996888M798367Q870422J0097125N459769
4664C1992194m746199j1546187p880391j47790P38350m005103m247117J792032
4656A949789N465546K643837q93132o79387L32090l70326k96314J383390R57412
4647A0492905k420870l811643m67679L851510N442899N016490L082192j823713
4639A9362091p390959p384090q88358N089783N761932M357017M259489L019260
$$ y = [18703092, 18163558, 17461856, 16474418, 15305318, 15312856, 17640139, 21166082, 23300367, 22769676, 20555459, 18079965, 15901757, 14845497, 16561082, 20797558, 23361073, 20209578, 13603308, 10215288, 12078595, 14053721, 12740079, 12590380, 18192315, 24799068, 23516208, 13934907, 4763399, 2766511, 7564878, 16435300, 26532425, 31992194, 27245995, 15699808, 7819417, 7671627, 8409977, 4404874, 157757, 1949789, 7415335, 10059172, 9166040, 8486653, 8818743, 8448417, 8152103, 9535493, 10492905, 8072035, 4260392, 3792713, 7644223, 13087122, 18103612, 21185804, 19362091, 11971132, 4587042, 3698684, 8788467, 14550399, 18907416, 23166905, 26186165]
4631B6186165j085392l883222k316217q3714p32231j599395m15559r67473n210402
4622I892560o592276J43825Q182753P369019l73404m546018k411109j106671l889728
4613F668951m871768J73542O384340P079774K560353j963387l147020j381200
4605A1503585J075730J665257o85367m181927o093671n907979m770765k934048
4597a0329185m16899J095568K69587j064917m39152J244272J841369K375522M740573
4588f83262O502698L657832j853345l448542N12176M286809L500285P12504k46572
4579A2940583k52229j636132l218286k742666j252538r66230j070100L38994J851539
4570C992935N84422k337541k371542K007521P043134Q798695P388831M712019
$$ y = [26186165, 25100773, 21217551, 18901334, 18817620, 18085389, 16485994, 16070435, 15102962, 9892560, 3300284, 3444109, 11626862, 18995881, 18622477, 14076459, 11665350, 10558679, 6668951, 1797183, 1970725, 8355065, 15434839, 17995192, 16031805, 12884785, 11503585, 12579315, 14244572, 13559205, 9377278, 3283607, -2624372, -7395137, -10329185, -10746084, -9650516, -9380929, -10445846, -10884998, -9640726, -7799357, -5423835, -683262, 5819436, 9477268, 7623923, 4175381, 4687557, 8974366, 12474651, 13187155, 12940583, 12688354, 11052222, 7833936, 5091270, 3838732, 2872502, 1802402, 2141396, 3992935, 4577357, 2239816, -131726, 1875795, 8918929, 17717624, 25106455, 29818474]
4562B9818474R96229l790393p161391o289036k614470r96327l433925o340862
4554A88299n478231j258900K735364M391123L835412J557130j130348j268465
4546C571384K414872O268191N760579K115263M09996J411868Q53771k403325l752631
4537A6649968p78095K268048J603644j53309N4654p33615n636682r944642o754426
4528c424455J672372O052894L019514j412330j709571Q98176L405538N512653
4520A4014791O393593K950735m675962j0121253p694554J41137N706251M871158
4512A1585896Q3950l935158m782224l225422j557969j261605j637177j040163
4504e769872O19279J701152J169178j68516q04258J72734K515613M298025K874206
$$ y = [29818474, 30814703, 27024310, 19862919, 13573883, 10959413, 9963086, 6529161, 188299, -5289932, -6548832, -3813468, 577655, 4413067, 5970197, 4839849, 3571384, 5986256, 12254447, 18015026, 20130289, 20540285, 21952153, 22805924, 20402599, 16649968, 15871873, 18139921, 19743565, 19590256, 19644910, 18911295, 13274613, 3329971, -3424455, -1752083, 4300811, 7320325, 5907995, 4198424, 5096600, 8502138, 14014791, 20408384, 23359119, 18683157, 8561904, 867350, 1008487, 6714738, 11585896, 11669846, 7734688, 2952464, -272958, -1830927, -3092532, -4729709, -5769872, -5150593, -3449441, -2280263, -2448779, -3253037, -3080303, -564690, 3733335, 6607541]
4495F607541j818235n963611o122898l601726j898040j316286K04125K218137
4487a1690993K425999J566897K342966L460540R07888l788870l665125K384704
4479f055994N642944K32476o483976l694000O698827J2376288P685376k78315
4471A6123626l624667l441548m103847m621022j531980L350025M439161P17589
4463G307337k741930k285217l58221p40800k417127j424741K605806N177163K645680
4454G767950l142042p043870o053698j566155K619192L506184J087216j537486
4446d362709r10317K974641O315393N709220J759584k192689l438695j021453
4438D832975M358960R489952R602628L129434n429382j0019421r484362o973488
$$ y = [6607541, 4789306, -1174305, -7297203, -10898929, -12796969, -14113255, -13909130, -11690993, -9264994, -7698097, -5355131, -1894591, -986703, -4775573, -8440698, -6055994, -413050, -180574, -6664550, -10358550, -3659723, 8716565, 16401941, 16123626, 12498959, 9057411, 4953564, 332542, -1199438, 2150587, 6589748, 7307337, 4565407, 2280190, 1921969, 1181169, -1235958, -2660699, -54893, 5122270, 7767950, 4625908, -2417962, -8471660, -10037815, -7418623, -3912439, -2825223, -4362709, -5273026, -2298385, 4017008, 9726228, 11485812, 9293123, 5854428, 4832975, 9191935, 18681887, 28284515, 31413949, 25984567, 15965146, 6480784, -492704]
4430d92704m476948j697443N95556O54574m95025L35254L231583M487034K349786
4421D491667m31409j311439j315283j700007r69577K094627N326472N756893L168899
4412A5110843o96979l955456m206121J45285O092505P344422K362859k517465
4404A9679893j491180K699450L478366J87803k106401r21275Q20748J19666k173654
4395B0293416l212282j238394K846333M942310N29913r058187j5213859j0962191
4387a1072941J7466P411182O291284Q79224k786333l058041j383434O98472K153936
4378h49185K991435M467389O459468N974733J582940k620000k101611Q45332O47071
4369A7397572k107019j680277K611470M836812K192496j338756l054595n270747
$$ y = [-492704, -4969652, -6667095, -6071539, -5416965, -5911990, -5576736, -2345153, 2141881, 4491667, 4060258, 2748819, 1433536, -266471, -1236048, 858579, 6185051, 11941944, 15110843, 14413864, 10458408, 6252287, 6397572, 12490077, 19834499, 22197358, 19679893, 18188713, 20888163, 24366529, 24554332, 22447931, 21526656, 22347404, 22467070, 20293416, 17081134, 15842740, 18689073, 23631383, 24161296, 15103109, -110750, -11072941, -11055475, -3644293, 2646991, 3526215, 739882, -2318159, -3701593, -3003121, -849185, 2142250, 6609639, 13069107, 19043840, 20626780, 18006780, 15905169, 16750501, 17397572, 15290553, 13610276, 16221746, 21058558, 23251054, 21912298, 18857703, 13586956]
4361A3586956p802111n007400M443380J2155622J0814580M385940P18214m07569
4353C2887612l803382p986274p121294j790558J075829j279267m624338n535099
4345A823229m903816l206563Q21959N562491O738854L778411O17371p53569j975458
4336H502909k878966q70568K615731J884135l853444p390039l489953L582112
4328a898083O851048N963884M729914L556645J67230m606225p097934n730512
4320A935967j845878K858606O418682O248160K368313r72420n08801J398829J140539
4311A9041997J64975J820996L991389J193475o198728j0913882q254647j655670
4303h10095K989934M286845M296065L938773K376885o21831l812825n482445m806595
$$ y = [13586956, 5784845, 777445, 5220825, 17376447, 28191027, 32576967, 33295181, 32887612, 29084230, 21097956, 13976662, 12186104, 13261933, 11982666, 7358328, 1823229, -3080587, -6287150, -5465191, 97300, 6836154, 10614565, 11231936, 10478367, 8502909, 5623943, 4753375, 7369106, 9253241, 5399797, -1990242, -5480195, -1898083, 4952965, 10916849, 15646763, 19203408, 19370638, 14764413, 7666479, 1935967, 90089, 2948695, 9367377, 15615537, 17983850, 17011430, 16502629, 17901458, 19041997, 19206972, 21027968, 25019357, 26212832, 20014104, 9100222, 845575, -810095, 2179839, 6466684, 10762749, 14701522, 17078407, 16456576, 12643751, 7161306, 2354711]
4294B354711k915403k148543l025084l087814o95789J699451J127760p00984n5115
4285g446810K044124J144271k418686k813180J896673N755305L928298L92691
4277B482686J495548N716010N993285L98261n581797p203356n500993l318749
4269e519105j188972Q33088J231561r2351K15125M551653R345698Q320681R22766
4260A8620144o058083o730849k944290l51927k59528L71578K014531J314869k080642
4251C895803l205428K33763K609125j481138p686516p560656j625674J406116
4243a3414605j424201k859090K267848Q237501P302168J431915j362115J150566
4235A329987L979464L691404K395798K727190L745450L142452M51952l073785
$$ y = [2354711, -560692, -2709235, -5734319, -8822133, -9517922, -7818471, -6690711, -7391695, -7446810, -5402686, -4258415, -6677101, -9490281, -7593608, -1838303, 2089995, 2482686, 3978234, 9694244, 15687529, 16085790, 10503993, 3300637, -2200356, -5519105, -6708077, -5874989, -4643428, -4735779, -4520654, 30999, 9376697, 17697378, 18620144, 12562061, 5831212, 2886922, 2534995, 2275467, 2647045, 4661576, 5976445, 3895803, 690375, 924138, 3533263, 2052125, -5634391, -13195047, -14820721, -13414605, -14838806, -17697896, -15430048, -7192547, 109621, 1541536, 179421, 1329987, 5309451, 9000855, 11396653, 14123843, 17869293, 21011745, 21463697, 18389912]
4227A8389912n855148o567086m594701m23456M522944P907693O962514J258166
4219B1600838m880781n918283k084541O54091q96139k842702j121332J576725
4211F087876J74595m576070p228802n295320j233877K096521L795333L468353
4203b711391J261612r19864j204377k07963O45173J789953L853049N186414M184352
4194A1876958K237987J177510j48916l177802n715007m827427j830247k47720
4186f54664m72647n25712l19983r10541j255293l825J213351K95006j636743k744948
4176g015999l515006l339269J181689Q905785J0579769N68940j2392612j5318683
4168b0345386q053770m63955L484165P034192Q899567L998615m187323n537693
$$ y = [18389912, 12534764, 5967678, 1372977, 949521, 5472465, 13380158, 20342672, 21600838, 16720057, 10801774, 8717233, 9371324, 8475185, 5632483, 4511151, 6087876, 6262471, 1686401, -5542401, -10837721, -12071598, -9975077, -6179744, -2711391, -1449779, -2369643, -3574020, -3781983, -3136810, -1346857, 2506192, 7692606, 11876958, 14114945, 15292455, 15143539, 11965737, 6250730, 1423303, -406944, -654664, -1127311, -1653023, -1973006, -2883547, -4138840, -4142665, -2929314, -2634308, -4271051, -7015999, -10531005, -13870274, -12688585, -3782800, 6796969, 7365909, -5026703, -20345386, -28399156, -28863111, -25378946, -18344754, -9445187, -5446572, -9633895, -15171588]
4160a5171588Q55442N295879L457726R79511O68662j025277k902700M19220M378762
4151c044363j915554j4174774j4703096j980283L689120n830041j1599129k835374
4143e2393494p54263k1298679l6496004q672761M8298124P9901128O1717951K3980197
4135I4282199J314203p142129j5394388k0067278j3044164k996181k407505o592422
4127B7952335m202990J934443J571178l741199m420960k2032K028646O48054Q62364
4118B2609839K534576J346132j350204o86774J600696l55498n188965n385345
4110A5124457M29534N331718M920101K423013J698128J732404Q926l250969n670717
4101B2746595m976154j090753K136193j68572o665864r368575m371501J458892
$$ y = [-15171588, -14316146, -9020267, -5562541, -4583030, -3914368, -4939645, -7842345, -7423125, -3044363, -4959917, -19134691, -33837787, -35818070, -32128950, -37958991, -49558120, -52393494, -53147757, -74446436, -110942440, -119615201, -71317077, 8584051, 70302002, 94282199, 95596402, 88454273, 73059885, 52992607, 39948443, 36952262, 34544757, 27952335, 23749345, 25683788, 27254966, 23513767, 19092807, 19070775, 21099421, 21747475, 22609839, 25144415, 26490547, 25140343, 24453569, 26054265, 25698767, 20509802, 15124457, 15553991, 20885709, 25805810, 28228823, 29926951, 31659355, 31668281, 28417312, 22746595, 17770441, 16679688, 18815881, 18647309, 11981445, 2612870, -1758631, -299739]
4093b99739M0088n861689p105333j727923L685061M737720L742313L532029L510275
4084D252802K824872K194723J699920P99522M71731J589259K171134L77514j282915
4075A5098562M77560L532103L153390k20104j881911p35467j62799j257385j435403
4066A6568546l00446r25163m193692p124113p797901p045369m682129N98143O741432
4057h160692R102898O823606L489040Q96589k188994m586192k919370J012972
4049C469857M62092n470008q401403k727362N304531O654038K536763J204908
4041C033416M730864O667845K648159l063691l449728K536394R081453R831419
4033C2016131M112995k806737n649384m680510l889367m636275m574134k978958
$$ y = [-299739, -259651, -6121340, -13226673, -14954596, -11269535, -6531815, -2789502, 742527, 4252802, 7077674, 9272397, 10972317, 11771839, 12243570, 13832829, 16003963, 16381477, 15098562, 15576122, 19108225, 22261615, 22041511, 20159600, 19424133, 19261334, 18003949, 16568546, 16268100, 15342937, 11149245, 4025132, -3772769, -10818138, -15500267, -14902124, -8160692, 942206, 7765812, 11254852, 12151441, 9962447, 5376255, 2456885, 3469857, 3931949, -1538059, -9939462, -12666824, -7362293, -708255, 1828508, 3033416, 7764280, 14432125, 17080284, 14016593, 10566865, 13103259, 22184712, 32016131, 36129126, 33322389, 27673005, 22992495, 19103128, 14466853, 9892719, 6913761]
4025F913761k548451m073888l828354N61414N366540N677180K124924j268900
4017H924226l328182n224032n563512j210198O795651J2173205R581312J98876
4009B2347346q997524j0790256m086377M013464M776043j902816o931886m055457
4001e627463J874441L030346N71238J346627N216866M624836k497658q103022
3993D36211n798230j89733P05763k686327l410615Q77312M791213L221421j923085
3984c976070m320914o55310N456902O775357L50384q059927r617479k830646M644717
3975a2232986N852276K587239J007058K531164L090056m00457o595197j1671399
3967a5832246j1755371n037360N254891J1818677J0913955P057139N945989N521993
$$ y = [6913761, 4365310, 291422, -3536932, -2975518, 2391022, 8068202, 10193126, 8924226, 5596044, 372012, -5191500, -6401698, 393953, 12567158, 22148470, 22347346, 13349822, 2559566, -1526811, 2486653, 7262696, 5359880, -1572006, -5627463, -3753022, -722676, -151438, 1195189, 6412055, 11036891, 8539233, 436211, -5362019, -5551752, -4845989, -7532316, -10942931, -10065619, -5274406, -2052985, -3976070, -8296984, -8952294, -3495392, 3279965, 3630349, -4429578, -14047057, -16877703, -12232986, -6380710, -3793471, -2786413, -255249, 2834807, 2434350, -4160847, -15832246, -27587617, -32624977, -27370086, -15551409, -4637454, 2419685, 8365674, 13887667]
3959A3887667L36022p308029r057077l675931N27671j007446k408586J330206
3951g375503N039604K597578j678486L3857N638397O497966J375857k930513l470694
3942E728063l592842l688124K3760N829148O038932l44553m156563n0725N156626
3933A0943722M187019O81068J063198K681202j97334m234203j938661M327798
3925A7513809M630354k630937p702991m165712K522513M296092P42774l640726
3917A1565176o261551o481017l735118N11874K615856J566565N22493J290574
3909A594852J381055q66595k702293j870858q03514j841653k240778J141560N414735
3900g93489N550333K543693J711542L944327M871955K804020J055605P69057k175911
$$ y = [13887667, 14223689, 6915660, -2141417, -5817348, -5289677, -6297123, -8705709, -7375503, -2335899, 261679, -1416807, -1382950, 4255447, 10753413, 12129270, 9198757, 5728063, 2135221, -1552903, -1529143, 4300005, 10338937, 9994384, 5837821, 5787096, 10943722, 15130741, 15811809, 16875007, 19556209, 19358875, 15124672, 13186011, 17513809, 22144163, 19513226, 11810235, 7644523, 10167036, 14463128, 15205902, 11565176, 5303625, -1177392, -4912510, -4400636, -1784780, -218215, 304278, 1594852, 2975907, 2109312, -592981, -2463839, -3267353, -5109006, -7349784, -6208224, -793489, 4756844, 7300537, 9012079, 12956406, 17828361, 20632381, 21687986, 22457043, 20281132]
3891B0281132r347853j4106480r424550J476846Q390449P074327K841233P32235
3883G917339j084282m822288o194826m60340Q069573J0209019M864060J59963
3875A8658218M97253N32295m287670q853436o590202q97420j90830m634576o473138
3866a2239506k634687J489808J678014L48826J67914n84317k705558k299542L096566
3857a3682482R139549J0053570O115814J792407n69792j226557n7226K435215
3849A4000498L057395o85904n960656p130569k714583L026049N301280L432512
3841A2326022N64765L43513L386348O133214M442240q96317m323154k455724J552601
3832B1073508K453095o43966m496556o322035n722577l691949j935530j816641
$$ y = [20281132, 10933279, -3173201, -12597751, -11120905, -2730456, 4343871, 7185104, 7917339, 6833057, 2010769, -4184057, -4644397, 3425176, 13634195, 18498255, 18658218, 19155471, 19687766, 15400096, 6546660, -43542, -940962, -1131792, -5766368, -12239506, -14874193, -13384385, -11706371, -11357545, -11189631, -11773948, -14479506, -16779048, -13682482, -4542933, 5510637, 11626451, 13418858, 12849066, 11622509, 11565283, 14000498, 17057893, 16371989, 10411333, 3280764, 566181, 3592230, 8893510, 12326022, 12890787, 13234300, 16620648, 22753862, 27196102, 26299785, 21976631, 19520907, 21073508, 23526603, 22882637, 18386081, 12064046, 6341469, 2649520, 713990, -1102651]
3824a102651k431124j511787P08042J375900R5085K96213L241490M917231K362871
3815G951270j075083j280634l00719k272404n578661n335871j631310J133799
3807h389613J739653K449400K745820j74167m557816m911611p60412K339405K251151
3798g268190L479044P926354R685491M157068l444227n093523j559315r0967k554839
3789E236896l172042J337935N799089L856597k850769p007747n600775l211193
3781e612009m353050o315529l302131L987770Q075249N046640O6253o30036J414894
3772a621949J232438q9149K349197O935677N945877k070084q042109m541159L824686
3763C923425P398519M573036J860902K987366M040118J70707p099299j1390524
$$ y = [-1102651, -3533775, -5045562, -4337520, -2961620, -2866535, -2570322, 671168, 5588399, 7951270, 6876187, 5595553, 5294834, 3022430, -2556231, -7892102, -9523412, -8389613, -6649960, -4200560, -1454740, -1628907, -6186723, -11098334, -11858746, -9519341, -7268190, -3789146, 4137208, 13822699, 17979767, 14535540, 9442017, 7882702, 7791735, 5236896, 2064854, 3402789, 9201878, 13058475, 10207706, 3199959, -2400816, -5612009, -9965059, -16280588, -19582719, -15594949, -7519700, -2473060, -2406807, -3036843, -1621949, -389511, -478660, 1870537, 8806214, 14752091, 12682007, 4639898, 98739, 3923425, 11321944, 15894980, 17755882, 20743248, 24783366, 24954073, 17854774, 6464250]
3755F464250q840070k462076J175302o95999m298280m796938k480351q05704k35657
3746a6975523J528850M070964M509463L505114M884286P833305O263364r46763
3738A4673060o011655l477360J041564J5799l749913k657272J817050J208620
3730B859893m899421o770426R4885P111308N341054j362304k896864K076059N391339
3721F945523K113800l058842l293485J599230O324923O889946L522650j397609
3713A9646136n456468o666357m480055j209726n60140l309207n709634l891975
3705a1637426J118899M864303N163599L680629K103916K14278j491720r62306
3697C054172J571129K070241k101070p643172q944348m656497J943897P403745
$$ y = [6464250, -2375820, -4837896, -3662594, -4358593, -8656873, -13453811, -15934162, -16739866, -16975523, -15446673, -11375709, -6866246, -3361132, 1523154, 9356459, 15619823, 14673060, 8661405, 5184045, 6225609, 6241408, 2491495, -165777, 1651273, 2859893, -2039528, -8809954, -8715069, -1603761, 3737293, 2374989, -521875, 1554184, 6945523, 9059323, 6000481, 2706996, 4306226, 10631149, 17521095, 21043745, 19646136, 14189668, 7523311, 3043256, 1833530, 1273390, -2035817, -7745451, -11637426, -10518527, -5654224, -490625, 3190004, 5293920, 5508198, 4016478, 3054172, 4625301, 6695542, 4594472, -3048700, -11993048, -16649545, -14705648, -7301903]
3689g301903R952469Q545386L633295j683625m250798m230717l592114k411956
3681a339963M15683L853822N389840M424493K093664j194081m719571n464861
3673C459026j705244K249957K36994o550554r967527n766060J257150M871049
3665a1915209M802680L600241J342872k086107l474138k77888M275274N099927
3657A367652K746930K168011M850017P039384N925340L001699J89897l273810
3649B4015120p904190j0920422r061303l288793J657366K350074k0301j619164
3641d791613l97515K056942K955667J685660j78879j602004k848367l273140j026328
3632g419577L288208N091220J105493n158121o923927k998816Q09339M8303k531888
$$ y = [-7301903, 2650566, 11195952, 14829247, 13145622, 8894824, 4664107, 1071993, -1339963, -924280, 2929542, 8319382, 12743875, 14837539, 13643458, 8923887, 3459026, 1753782, 4003739, 4240733, -2309821, -12277348, -18043408, -16786258, -11915209, -7112529, -3512288, -2169416, -4255523, -7729661, -8007549, -3732275, 1367652, 4114582, 6282593, 11132610, 18171994, 24097334, 27099033, 27288930, 24015120, 16110930, 5190508, -3870795, -7159588, -5502222, -3152148, -3172449, -4791613, -5189128, -3132186, -176519, 1509141, 1330262, -271742, -3120109, -6393249, -7419577, -4131369, 959851, 2065344, -3092777, -10016704, -13015520, -12206181, -12157878, -14689766]
3623a4689766j784330K503759O548757Q581511R658985R402998N665275p48867
3615B5138322n299676n663331m869686n777435n848883j679668L602846L167391
3607B769880l245134p416662l182607N358509R294264N692208l98932k922448
3599E949078n40887L673382N511057K990492j636431l902141k446646o33697j120810
3590G843397j408628J967059P036599Q633157N947276L040918J868322k96415
3582C4631685n291355j0227608j1176303p615849j775734L513435N253713K010128
3574I322112l182490m770373j149222L714707O152447O510826N693957K728225
3566B5020189j619164l503115j899604j463613n175061q399842n706882J12541
$$ y = [-14689766, -16474096, -13970337, -7421580, 1159931, 10818916, 20221914, 25887189, 25138322, 19838646, 14175315, 9305629, 3528194, -2320689, -4000357, -397511, 2769880, -475254, -7891916, -11074523, -5716014, 3578250, 9270458, 8871526, 5949078, 5408191, 9081573, 14592630, 17583122, 15946691, 12044550, 9597904, 8964207, 7843397, 6434769, 8401828, 15438427, 24071584, 30018860, 33059778, 34928100, 34631685, 29340330, 19112722, 7936419, 320570, -1455164, 2058271, 7311984, 9322112, 6139622, 1369249, 220027, 3934734, 10087181, 16598007, 22291964, 25020189, 23401025, 19897910, 17998306, 16534693, 11359632, 2959790, -2747092, -2634551]
3558b634551K332973Q11059Q19573K928046K250273j896281l801888r87077J514191
3549A336318N054j510982J325555N174747M372231M21080n38692K362256L954072
3540A6901639J741813p68858o19646l8444j974158m664115l994343L39846L953559
3531A0877293L034641j212875m073472k866883j82124n64418m100866n497156
3523d585860j107128N323995P254310M516307L252576N958861O782215J61458
3515B7556734r794288j3815066r580968l631892j236539l65397K196477M359431
3507d311508K713917p84670j530426J50133l46593l911171n714855k516357K405860
3498a3845670L887449J364031j549309j796035O55440L384248L378749J36435
$$ y = [-2634551, -301578, 509481, 1329054, 4257100, 6507373, 4611092, 809204, -177873, 1336318, 1341372, -169610, 1155945, 6330692, 10702923, 11124003, 10585311, 12947567, 16901639, 18643452, 17874594, 17254948, 17216504, 15242346, 10578231, 6583888, 6923734, 10877293, 13911934, 12699059, 8625587, 5758704, 5576580, 5012162, 911296, -4585860, -5692988, -368993, 6885317, 11401624, 14654200, 20613061, 27395276, 27556734, 17762446, 3947380, -5633588, -9265480, -10502019, -10867416, -8670939, -4311508, -1597591, -2382261, -3912687, -3762554, -4109147, -8020318, -13735173, -16251530, -13845670, -9958221, -8594190, -10143499, -11939534, -11284094, -7899846, -4521097, -4384662]
3490d384662k573865o70626M051289N336125J153272l472127m332519l565178
3482h458291l738588j906574M531780J0367861Q626234J847892p27983L226816
3474A3769147O373156L551168j437454l407513l060608l034879k835513k037001
3466G880503l198777o727732p541266k371324L562392L451769m25464K2070N943323
3457E95494R382548M999253k294190m284695K53600N658762P200932N244591K375829
3448B9132124m45012l574030n959030n051501m74256L802537L432906n02061k616755
3439A7744922o54958J551644L6083l862193o478220o958399o051933k749866L371684
3430d051236Q369189P545766K326028j087172q573K071511J516603j140018m000082
$$ y = [-4384662, -6958527, -7629153, -3577864, 1758261, 2911533, -560594, -4893113, -8458291, -12196879, -14103453, -9571673, 796188, 9422422, 11270314, 10542331, 13769147, 20142303, 23693471, 22256017, 18848504, 15787896, 12753017, 9917504, 7880503, 4681726, -2046006, -9587272, -11958596, -8396204, -4944435, -5369899, -5347829, 595494, 9978042, 14977295, 12683105, 8398410, 8652010, 14310772, 21511704, 26756295, 29132124, 28687112, 25113082, 19154052, 14102551, 13628295, 17430832, 20863738, 20361677, 17744922, 17089964, 18641608, 18677691, 14815498, 8337278, 1378879, -4673054, -7422920, -4051236, 4317953, 11863719, 14189747, 13102575, 13094002, 15165513, 16682116, 15542098, 11542016]
3421A1542016o674047q295927o266897j4732O020141O173473Q4028o132701n550248
3412i114894K643353J1590876J3082972O373503r55963k593888j194328k727031
3404A7104600n904834m005275K894744N504774j373200r860973r344279j423662
3396f408105K767694j417615o272553l304168N333560J0564748Q068668K015949
3388A1348178j712980j978605r48203P33868M085426P587664O588253p05648q745698
3379A6252255r817971l631341J755519r4480o007893p676199k423624L726887
3371g916847M085426k12202j992904K174114O934003N208394j520182m550457
3363B209345k06292M731408L261297j296351j102569L465402N028411J931933
$$ y = [11542016, 4867969, -3427958, -9694855, -9709587, -3689446, 2484027, 2568055, -3564646, -9114894, -6471541, 5119335, 18202307, 24575810, 23619847, 21025959, 19831631, 17104600, 11199766, 7194491, 10089235, 15594009, 14220809, 4359836, -4984443, -6408105, -3640411, -5058026, -11330579, -14634747, -9301187, 1263561, 9332229, 11348178, 9635198, 7656593, 6708390, 7442258, 11527684, 19115348, 25703601, 24997953, 16252255, 6434284, 2802943, 4558462, 4463982, -1543911, -9220110, -11643734, -7916847, -3831421, -4043623, -6036527, -3862413, 3071590, 8279984, 6759802, 2209345, 2003053, 6734461, 9995758, 8699407, 7596838, 11062240, 16090651, 18022584]
3355A8022584O48134L982494N759207J109297n631508q442493q380606q764463
3347a697354p487643j517198N244260O545512L611237K760874N019167N775882
3339A8254737L803733K605169K485401o64532o736007q952949l628096L429191
3331A0596647M627228O59146j683490N64954L131191Q50777n257269q458495l878946
3322A151743M961229R152870M873302j973858m006732j869990j098628k455455
3314H734481j857835J138112J941083r69590k976408n82009L529492N129302L755894
3305A7842522J269209q80784j217625R47690L025826J790972p99527J05076L277640
3296B5360999J733041n626150j0328983o582364L4J625780k12624M60617L163132
$$ y = [18022584, 18670718, 22653212, 28412419, 29521716, 23890208, 15447715, 7067109, -1697354, -9184997, -10702195, -5457935, 1087577, 4698814, 7459688, 12478855, 18254737, 22058470, 24663639, 27149040, 26484508, 19748501, 10795552, 7167456, 10596647, 15223875, 15883021, 14199531, 14764485, 17895676, 18746453, 13489184, 5030689, 1151743, 6112972, 15265842, 20139144, 18165286, 14158554, 12288564, 11189936, 8734481, 6876646, 8014758, 9955841, 8986251, 6009843, 5427834, 8957326, 14086628, 17842522, 19111731, 18230947, 17013322, 17961012, 20986838, 22777810, 21978283, 22083359, 25360999, 27094040, 21467890, 11138907, 4556543, 4556577, 6182357, 5969733, 6430350, 9593482]
3287I593482K916945l23209k258704k211121l000451m141127k270662K161262
3279D66415N073697N308710N055189M268348R75502k906944k588880J820662M439727
3270B1912426J883911k740854n344580n406342l813057j129469M26795j927711
3262C861119o571422p934501l912297J162518K885289K219119K391301L872376
3254b026498M840304L940095P70215l855404o889202n124018M74435N163351N925150
3245C218428L782242N91062k542622l338231K68299N431741O023227J084097l006023
3236A1512220j354239K961058M185983J395505k577587n691062o656430m161357
3228c85909K07345J927602N4379l25461L665858O620115K787877l876832m854734
$$ y = [9593482, 12510427, 12187218, 9928514, 7717393, 4716942, 575815, -1694847, 466415, 5540112, 10848822, 15904011, 20172359, 21147861, 18240917, 15652037, 17472699, 21912426, 23796337, 21055483, 15710903, 10304561, 6491504, 5362035, 5788830, 3861119, -2710303, -10644804, -14557101, -13394583, -10509294, -8290175, -5898874, -2026498, 2813806, 6753901, 7524116, 3668712, -3220490, -8344508, -7870073, -2706722, 3218428, 7000670, 7591732, 5049110, 1710879, 1979178, 7410919, 13434146, 14518243, 11512220, 10157981, 13119039, 17305022, 18700527, 16122940, 10431878, 3775448, -385909, -178564, 1749038, 1803417, 1477956, 5143814, 11763929, 14551806, 10674974, 5820240]
3219E820240J25228L207486O51569k874970l228818k582959l517644l593846q3102
3210f076816M162160M252361M37945k346129j207682J736186L130937K566666
3202F655628K026126K468460K447705M84416k200485k882269j236062N8128m67514
3193G354133o23471J647510M193466L425580j30404k489855j941035p20756q62242
3184I852926j676318k029102k116206j954122p85417Q48602R88811l36990L3612
3175B825796M154405R241157J0237631N262702k873043r585529j1633089q507958
3167h77928k680788J819492K708417J632024K108005N066491P261072M727327
3159B1764112k357669q913021r714299m948049r8791L54607j885423j565085K882966
$$ y = [5820240, 5945468, 9152954, 9804523, 6929553, 3700735, 1117776, -2399868, -5993714, -6076816, -1914656, 2337705, 2775650, 429521, -778161, 958025, 4088962, 6655628, 8681754, 11150214, 13597919, 14082335, 11881850, 8999581, 7763519, 7821647, 7354133, 6730662, 8378172, 12571638, 15997218, 15866814, 13376959, 11435924, 10715168, 9852926, 8176608, 6147506, 4031300, 2077178, 1291761, 2140363, 3129174, 2792184, 2825796, 6980201, 16221358, 26458989, 31721691, 28848648, 19263119, 7630030, -877928, -3558716, -1739224, 969193, 2601217, 4709222, 9775713, 17036785, 21764112, 19406443, 10493422, 779123, -4168926, -4267717, -3913110, -5798533, -7363618, -4480652]
3150d480652P067817O368540J814047j682737j739149n55671n90329j037311j49240
3141E015315J177818R20613m1305J169723M299751N364848K572164p11321j323585
3132A8444021j133818k861805m308281j897709K322253L507610K624314M814405
3124B1510990Q887394O996201k363796r461435o717335K61209J903655j219429
3116A9797454k044391k07698j451192n659017n920138n46944L339512J143563
3108H451149k203172o81020L739897N264689K795303n87862l321053n877457p651629
3099g1155p290014n042781k094743J160106M043057M554981J879043j478468k425741
3090f765715j124252l7961j72641l99207Q5395O42279N23896q0048n08535k96731
$$ y = [-4480652, 2587165, 8955705, 10769752, 9087015, 7347866, 6792195, 6201866, 5164555, 5015315, 6193133, 7113746, 7072441, 8242164, 12541915, 17906763, 20478927, 19767606, 18444021, 17310203, 14448398, 10140117, 8242408, 10564661, 14072271, 16696585, 21510990, 30398384, 37394585, 35030789, 25569354, 18852019, 19113228, 21016883, 19797454, 17753063, 17545365, 16094173, 10435156, 4515018, 3968074, 7307586, 8451149, 6247977, 5566957, 9306854, 14571543, 17366846, 16778984, 13457931, 7580474, -71155, -7361169, -12403950, -14498693, -13338587, -9295530, -4740549, -2861506, -4339974, -6765715, -7889967, -7927928, -8100569, -8499776, -8414381, -7772102, -7248206, -7328254, -7836789, -8133520]
3080h133520P64102K617729M538562M932081K584126j002063j793389J857882
3072F365510N379083L054558k950644m241600J170762M630347j34915o548108
3064F724993n194537J447570M033619J952256K235117M984357L132621k675984
3056A6640012k985884L334547M993827k598596q031650k847766L209072j604968
3048A0108594j0298026p927778L950022J0148284N850484J308511K550130L075322
3040A8765543j903241o552444n259454j637270p92299j331290p67113j176208
3032f53776l614943l691212J132990N516005L754347j320958l119855j162207
3024c159609P4195n72945j80769J803868J880230k135049p482005q995480l996608
$$ y = [-8133520, -7369418, -4751689, -213127, 4718954, 7303080, 6301017, 4507628, 6365510, 11744593, 14799151, 11848507, 7606907, 8777669, 13408016, 13273101, 6724993, 1530456, 2978026, 7011645, 8963901, 11199018, 16183375, 19315996, 16640012, 13654128, 16988675, 21982502, 19383906, 11352256, 8504490, 11713562, 10108594, -189432, -8117210, -4167188, 5981096, 11831580, 13140091, 15690221, 18765543, 16862302, 10309858, 5050404, 3413134, 2620835, 1289545, 522432, -653776, -4268719, -7959931, -6826941, -1310936, 2443411, 1122453, -1997402, -3159609, -3085414, -3658359, -3839128, -2035260, -155030, -2290079, -9772084, -18767564, -22764172]
3015b2764172M720671J0150456P333610n57457m904376j810786L345384L426445
3007a060225j602285o139700o547979l811652l00607K641836M332524M453520
2999h034568L257647J192972j044182k051741j154960l28806j894759l963275
2991a4021672j939186M166187Q148607N790720P10702j213155K36299J238210
2983C116712O76909O94726K006516K868037K196617O01045j116607k161620j696151
2974G186184p30747k021339n506850o554751k408987K349051J769351j996939
2966g915027j369901M796061Q616082M446234k797086m316109J019506N937565
2958H417325M263347k244019o770169n161935J01230L178487J395162k352065
$$ y = [-22764172, -18043501, -7893045, -559435, -1116892, -6021268, -7832054, -4486670, -1060225, -2662510, -8802210, -15350189, -19161841, -19462448, -16820612, -12488088, -8034568, -4776921, -3583949, -4628131, -6679872, -7834832, -8163638, -10058397, -14021672, -15960858, -11794671, -3646064, 2144656, 2855358, 1642203, 1878502, 3116712, 3793621, 4488347, 6494863, 9362900, 11559517, 12160562, 11043955, 8882335, 7186184, 6455437, 4434098, -1072752, -7627503, -10036490, -7687439, -5918088, -7915027, -9284928, -4488867, 4127215, 8573449, 5776363, 1460254, 2479760, 8417325, 12680672, 10436653, 3666484, -1495451, -1394221, 1784266, 3179428, 827363]
2950H27363l916526l103906k924852m531362n249781k150062L977103R106922
2942g965101R964429P108327L952939K614810J510988j596772n054922m801983
2934E732715p37083K131900P66564j306784L92433M135526M577683O77195l244261
2925A3125888l569805q84547K018094K519565n59256n097640o391473k886294
2917a725468O54563n34120m051385m351117j605639k65508m40910J627501M860402
2908e831681L720174j328239k702895J814196M506722P28360k247871L060150
2900A718916J0964749J0430959J607087n509968o327006n301689n062916k470690
2892D9442K492952L593993j491449n511977j721342N981225Q983765N971619K555640
$$ y = [827363, -3089163, -6193069, -9117921, -13649283, -18899064, -21049126, -17072023, -7965101, 1999328, 9107655, 13060594, 15675404, 17186392, 15589620, 10534698, 5732715, 4995632, 7127532, 7894096, 6587312, 6979745, 11115271, 15692954, 16370149, 13125888, 9556083, 8671536, 10689630, 13209195, 12649939, 7552299, 1160826, -1725468, -1070905, -1605025, -5656410, -10007527, -11613166, -11878674, -12319584, -10692083, -5831681, -2111507, -3439746, -6142641, -4328445, 178277, 906637, -1341234, 1718916, 12683665, 23114624, 24721711, 19211743, 12884737, 7583048, 2520132, 49442, 2542394, 6136387, 4644938, -867039, -2588381, 3392844, 12376609, 18348228, 20903868]
2883B0903868J284047j034050n857380q940054o454086j200012P94542j798595
2875b301720m402307l093797O57490L054041L284394L135223K734703M53627k803098
2866G18556l421572r48039K3772k924007m852725n77312N979694O359930N26328
2857H84625k503340J624598O107259M108430p18651j113200J773365J375179k186600
2848I351665k151732K651947M569450r35705p607263p591001k600385K34100l17993
2839d396917M05241L490259M599006K099908l9721K33782q79622n523260q355953
2830h367277l961100L852388O831808M024752J520282J526339o4727m134825m942289
2821c714649J03716M948539M499530K835018M820794N674746j660412j2558805
$$ y = [20903868, 22187915, 21153865, 15296485, 6356431, -97655, -1297667, -503125, -2301720, -6704027, -9797824, -9140334, -6086293, -2801899, 333324, 3068027, 3521654, 718556, -2703016, -3651055, -3627283, -6551290, -11404015, -11981327, -6001633, 358297, 884625, -1618715, 5883, 6113142, 10221572, 9502921, 8389721, 10163086, 11538265, 9351665, 7199933, 9851880, 14421330, 13485625, 5878362, -1712639, -4313024, -4078924, -4396917, -3991676, -501417, 4097589, 6197497, 6157776, 6391558, 5511936, -11324, -8367277, -12328377, -8475989, -1644181, 2380571, 3900853, 5427192, 5362465, 1227640, -3714649, -3610933, 1337606, 5837136, 8672154, 13492948, 19167694, 17507282, 4948477]
2813D948477j4988890o879744J467870L335510L119465M822276M044832k197210
2805b327414o974677l363709L784677N150183J213712k95807K032290K313500
2797A532755j210093l484324k079469o84037j469674j557090P44909K919177L521833
2788a766013L985526L323610j726286q657514r122475j127375O117759N020026
2780c952742M23598Q80366N183141N887357J966683j029052j107194j317763k004734
2771D929660n8992L620341L729975q77393n052772n468846m376529l300192J57889
2762f696859N923767Q266716L772948k385816l326178J42739K357303K127500
2754A0182120L097540N867285N883460N12213o173755q122985m619978p10080
$$ y = [4948477, -10040413, -16920157, -15452287, -12116777, -8997312, -4175036, -130204, -2327414, -9302091, -12665800, -8881123, -3730940, -2517228, -2813035, -780745, 1532755, 322662, -3161662, -5241131, -5925168, -7394842, -8951932, -8207023, -5287846, -1766013, 2219513, 5543123, 3816837, -4840677, -13963152, -15090527, -8972768, -3952742, -3529144, -2648778, 2534363, 8421720, 10388403, 9359351, 8252157, 6934394, 4929660, 4870668, 8491009, 12220984, 11343591, 6290819, 821973, -3554556, -6854748, -6696859, -773092, 7493624, 11266572, 8880756, 5554578, 5697317, 8054620, 10182120, 13279660, 19146945, 25030405, 25542618, 19368863, 11245878, 6625900, 5915820]
2746E915820j042202m780378o935319m139487J831627O666437Q329678P597903
2738A3444079M913614l4332n165915o120706j813169K670501J724606l529845
2730F088833o513473l214929L600789Q331020Q477191N798256K973607O63842
2722B6205136j839687l980982l652472m21769K520337J841469j319836l015169
2714A6337027k391565k290988l400135k285320K297663N293819J876382m509994
2706A0926889n898146r39195L075731P67336l392402j345457O684341J1299261
2698B1178358N815936m587000q926863m205711J370272J25695m831077n166405
2690G73205J34809L915936J775318k635955m474550l744152j857213K122633P744075
$$ y = [5915820, 4873618, 93240, -6842079, -10981566, -9149939, -2483502, 5846176, 13444079, 18357693, 18323361, 13157446, 7036740, 5223571, 7894072, 9618678, 6088833, -424640, -3639569, -38780, 8292240, 16769431, 22567687, 25541294, 26205136, 24365449, 20384467, 16731995, 16310226, 18830563, 20672032, 19352196, 16337027, 13945462, 11654474, 8254339, 5969019, 8266682, 13560501, 15436883, 10926889, 5028743, 4089548, 7165279, 7932615, 4540213, 3194756, 9879097, 21178358, 26994294, 22407294, 13480431, 9274720, 10644992, 10770687, 5939610, 773205, 908014, 4823950, 6599268, 3963313, -511237, -4255389, -6112602, -3989969, 3754106]
2681C754106J0351157O919830J395654n51593O93940Q88763p80370j910842k414614
2672A8346031m242643o601201o680589m626072l033499k149545l95156J053144
2664h329530m39783l247063k577967K127851O111880O495078N511671N316075
2656A0968212M499518J673466j576600l105153k317655P59283M771796N488956
2648B1161823M012p124232p776312j484736L511657K258228p41452l99680J076769
2639A0486077Q2094r18251J908198O197335O898992L939475N51674k741595o419952
2630A9984047p357709k783614L091596L249540k220996o605857o309238l989538
2622b941769k278769o54617Q80003Q12854j54845M81301K098053J516303q19883
$$ y = [3754106, 14105263, 21025093, 22420747, 21869154, 22563094, 23451857, 22671487, 20760645, 18346031, 14103388, 7502187, 821598, -3804474, -6837973, -8987518, -9382674, -8329530, -8769313, -12016376, -14594343, -12466492, -6354612, 140466, 5652137, 10968212, 15467730, 17141196, 15564596, 12459443, 10141788, 10901071, 15672867, 21161823, 21165835, 14041603, 6265291, 4780555, 8292212, 10550440, 9808988, 9409308, 10486077, 10568171, 9649920, 11558118, 17755453, 24654445, 28593920, 29145594, 26403999, 19984047, 12626338, 9842724, 12934320, 16183860, 13962864, 7357007, 1047769, -2941769, -5220538, -5875155, -4995152, -4182298, -4337143, -3855842, -1757789, -241486, -1061369]
2613a061369p93085K135652L542753J790771J026370L453920M615226P59017m163448
2604A1305807m208744l36294K065917J716025J490347J728857j03156l294724
2596A0364035l593638k97977J660740r94267m781835m526962l28862L577149M541622
2587E620005L054886M48980j801342j789770O80854K654287J899233J215795M824590
2578A6807518J0724374J1531508M345176m747000q474194o637140l421900n38969
2570A9589373K251004K780146j422605p590782r695987o163850j221215J470539
2562c377K170601K108337J843298K746225N324459O034711J290302n170171n652495
2553A0691890l95049J632048l461483q078992n192015J170108L956932M311066
$$ y = [-1061369, -1854454, 281198, 3823951, 5614722, 6641092, 10095012, 14710238, 15469255, 11305807, 7097063, 6760769, 8826686, 10542711, 12033058, 13761915, 13658759, 10364035, 6770397, 6472420, 8133160, 7138893, 2357058, -2169904, -2498766, 1078383, 5620005, 8674891, 9123871, 7322529, 5532759, 6213613, 8867900, 10767133, 11982928, 16807518, 27531892, 39063400, 43408576, 38661576, 30187382, 23550242, 20128342, 19589373, 21840377, 24620523, 23197918, 15607136, 5911149, -252701, -1473916, -3377, 2167224, 4275561, 6118859, 8865084, 14189543, 20224254, 21514556, 16344385, 10691890, 10296841, 11928889, 8467406, 388414, -4803601, -3633493, 323439, 4634505]
2545D634505O505082P828060L462574k710309k905431J158000N40057n732539
2537A2779999q790319m658287k12823j051375l111130j404655J199564K48710
2529e000316j673578M85491N395393P608837N922285L735001K880176K107585
2521B1460874O47585q43315k227949l631218m105507l177281k509882l408611
2513B204696l979699j681750K143609L285983L17109l054998k124107L230794
2505C41637P866305O713565P26529l967953l772941k041958l215835n385368l712266
2496f448285M43667P13348l414059m362831J914513Q880414Q806929L744466J056979
2487A1335141J977213J594185j599122l182976l90322L380280L593184N00437
$$ y = [4634505, 11139587, 18967647, 22430221, 19719912, 16814481, 17972481, 18512538, 12779999, 3989680, -668607, -881430, -1932805, -5043935, -6448590, -5249026, -5000316, -6673894, -6188403, -793010, 6815827, 12738112, 16473113, 19353289, 21460874, 22108459, 21265144, 19037195, 15405977, 11300470, 8123189, 5613307, 2204696, -1775003, -3456753, -1313144, 1972839, 2289948, -765050, -2889157, 341637, 8207942, 14921507, 15648036, 11680083, 7907142, 5865184, 2649349, -2736019, -6448285, -6004618, -5291270, -8705329, -13068160, -11153647, -2273233, 6533696, 10278162, 11335141, 13312354, 14906539, 13307417, 10124441, 9734119, 13114399, 16707583, 17208020]
2479A7208020k157868k335078j479358j672769k492739j740085P99039K043252
2471H172414l99998m442783o192922n032049k719917R45524O618481J0452490
2463G401240P110524j403636o473675m283190J02897K287878M382814P323422
2455A6448274N685845l083370j1058251r536237j417455M057752M500741L847856
2447I445155K686420j132716m568625k149904L903952N605038J348776k677242
2439A2460854l502641m521780o421337m553427J673909N454413K626483k252588
2431I63886l783506k806947j567368J353796O261936Q425227M455511j864751
2423A1437784m906357m157912j750738K017076N766999M652943k902945r893341
$$ y = [17208020, 15050152, 12715074, 11235716, 9562947, 7070208, 5330123, 6129162, 8172414, 7772416, 3329633, -2863289, -7895338, -10615255, -9669731, -3051250, 7401240, 14511764, 13108128, 6634453, 2351263, 2454160, 4742038, 9124852, 16448274, 22134119, 19050749, 7992498, -1543739, -2961194, 1096558, 5597299, 9445155, 12131575, 10998859, 6430234, 4280330, 8184282, 13789320, 15138096, 12460854, 8958213, 4436433, -1984904, -6538331, -4864422, 589991, 3216474, 963886, -2819620, -5626567, -7193935, -5840139, 421797, 8847024, 13302535, 11437784, 6531427, 2373515, 622777, 2639853, 8406852, 13059795, 10156850, 263509]
2415B63509q691187j600236K976973K612007K004595L144874K021016l391512
2407f59961q284806p403115k194691J781910K181875J423977J983516L160611
2399h010684L208547K583801K945963L450700J038374m142702o634849k382133
2391g942983M620017O999991M041243J405143J310322Q2852l142186l237277J522941
2382E660063M437053P80952l344051n32503M691848K122807p071420j0434466
2374c689717k476564O985909O552717k279294r303838q727822k806797L717514
2366a2027892P361869O304009J950946r22245M44907K210172j265960q484535
2358d428729j1196222m879688N021291R713142P210595K905348J681517L131129
$$ y = [263509, -8427678, -10027914, -7050941, -4438934, -2434339, 710535, 2731551, -659961, -8944767, -16347882, -18542573, -16760663, -14578788, -13154811, -11171295, -8010684, -4802137, -2218336, 727627, 4178327, 5216701, 1073999, -5560850, -7942983, -3322966, 3677025, 7718268, 9123411, 10433733, 10516585, 7374399, 4137122, 5660063, 10097116, 10878068, 7534017, 7001514, 11693362, 13816169, 6744749, -3689717, -6166281, 819628, 7372345, 5093051, -4210787, -12938609, -15745406, -12027892, -4666023, 1637986, 3588932, 2666687, 3111594, 5321766, 4055806, -4428729, -15624951, -20504639, -15483348, -5770206, 1440389, 4345737, 6027254, 9158383]
2350I158383M523239M887437M529673L040611J85501k516436l369373l032564
2342A7406471l522400n103653o005122m943452k216145J351479M675426N921556
$$ y = [9158383, 13681622, 18569059, 23098732, 26139343, 26324844, 23808408, 20439035, 17406471, 13884071, 8780418, 2775296, -2168156, -4384301, -3032822, 1642604, 7564160]
$$ [...]
##END NTUPLES=NMR SPECTRUM
##END=
