##TITLE=31Pdec_DE-107_oil2_TFA
CDCl3, 24 sc
 3.9.2025
##JCAMPDX= 6.0         $$ Bruker NMR JCAMP-DX V2.0
##DATA TYPE= NMR SPECTRUM
##DATA CLASS= NTUPLES
##ORIGIN= UXNMR, Bruker Analytische Messtechnik GmbH
##OWNER= root
$$ XWIN-NMR		Version 3.5
$$ Wed Sep  3 14:20:48 2025 Russian Standard Time (UT+4h)  she@DPX200
##.OBSERVE FREQUENCY= 81.013821
##.OBSERVE NUCLEUS= ^31P
##.ACQUISITION MODE= SIMULTANEOUS
##.ACQUISITION SCHEME= undefined
##.AVERAGES= 64
##.DIGITISER RES= 17
##SPECTROMETER/DATA SYSTEM= spect
##.PULSE SEQUENCE= zgpg30
##.SOLVENT NAME= CDCl3
##.SHIFT REFERENCE= (INTERNAL, CDCl3, 0, 198.062)
##AUDIT TRAIL= $$ (NUMBER, WHEN, WHO, WHERE, WHAT)
$$ ##TITLE= Audit trail, XWIN-NMR		Version 3.5
$$ ##JCAMPDX= 5.01
$$ ##ORIGIN= Bruker BioSpin GmbH
$$ ##OWNER= she
$$ F:/spectra/data/she/nmr/P31/2/pdata/1/auditp.txt
$$ ##AUDIT TRAIL=  $$ (NUMBER, WHEN, WHO, WHERE, WHAT)
(   1,<2025-09-03 14:19:44.57 +0400>,<she>,<DPX200>,
      <created by zg, POWCHK disabled, PULCHK disabled
       configuration hash MD5:
       00 E9 B6 7A A2 85 ED C7 34 08 36 98 17 FE 4E 26
       data hash MD5: 32K
       6A 62 29 D5 12 33 62 E6 F1 32 5A 64 01 5A 77 30>)
(   2,<2025-09-03 14:19:47.71 +0400>,<she>,<DPX200>,
      <Start of raw data processing
       efp BC_mod = 2 LB = 1.5 FT_mod = 6 PKNL = 1 PHC0 = 1362.553 PHC1 = 149.4999 SI = 64K 
       data hash MD5: 64K
       2D 4B 4B EB FF 74 35 8E 9C 46 E1 67 E5 FF C3 78>)
(   3,<2025-09-03 14:20:05.82 +0400>,<she>,<DPX200>,
      <pk PHC0 = 27.91792 PHC1 = 0 
       data hash MD5: 64K
       9A E7 21 6F A5 C7 43 CF E4 1F A5 6C EF A1 FA CA>)
(   4,<2025-09-03 14:20:14.07 +0400>,<she>,<DPX200>,
      <abs ABSG = 5 
       data hash MD5: 64K
       95 78 96 18 26 D2 9C AB 84 02 3C 93 CB 84 EB BF>)
$$ ##END=
$$ 
$$ hash MD5
$$ 5C 85 39 F7 87 6C 8A AC 66 35 48 5D 96 E1 78 CD
##$RELAX= 
##$RELAX= 
##$RELAX= 
##$RELAX= 
##$RELAX= 
##$RELAX= 
##$RELAX= 
##$RELAX= 
$$ Bruker specific parameters
$$ --------------------------
##$DU= <F:/spectra>
##$EXPNO= 2
##$NAME= <P31>
##$PROCNO= 1
##$TYPE= <nmr>
##$USER= <she>
##$AMP= (0..31)
100 100 100 100 100 100 100 100 100 100 100 100 100 100 100 100 100 100 
100 100 100 100 100 100 100 100 100 100 100 100 100 100 
##$AQSEQ= 0
##$AQ_mod= 1
##$AUNM= <au_zg>
##$AUTOPOS= <>
##$BF1= 81.014009
##$BF2= 200.13
##$BF3= 200.13
##$BF4= 200.13
##$BF5= 200.13
##$BF6= 200.13
##$BF7= 200.13
##$BF8= 200.13
##$BYTORDA= 1
##$CFDGTYP= 0
##$CFRGTYP= 5
##$CHEMSTR= <none>
##$CNST= (0..31)
1 1 145 1 1 1 1 1 1 1 1 1 1 1 1 1 1 1 1 1 1 1 1 1 1 1 1 1 1 1 1 1 
##$CPDPRG= <waltz16>
##$CPDPRG1= <>
##$CPDPRG2= <waltz16>
##$CPDPRG3= <>
##$CPDPRG4= <mlev>
##$CPDPRG5= <mlev>
##$CPDPRG6= <mlev>
##$CPDPRG7= <mlev>
##$CPDPRG8= <mlev>
##$CPDPRGB= <>
##$CPDPRGT= <>
##$D= (0..31)
0 1 0 0 0 0 0 0 0 0.06 0 0.03 2e-05 3e-06 0 0 0.0002 0 0 0 0 0 0 0 0 0 
0 0 0 0 0 0 
##$DATE= 1756894784
##$DBL= (0..7)
120 120 120 11 120 120 24 19 
##$DBP= (0..7)
150 150 150 150 150 150 150 150 
##$DBP07= 0
##$DBPNAM0= <>
##$DBPNAM1= <>
$$ [...]
##$SUBNAM3= <"">
##$SUBNAM4= <"">
##$SUBNAM5= <"">
##$SUBNAM6= <"">
##$SUBNAM7= <"">
##$SUBNAM8= <"">
##$SUBNAM9= <"">
##$SW= 400.765351723535
##$SWIBOX= (0..15)
0 1 3 0 0 0 0 0 0 0 0 0 0 0 0 0 
##$SW_h= 32467.5324675325
##$TD= 32768
##$TD0= 1
##$TE= 0
##$TE2= 300
##$TE3= 300
##$TEG= 300
##$TL= (0..7)
0 120 53 12 22 120 120 120 
##$TP= (0..7)
150 150 150 150 150 150 150 150 
##$TP07= 0
##$TPNAME0= <>
##$TPNAME1= <>
##$TPNAME2= <>
##$TPNAME3= <>
##$TPNAME4= <>
##$TPNAME5= <>
##$TPNAME6= <>
##$TPNAME7= <>
##$TPOAL= (0..7)
0.5 0.5 0.5 0.5 0.5 0.5 0.5 0.5 
##$TPOFFS= (0..7)
0 0 0 0 0 0 0 0 
##$TUNHIN= 0
##$TUNHOUT= 0
##$TUNXOUT= 0
##$USERA1= <user>
##$USERA2= <user>
##$USERA3= <user>
##$USERA4= <user>
##$USERA5= <user>
##$V9= 5
##$VALIST= <valist>
##$VCLIST= <CCCCCCCCCCCCCCC>
##$VD= 0
##$VDLIST= <DDDDDDDDDDDDDDD>
##$VPLIST= <PPPPPPPPPPPPPPP>
##$VTLIST= <TTTTTTTTTTTTTTT>
##$WBST= 1024
##$WBSW= 4
##$XGAIN= (0..3)
0 0 0 0 
##$XL= 0
##$YL= 0
##$YMAX_a= 7510
##$YMIN_a= -16232
##$ZGOPTNS= <>
##$ZL1= 120
##$ZL2= 120
##$ZL3= 120
##$ZL4= 120
##$ABSF1= 198.0616
##$ABSF2= -202.7028
##$ABSG= 5
##$ABSL= 3
##$ALPHA= 0
##$AQORDER= 0
##$ASSFAC= 0
##$ASSFACI= 0
##$ASSFACX= 0
##$ASSWID= 0
##$AUNMP= <proc_1d>
##$AZFE= 0.1
##$AZFW= 0.5
##$BCFW= 0
##$BC_mod= 2
##$BYTORDP= 0
##$COROFFS= 0
##$CY= -3
##$DATMOD= 1
##$DC= 0
##$DFILT= <>
##$DTYPP= 0
##$F1P= 0
##$F2P= 0
##$FCOR= 1
##$FTSIZE= 65536
##$FT_mod= 6
##$GAMMA= 0
##$GB= 0
##$INTBC= 1
##$INTSCL= 9.790993e-09
##$ISEN= 30
##$LB= 1.5
##$LEV0= 0
##$LPBIN= 0
##$MAXI= 10000
##$MC2= 0
##$MEAN= 0
##$ME_mod= 0
##$MI= 50
##$NCOEF= 0
##$NC_proc= -9
##$NLEV= 6
##$NOISF1= 182.463
##$NOISF2= 159.3651
##$NSP= 0
##$NTH_PI= 0
##$NZP= 0
##$OFFSET= 198.0616
##$PC= 4
##$PHC0= 1390.471
##$PHC1= 149.4999
##$PH_mod= 1
##$PKNL= yes
##$PPARMOD= 0
##$PSCAL= 0
##$PSIGN= 0
##$REVERSE= no
##$SF= 81.0140089999434
##$SI= 65536
##$SIGF1= 159.3651
##$SIGF2= -187.1042
##$SINO= 113.3802
##$SIOLD= 16384
##$SREGLST= <1H.CDCl3>
##$SSB= 0
##$STSI= 65536
##$STSR= 0
##$SW_p= 32467.5324675325
##$SYMM= 0
##$S_DEV= 0
##$TDeff= 32768
##$TDoff= 0
##$TI= <>
##$TILT= no
##$TM1= 0
##$TM2= 0
##$TOPLEV= 0
##$USERP1= <user>
##$USERP2= <user>
##$USERP3= <user>
##$USERP4= <user>
##$USERP5= <user>
##$WDW= 1
##$XDIM= 65536
##$YMAX_p= 347604173
##$YMIN_p= -139080808
$$ End of Bruker specific parameters
$$ ---------------------------------
##NTUPLES= NMR SPECTRUM
##VAR_NAME=  FREQUENCY,     SPECTRUM/REAL,   SPECTRUM/IMAG
##SYMBOL=    X,             R,               I
##VAR_TYPE=  INDEPENDENT,   DEPENDENT,       DEPENDENT
##VAR_FORM=  AFFN,          ASDF,            ASDF
##VAR_DIM=   65536,         65536,           65536
##UNITS=     HZ,            ARBITRARY UNITS, ARBITRARY UNITS
##FACTOR=    0.49542278885378, 1,            1
##FIRST=     16045.7642231865, 0,            0
##LAST=      -16421.768244346, 0,            0
##MIN=       -16421.768244346, -139080808,   0
##MAX=       16045.7642231865, 347604173,    0
$$ Real data points
##PAGE= N=1
##DATA TABLE= (X++(R..R)), XYDATA
$$ [...]
##PAGE= N=2
##DATA TABLE= (X++(I..I)), XYDATA
7374A5129926l62081m073792l387233r6993J829471R20753q88984j184616K17038
$$ 15129926 14767845 10694053 7306820 7209827 9039298 9960051 9071067 7886451 8103489
7365H103489J189940l25050l367142m052975k34086M758892N749371K553114n51633
$$ 8103489 9293429 8968379 5601237 1548262 1314176 6073068 11822439 14375553 13823920
7356A3823920k021365m488004p811836p059797r70595L654450J473168k741462
$$ 13823920 11802555 7314551 -497285 -7557082 -8527677 -4873227 -3400059 -6141521
7348f141521j816854J905359R02742m136162n071573K5539L918589K526536P43034
$$ -6141521 -7958375 -6053016 -5150274 -9286436 -14358009 -14332470 -10413881 -7887345 -7144311
7339g144311K602024M315702K027441r23096l62424J230792j53j646611L18359
$$ -7144311 -4542287 -226585 1800856 877760 515336 1746128 1745975 99364 417723
7330D17723L146812J152782m233074n730139j142710L540529K894152j261311
$$ 417723 3564535 4717317 484243 -5245896 -6388606 -2848077 46075 -1215236
7322a215236l442233j177466L245565N534231L509019j65374n70348K406169K282961
$$ -1215236 -4657469 -5834935 -2589370 2944861 6453880 6288506 5718158 8124327 10407288
7313A0407288n167738j3866618j3653688l725801N851856O728182J153600l298745
$$ 10407288 5239550 -8627068 -22280756 -26006557 -20154701 -13426519 -12272919 -15571664
7305a5571664l155221m99659J428983R14975j901918m697181m153468N59082O256460
$$ -15571664 -18726885 -19226544 -17797561 -16882586 -18784504 -23481685 -27635153 -27076071 -20819611
7296b0819611Q835508P022037K513975k030565m250190k976848O89665M055615
$$ -20819611 -11984103 -4962066 -2448091 -4478656 -8728846 -11705694 -11016029 -6960414
7288f960414N447379N306201M331156K166867j024075l257132k796688q48541
$$ -6960414 -1513035 3793166 8124322 10291189 9267114 6009982 3213294 2364753
7280B364753l80496k125659l206485o05604M629146P813504N612815k05447m780584
$$ 2364753 1984257 -141402 -3347887 -3953491 675655 8489159 14101974 13896527 9115943
7271I115943n271040k794334J6292J288492q3884l763257o289857l227485M716560
$$ 9115943 3844903 1050569 1066861 2355353 2271469 -1491788 -7781645 -11009130 -6292570
7262f292570J0370017Q056743R17747l388110k795076k045814m097118n604362
$$ -6292570 4077447 12134190 13051937 9663827 6868751 4822937 725819 -4878543
7254d878543k996197J199998J794471j387214l166957l30090L874625M181571
$$ -4878543 -7874740 -6674742 -4880271 -6267485 -9434442 -9764532 -5889907 -1708336
7246a708336N82868j547715R16031L809624J059224o202529j0071080o120779
$$ -1708336 -1125468 -2673183 -1757152 2052472 3111696 -3090833 -13161913 -19282692
7238a9282692J035934M596764L890462K406005J274462l01910o89263K251377
$$ -19282692 -18246758 -13649994 -9759532 -7353527 -6079065 -6380975 -7070238 -4818861
7230d818861N911712N346500Q29815k439590k396579k106454k792909j127337
$$ -4818861 1092851 6439351 7269166 4829576 2432997 326543 -2466366 -3593703
7222c593703L973223P446663M875877p87499l228078q21872K611773L087115k6041
$$ -3593703 379520 7826183 12702060 11914561 8686483 7864611 10476384 13563499 13537458
7213A3537458l932790m317940L28666N396413M661692q60599l316363P31602N024558
$$ 13537458 9604668 5286728 5615394 11011807 15673499 14812900 11496537 12228139 17252697
7204A7252697L187800k003024m184891l332374l463708m100396j714976K195763
$$ 17252697 20440497 18437473 14252582 10920208 7456500 3356104 1641128 3836891
7196C836891K389012r78853j889204J867346N290376M275125J073547p84444j572862
$$ 3836891 6225903 5247050 3357846 5225192 10515568 14790693 15864240 15079796 13506934
7187A3506934k357436j747910O72523J585949j374212n044215m791347j109516
$$ 13506934 11149498 9401588 10074111 11660060 10285848 5241633 450286 -659230
7179f59230J592019J337417O4685m65407p53238j487181k241525k757544l345080
$$ -659230 932789 2270206 2334891 1869484 1116246 -370935 -2612460 -5370004 -8715084
7170h715084l465968j872464J028828K715843J831290O71153K377553N901498
$$ -8715084 -12181052 -14053516 -13024688 -10308845 -8477555 -7806402 -5428849 472649
7162D72649O185140P03445o005384o970185j471689L859145L281227j636497n383187
$$ 472649 6657789 7361234 1355850 -5614335 -7086024 -3226879 54348 -1582149 -6965336
7153f965336n475815l476329j244635N20527J182172P80588J037300K911767M154681
$$ -6965336 -12441151 -15917480 -17162115 -16641588 -15459416 -14678828 -13641528 -10729761 -6575080
7144f575080K537984L91223J672730M974019M534551q18980m889006k687552K564830
$$ -6575080 -4037096 -3645873 -1973143 3000876 7535427 6716447 1827441 -860111 1704719
7135A704719M405132J789857j063857j330043j76633K29469j031397l914333p163778
$$ 1704719 6109851 7899708 6835851 5505808 5329175 5558644 4527247 612914 -6550864
7126f550864q054537m871434K77373L136158K023844n33741q71408K268302O922924
$$ -6550864 -14605401 -19476835 -19199462 -16063304 -14039460 -14573201 -15444609 -13176307 -6253383
7117f253383R442633P292171J716584k637631k111140J970952M757048L262885
$$ -6253383 3189250 10481421 12198005 9560374 7449234 9420186 14177234 17440119
7109A7440119p34913l289357k750545r97747n37841j301737j282455j33932j78178
$$ 17440119 16705206 13415849 10665304 9667557 9129716 7827979 6545524 6411592 6233414
7100F233414k538453m239154j942082K538055M026507J152243k156227k913174
$$ 6233414 3694961 -544193 -2486275 51780 4078287 5230530 3074303 161129
7092A61129k564151k736421j974280N26062J914906L884k725059l242452k917909
$$ 161129 -2403022 -5139443 -7113723 -6587661 -4672755 -4668871 -7393930 -10636382 -13554291
7083a3554291l967576m121449m23982L965688L326221j178005k393213K038433
$$ -13554291 -17521867 -21643316 -22067298 -18101610 -14775389 -15953394 -18346607 -16308174
7075a6308174O357758N629312J784313j527456m051280n611437l463332K328304
$$ -16308174 -9950416 -4321104 -2536791 -4064247 -8115527 -13726964 -17190296 -14861992
7067a4861992N475140J076129o296211p746310j638822N177260O823724M041340
$$ -14861992 -9386852 -8310723 -14606934 -22353244 -23992066 -18814806 -11991082 -7949742
7059g949742M15984k251894l544144k938618n57667K355748M570086N379700M383162
$$ -7949742 -7533758 -9785652 -13329796 -16268414 -16826081 -14470333 -9900247 -4520547 -137385
7050a37385K361916J569232K970570M054299K081545j177824j222949K692847
$$ -137385 2224531 3793763 6764333 10818632 12900177 11722353 10499404 13192251
7042A3192251O174488N374437J115495l362083n845148n415680k209481J632057
$$ 13192251 19366739 24741176 25856671 22494588 16649440 11233760 9024279 10656336
7034A0656336L060813J440254j116499l140808m860452n524603l540879o92582
$$ 10656336 13717149 15157403 14040904 10900096 6039644 515041 -3025838 -3718420
7026c718420j895741p859033j1835275p733678J328275P023611O397328L752119
$$ -3718420 -5614161 -13473194 -25308469 -33042147 -31713872 -24690261 -18292933 -14540814
7018a4540814L138873L968172M222077L570931K305869N78612m02294P78619L248156
$$ -14540814 -11401941 -7433769 -3211692 359239 2665108 3243720 2841426 3620045 6868201
7009F868201M841110N373640N686657M021095j969793r164665j0389612l971812
$$ 6868201 11709311 17082951 22769608 26790703 24820910 15656245 5266633 1294821
7001A294821L135058M698709K802533K147728J645873k241365o974918o183978
$$ 1294821 4429879 9128588 11931121 14078849 15724722 13483357 6508439 324461
6993C24461k2678L686128M15679m600021l962030J893064O137392M724699K18625
$$ 324461 301783 3987911 4403590 -196431 -4158461 -2265397 3871995 8596694 8815319
6984H815319k967778l731092l629098l292194j766616O96241J420232j381129
$$ 8815319 5847541 2116449 -1512649 -4804843 -6571459 -5875218 -4454986 -5836115
6976e836115n189101n731672k892231q68364j519335j426681J893678M794639
$$ -5836115 -11025216 -16756888 -19649119 -20517483 -22036818 -23463499 -21569821 -16775182
6968a6775182L004512n94874K77966M940398N928675M95667m683990l263243J838729
$$ -16775182 -13770670 -14365544 -14087578 -9147180 -3218505 -2722838 -7406828 -10670071 -8831342
6959h831342L557581P41517j877182j409764L82963J119535N15281q33106k227217
$$ -8831342 -5273761 -4532244 -6409426 -7819190 -7436227 -6316692 -5801411 -6634517 -8861734
6950h861734k430746r39477N76186L30193p15689n07015L72670l07495j999564
$$ -8861734 -11292480 -12231957 -11655771 -11325578 -12041267 -12548282 -12175612 -12483107 -14482671
6941a4482671j380007K563682O520954P168970M972102K263514j31970k378002
$$ -14482671 -15862678 -13298996 -6778042 390928 5363030 7626544 7494574 5116572
6933E116572l443956j929140J297782L125316J212937l755842q762432j0851436
$$ 5116572 1672616 -256524 1041258 4166574 5379511 1623669 -7138763 -17990199
6925a7990199r114628m989079p46551K406859M617716O006708N812547L363288
$$ -17990199 -27104827 -32093906 -32840457 -30433598 -25815882 -19809174 -13996627 -10633339
6917a0633339n63931l940002n031018l576109o16839K525439N020414O432318
$$ -10633339 -11197270 -15137272 -20168290 -23744399 -24361238 -21835799 -16815385 -10383067
6909a0383067O221127L884787n6329l426284l403337J000118O899180Q575793
$$ -10383067 -4161940 -277153 -333482 -3759766 -7163103 -6162985 736195 9311988
6901I311988K414145q160626j4320088j0689546j810115K986279Q77432j860387
$$ 9311988 11726133 3565507 -10754581 -21444127 -23254242 -20267963 -19390531 -21250918
6893b1250918O43485O060055Q369155O499700M076512K742226Q47843j752581
$$ -21250918 -20607433 -14547378 -6178223 321477 4397989 7140215 7988058 6235477
6885F235477k573343q92765Q91362J313884J363589R34527j773151n350850m442472
$$ 6235477 3662134 2769369 3660731 4974615 6338204 7272731 5499580 148730 -4293742
6876d293742K526403Q854205P509572Q17329l031245j383708Q27297M0004j253377
$$ -4293742 -1767339 7086866 14596438 15413767 12382522 10998814 11826111 11866115 10612738
6867A0612738m00509N11640j043147l118939k836914j877061l750451p108689
$$ 10612738 10212229 10723869 9680722 6561783 3724869 1847808 -1902643 -9011332
6859i011332o684424j147798M203649M198394L47937j450379J735687O738963
$$ -9011332 -15695756 -16843554 -12639905 -8441511 -8093574 -9543953 -7808266 -1069303
6851a069303Q180862M368119j039434l278133j991819j105716k745038l770309
$$ -1069303 7111559 11479678 10440244 7162111 5170292 4064576 1319538 -2450771
6843b450771p75631L648928L826461n56056l734323k310531M61560O45023r11696
$$ -2450771 -3226402 422526 4248987 3692931 -41392 -2351923 -1890363 -1245340 -2157036
6834b157036j893160k756472l961568l226651K8798J677641l82374q65312M517264
$$ -2157036 -4050196 -6806668 -10768236 -13994887 -13966089 -12288448 -12670822 -13536134 -9018870
6825i018870R255455L982907p711827j2113567m610609M758635P416694O626031
$$ -9018870 236585 4219492 -3492335 -15605902 -20216511 -15457876 -8041182 -1415151
6817a415151P019812N191679j298294n403634j357455L729116M93744o460389
$$ -1415151 5604661 10796340 9498046 4094412 2736957 6466073 6959817 499428
6809D99428n743708J493645L534020j908756m300560J303781O479939M490843
$$ 499428 -5244280 -3750635 -216615 -2125371 -6425931 -5122150 1357789 5848632
6801E848632L79540l22729j426013o398095q847693k734510N459217N497384r82758
$$ 5848632 6228172 5905443 4479430 -1918665 -10766358 -13500868 -8041651 -2544267 -3527025
6792c527025m246546j947980J21002M00502L204205Q002707Q099682K251599k087845
$$ -3527025 -7773571 -9721551 -9600549 -9200047 -5995842 2006865 10106547 12358146 10270301
6783A0270301o72563J007449k170624n944426m044630J142594K542054m12790
$$ 10270301 9597738 10605187 8434563 2490137 -1554493 -411899 2130155 1717365
6775A717365j876814L91339J952314n92759m343718m768359j887537Q03423J349216
$$ 1717365 -159449 231890 2184204 1591445 -2752273 -7520632 -9408169 -8604746 -7255530
6766g255530Q19992R31742K151017L626824L653432R21673l219809m607287o25950
$$ -7255530 -6435538 -5503796 -3352779 274045 3927477 4849150 1629341 -2977946 -3603896
6757c603896N403322O903796K043412l546099l907666k85907J377357j038779
$$ -3603896 1799426 8703222 10746634 7200535 3292869 3006962 4384319 3345540
6749C345540l466463j768342K921954N785684L289160l657449r917546j0217530
$$ 3345540 -120923 -1889265 1032689 6818373 10107533 6450084 -3467462 -13684992
6741a3684992n036188q80646j777422k986077J676957Q484685P665715j256960
$$ -13684992 -18721180 -19601826 -21379248 -24365325 -22688368 -14203683 -6537968 -7794928
6733g794928p184154l506984K613862K498539q94735O9489M236500M661342Q63426
$$ -7794928 -14979082 -18486066 -15872204 -13373665 -14268400 -14198911 -9962411 -5301069 -4437643
6724d437643j527079q55286m5140R83602M231516O245781J642597o166448p713085
$$ -4437643 -5964722 -6820008 -6865148 -5881546 -1650030 4595751 6238348 71900 -7641185
6715g641185j711971L471055L972865N105927Q837020Q182764K863p032218n227301
$$ -7641185 -9353156 -5882101 -1909236 3196691 12033711 20216475 20219338 13187120 7959819
6706G959819j20088r72514n800782n783062l5233L959861K392422j165424k982528
$$ 7959819 7839731 6867217 1066435 -4716627 -4751860 -791999 1600423 434999 -2547529
6697b547529k662063k11248L817105N954927L379178j143614l063924k836704
$$ -2547529 -5209592 -5420840 -1603735 4351192 7730370 6586756 3522832 686128
6689F86128l249499k744604J309777M906546J737877n301309o247100R13351O298241
$$ 686128 -2563371 -5307975 -3998198 908348 2646225 -2655084 -8902184 -7988833 -1690592
6680a690592K326318o037531r549687o625281j923524J898045N402535Q284387
$$ -1690592 635726 -5401805 -14951492 -21576773 -23500297 -21602252 -16199717 -7915330
6672g915330Q816508O200483J114706m314867o186438k020398M301451N237644
$$ -7915330 901178 7101661 8216367 3901500 -2284938 -4305336 -3885 5233759
6664E233759l65001m515473p26841O928561R689237N374986j077088n473516p340837
$$ 5233759 4868758 353285 -373556 6555005 16244242 21619228 20542140 15068624 7727787
6655G727787o660781l085336J605205M424695M846316M512681L733546J543406
$$ 7727787 1067006 -2018330 -413125 4011570 8857886 13370567 17104113 18647519
6647A8647519j128206j893681p77105m56758k056922l539462l126969j828307
$$ 18647519 17519313 15625632 14848527 14391769 12334847 8795385 5668416 3840109
6639C840109j423247j888344k048031j397957j72316J464515L316624M687519
$$ 3840109 2416862 528518 -1519513 -2917470 -3089786 -1625271 1691353 6378872
6631F378872M667180K858865l00639l878789o997651q700665p331214j666497
$$ 6378872 11046052 13904917 13604278 9725489 2727838 -5972827 -13304041 -14970538
6623a4970538N764626Q317913J964509p773691j0212175k473746O353992O908726
$$ -14970538 -9205912 -887999 1076510 -6697181 -16909356 -19383102 -13029110 -6120384
6615f120384J065504k678938j601048k15082j098867j397243O80019K197939Q91210
$$ -6120384 -5054880 -7733818 -9334866 -9549948 -10648815 -12046058 -11366039 -9168100 -8276890
6606h276890o44357N88570K910903K801169L00608j720429j890248q22742J222867
$$ -8276890 -8921247 -8332677 -5421774 -2620605 -2319997 -4040426 -5930674 -6753416 -5530549
6597e530549L789870M195673j43350o806889r151497l926367L894206O276371
$$ -5530549 -1740679 2454994 2311644 -4495245 -13646742 -17573109 -13678903 -7402532
6589g402532J401489m559907n198118j040821K570144K909427K130867K392786
$$ -7402532 -6001043 -10560950 -15759068 -16799889 -14229745 -11320318 -9189451 -6796665
6581f796665K375420M13971j797151j689454l96286j330675m528368n757237k009165
$$ -6796665 -4421245 -4007274 -5804425 -7493879 -7890165 -9220840 -13749208 -19506445 -21515610
6572b1515610M634442R556739J0072560O634889J647815j795966j687665R71373
$$ -21515610 -16881168 -7324429 2748131 9383020 11030835 9234869 7547204 8518577
6564H518577K881535J896319r96424l428387m233726l896851l548826l884787
$$ 8518577 11400112 13296431 12300007 8871620 4637894 741043 -2807783 -6692570
6556f692570m204154k727109R15363M107177M102277J951324J029147J860319
$$ -6692570 -10896724 -13623833 -12708470 -8601293 -4499016 -2547692 -1518545 341774
6548C41774J557871j180874l937679m444679l180751q28682L008575O587655N775285
$$ 341774 1899645 718771 -3218908 -7663587 -10844338 -11673020 -8664445 -2076790 3698495
6539C698495K04528m296470l524853j329526k872556m950540n23213Q512151J1776623
$$ 3698495 3903023 -393447 -3918300 -5247826 -8120382 -13070922 -13594135 -5081984 6694639
6530F694639N309809k079423j544663L337261K948969m004397r831698r790630
$$ 6694639 12004448 9925025 8380362 11717623 14666592 10662195 830497 -8960133
6522h960133p318222o406033n110165j5929O778052R372475N515902q54816m387240
$$ -8960133 -16278355 -22684388 -27794553 -27810482 -21032430 -11659955 -6144053 -6998869 -11386109
6513a1386109l344933L38479L938886N692391M797214J368954l147825o241832
$$ -11386109 -14731042 -14392563 -10453677 -4761286 35928 1404882 -1742943 -7984775
6505g984775n917873k522331J073181J716734r00572l400639j907105L330616
$$ -7984775 -13902648 -16424979 -15351798 -13635064 -14535636 -17936275 -19843380 -16512764
6497a6512764P338505N713394R9373l493158k145673N82886L39493j350018L58726
$$ -16512764 -9174259 -3460865 -3361492 -6854650 -9000323 -8417437 -8077944 -9427962 -9069236
6488i069236N264210P070392K467449k943422j831232M188655O330231Q73101
$$ -9069236 -3805026 3265366 5732815 2789393 958161 5146816 11477047 12350148
6480A2350148n930485p167319m322860k868713k856196k68638L968797L933797
$$ 12350148 6419663 -747656 -5070516 -7939229 -10795425 -11064063 -7095266 -3161469
6472c161469j045143l463013J093391O121897L832214k280151k727385K682793
$$ -3161469 -4206612 -7669625 -6576234 -454337 3377877 1097726 -1629659 1053134
6464A053134M589657l58488l785755N83836O369447M732640j587380l233839P48266
$$ 1053134 5642791 5284303 1498548 2082384 8451831 13184471 11597091 8363252 9111518
6455I111518K445255j531711n532761n018223k854700k401208j441679K424911
$$ 9111518 11556773 10025062 4492301 -525922 -3380622 -5781830 -7223509 -4798598
6447d798598N747975L930691j407942m749812m231544k535645j730237j209311
$$ -4798598 949377 4880068 3472126 -1277686 -5509230 -8044875 -9775112 -10984423
6439a0984423m832K047312M768855O772175N444350N38441l732170l399723k25635
$$ -10984423 -10989255 -8941943 -4173088 2599087 8043437 8581878 4849708 1449985 1224350
6430A224350J001235o18011j984050j938880k385944l197088j236528L695600
$$ 1224350 2225585 1607574 -376476 -2315356 -4701300 -7898388 -9134916 -5439316
6422e439316O542728L576109k103206m844813l591366j427554j94177O09618Q26816
$$ -5439316 1103412 4679521 2576315 -2268498 -5859864 -7287418 -7481595 -6871977 -6045161
6413f045161l73077j664788o17621J578723J20603o367947j1411095o985113N904903
$$ -6045161 -6418238 -8083026 -8700647 -7121924 -7001321 -13369268 -24780363 -31765476 -25860573
6404b5860573J6239020J4487154L406436n372617n120931p42563j44190k929911
$$ -25860573 -9621553 4865601 8272037 2899420 -2221511 -2964074 -3108264 -6038175
6396f038175k632781J729089L475312n76878l699413Q51246Q522739R319867K559765
$$ -6038175 -8670956 -6941867 -3466555 -4043433 -7742846 -6891600 1631139 10951006 13510771
6387A3510771k428372n73540K357777M54270k693305q33329L821374L677475k446564
$$ 13510771 11082399 10508859 12866636 13320906 10627601 9794272 13615646 17293121 14846557
6378A4846557p735382p181851k711932J995182N730703P112799L578472l567594
$$ 14846557 7111175 -70676 -2782608 -787426 4943277 12056076 15634548 12066954
6370A2066954p637188m430274J407201K346740j849687m755829k973687J46113
$$ 12066954 4429766 -508 1406693 3753433 1903746 -2852083 -5825770 -5679657
6362e679657J079749J213537K713668L327567l43591o084191p343891k046524
$$ -5679657 -4599908 -3386371 -672703 2654864 2311273 -3772918 -11116809 -13163333
6354a3163333L726769L305873j791417m144033n79204M066517M301684J117069
$$ -13163333 -9436564 -6130691 -7922108 -12066141 -12645345 -8578828 -4277144 -3160075
6346c160075j004113j024090r99050o41860K319761O208312N425864j402038p901472
$$ -3160075 -4164188 -5188278 -6187328 -6829188 -4509427 1698885 7124749 5722711 -2178761
6337b178761p715778k169706L240394O493922Q651327Q561460L807025l572342
$$ -2178761 -9894539 -12064245 -8823851 -2329929 6321398 14882858 18689883 15117541
6329A5117541p573270n402687m56164K479179J644260k299127p420828j0222854
$$ 15117541 7544271 2141584 1685420 4164599 5808859 3509732 -3911096 -14133950
6321a4133950p956995k599544P79477P63640J053198L713568N238262K269495
$$ -14133950 -22090945 -24690489 -23911012 -23147372 -22094174 -18380606 -13142344 -10872849
6313a0872849k419121l660411j239752P40380N76719P47752K910109M850199L759341
$$ -10872849 -13291970 -16952381 -18192133 -17451753 -16875034 -16127282 -13217173 -8366974 -4607633
6304d607633K80033k205327j323629K133209N186916N158377J510826l935061
$$ -4607633 -4327600 -6532927 -7856556 -5723347 -536431 4621946 6132772 2197711
6296B197711p973995p638809k570079L381750M806263R15216k657780r48839L314736
$$ 2197711 -5776284 -13415093 -15985172 -12603422 -7797159 -6881943 -9539723 -10488562 -7173826
6287g173826L856195N24054r62984J048861J392387k485766n229946k133130K858143
$$ -7173826 -3317631 -2793577 -3756561 -2707700 -1315313 -3801079 -9031025 -11164155 -8306012
6278h306012L492149R83627P98359K992855L012997L34565r04582N92191J763572
$$ -8306012 -4813863 -3830236 -3031877 -39022 2973975 3308540 2403958 2996149 4759721
6269D759721J304234J148683J482405L25451j323094k35806K100816R4360o221789
$$ 4759721 6063955 7212638 8695043 9020494 7697400 7461594 9562410 9656770 3434981
6260C434981q948254l591372L401287L322573l003265p266162m481550K842117
$$ 3434981 -5513273 -9104645 -5703358 -2380785 -5384050 -12650212 -17131762 -14289645
6252a4289645Q960645R266880K728364n996087q899042l065681M983239P157171
$$ -14289645 -5329000 3937880 6666244 670157 -8228885 -11294566 -6311327 845844
6244H45844L944312K201627M445293N871786K315811l732100o765316m754550
$$ 845844 4790156 6991783 11437076 17308862 19624673 15892573 9127257 4372707
6236D372707l76793K291576J313486j544189k557086m65039J608963L72211k744526
$$ 4372707 3995914 6287490 7600976 6056787 3499701 3034662 4643625 5015836 2271310
6227B271310l654616j703089j70349o95084j016123N99691K204135J580191J28536
$$ 2271310 -1383306 -3086395 -3256744 -3951828 -4967951 -4368260 -2164125 -583934 -455398
6218d55398O40487K810645L729322K157086j76359j468199j789741j597609k52872
$$ -455398 185089 2995734 6725056 8882142 8705783 7237584 5447843 3850234 3597362
6209C597362K640306N510598N976019L452490n35106m328589p022833p615647
$$ 3597362 6237668 11748266 17724285 21176775 20641669 16313080 9290247 1674600
6201A674600n401002j856178J03936R6112J118050M291904N405409M77484o969604
$$ 1674600 -3726402 -5582580 -5478644 -5382532 -4264482 27422 5432831 5910315 -1059289
6192a059289r117604m103298J955041L866678K992579K182393O98849k219119
$$ -1059289 -10176893 -14280191 -12325150 -8458472 -5465893 -3283500 -2584651 -4803770
6184d803770l473943n92484L240781L576150J552751J260117K369549J161476
$$ -4803770 -8277713 -8870197 -5629416 -2053266 -500515 759602 3129151 4290627
6176D290627k112126k943002r2434K075460K90466l092510m235064k957625j664274
$$ 4290627 2178501 -764501 -856935 1218525 1508991 -1583519 -5818583 -8776208 -10440482
6167a0440482j690255k410162k145609Q04322O022229R649661P819202J799847
$$ -10440482 -12130737 -14540899 -16686508 -15882186 -9859957 -210296 7608906 9408753
6159I408753k967798l261025o14423K488315N072019N642433K152802l986308
$$ 9408753 6440955 3179930 2565507 5053822 10125841 15768274 17921076 13934768
6151A3934768p672630o369345l350835k267704j941736K05042K702113K233294
$$ 13934768 6262138 -107207 -3458042 -5725746 -7667482 -7462440 -4760327 -2527033
6143b527033o17686k083324q19885J032616K080685L306557N013240N336671L071645
$$ -2527033 -3144719 -5228043 -6047928 -5015312 -2934627 371930 5385170 10721841 13793486
6134A3793486j75060k087867k629917l497936m921550m312013P29752P905328
$$ 13793486 13618426 11530559 8900642 5402706 481156 -3830857 -3101105 4804223
6126D804223J0423229L927947p173925j3073464r028013j20611N350537M569068
$$ 4804223 15227452 19155399 11981474 -1091990 -10120003 -10240614 -4890077 -321009
6118c21009P79430k022193k418132j412590j332116l551195n724439l499712L021448
$$ -321009 458421 -1563772 -3981904 -5394494 -6726610 -10277805 -16002244 -19501956 -16480508
6109a6480508P415089M646071j971997n340299l644522j97268L515403Q347623
$$ -16480508 -9065419 -4419348 -6391345 -11731644 -15376166 -15573434 -12058031 -3710408
6101c710408J1769420Q819073N01351n141299l532589J41179r05002n117852n910971
$$ -3710408 8059012 16878085 17379436 12238137 8705548 8846727 7941725 2823873 -3087098
6092c087098j904081J745530J232097j554451k823714j376129J317052K954378
$$ -3087098 -4991179 -3245649 -2013552 -3568003 -6391717 -7767846 -6450794 -3496416
6084c496416J934644j102784l453996l579027l010581l047872j569286L263092
$$ -3496416 -1561772 -2664556 -6118552 -9697579 -12708160 -15756032 -17325318 -14062226
6076a4062226P735903O150160l55043m088703j475279K008893O40538k826511
$$ -14062226 -6326323 -176163 -531206 -4619909 -6095188 -4086295 -3445757 -6272268
6068f272268k119534K368404M309649J017553l358567m341879j994730J441784
$$ -6272268 -8391802 -6023398 -1713749 -696196 -4054763 -8396642 -10391372 -8949588
6060h949588M360934N018753K069255k315654l442337j85148L278959L819754
$$ -8949588 -4588654 430099 2499354 183700 -3258637 -3443785 -164826 3654928
6052C654928L610048N145575N984545K923742j523340k301244l7157l96202n222760
$$ 3654928 7264976 12410551 18395096 21318838 19795498 17494254 17457097 17060895 11838135
6043A1838135r702769r442962n596360j294710K495037N166880M679422Q64962
$$ 11838135 2135366 -7307596 -12903956 -14198666 -11703629 -6536749 -1857327 -992365
6035i92365k550999k604446j259061j614715k477503p75674K434437K987944j4230
$$ -992365 -3543364 -6147810 -7406871 -9021586 -11499089 -12274763 -9840326 -6852382 -6866612
6026f866612l143207l843290k641504j76813L456311N770709L309565k149278
$$ -6866612 -10009819 -13853109 -16494613 -16671426 -13215115 -7444406 -4134841 -6284119
6018f284119l802196O70443M532267J483516m307497l924467K847949P104927
$$ -6284119 -10086315 -9415872 -4883605 -3400089 -7707586 -11632053 -8784104 -1679177
6010a679177L898381j484502k422069L52429K678198M057048N613567M979380
$$ -1679177 2219204 734702 -1687367 -1334938 1343260 5400308 11013875 15993255
6002A5993255n53148p630781r483206m549692K355813P015609R008087Q237584
$$ 15993255 15440107 7809326 -1673880 -6223572 -3867759 3147850 12155937 20393521
5994B0393521L945869j732090m397029l265345j886216j662135K0241L136060
$$ 20393521 24339390 22607300 18210271 14944926 13058710 11396575 11416816 14552876
5986A4552876K594223l599141r119257p444884j067039K915892K949020K785343
$$ 14552876 17147099 13547958 4428701 -3016183 -4083222 -1167330 1781690 4567033
5978D567033L738090L589551J878542L04862j396499m535603p126537n802089
$$ 4567033 8305123 11894674 13773216 14078078 12681579 8145976 1019439 -4782650
5970d782650j484470J956227L744995N503005N959416K913888n93062L63344L387990
$$ -4782650 -6267120 -4310893 -565898 4937107 10896523 13810411 13217349 13580693 16968683
5961A6968683J358084n067546o834829q13652M691427K897143j903480l202593
$$ 16968683 18326767 13259221 6424392 5610740 10302167 13199310 11295830 8093237
5953H093237k367388l124578l387779m52576J786993q29696m255068k668869R94253
$$ 8093237 5725849 2601271 -786508 -1239084 547909 -281787 -4536855 -7205724 -6211471
5944f211471L2449m056332m271132m26058J182227o48433p42558J978120K482698
$$ -6211471 -6179022 -10235354 -14506486 -14932544 -13750317 -14398750 -15141308 -13163188 -10680490
5935a0680490m81396j691554R49724K694946J033362M51933L966602P083493N216017
$$ -10680490 -11161886 -12853440 -11903716 -9208770 -8175408 -7723475 -3756873 3326620 8542637
5926H542637J178424o7228O67517l79827k806877l167547r82232R51580R03175
$$ 8542637 9721061 9653833 10321350 9941523 7134646 3967099 2984867 3936447 4839622
5917D839622n31085k200214k813633j111107K106289L666106J693177j855453
$$ 4839622 4308537 2108323 -705310 -1816417 289872 3955978 5649155 3793702
5909C793702l638023k242002J563044N425203N823506J220801m375955m792478
$$ 3793702 155679 -2086323 -523279 4901924 10725430 11946231 7570276 2777798
5901B777798K45848M572053M344028K298050J198801j014101n630209q256162
$$ 2777798 3023646 7595699 11939727 14237777 15436578 14422477 8792268 536106
5893E36106m996386N91066K590299J477605J560562K396254p9074n000191o480319
$$ 536106 -4460280 -3869214 -1278915 198690 1759252 4155506 4076432 -923759 -7404078
5884g404078k749083J011398O10200j861538k844832k480287k033230l21135L477789
$$ -7404078 -10153161 -9141763 -8531563 -10393101 -13237933 -15718220 -17751450 -18072585 -14594796
5875a4594796O267688M496929p0831k030339J43103J830905j004657n634730o004662
$$ -14594796 -8327108 -3830179 -3901010 -5931349 -5788246 -3957341 -4961998 -10596728 -16601390
5866a6601390j148227L468496L569761J238395J60729n84091l396498n249756
$$ -16601390 -17749617 -14281121 -10711360 -9472965 -9312236 -9896327 -13292825 -18542581
5858a8542581n07767R005604J3500615P668233j789417n032977j111441L499176
$$ -18542581 -19050348 -10044744 3455871 11124104 9334687 4301710 3190269 6689445
5850F689445M728233L626489J342285k554612o620035p248853l236579K091907
$$ 6689445 11417678 15044167 16386452 13831840 7211805 -37048 -3273627 -1181720
5842a181720M293108K099296j476040j742321K309723M825725j077913j2598318
$$ -1181720 3111388 5210684 3734644 1992323 4302046 9127771 8049858 -4548460
5834d548460j7519814r416478K468658N103438n62810k398595M162315J0297589
$$ -4548460 -22068274 -31484752 -29016094 -23912656 -24475466 -26874061 -22711746 -12414157
5826a2414157Q277516K254411J60183K294449L858125L578591L415820K893309
$$ -12414157 -4136641 -1882230 -1722047 572402 4430527 8009118 11424938 14318247
5818A4318247m3390l878695m628077k004161k14277j927660m608199m036681L53747
$$ 14318247 14274857 10396162 5768085 3763924 3549647 1621987 -2986212 -7022893 -6669146
5809f669146M771807N109251J294745k481868k331001R08694L084957K335487
$$ -6669146 -1897339 3211912 4506657 2024789 -306212 602482 3687439 6022926
5801F022926J154181K298551M868178N845309L979348P16289j715614k085973
$$ 6022926 7177107 9475658 14343836 20189145 24168493 24884782 23169168 21083195
5793B1083195q22417N02963R87284J392132K052966Q08509m161585r805772j0327024
$$ 21083195 20260778 20763741 21751025 23143157 25196123 26004632 21843047 12037275 1710251
5784A710251m767172J252554K920244J519039J05244j797322n233782p095343
$$ 1710251 -3056921 -1804367 1115877 2634916 2740160 942838 -4290944 -11386287
5776a1386287l849914J682768L093522j02593j408110K604230O480461L810755
$$ -11386287 -15236201 -13553433 -10459911 -10562504 -11970614 -9366384 -2885923 924832
5768I24832k665958m086126K204899Q369216N971568l266956r938486q661415
$$ 924832 -1741126 -5827252 -3622353 4746863 10718431 7451475 -2487011 -11148426
5760a1148426l319346j04469N29732J998619M471738M412370J100462j015345
$$ -11148426 -14467772 -14572241 -14042509 -12043890 -7572152 -3159782 -2059320 -3074665
5752c074665J390401M945986L362342m347158j2006087j2768154o108784J981428
$$ -3074665 -1684264 3261722 6624064 2276906 -9729181 -22497335 -28606119 -26624691
5744b6624691N269631L382200J121166J736480K921997J364775r96307N22906
$$ -26624691 -21355060 -17972860 -16851694 -15115214 -12193217 -10828442 -11824749 -11301843
5736a1301843N252227O866351K538225k771292l987796l039107m059312n664537
$$ -11301843 -6049616 816735 3354960 583668 -3404128 -6443235 -10502547 -16167084
5728a6167084l761203O09113K676619K044815K744293N036127M089081j167801
$$ -16167084 -19928287 -19319174 -16642555 -14597740 -11853447 -6817320 -2728239 -3896040
5720c896040m375521q26418M836643M973246l75721m448197l473300j90455J663916
$$ -3896040 -8271561 -9097979 -4261336 711910 336189 -4112008 -7585308 -7775763 -6111847
5711f111847J477481K4004k028669k863692o32318K787509K819942j144319l740707
$$ -6111847 -4634366 -4610362 -6639031 -9502723 -10135041 -7347532 -4527590 -5671909 -9412616
5702i412616r72523L876376N416767M278534M893660O800805M589774k593118
$$ -9412616 -10385139 -6508763 -1091996 3186538 8080198 14881003 19470777 16877659
5694A6877659p665993n008989J281378K915925j583936o058335n624954j964684
$$ 16877659 9211666 4202677 5484055 8399980 6816044 757709 -4867245 -6831929
5686f831929M91051J41517j063043m98883K207474M286695K567800j872360l705272
$$ -6831929 -6340878 -6199361 -7262404 -7761287 -5553813 -1267118 1300682 -571678 -4276950
5677d276950j27822M637504N008568K034981Q75666J669646o69781o814568r912598
$$ -4276950 -4404772 232732 5241300 7276281 8151947 9821593 9151812 2337244 -7575354
5668g575354n335660J831913L584605l49625l466464j936527J537369K532042
$$ -7575354 -12911014 -11079101 -7494496 -7844121 -11310585 -13247112 -11709743 -9177701
5660i177701j17627m019597n418280k141377L738888P125179N470826J679942
$$ -9177701 -9295328 -13314925 -18733205 -20874582 -17135694 -10010515 -4539689 -2859747
5652b859747k66086l21535n01760n29630Q91929K261267J138712j010463l87306
$$ -2859747 -3125833 -3447368 -3949128 -4478758 -3586829 -1325562 -186850 -1197313 -1584619
5643a584619K739361L828197J231317q94306R49860L860694K557012k841775o590770
$$ -1584619 1154742 4982939 6214256 5319950 6269810 10130504 12687516 9845741 3254971
5634C254971m757293j75827J319648j641100m355563k568369J435020K067943
$$ 3254971 -1502322 -1678149 -358501 -1999601 -6355164 -8923533 -7488513 -5420570
5626e420570r89232j909242K020088N062857J203527n891313p080730n00938O219731
$$ -5420570 -6409802 -8319044 -6298956 -1236099 -32572 -5923885 -13004615 -13505553 -7285822
5617g285822O769521L098613Q7080r26689o12060J197825L237116K010102k746591
$$ -7285822 -516301 2582312 2669392 1742703 1130643 2328468 5565584 7575686 4829095
5608D829095n618991k956335Q70683P8433k764433n59248O069417Q237208J845338
$$ 4829095 -789896 -3746231 -2875548 -2797115 -5561548 -6120796 -51379 8185829 10031167
5599A0031167o022605p041301k185879J948944K641722J639249k04400k847100
$$ 10031167 4008562 -3032739 -5218618 -3269674 -627952 1011297 806897 -2040203
5591b040203l611068j04501M022248K486721l958580p467018m176449J022339
$$ -2040203 -5651271 -5755772 -1733524 753197 -3205383 -10672401 -14848850 -13826511
5583a3826511L426784N368708R232880J0002719K439131q174554j1179759n137181
$$ -13826511 -10399727 -5031019 4201861 14204580 16643711 8469157 -2710602 -7847783
5575g847783J030274J442308o31033j318655j896357k576864R18363Q883304J2840173
$$ -7847783 -6817509 -5375201 -6006234 -7324889 -9221246 -11798110 -10879747 -1996443 10843730
5566A0843730O600924k961911m271457K967648Q255774N244364j712002n934158
$$ 10843730 17444654 14482743 10211286 13178934 21434708 26679072 24967070 19032912
5558A9032912n978025l379753R04386N276696P061116N510461K423346q90388
$$ 19032912 13054887 9675134 10579520 15856216 22917332 28427793 30851139 29960751
5550B9960751m152741n858200m588293k595302l449142n768337m391310J309732
$$ 29960751 25808010 19949810 15361517 12766215 9317073 3548736 -842574 467158
5542D67158N713159N163995K419705O25340j457238m817493o199813l374730j49634
$$ 467158 6180317 11344312 13764017 14389357 12932119 8114626 1914813 -1459917 -1609551
5533a609551j045874m191061m555184j640124J206606L043537N460156P691703
$$ -1609551 -2655425 -6846486 -11401670 -13041794 -11835188 -8791651 -3331495 4360208
5525D360208P011996L682069O49927j535808m560940o877894m015216L695167
$$ 4360208 11372204 15054273 15704200 14168392 9607452 2729558 -1285658 2409509
5517B409509Q627564M605956m844313j0446624p688005m40205M759386N067976
$$ 2409509 11037073 15643029 10798716 352092 -7335913 -7776118 -3016732 2051244
5509B051244K204400m17529o22856J010007J813917q9291l373531m786005k921019
$$ 2051244 4255644 3838115 3215259 4225266 6039183 5949892 2576361 -2209644 -5130663
5500e130663M17528K912774M200920M606401L230574l21746l359590k497190J275429
$$ -5130663 -4713135 -1800361 2400559 7006960 10237534 9915788 6556198 4059008 5334437
5491E334437L345530K096600Q68563J562984Q68238l532679p307842n524885j199136
$$ 5334437 8679967 10776567 11645130 13208114 14076352 10543673 3235831 -2289054 -3488190
5482c488190j027086m347330m089069J359814N512208M781037L803319O004382
$$ -3488190 -4515276 -8862606 -12951675 -11591861 -6079653 -1298616 2504703 8509085
5474H509085O634946J135254n681775n983238n50215K966097J035786k927307
$$ 8509085 15144031 16279285 10597510 4614272 4064057 7030154 8065940 5138633
5466E138633n154627m987494k759470L55928J130627k087895n387689l916517
$$ 5138633 -15994 -5003488 -7762958 -7407030 -6276403 -8364298 -13751987 -17668504
5458a7668504M86953J745468j016902k523609j73854K277803J456455n42184j55112
$$ -17668504 -17181551 -15436083 -16452985 -18976594 -19150448 -16872645 -15416190 -15958374 -16113486
5449a6113486K612196N344894O259814M605344J010004j633715q05581J545422
$$ -16113486 -13501290 -8156396 -1896582 2708762 3718766 2085051 1279470 2824892
5441B824892J149500j883112k881468j88619J863387l15555m163925n072601k530881
$$ 2824892 3974392 2091280 -790188 -978807 884580 569025 -3594900 -8667501 -11198382
5432a1198382M53677J322912o18597l860657m241225J527065J0028162J2932193
$$ -11198382 -10744705 -9421793 -10040390 -13901047 -18142272 -16615207 -6587045 6345148
5424F345148P161191q15251l831785k824303k796044m185617l722553j222530
$$ 6345148 13506339 12691088 8859303 6035000 3238956 -946661 -4669214 -5891744
5416e891744K64212K8232M10446K269278L849917L926200K638069j12455l701667
$$ -5891744 -5627532 -5599300 -5188854 -2919576 930341 4856541 7494610 7382155 3680488
5407C680488n277589l033724K2345j91920k237530j287663K458414L397681j90110
$$ 3680488 -1597101 -4630825 -4608480 -4800400 -7037930 -8325593 -5867179 -2469498 -2659608
5398b659608k528313O97857M770242K319675n579727j0221638o633249P84908
$$ -2659608 -5187921 -4490064 280178 2599853 -2979874 -13201512 -19834761 -19049853
5390a9049853N144813N530685N750627P221016P380482N183203L795792N292390
$$ -19049853 -13905040 -8374355 -2623728 4597288 11977770 17160973 20956765 26249155
5382B6249155N953440J271965n908050p808317k812113J595531n93886n759116
$$ 26249155 32202595 33474560 27566510 19758193 16946080 18541611 17947725 12188609
5374A2188609p057088m271489j841592o69919J553590L857585K675411j450600
$$ 12188609 5131521 860032 -981560 -1651479 -97889 3759696 6435107 4984507
5366D984507m101053l944263l533947l195699o76859K605951K198328j072738
$$ 4984507 883454 -3060809 -6594756 -9790455 -10467314 -7861363 -5663035 -6735773
5358f735773j106140K658108K815088l271795o853364q04890Q009472Q248533
$$ -6735773 -7841913 -5183805 -2368717 -5640512 -12493876 -13298766 -5289294 2959239
5350B959239Q14954l746978j507949J424939Q71234m6624J169543J833689J20548
$$ 2959239 3774193 27215 -1480734 -55795 815439 768815 1938358 3772047 3892595
5341C892595j402106j074461q96478j523748m82992K089304K038298j504356l577120
$$ 3892595 2490489 1416028 519550 -1004198 -1487190 602114 2640412 1136056 -2441064
5332b441064j669205j59301j994770k470337K518529P775774O120310K98059r70121
$$ -2441064 -4110269 -4269570 -6264340 -8734677 -6216148 1559626 7679936 7977995 7007874
5323G007874L477402O424810M284562J174640L7910j884199n920032p724090m447265
$$ 7007874 10485276 16910086 21194648 22369288 22407198 20522999 14602967 6878877 2431612
5314B431612l84128n53042k971584k542826M17929J043003k074324m735163l126214
$$ 2431612 2047484 1494442 -1477142 -4019968 -3602039 -2559036 -4633360 -9368523 -12494737
5305a2494737J744601O158453P526345N559515J775978j364284k173743j190242
$$ -12494737 -10750136 -4591683 2934662 8494177 10270155 8905871 6732128 5541886
5297E541886l24261p05552j967778l032645k742760n96073J909987J649184k502249
$$ 5541886 5217625 4512073 2544295 -488350 -3231110 -3827183 -1917196 -268012 -2770261
5288b770261o867532o129091K03552O473705P151517K927976r78171j460179j93294
$$ -2770261 -9637793 -15766884 -15563332 -9089627 -1938110 989866 11695 -1448484 -1641778
5279a641778K61213L86879K146421N221453P308942P575672P095390N667346J358893
$$ -1641778 -1380565 -993686 1152735 6374188 13683130 21258802 28354192 34021538 35380431
5270C5380431n299777r629380q149222l760369k323440n019493p532050o609700
$$ 35380431 30080654 20451274 12302052 8541683 6218243 1198750 -6333300 -12943000
5262a2943000l826231j903161m89206K347462O192748P973208N377048k12737
$$ -12943000 -16769231 -18672392 -19161598 -16814136 -10621388 -2648180 2728868 2516131
5254B516131m332884l483204R99351M190062L544354J779800K113282L101137
$$ 2516131 -1816753 -5299957 -4300606 -110544 3433810 5213610 7326892 10428029
5246A0428029J478308j924674l495696k836178k517386k528074n32816K342170
$$ 10428029 11906337 9981663 6485967 3649789 1132403 -1395671 -1928487 413683
5238D13683K233256q9528N22110L964233L100256m490425j0484346p504983m02223
$$ 413683 2646939 2557411 3079521 7043754 10144010 5653585 -4830761 -12335744 -12737967
5229a2737967J612245j055404j071631K476756L179485r14426l856552j706662
$$ -12737967 -11125722 -12181126 -13252757 -10776001 -7596516 -8510942 -12367494 -14074156
5221a4074156J823167K290863R27715J027799K705701M320111N526903O219088
$$ -14074156 -12250989 -9960126 -9032411 -8004612 -5298911 -978800 4548103 10767191
5213A0767191N168167J961249j597943l322772k423807M87099L130652K124715
$$ 10767191 15935358 17896607 16298664 12975892 10552085 11039184 14169836 16294551
5205A6294551l165791q135079p838018l604279p50312o33670j2025K061743K570293
$$ 16294551 13128760 4993681 -2844337 -6448616 -7198928 -7832598 -7844623 -5782880 -3212587
5196c212587O24879m54265J135873K961485L246448L680337N324275O236200N083598
$$ -3212587 -2587708 -3041973 -1906100 1055385 4301833 7982170 13306445 19542645 24626243
5187B4626243K774664q08691o543802j1175552q956319o59065N428415M689968
$$ 24626243 27400907 26592216 20048414 8872862 -83457 -742522 4685893 9375861
5179I375861J799696J452599R08225k669567m687540n85344M809884L874465j895464
$$ 9375861 11175557 12628156 13536381 10866814 6179274 5593930 10403814 14278279 12382815
5170A2382815m975745l576358j762875n79467J777813K830765j259751o240462
$$ 12382815 7407070 3830712 2067837 1488370 3266183 6096948 4837197 -1403265
5162a403265l502550N765931J0391366N619605l40552j93498J835220n13715m010215
$$ -1403265 -4905815 860116 11251482 16871087 16530535 16337037 18172257 17658542 13648327
5153A3648327k278467K309992K275810k616546n319552k689360R34071J509788
$$ 13648327 11369860 13679852 15955662 13339116 8019564 5330204 6264275 7774063
5145G774063L343j754881m021143n892823m061940K042580P101635N301699k447752
$$ 7774063 7777406 6022525 2001382 -3891441 -7953381 -5910801 1190834 6492533 4044781
5136D044781r135735r005549k883914L339180M447698L79082m233980m860764
$$ 4044781 -5090954 -14096503 -16980417 -13641237 -9193539 -8814457 -13048437 -17909201
5128a7909201j372385K642694M260405L801964L175093L185170L321670L238328
$$ -17909201 -19281586 -16638892 -12378487 -8576523 -5401430 -2216260 1105410 4343738
5120D343738L216177L235496K429822j06922m003611p235566p449391m198434
$$ 4343738 7559915 10795411 13225233 13118311 9114700 1879134 -5570257 -9768691
5112i768691K03644K749330K804123K288923K502853K092914n10743l628298l517546
$$ -9768691 -9565047 -6815717 -4011594 -1722671 780182 2873096 2362353 -1265945 -4783491
5103d783491P51921N595909O925924M294507J67099l201463m841966m753398m347933
$$ -4783491 -4031570 1564339 8490263 12784770 12951869 9750406 4908440 155042 -4192891
5094d192891n720642q337214p930050j516619P452359J2127031J0042892M763150
$$ -4192891 -9913533 -18250747 -26180797 -27697416 -20245057 -8118026 1924866 6688016
5086F688016J72859l053949n035042n030092l739675l584497m769803m288839
$$ 6688016 6860875 3806926 -1228116 -6258208 -9997883 -13582380 -18352183 -22641022
5078b2641022p36733L223922N330550O948145Q902199P911136J584600n683118
$$ -22641022 -23377755 -20153833 -14823283 -7875138 1027061 8938197 10522797 4839679
5070D839679o896406j475053M385924N855503L737348P05257k296158m669575
$$ 4839679 -2056727 -3531780 854144 6709647 10446995 11152252 8856094 4186519
5062D186519m737726j874124J708329L023323J571217k39991J69458K328959K545478
$$ 4186519 -551207 -2425331 -717002 2306321 3877538 3637547 3807005 6135964 8681442
5053H681442j689786p110150p083496O3096P781529Q638938K729902l750022o165610
$$ 8681442 6991656 -118494 -7201990 -7138894 642635 9281573 12011475 8261453 2095843
5044B095843m630329j398624J324896J817725R9297j758792k489385l148977l806384
$$ 2095843 -2534486 -3933110 -2608214 -790489 -691192 -2449984 -4939369 -8088346 -11894730
5035a1894730j652185M224882R164428Q553702M647533K675162K440289k5854
$$ -11894730 -13546915 -9322033 -157605 8396097 13043630 15718792 18159081 18133227
5027A8133227l962209m204414j18334K771651J314702j485987k802315l729323
$$ 18133227 14171018 9966604 9848270 12619921 13934623 12448636 9646321 5916998
5019E916998m523770k528541J904854L375244n51717m425430k646576K305695
$$ 5916998 1393228 -1135313 769541 4144785 3593068 -832362 -3478938 -1173243
5011a173243M506755L751323M205356O117444N041043o54302o306999o391616
$$ -1173243 3333512 7084835 11290191 17407635 22448678 21794376 15487377 9095761
5003I095761r61910M317442L763585k459719p913258o779326j148205J464648
$$ 9095761 8133851 12451293 16214878 13755159 5841901 -937425 -2085630 -620982
4995f20982j609033m637107k364095K086098K337914j581795l962571k082320
$$ -620982 -2230015 -6867122 -9231217 -7145119 -4807205 -6389000 -10351571 -12433891
4987a2433891J077900K407319K225913J759493J028303K23877Q1540J59101m24373
$$ -12433891 -11355991 -8948672 -6722759 -4963266 -3934963 -3711086 -3629546 -3470445 -3894818
4978c894818l14237K453516N629237M189869j315447k889121L950545J1366860
$$ -3894818 -4209055 -1755539 3873698 8063567 6748120 3858999 7809544 19176404
4970A9176404Q227879l671868j0607383n610358K260025K039527l460792m261074
$$ 19176404 27404283 23732415 13125032 7514674 9774699 11814226 8353434 4092360
4962D092360K4680J058962k530758k666184K959322N233446j194115p631286m556093
$$ 4092360 4117040 5176002 2645244 -20940 2938382 8171828 6977713 -653573 -5209666
4953e209666L224643M599327o55077l523028r19454J690633J243618M52481M97363
$$ -5209666 -1985023 2614304 1959227 -1563801 -2483255 -792622 450996 903477 1400840
4944A400840m34265j068426J895237O274893O297056K352352L62389R99006j180639
$$ 1400840 966575 -101851 1793386 8068279 14365335 16717687 17080076 18079082 16898443
4935A6898443o488079p732092k124362L320043K380669j774147k755514L52221
$$ 16898443 10410364 2678272 553910 3873953 6254622 4480475 1724961 2077182
4927B077182M052075N263898K860857j226538k215852J209615K665041k849873
$$ 2077182 6129257 11393155 14254012 13027474 10811622 12021237 14686278 11836405
4919A1836405q874369o557749n86612k619129j0396494r615995K009183J0072350
$$ 11836405 2962036 -3595713 -4182325 -6801454 -17197948 -26813943 -24804760 -14732410
4911a4732410P123272L222706O069597Q283729L817251J08147K635593L321479
$$ -14732410 -7609138 -4386432 1683165 9966894 13784145 13892292 16527885 19849364
4903A9849364l178273p063604j069447M548518J63630m629259J931443J1307544
$$ 19849364 16671091 9607487 8538040 13086558 13250188 8620929 10552372 21859916
4895B1859916Q515624k478878o921678l719111k332310l261282o00455L163681
$$ 21859916 30375540 27896662 20974984 17255873 14923563 11662281 11061826 14225507
4887A4225507K697202K329307O494262Q023589K696200J465735R440185J1161499
$$ 14225507 16922709 19252016 25746278 33769867 36466067 37931802 47371987 58533486
4879E8533486k544j507668J7859739K5842173J796341m679219N9759949J39241133
$$ 58533486 58530942 57023274 74883013 100725186 102521527 97842308 157602257 296843390
4871B96843390J10662805m0915921j73820104j64009476n8085665J0396790O88982
$$ 296843390 407506195 366590274 192770170 28760694 -29324971 -18928181 -18239199
4864a8239199j9339801l603609J6698377Q959278p097763m575669O323510O039765
$$ -18239199 -37579000 -41182609 -24484232 -15524954 -22622717 -27198386 -20874876 -14835111
4856a4835111m63335j312932m74374l203670k418002M208547M809298m998181
$$ -14835111 -15298446 -16611378 -17085752 -20289422 -22707424 -18498877 -13689579 -18687760
4848a8687760j1141665m826691K323002M5111k591302M384793J2361918Q890578
$$ -18687760 -29829425 -34656116 -32333114 -32288003 -34879305 -30494512 -18132594 -9242016
4840i242016j616286o950818n838493m106978k033977J784894K589361k724769
$$ -9242016 -10858302 -17809120 -23647613 -27754591 -29788568 -28003674 -25414313 -28139082
4832b8139082p363950m485254J877904M746137N281379P068666P370086L420696
$$ -28139082 -35503032 -39988286 -38110382 -33364245 -28082866 -21014200 -13644114 -10223418
4824a0223418j10794P48632J046429l820342q014759m664998J376604J241777
$$ -10223418 -10334212 -9585580 -8539151 -12359493 -20374252 -25039250 -23662646 -22420869
4816b2420869k878247j862243M709647Q252602M886128l97817k812807k787015
$$ -22420869 -25299116 -27161359 -22451712 -14199110 -9312982 -9710799 -12523606 -15310621
4808a5310621j853696k01676J475579K451629L476125M270496K161280k858133
$$ -15310621 -17164317 -17365993 -15890414 -13438785 -9962660 -5692164 -3530884 -6389017
4800f389017n438416k234513J821484M15869m299727n139443p63810L269842L043542
$$ -6389017 -11827433 -14061946 -12240462 -11824593 -16124320 -21263763 -22027573 -18757731 -15714189
4791a5714189K52363j689010j098246J637914L869880K377538j968302l727894
$$ -15714189 -15461826 -17150836 -18249082 -16611168 -12741288 -10363750 -12332052 -16059946
4783a6059946O7995N440139O916881L900685j252103o920111j0426077p792348
$$ -16059946 -15991951 -10551812 -3634931 265754 -986349 -7906460 -18332537 -26124885
4775b6124885l4788N199782L399254l57067o4727J791253K73651k159459l11674
$$ -26124885 -26159673 -20959891 -17560637 -17917704 -17982431 -16191178 -15917527 -18076986 -18388660
4766a8388660L599788L677557J105047J588300M096298K179895l946780o450638
$$ -18388660 -14788872 -11111315 -10006268 -8417968 -4321670 -2141775 -6088555 -12539193
4758a2539193k145453K920139L076677j6211j888464n28148L928299Q726082P536577
$$ -12539193 -14684646 -11764507 -8687830 -8704041 -10592505 -11120653 -7192354 1533728 9070305
4749I070305k937930j4884948j5853747n009976M916454M386209k065940n048409
$$ 9070305 6132375 -8752573 -24606320 -29616296 -24699842 -20313633 -22379573 -27427982
4741b7427982k639891J315304M498070N921623L666070j329417l213845J478381
$$ -27427982 -30067873 -28752569 -24254499 -18332876 -14666806 -15996223 -19210068 -17731687
4733a7731687P677291Q120303L165031o85583J61949L557475O077972N927290
$$ -17731687 -10054396 -1934093 1230938 545355 707304 4264779 10342751 16270041
4725A6270041K770126j400421k662052n9198J747309j311735n983240o126858
$$ 16270041 19040167 17639746 14977694 14918496 16665805 15354070 9370830 3243972
4717C243972k245396n47320k732173l285492J218569O039537N078593n05901m727316
$$ 3243972 998576 451256 -2280917 -5566409 -4347840 1691697 6770290 6264389 1537073
4708A537073n049730l898809l425050k973411j489246R42476L968701O498127
$$ 1537073 -3512657 -7411466 -10836516 -13809927 -15299173 -14356697 -10387996 -3889869
4700c889869N680880j41829p211710r013786m459043L68399O22640j024887L81258
$$ -3889869 1791011 1649182 -5562528 -14576314 -19035357 -18666958 -18044318 -19069205 -18687947
4691a8687947M147269N649261L566311N40693j817051l466608k520516K927954
$$ -18687947 -14540678 -8891417 -5325106 -4784413 -6601464 -10068072 -12588588 -9660634
4683i660634R418009J0355814M783693j370001m026030n258478p121896p523666
$$ -9660634 -242625 10113189 14896882 13526881 9500851 4242373 -2879523 -10403189
4675a0403189n449765m242200n369914m480792J201851O560212N581555M59347
$$ -10403189 -15852954 -20095154 -25465068 -29945860 -28744009 -22183797 -16602242 -16142895
4667a6142895k526806k323001j454908J200886P704275J3405280J1057226K240334
$$ -16142895 -18669701 -20992702 -22447610 -21246724 -13542449 -137169 10920057 13160391
4659A3160391l798113l236645j330750j814235j404704K175807M815382L063728
$$ 13160391 9362278 6125633 4794883 2980648 1575944 3751751 8567133 11630861
4651A1630861j08625j310609k504604n653211p181505l928846r4722j308732m913326
$$ 11630861 11522236 10211627 7707023 2053812 -5127693 -9056539 -9151261 -10459993 -15373319
4642a5373319l603303K702312O198035K986588j333529m40818L620432M120740
$$ -15373319 -18976622 -16274310 -10076275 -7089687 -8423216 -8864034 -5243602 -1122862
4634a122862m52845m409943k462208L610339O997401L460775m191724r186924
$$ -1122862 -1575707 -5985650 -8447858 -4837519 2159882 5620657 1428933 -7757991
4626g757991p531513j198135M653379O375005L982141L16834j254976M25152K961102
$$ -7757991 -15289504 -16487639 -11834260 -5459255 -1477114 -1160280 -2415256 -1990104 970998
4617I70998K663327j073256m590146m111955j77942L354736M046797K746356O80222
$$ 970998 3634325 2561069 -2029077 -6141032 -6318974 -2964238 1082559 3828915 4509137
4608D509137k795479p559559r665978m940665L747003P332527J936881m391483
$$ 4509137 1713658 -5845901 -15511879 -20452544 -16705541 -9373014 -7436133 -11827616
4600a1827616j776227P099389J0157255L201285m740167n759981l393078l077175
$$ -11827616 -13603843 -6504454 3652801 6854086 2113919 -3646062 -7039140 -10116315
4592a0116315j434911N641598J1131402N289719p148286j0912845j763849P719429
$$ -10116315 -11551226 -5909628 5221774 10511493 3363207 -7549638 -9313487 -1594058
4584a594058O670365l82297k998678R47443O299877Q959188P421434J381044o033872
$$ -1594058 5076307 4694010 1695332 2642775 8942652 17901840 25323274 26704318 20670446
4575B0670446r083098o501476l176575j800574Q47641N462777N608005k250860
$$ 20670446 11587348 5085872 1909297 108723 956364 6419141 12027146 9776286
4567I776286j0733597j1067798n342907j488155p27880J405108N167385O704797
$$ 9776286 -957311 -12025109 -17368016 -18856171 -19584051 -18178943 -13011558 -6306761
4559f306761N797447N035827L177657k127080o643480l835276L746138O680808
$$ -6306761 -509314 4526513 7704170 5577090 -1066390 -4901666 -1155528 5525280
4551E525280K558714j688463k161588k718873n075567m422911P56587L853132
$$ 5525280 8083994 6395531 4233943 1515070 -3560497 -7983408 -7226821 -3373689
4543c373689Q54206k296433J98603L714175R68918n473074p139982k626086J779184
$$ -3373689 -2519483 -4815916 -4617313 -903138 65780 -5407294 -12547276 -15173362 -13394178
4534a3394178K532027K053816K215553J769986N84277L07564L08778j492901l342732
$$ -13394178 -10862151 -8808335 -6592782 -4822796 -4238519 -3930955 -3622177 -5115078 -8457810
4525h457810j030261M429987O520039K789288r47157P28849M929046N595068K690908
$$ -8457810 -9488071 -5058084 1461955 4251243 3304086 4032935 8961981 14557049 17247957
4516A7247957R29047J538805J068307j854225l866972k413925J77070M54192j356125
$$ 17247957 18177004 19715809 20784116 18929891 15062919 12648994 12826064 13280256 11924131
4507A1924131l091901m914196q169194j0872063q502359n93303O710093P354862
$$ 11924131 8832230 3918034 -4251160 -15123223 -23625582 -24218885 -17508792 -10153930
4499a0153930K903124K56294K461144N289202L871245o88799l917806m635898
$$ -10153930 -7250806 -6994512 -4533368 755834 4627079 3938280 20474 -4615424
4491d615424m931207m403796L67059Q798927J3414744Q338692j784396o594973
$$ -4615424 -9546631 -13950427 -13583368 -4784441 8630303 16968995 15184599 8589626
4483H589626l263810M65837k218383p899587q521681k395787M892408Q322140
$$ 8589626 5325816 5791653 3573270 -4326317 -12847998 -15243785 -10351377 -2029237
4475b029237P475447L840196j099947m832048n024488k770480j550779k392939
$$ -2029237 5446210 9286406 8186459 3354411 -1670077 -4440557 -5991336 -8384275
4467h384275k995583j837388J95781K398717M566299M534703K06035n080370m775383
$$ -8384275 -11379858 -13217246 -13021465 -10622748 -6056449 -1521746 -1315711 -6396081 -11171464
4458a1171464J193210M843374J634154k424813j60814N704670P512450M513917
$$ -11171464 -9978254 -5134880 -3500726 -5925539 -6086353 -381683 7130767 11644684
4450A1644684K063440J578740l90981l888677m492983j226179J842545L097384
$$ 11644684 13708124 15286864 14895883 11007206 6514223 5288044 7130589 10227973
4442A0227973N186707P457864M323209n019159j2079141r604056j584323K755308
$$ 10227973 15414680 22872544 27195753 22176594 10097453 493397 -1090926 1664382
4434A664382J048032j774212k155428j040781K04687J458032J634658o73620m022259
$$ 1664382 2712414 938202 -1217226 -2258007 -2053320 -595288 1039370 365750 -3656509
4425c656509m976499k386764J735517N083513O176796L734524j524105n017749
$$ -3656509 -8633008 -11019772 -9284255 -4200742 1976054 5710578 4186473 -831276
4417h31276k277369M715400Q806877O336521J256209q46538K62244P43216j277771
$$ -831276 -3108645 1606755 10413632 16750153 18006362 17159824 17422068 18165284 16887513
4408A6887513l770083m146830k396575q16065j620136m547314o372325l831752
$$ 16887513 13117430 8970600 6574025 5757960 4137824 -409490 -6781815 -10613567
4400a0613567K080269O063955M442219J58170n67352L487119O333479K115158
$$ -10613567 -8533298 -2469343 1972876 2131046 1563694 5050813 11384292 13499450
4392A3499450p387305j4520130j3771405o115781L348711R385718R006459L494520
$$ 13499450 6112145 -8407985 -22179390 -28295171 -24946460 -15560742 -6554283 -3059763
4384c059763j291358m0934N161862O413719M22846o261599n861799J0788L259406
$$ -3059763 -4351121 -4392055 769807 7183526 7606372 1344773 -4517026 -4506238 -1246832
4375a246832Q58045k403833k580189j853437l183573m665683k576975K896483
$$ -1246832 -388787 -2792620 -5372809 -7226246 -10409819 -15075502 -17652477 -14755994
4367a4755994P911311R144502N936941L23629l630436k964458K01177N49522k959021
$$ -14755994 -6844683 2299819 8236760 8560389 4929953 1965495 2166672 2716194 -242827
4358b42827m884703j161079M236422M301357j611733p480850q344674m515394
$$ -242827 -5127530 -6288609 -2052187 2249170 637437 -6843413 -15188087 -19703481
4350a9703481R76751N283333O347384M121186J428997R00874J202174q75841m817208
$$ -19703481 -18726730 -13443397 -7096013 -2974827 -1545830 -644956 557218 -318623 -5135831
4341e135831o190649k676393K542372M494084J648420l162059n469492k777564
$$ -5135831 -11326480 -14002873 -11460501 -6966417 -5317997 -8480056 -13949548 -16727112
4333a6727112K805584N773292L053528j817304k780047J030442M810044N170572
$$ -16727112 -13921528 -8148236 -5094708 -6912012 -9692059 -8661617 -3851573 1318999
4325A318999L776144K950490J744286j191120l969515l907348j747296m12469
$$ 1318999 5095143 8045633 9789919 8598799 4629284 721936 -1025360 -1437829
4317a437829o07962m56079R75374K361342K471921J743457R65029j9265j444781
$$ -1437829 -2045791 -2501870 -1526496 834846 3306767 5050224 6015253 5995988 4551207
4308D551207k429812j714178M50084J886291O67135k305690l875318k509958n56642
$$ 4551207 2121395 407217 857301 2743592 3410727 1105037 -2770281 -5280239 -5836881
4299e836881j020749k857935k080259K102479N210601L372967j007062k207435
$$ -5836881 -6857630 -9715565 -11795824 -9693345 -4482744 -1109777 -2116839 -4324274
4291d324274J378036N769162P113923N740527L660856J032062k567034n170870
$$ -4324274 -2946238 2822924 9936847 15677374 19338230 20370292 17803258 12632388
4283A2632388l957082K80594L037203J698164q38697j15212L536540N091406J241646
$$ 12632388 8675306 8955900 11993103 13691267 12852570 12737358 16273898 21365304 22606950
4274B2606950n555394j0190947j0288558p384068m234835k564925k680691l568417
$$ 22606950 17051556 6860609 -3427949 -10812017 -15046852 -17611777 -20292468 -23860885
4266b3860885l260354k59424M844409R379149J0449822P246087J989459j857330
$$ -23860885 -27121239 -27380663 -22536254 -13157105 -2707283 4538804 6528263 4670933
4258D670933l051327l454421m328747l388835J574154P354917Q174747M079347
$$ 4670933 1619606 -1834815 -6163562 -9552397 -7978243 -623326 7551421 11630768
4250A1630768J136655J634110K82261o056787j1204720q599951k260455n03583
$$ 11630768 12767423 14401533 14683794 8627007 -2577713 -11177664 -13438119 -13941702
4242a3941702k226298N11284P400046Q627225Q09381o504185n014775Q45859K887925
$$ -13941702 -16168000 -15656716 -8256670 370555 1179936 -5324249 -10339024 -9493165 -6605240
4233f605240J534252J393411J123100k901086p139639m986989J784848N095532
$$ -6605240 -5070988 -3677577 -2554477 -5455563 -12595202 -17582191 -15797343 -10701811
4225a0701811L344138K915286O261357P606627L176531k300129l392451j891608
$$ -10701811 -7357673 -4442387 1818970 9425597 12602128 10301999 6909548 5017940
4217E017940k209441l707846k682061J094879M360116N112644L898728J654520
$$ 5017940 2808499 -899347 -3581408 -2486529 1873587 6986231 10884959 12539479
4209A2539479j029720l380783m843354n068919l073725J522483O133464P071506
$$ 12539479 11509759 8128976 3285622 -1783297 -4857022 -3334539 2798925 9870431
4201I870431M444667J874224P22337j150993l737367l249052J180836M236716
$$ 9870431 14315098 16189322 16911659 15760666 12023299 8774247 9955083 14191799
4193A4191799J731975l069671m624160k704815l91680J682664L953872M191655
$$ 14191799 15923774 12854103 8229943 5525128 5133448 6816112 10769984 14961639
4185A4961639P72588k977161l140412j254240o08394J43880L202044M956702J197414
$$ 14961639 15734227 12757066 9616654 8362414 7754020 7897900 11099944 16056646 17254060
4176A7254060l721825k267794L281591L641081j779295l320647K733416P869771
$$ 17254060 13532235 11264441 14546032 18187113 16407818 13087171 15820587 23690358
4168B3690358N498770O87544j89553J14780l087507o948232o677706l987151k492796
$$ 23690358 29189128 29876672 29687119 29801899 26714392 19766160 13088454 9101303 6608507
4159F608507q19894K542615L755788L90494k577756r47798J325087O09153J402513
$$ 6608507 5788613 8331228 12087016 12477510 9899754 8951956 10277043 10886196 12288709
4150A2288709O608947R116459M217438O11929N473476R546189M623815L500521
$$ 12288709 18897656 28014115 32231553 32843482 38316958 47863147 52486962 55987483
4142E5987483J7163405K1988580j4667111p4874587r5770538n0282319J2567340
$$ 55987483 73150888 95139468 80472357 5597770 -90172768 -140455087 -127887747
4135a27887747L2368150J2887441R48580J2681041K1768438J2291521J304812
$$ -127887747 -95519597 -82632156 -81683576 -69002535 -47234097 -34942576 -33637764
4128c3637764L436769P609347J643350o228998n160838q68162k192618m420794
$$ -33637764 -30200995 -22591648 -20948298 -27177296 -32338134 -33206296 -35398914 -39819708
4120c9819708n06546M019557J594601k466889M57221O347212N938843J432362
$$ -39819708 -40326254 -36306697 -34712096 -37178985 -36721764 -30374552 -24435709 -23003347
4112b3003347K008800O990161O906371k65214n784894l475584K993750P114879
$$ -23003347 -20994547 -14004386 -7098015 -7363229 -13148123 -16623707 -13629957 -6515078
4104f515078O596189K691628j815958l701249k611076k247335m588254n680612
$$ -6515078 81111 2772739 956781 -2744468 -5355544 -7602879 -12191133 -17871745
4096a7871745j737726L933500N652556L764603K222688J067845j680815l520527
$$ -17871745 -19609471 -15675971 -10023415 -6258812 -4036124 -2968279 -4649094 -8169621
4088h169621p39815L732816L866598N74870k18787J372379m28606n178466m954244
$$ -8169621 -8909436 -5176620 -1310022 -735152 -953939 418440 -10166 -5188632 -10142876
4079a0142876K155614O956724K611720m791447n505223J03999M065387L043969
$$ -10142876 -7987262 -1030538 1581182 -3210265 -8715488 -8611489 -4546102 -1502133
4071a502133R45223J112901K196175J809586j31334k244487l043929j478483J730131
$$ -1502133 -556910 555991 2752166 4561752 4430418 2185931 -857998 -2336481 -606350
4062f06350L756984K763128P16592Q70131K736468K124006l037286q893464r589785
$$ -606350 3150634 5913762 6630354 7500485 10236953 12360959 9323673 430209 -9159576
4053i159576m550064L19827o9002l236913k597298K864684O627019L948782j179824
$$ -9159576 -13709640 -13389813 -13458815 -16695728 -19293026 -16428342 -9801323 -5852541 -7032365
4044g032365k034286J282145L156572J236067j530128k668514k535640j002059
$$ -7032365 -9066651 -7784506 -4627934 -3391867 -4921995 -7590509 -10126149 -11128208
4036a1128208K762528O494652O070898J909819o53904R36690K928877J360775
$$ -11128208 -8365680 -1871028 4199870 6109689 5455785 6392475 9321352 10682127
4028A0682127k614865n702338o719087n567240j901725K515567L711090N59005
$$ 10682127 8067262 2364924 -4354163 -9921403 -11823128 -9307561 -5596471 -5037466
4020e037466l097985l758349k483685j526178l49003K073059M188887M175079
$$ -5037466 -8135451 -11893800 -14377485 -15903663 -16252666 -14179607 -9990720 -5815641
4012e815641K693995R54375j042668k253914l26245L915112N774034L323762K88383
$$ -5815641 -3121646 -2167271 -3209939 -5463853 -5790098 -1874986 3899048 7222810 7511193
4003G511193q51930l179007q205607j0251643m612588L337516N011337J162187
$$ 7511193 6659263 3480256 -4725351 -14976994 -19589582 -16252066 -11240729 -10078542
3995a0078542p49047Q73457J154222m74994Q88169M890228M070718l810213j0302942
$$ -10078542 -10827589 -9954132 -8799910 -9274904 -8386735 -3496507 574211 -3236002 -13538944
3986a3538944q085119j253631J737359k54693k471500k945063l246795l041138
$$ -13538944 -21624063 -22877694 -21140335 -21395028 -23866528 -26811591 -30058386 -33099524
3978c3099524j12614M666530P039483M435034j270112n802158n770166j252227
$$ -33099524 -33212138 -28545608 -21506125 -17071091 -18341203 -24143361 -29913527 -31165754
3970c1165754L434938L558350M070j313490K183639N830452N130534K634051K551933
$$ -31165754 -27730816 -24172466 -24168396 -25481886 -23298247 -17467795 -12337261 -9703210 -7151277
3961g151277K568433j876476p374454n280732M486285J0727681N676540m245569
$$ -7151277 -4582844 -6459320 -13833774 -19114506 -14628221 -3900540 1776000 -2469569
3953b469569p539264k517454L078986M088361K533666J228764j80111j438441
$$ -2469569 -10008833 -12526287 -9447301 -5358940 -2825274 -1596510 -1776621 -3215062
3945c215062K4690M016186N379724Q55475n017118n360059n24564K562042K12871
$$ -3215062 -3190372 825814 6205538 7061013 2043895 -3316164 -3840728 -1278686 -1065815
3936a065815l556021l465853J37858L091294L262339J781481p5567k489675n657101
$$ -1065815 -4621836 -8087689 -7949831 -4858537 -1596198 185283 109716 -2379959 -8037060
3927h037060q315139q110262l543192L629886Q340836O665520P48630l113242
$$ -8037060 -16352199 -24462461 -28005653 -24375767 -16034931 -9369411 -8620781 -11734023
3919a1734023k126890J24282k3236n66706K362177P360730Q621811L388542m768943
$$ -11734023 -13860913 -13736631 -13759867 -14326573 -11964396 -4603666 4018145 7406687 2637744
3910B637744j0109156r732444m788776J026162M381041N242636N955435O385183
$$ 2637744 -7471412 -17203856 -21992632 -20966470 -16585429 -11342793 -5387358 997825
3902I97825K928572m943902j0728423q371968j178033K748670K288738L412552
$$ 997825 3926397 -1017505 -11745928 -20117896 -21295929 -18547259 -16258521 -12845969
3894a2845969P831437R710622N747815P83732m70296m74433k579859l699694J61991
$$ -12845969 -5014532 4696090 10443905 11227637 10757341 10282908 7703049 4003355 4165346
3885D165346N226282M123074l022761q280835o460203o64515L049474K307567
$$ 4165346 9391628 13514702 10491941 2211106 -4249097 -4913612 -1864138 443429
3877D43429r38148l248583k666612p62193j045932l752331m468654o69268L358928
$$ 443429 -494719 -3743302 -6409914 -7172107 -8218039 -11970370 -16439024 -17108292 -13749364
3868a3749364K465290j129630j343823J710185K308912j73533Q57936P776953
$$ -13749364 -11284074 -12413704 -13757527 -12047342 -9738430 -9911963 -9054027 -1277074
3860a277074J2459213O981023m289824r910718o253591n07247Q19532k48057R58210
$$ -1277074 11182139 18163162 13873338 3962620 -2290971 -2798218 -1978686 -2226743 -1268533
3851a268533L360356K279788k479426n768369m423407j172019L05228M80676J331891
$$ -1268533 2091823 4371611 1892185 -3876184 -8299591 -9471610 -9166382 -8685706 -7353815
3842g353815J734245j85229k005597K49153M624672M459985j468324n983293l719528
$$ -7353815 -5619570 -5804799 -7810396 -7561243 -2936571 1523414 55090 -5928203 -9647731
3833i647731J273998K591502J131138J720726L877029L127845l49959j820292
$$ -9647731 -8373733 -5782231 -4651093 -2930367 946662 4074507 3724548 1904256
3825A904256m58700o92507l990514n615416j716174N266301J0292775J0706583
$$ 1904256 1445556 753049 -3237465 -8852881 -10569055 -5302754 4990021 15696604
3817A5696604O281793j108096o396497m757481J741967N307568K212014l088926
$$ 15696604 21978397 20870301 14473804 9716323 11458290 16765858 18977872 15888946
3809A5888946n472319n349210m528370j762434L043619N247214J733226k994968
$$ 15888946 10416627 5067417 539047 -1223387 1820232 7067446 8800672 5805704
3801E805704k839037P12691J521071j252612k640865m29306K083293K145965P69319
$$ 5805704 2966667 3679358 5200429 3947817 1306952 877646 2960939 5106904 5876223
3792E876223r35431l470210n625735m176391R65764N065901M370166O98335j838443
$$ 5876223 4940792 1470582 -4155153 -8331544 -7365780 -2299879 2070287 2768622 930179
3783I30179k064382j422158p00119J56645J59786k059318n572836o989267l916197
$$ 930179 -1134203 -2556361 -3256480 -3099835 -2940049 -4999367 -10572203 -17561470 -21477667
3774b1477667J885315N675413M559415O20594j850666j770236j635559k199923
$$ -21477667 -19592352 -13916939 -9357524 -8736930 -10587596 -12357832 -13993391 -16193314
3766a6193314k66664N766740J1190163R935373K830450l449314n201078m863159
$$ -16193314 -16459978 -10693238 496925 10432298 13262748 9813434 4612356 -250803
3758b50803m895472l554936P03348M559543L534657j339698m270402k086355J859601
$$ -250803 -5146275 -8701211 -7997863 -3438320 96337 -1243361 -5513763 -7600118 -5740517
3749e740517K085284k334655o947813p494081m700598k287567j278513Q34672
$$ -5740517 -3655233 -5989888 -12937701 -20431782 -25132380 -27419947 -28698460 -27863788
3741b7863788M679205O409847L435809k03000J101646N496766N489507o37195
$$ -27863788 -23184583 -16774736 -13338927 -13541927 -12440281 -6943515 -1454008 -2091203
3733b091203n363796k790746K425547K040761l425239n741927j392971L719530
$$ -2091203 -7454999 -10245745 -7820198 -5779437 -9204676 -14946603 -16339574 -12620044
3725a2620044L730898J243081K148890N703195N511675k51633n316361l979245
$$ -12620044 -8889146 -7646065 -5497175 206020 5717695 5466062 149701 -3829544
3717c829544J141264L593146K231031J046309J366612j3759m170519o996455n363304
$$ -3829544 -2688280 904866 3135897 4182206 5548818 5535059 1364540 -5631915 -10995219
3708a0995219j972701q05382j393236j317376j060218j947809k062881P61612
$$ -10995219 -12967920 -13773302 -15166538 -16483914 -17544132 -19491941 -21554822 -20793210
3700b0793210M037882M114186K760002M149595O535466M130934k611906o413970
$$ -20793210 -16755328 -12641142 -9881140 -5731545 803921 4934855 2322949 -4091021
3692d091021m600344l184766n941086p047769o09214Q404557J0282065M397641
$$ -4091021 -8691365 -11876131 -17817217 -24864986 -25474200 -17069643 -6787578 -2389937
3684b389937n35691J048429N404425O216005K234431l080852n790793m057686
$$ -2389937 -2925628 -1877199 3527226 9743231 11977662 8896810 3106017 -951669
3676i51669Q97360N419496O522321M435077J075563k572815n654796n998047k737647
$$ -951669 -54309 5365187 11887508 16322585 17398148 14825333 9170537 3172490 434843
3667D34843P82100L46847l243987m977687k224814K679878O447464P933380O692796
$$ 434843 1216943 1563790 -1680197 -6657884 -8882698 -6202820 244644 8178024 14870820
3658A4870820K133238m113434p696611n794746o79175K590933J433460k162881
$$ 14870820 17004058 12890624 5194013 -600733 -1279908 1311025 2744485 581604
3650E81604m168770k450962J478581M292737M335979K797065J395289K62508j070463
$$ 581604 -3587166 -6038128 -4559547 -266810 4069169 6866234 8261523 8524031 7453568
3641G453568k076589k064479j479839r92120m67440j55762j236597l397485l678950
$$ 7453568 5376979 3312500 1832661 840541 373101 217339 -1019258 -4416743 -8095693
3632h095693j32978M782301O848941M791439K61745m699940p430877m649777L004968
$$ -8095693 -8228671 -3446370 3402571 8194010 8455755 3755815 -3675062 -8324839 -5319871
3623e319871Q540022N891863j500823m823318j871738J185143K23952j427891
$$ -5319871 3220151 9112014 7611191 2787873 916135 2101278 2325230 897339
3615H97339K227K492235K330425j96607k461115l051972j189879L236732O561164
$$ 897339 899566 3391801 5722226 5525619 3064504 12532 -1177347 2059385 8620549
3606H620549L128149o310282j2661928r274569n78853M628570M595756L980513
$$ 8620549 11748698 5438416 -7223512 -16498081 -17076934 -12448364 -7852608 -3872095
3598c872095N191839O421421O186535M197411m59110o582319q585276l292168
$$ -3872095 1319744 7741165 13927700 18125111 17666001 11083682 2498406 -793762
3590g93762L023729J966446l673431k837802O487183J2325857N288098p840965
$$ -793762 2229967 4196413 522982 -2314820 4172363 16498220 21786318 13945353
3582A3945353j3467865q746232k593372k019500m571000m367733k37935L885716
$$ 13945353 477488 -8268744 -10862116 -12881616 -17452616 -21820349 -22058284 -18172568
3574a8172568M068376O05886k134871l88934M199302O004156K346996l219672
$$ -18172568 -14104192 -13498306 -15633177 -16022111 -11822809 -5818653 -3471657 -6691329
3566f691329n747426m402415j358008J957834M756107N363755L063549M1662j226820
$$ -6691329 -12438755 -16841170 -18199178 -16241344 -11485237 -6121482 -3057933 -3016271 -4243091
3557d243091j099316q89905J3348K142966L262451J383979j393864k069643j881861
$$ -4243091 -5342407 -6232312 -6218964 -4075998 -813547 570432 -823432 -2893075 -4774936
3548d774936l596843n406030l315330J203625K431255l96090j842783L70345J788581
$$ -4774936 -8371779 -13777809 -17093139 -15889514 -13458259 -13854349 -15697132 -15326787 -13538206
3539a3538206k38248j441701J524590M431723K534551q14500M33119M513856M247694
$$ -13538206 -13776454 -15218155 -13693565 -9261842 -6727291 -7541791 -7108672 -2594816 1652878
3530A652878j705332p117546p454150m525214j425065J450715M195594O003766
$$ 1652878 -52454 -7170000 -14624150 -19149364 -20574429 -19123714 -14928120 -8924354
3522h924354P254267R042046R927469P116012J428893k965694m308810m593579
$$ -8924354 -1670087 7371959 17299428 24415440 25844333 22878639 18569829 13976250
3514A3976250m803942l518670j053369o1210p44964l95767Q81415o48286n347265
$$ 13976250 9172308 5653638 4600269 4539059 3794095 3398328 4279743 3631457 -1715808
3505a715808p886153m917983o2718K037788J775441J141361p20651m061571n129613
$$ -1715808 -9601961 -14519944 -14582662 -12544874 -10769433 -9628072 -10348723 -14410294 -19539907
3496a9539907j335311L631322M595714J729511j552603l797927m164144j97088
$$ -19539907 -20875218 -17243896 -12648182 -10918671 -12471274 -16269201 -20433345 -20630433
3488b0630433P409076J1720117P569491m70547m370770l656365l384602m449246
$$ -20630433 -13221357 -1501240 6068251 5597704 1226934 -2429431 -5814033 -10263279
3480a0263279l824056k028652j940317j874926J468884M555830J060418o093412
$$ -10263279 -14087335 -16115987 -18056304 -19931230 -18462346 -13906516 -12846098 -18939510
3472a8939510p071871n78507L543527j45593m664668k419685L984383P957845
$$ -18939510 -26011381 -26589888 -23046361 -23191954 -27856622 -30276307 -26291924 -18334079
3464a8334079Q305045P016124M244345N92452j302390j614982l795512o790768
$$ -18334079 -10029034 -3012910 1231435 1823887 521497 -1093485 -4888997 -11679765
3456a1679765m190680M559215J0155441O362020p32084k747582o65380P12661
$$ -11679765 -15870445 -11311230 -1155789 5206231 4474147 1726565 1061185 1773846
3448A773846K125908N026597M664096j907419p015498k627057N401649N090235
$$ 1773846 3899754 8926351 13590447 11683028 4667530 2040473 7442122 12532357
3440A2532357l100624p745119m610236q38101j053007j414428P62833K361909
$$ 12532357 9431733 1686614 -2923622 -3761723 -4814730 -6229158 -5466325 -3104416
3432c104416K008086K632185L932075J408290m395012o635493l157677L47p12313
$$ -3104416 -1096330 1535855 5467930 6876220 2481208 -4154285 -7311962 -7311615 -8023928
3423h023928j121846J324880K122586j152922k877000J006756N003248K993757
$$ -8023928 -9145774 -7820894 -5698308 -6851230 -9728230 -8721474 -3718226 -724469
3415g24469j384519j395213R59711j261816p275611q644843j770292O791475Q703368
$$ -724469 -2108988 -3504201 -2544490 -3806306 -11081917 -19726760 -21497052 -14705577 -6002209
3406f002209K929894m506603o823190k242884M446355O441248K317010k480972
$$ -6002209 -3072315 -7578918 -14402108 -16644992 -12198637 -5757389 -3440379 -5921351
3398e921351k623601J009011L884815L766313J732841n12409j840670j619435
$$ -5921351 -8544952 -7535941 -3651126 115187 1848028 1335619 -505051 -2124486
3390b124486k07773J445357K959562L565702J024921m939913r249516o818823
$$ -2124486 -2332259 -886902 2072660 5638362 6663283 1723370 -7526146 -14344969
3382a4344969q74527O94124k323769j882611M551604Q802767M948315j430367
$$ -14344969 -15219496 -14525372 -16849141 -18731752 -14180148 -5377381 -429066 -1859433
3374a859433l269425k996920n466746p323653l273438K573638K394543j891509
$$ -1859433 -5128858 -8125778 -13592524 -20916177 -24189615 -21615977 -19221434 -21112943
3366b1112943j754594L367682N532384J965031j220852j29666J682108J324429
$$ -21112943 -22867537 -19499855 -13967471 -12002440 -13223292 -13352958 -11670850 -10346421
3358a0346421J438603L923179N812600M432957J058485k487701n433179n379236
$$ -10346421 -8907818 -4984639 827961 5260918 6319403 3831702 -1601477 -6980713
3350f980713m16671N156960M468290j087664k511634K927205O986429L535696
$$ -6980713 -7397384 -2240424 2227866 1140202 -1371432 1555773 8542202 12077898
3342A2077898k110031k648163k7034q1942k077108j755400m52290k539339o151539
$$ 12077898 9967867 7319704 7292670 7210728 5133620 3378220 2925930 386591 -5764948
3333e764948m832210K023372P585260P088448K982324m65187k598534m724657
$$ -5764948 -10597158 -8573786 -988526 6099922 9082246 8617059 6018525 1293868
3325A293868o826166p691739o157424j771880L778410O550464M433706O26554
$$ 1293868 -5532298 -13224037 -19381461 -21153341 -17374931 -10824467 -6390761 -5764207
3317e764207k90444R76995j03524l878671n156888j577684J652389r68011o730662
$$ -5764207 -6054651 -5077656 -5181180 -9059851 -14216739 -15794423 -14142034 -15110045 -21840707
3308b1840707q099086k830760M042614P897950R125516Q802135M912847l137679
$$ -21840707 -29939793 -32770553 -28727939 -20829989 -11704473 -2902338 2010509 -1127170
3300a127170r580408p576954R45077O210006K934443k960491k923778K928319
$$ -1127170 -10707578 -18284532 -17339455 -11129449 -8195006 -11155497 -14079275 -11150956
3292a1150956P420587O501424K536995j499588n505207r020115r361559n345811
$$ -11150956 -3730369 2771055 5308050 3808462 -1696745 -10716860 -20078419 -25424230
3284b5424230J51048L537913M453467M871647N975534P082372O394980K575627
$$ -25424230 -25273182 -21735269 -17281802 -12410155 -6434621 647751 7042731 9618358
3276I618358k809536n032680j262749M554451N796510K343507P73793L930095
$$ 9618358 6808822 1776142 513393 5067844 10864354 13207861 13981654 17911749
3268A7911749N797269M42153q431057j1977988p691768j274713J653730Q13792
$$ 17911749 23709018 24151171 15720114 3742126 -3949642 -5224355 -3570625 -2756833
3260b756833j517317l855534m839619k654356K739283Q197476R643526N529457
$$ -2756833 -4274150 -8129684 -12969303 -15623659 -12884376 -4686900 4956626 10486083
3252A0486083j956019q594613j1214945r532292n048210R40173O853151R542444
$$ 10486083 8530064 -64549 -11279494 -20811786 -25859996 -24919823 -18066672 -8524228
3244h524228O775389J177810j982021j830089k520235n336509n538665o34729
$$ -8524228 -1748839 -571029 -2553050 -4383139 -6903374 -12239883 -17778548 -18413277
3236a8413277L621411J381059l311965k241939L583994M968886q54763n500300
$$ -18413277 -14791866 -13410807 -16722772 -18964711 -15380717 -10411831 -11266594 -16766894
3228a6766894k242667M190535N687625K655876J316263K741076J930620k878234
$$ -16766894 -19009561 -14819026 -9131401 -6475525 -5159262 -2418186 -487566 -3365800
3220c365800o666129n218069j485490j199806m657598o288460k017891N501187
$$ -3365800 -10031929 -15249998 -16735488 -17935294 -22592892 -28881352 -30899243 -25398056
3212b5398056R941229Q343806L811154J281296J826219K147556m78040m037437
$$ -25398056 -15456827 -7113021 -3301867 -2020571 -194352 1953204 1475164 -2562273
3204b562273l804507J384768O313986M712150k597561p425240l975556L290502
$$ -2562273 -6366780 -4982012 1331974 6044124 3446563 -3978677 -7954233 -4663731
3196d663731N200708L45530l082689P07743O609569O188383j40507m292192k202616
$$ -4663731 536977 882507 -2200182 -1492439 5117130 11305513 11165006 6872814 4670198
3187D670198J913485L485498L827113N777574P528215M905539k045269q276964
$$ 4670198 6583683 10069181 13896294 19673868 27202083 32107622 30062353 21785389
3179B1785389r274681n317704m44604J376038o81180l795750m119676p05271L317535
$$ 21785389 12510708 7193004 6748400 8124438 7443258 3647508 -472168 -1177439 2140096
3170B140096M070693J146092k198621k925289j391452p7513J82881J036395L007443
$$ 2140096 6210789 7356881 5158260 2232971 841519 764006 946887 1983282 4990725
3161D990725L166394q41053n515767m617062J503883M544004n63461p366305o008108
$$ 4990725 8157119 7316066 1800299 -2816763 -1312880 3231124 2667663 -4698642 -10706750
3152a0706750L039192R590201P243778q5671n639853p423889o339424k685598
$$ -10706750 -7667558 1922643 9166421 9080750 3440897 -3982992 -10322416 -13008014
3144a3008014J932672L735188J595875q02078q94229j292186l997576m991659
$$ -13008014 -11075342 -7340154 -5744279 -6546357 -7440586 -8732772 -12730348 -17722007
3136a7722007l68607N471055M886224j230559m349998j306572J465258o58202
$$ -17722007 -18090614 -12619559 -7733335 -8963894 -13313892 -14620464 -13155206 -13813408
3128a3813408k269392L269319J1750992J2179975J723678r779312j1553545l685080
$$ -13813408 -16082800 -12813481 -1062489 11117486 12841164 3061852 -8491693 -12176773
3120a2176773M912386P203139L948702N14894N76810L062674L728037n05848p844657
$$ -12176773 -7264387 -61248 3887454 4402348 4979158 8041832 11769869 11264021 3419364
3111C419364j2371356r721151k098641L743787L872911Q45319p73621k89865k694
$$ 3419364 -8951992 -18673143 -20771784 -17027997 -13155086 -12309767 -13083388 -13373253 -13375947
3102a3375947k48026R15203L235074L590985J159757n19681Q72396K209629o2118
$$ -13375947 -13623973 -12708770 -9473696 -5882711 -4722954 -5242635 -4370239 -2160610 -2222728
3093b222728l442721k863409P88229J503130k039667l586622J071651O749937
$$ -2222728 -5665449 -8528858 -7740629 -6237499 -8277166 -11863788 -10792137 -4042200
3085d042200N709719j274286n839393k961638L622195P164775N410637J317134
$$ -4042200 1667519 393233 -5446160 -8407798 -4785603 2379172 7789809 9106943
3077I106943j212184j042966k59425j100657k206027J65626N633968P529482J245724
$$ 9106943 7894759 6851793 6592368 5491711 3285684 3451310 9085278 16614760 17860484
3068A7860484p646815r540407m199731r35248m248156p169817k877035M225596
$$ 17860484 10213669 673262 -3526469 -4461717 -8709873 -15879690 -18756725 -14531129
3060a4531129N559349J428716p12429J745598M176487L441928J718604J137238
$$ -14531129 -8971780 -7543064 -8255493 -6509895 -2333408 1108520 2827124 3964362
3052C964362Q51353L56463K69996q31158m782078q401611n815114K402993Q517297
$$ 3964362 4815715 5172178 5442174 4611016 -171062 -8572673 -14387787 -11984794 -3467497
3043c467497P945093M143209J037350k533790p259788r080596n675198j725241
$$ -3467497 4477596 8620805 9658155 7124365 -135423 -9216019 -14891217 -16616458
3035a6616458k085425m217737k964905J261311M674120O618946Q130151P684741
$$ -16616458 -18701883 -22919620 -25884525 -24623214 -19949094 -13330148 -5199997 2484744
3027B484744M407927K005569L302807M465532J338609k311100p20377L173808
$$ 2484744 6892671 8898240 12201047 16666579 18005188 15694088 14973711 18147519
3019A8147519K025982l353467n559476l435591k933435n086978l916962J949744
$$ 18147519 20173501 16820034 11260558 7824967 4891532 -195446 -4112408 -2162664
3011b162664N970888M871668L328784M057114L106510m85063l12515N982789J0055621
$$ -2162664 3808224 8679892 12008676 16065790 19172300 18687237 18374722 24357511 34413132
3002C4413132N082952l204072n887579m421027n770317r421498r015600l772733
$$ 34413132 39496084 36292012 30404433 25983406 20213089 10791591 1775991 -1996742
2994a996742P80974J755466P48645j749578o352092r985515p983673j047848N209721
$$ -1996742 -1215768 539698 1288343 -461235 -6813327 -16798842 -24782515 -25830363 -20620642
2985b0620642P372269O601714N232261N047139O896985Q171606L966672m807530
$$ -20620642 -13248373 -6646659 -1414398 3632741 10529726 18701332 22668004 17860474
2977A7860474r155232l950276K905748J356725n452915o750332j527084J536791
$$ 17860474 8705242 4754966 7660714 9017439 3564524 -3185808 -4712892 -3176101
2969c176101N7423P76205N190872N539164q94292n601510k890507P57009j304096
$$ -3176101 -3118678 -2342473 2848399 8387563 7493271 1891761 -998746 -241737 -1545833
2960a545833m269399j310699L348286J235544n755965q126074l324593K151588
$$ -1545833 -5815232 -7125931 -3777645 -2542101 -8298066 -16424140 -19748733 -17597145
2952a7597145L905683L949667L967741K509931J06147J07407K462641K589938
$$ -17597145 -13691462 -9741795 -5774054 -3264123 -3157976 -3050569 -587928 2002010
2944B002010j201593m242112k250813K505033M857536L544308J312369L01263
$$ 2002010 800417 -3441695 -5692508 -3187475 1670061 5214369 6526738 6828001
2936F828001L87126J168409K850158M891341N493288L290952r05139m598285n929139
$$ 6828001 7215127 8383536 11233694 16125035 21618323 24909275 24004136 19405851 13476712
2927A3476712n259400m211752l571326k952932k294102k281016k850021k596111
$$ 13476712 8217312 4005560 434234 -2518698 -4812800 -7093816 -9943837 -12539948
2919a2539948o23077J920982L231959L300585L893122N869553P182046M668257
$$ -12539948 -13163025 -11242043 -8010084 -4709499 -816377 5053176 12235222 16903479
2911A6903479j296976n052153j457391O040205P217306k081865j2734767j3173561
$$ 16903479 15606503 10554350 9096959 15137164 22354470 20272605 7537838 -5635723
2903e635723m710659J072017o50661k313902K356819P871836O085979p52931l862215
$$ -5635723 -10346382 -9274365 -9925026 -12238928 -9882109 -2010273 4075706 3322775 -539440
2894e39440j236578Q79251j339427m425910m110445q82031K372417L848402K593637
$$ -539440 -1776018 -896767 -2236194 -6662104 -10772549 -11654580 -9282163 -5433761 -2840124
2885b840124j386465n426532n924078l038405o25180m60680q2125J879026K033241
$$ -2840124 -4226589 -9653121 -15577199 -18615604 -19240784 -19701464 -19783589 -17904563 -15871322
2876a5871322k614176q278703p681422L21369Q243512Q738853L262597o52711
$$ -15871322 -18485498 -26764201 -34445623 -34124254 -25880742 -17141889 -13879292 -14532003
2868a4532003N84821K922689J624760j718404k109101J113085L571843K539345
$$ -14532003 -13947182 -11024493 -9399733 -11118137 -13227238 -12114153 -8542310 -6002965
2860f002965K25612n26878j69284l08771o50105k15495O59343J474786K682006
$$ -6002965 -5777353 -6304231 -6473515 -6782286 -7432391 -7647886 -6988543 -5513757 -2831751
2851b831751M001269L726224J214125k069469m996638p393701p415817k610253
$$ -2831751 1169518 4895742 6109867 4040398 -956240 -8349941 -15765758 -18376011
2843a8376011M542521P159706L183604j022011l63987J323218r41160l550877
$$ -18376011 -13833490 -6673784 -3490180 -4512191 -4876178 -3552960 -4494120 -8044997
2835h044997n36489M761809M143724j495487l288995O81194K500828j684605n584932
$$ -8044997 -8581486 -3819677 324047 -1171440 -4460435 -3779241 -1278413 -2963018 -8547950
2826h547950m221868j325712k51346K542727Q034421Q166791j686021j1448413
$$ -8547950 -12769818 -14095530 -14346876 -11804149 -3769728 4397063 2711042 -8737371
2818h737371q892061J792003O355664K367134J004696O763950R676563K543881
$$ -8737371 -17629432 -15837429 -9481765 -7114631 -6109935 654015 10330578 12874459
2810A2874459o450182o491797l10914K160030k2733O6325L030242J640171n632584
$$ 12874459 6424277 -67520 -378434 1781596 1758863 1825188 4855430 6495601 863017
2801H63017r862818m569153M181386O159326N96355m399819l228040J941372N997610
$$ 863017 -8999801 -13568954 -9387568 -3228242 -2631887 -7031706 -10259746 -8318374 -2320764
2792b320764O076304K191362l137993n602977k860861K128852M370747L016956
$$ -2320764 3755540 5946902 2808909 -2794068 -5654929 -3526077 844670 3861626
2784C861626R49252q56517l569292n175215j338938O256507Q888829K430765n416261
$$ 3861626 4810878 3954361 385069 -4790146 -6129084 127423 9016252 11447017 6030756
2775F030756n247870Q94568L349821q84595n383879n201111k964956k573959l121955
$$ 6030756 782886 1677454 5027275 4142680 -1241199 -6442310 -9407266 -11981225 -15103180
2766a5103180j887319J069838L889735N257835M136890M65856k584543q40596
$$ -15103180 -16990499 -15920661 -12030926 -6773091 -2636201 -2170345 -4754888 -5595484
2758e595484M608142P095098K699666m293502o903047l932889k56996j70859k665581
$$ -5595484 -987342 6107756 8807422 4513920 -2389127 -6322016 -6579012 -6749871 -9415452
2749i415452k892078K147954Q820233R337521J445436o698888o046268Q72154
$$ -9415452 -12307530 -10159576 -1339343 7998178 9443614 2744726 -3301542 -2429388
2741b429388L852965O66601k95455M923583Q178591K393817o239847p572569k674094
$$ -2429388 1423577 2090178 1794723 6718306 14896897 17290714 11050867 3478298 804204
2732H04204j63476j529983m67844M638339P577072M643314j69756k322082k416446
$$ 804204 640728 -889255 -1357099 3281240 10858312 15501626 15331870 13009788 10593342
2723A0593342k614076k964726l349623m311356m379963j155184L642931M906695
$$ 10593342 7979266 5014540 1664917 -2646439 -7026402 -8181586 -4538655 368040
2715C68040J337590k723585m042899m139666m434165l027596P72101L299943J516988
$$ 368040 1705630 -1017955 -5060854 -9200520 -13634685 -16662281 -15890180 -12590237 -11073249
2706a1073249k179731l384816j280157J820901L881903L694111P47734k923499
$$ -11073249 -13252980 -16637796 -17917953 -16097052 -12215149 -8521038 -7773304 -10696803
2698a0696803l257978R67710N860836O986224M067962l05013l717677l953703
$$ -10696803 -13954781 -12987071 -7126235 -140011 3927951 3622938 -94739 -4048442
2690d048442M24376O733243Q546394K766382n900830j0447448r383271o310071
$$ -4048442 -3624066 3109177 11655571 14421953 8521123 -1926325 -11309596 -17619667
2682a7619667m033826k368266k46736K819591O323409Q148000O277765K397546
$$ -17619667 -21653493 -24021759 -24268495 -21448904 -15125495 -6977495 -699730 1697816
2674A697816Q23582K319738K866314O36281p78883N78155L96831m329675q497662
$$ 1697816 2521398 4841136 7707450 8343731 7564848 8143003 8539834 4210159 -4287503
2665d287503o499609k025065k028633m534871k133876M396795O697577L044988
$$ -4287503 -10787112 -12812177 -14840810 -19375681 -21509557 -17112762 -10415185 -7370197
2657g370197Q86008L207064L540733j296993m286327m90432L303467l22861o411765
$$ -7370197 -6484189 -3277125 263608 -1033385 -5319712 -5810144 -2506677 -2829538 -9241303
2648i241303n561697O66193K865714q31182k995091M40289N395189P949107Q724816
$$ -9241303 -14803000 -14136807 -11271093 -12102275 -15097366 -14657077 -9261888 -1312781 7412035
2639G412035P737423L037105l311651n335895k159483k42248l272497o084504
$$ 7412035 15149458 18186563 14874912 9539017 7379534 7137286 3864789 -2219715
2631b219715k891848L744960O994844M751602J0400m299006o444120m924865q62070
$$ -2219715 -5111563 -1366603 5628241 10379843 10390243 6091237 -352883 -5277748 -6139818
2622f139818J144093j283680m165228k796508J226758L280361L263199M176278
$$ -6139818 -4995725 -6279405 -10444633 -13241141 -12014383 -8734022 -5470823 -1294545
2614a294545N149934K503684k686454m621787j263229K922369L914597K470838
$$ -1294545 3855389 6359073 3672619 -949168 -2212397 709972 4624569 7095407
2606G095407J34625l447808p015455o963860l107545j35290k0628J676302P428000
$$ 7095407 7230032 3782224 -3233231 -10197091 -13304636 -13439926 -13460554 -11784252 -4356252
2597d356252J0936504N295120n437058j0247587n622360R18748J963726j450248
$$ -4356252 6580252 11875372 6438314 -3809273 -9431633 -8512885 -6549159 -7999407
2589g999407m030286l249043J59065M471278P245217O463019L382129J477003
$$ -7999407 -12029693 -15278736 -15119671 -10648393 -3403176 3059843 6441972 7918975
2581G918975J262700l96926m294955o319348l601521N98698J791407P67642Q34453
$$ 7918975 9181675 8784749 4489794 -1829554 -5431075 -4832377 -3040970 -2273328 -1438875
2572a438875J283502q60456l967354k956797K086955M518656P95741l659922k270689
$$ -1438875 -155373 -1015829 -4983183 -7939980 -5853025 -1334369 -538628 -4198550 -6469239
2563f469239K867650M191037k33488m535625m113183j427080o74095j235201j29351
$$ -6469239 -3601589 589448 355960 -4179665 -8292848 -9719928 -10394023 -11629224 -11758575
2554a1758575K031614K142488L25919k14572Q99753K37805l149935n035460k425476
$$ -11758575 -9726961 -7584473 -7258554 -7473126 -6573373 -6335568 -9485503 -14520963 -16946439
2545a6946439J212572J156471j041323l04873L172730L698222p79685m704509
$$ -16946439 -15733867 -14577396 -15618719 -15923592 -12750862 -9052640 -9832325 -14536834
2537a4536834k524612L627192O982028M498529o65841l590943k145333J931292
$$ -14536834 -17061446 -13434254 -6452226 -1953697 -2619538 -6210481 -8355814 -6424522
2529f424522M634685L046197j717006n588956n976690l644111j51064L820021
$$ -6424522 -1789837 1256360 -460646 -6049602 -12026292 -15670403 -15821467 -12001446
2521a2001446O744290O293023L088664J130346J860556J298879l281230p369043
$$ -12001446 -5257156 1035867 4124531 5254877 7115433 8414312 5133082 -2235961
2513b235961n183894Q76146L153065Q1904k315796p47236R13928j11389l5712
$$ -2235961 -7419855 -6543709 -3390644 -3308740 -5624536 -6371772 -5457844 -5569233 -5604945
2504e604945M061120P342219M241484j650862k236374K387104L794058j590864
$$ -5604945 -1543825 5798394 10039878 8389016 6152642 8539746 12333804 10742940
2496A0742940o782388m891995O09600J484943l079836n885195k348190L715275
$$ 10742940 3960552 -931443 -321843 1163100 -1916736 -7801931 -10150121 -6434846
2488f434846N973715L114665j524795m864395n918998m469118q49387L157588
$$ -6434846 -461131 2653534 1128739 -3735656 -9654654 -14123772 -14973159 -11815571
2480a1815571N235970M498441J519233k773337o623093o965491k234020M425189
$$ -11815571 -6579601 -2081160 -561927 -3335264 -9958357 -16923848 -19157868 -14732679
2472a4732679P676316O304906M096100L588480K578792j031133m525258m221279
$$ -14732679 -7056363 -751457 3344643 6933123 9511915 8480782 3955524 -265755
2464b65755j556768q95301k468209k130827J817754N836543O141833L159606j10761
$$ -265755 -1822523 -2717824 -5186033 -7316860 -5499106 337437 6479270 9638876 9528115
2455I528115j487128n95377J051338O87256k346432m324938j990454R09246k371951
$$ 9528115 8040987 7445610 8496948 9184204 6837772 2512834 522380 1431626 -940325
2446i40325j0153659j1944784l085721O894743O672317j197858m766602J21644
$$ -940325 -11093984 -23038768 -26124489 -19229746 -12557429 -13755287 -18521889 -18400245
2438a8400245N870148N992494L261123K631701L237451J765432r08711j131346
$$ -18400245 -12530097 -6537603 -3276480 -644779 2592672 4358104 3449393 2318047
2430B318047J841871M994854M965429L67868p277687j3152455j2068238m068895
$$ 2318047 4159918 9154772 14120201 14488069 7210382 -5942073 -18010311 -22079206
2422b2079206M686388Q408133P062010L898090O85310k028289k848848j355685
$$ -22079206 -17392818 -8984685 -1922675 1975415 2660725 632436 -2216412 -3572097
2414c572097m8810r20284j795723Q6429K519139J101157l270146n127432l113679
$$ -3572097 -3620907 -4541191 -6336914 -6250485 -3731346 -2630189 -5900335 -11027767 -14141446
2405a4141446k153490m796022n926562l72641Q151927J1166731O706808J062785
$$ -14141446 -16294936 -21090958 -27017520 -27390161 -19238234 -8071503 -1364695 -301910
2397c01910n30856L65457L94734K53547K042097L900811J995715k860995n090228
$$ -301910 -832766 -467309 -72575 180972 2223069 6123880 8119595 5258600 168372
2388A68372k054463J796691J115399k629505l504099j72323K060687m76845l803263
$$ 168372 -1886091 -89400 1025999 -1603506 -5107605 -5279928 -3219241 -3696086 -7499349
$$ [...]
##END NTUPLES=NMR SPECTRUM
##END=
