##TITLE=31Pdec_DE-107_k_TFA
CDCl3, 64 sc
 29.8.2025
##JCAMPDX= 6.0         $$ Bruker NMR JCAMP-DX V2.0
##DATA TYPE= NMR SPECTRUM
##DATA CLASS= NTUPLES
##ORIGIN= UXNMR, Bruker Analytische Messtechnik GmbH
##OWNER= root
$$ XWIN-NMR		Version 3.5
$$ Fri Aug 29 15:53:57 2025 Russian Standard Time (UT+4h)  she@DPX200
##.OBSERVE FREQUENCY= 81.013821
##.OBSERVE NUCLEUS= ^31P
##.ACQUISITION MODE= SIMULTANEOUS
##.ACQUISITION SCHEME= undefined
##.AVERAGES= 64
##.DIGITISER RES= 17
##SPECTROMETER/DATA SYSTEM= spect
##.PULSE SEQUENCE= zgpg30
##.SOLVENT NAME= CDCl3
##.SHIFT REFERENCE= (INTERNAL, CDCl3, 0, 198.062)
##AUDIT TRAIL= $$ (NUMBER, WHEN, WHO, WHERE, WHAT)
$$ ##TITLE= Audit trail, XWIN-NMR		Version 3.5
$$ ##JCAMPDX= 5.01
$$ ##ORIGIN= Bruker BioSpin GmbH
$$ ##OWNER= she
$$ F:/spectra/data/she/nmr/P31/2/pdata/1/auditp.txt
$$ ##AUDIT TRAIL=  $$ (NUMBER, WHEN, WHO, WHERE, WHAT)
(   1,<2025-08-29 15:52:38.31 +0400>,<she>,<DPX200>,
      <created by zg, POWCHK disabled, PULCHK disabled
       configuration hash MD5:
       00 E9 B6 7A A2 85 ED C7 34 08 36 98 17 FE 4E 26
       data hash MD5: 32K
       29 B7 70 FE 5B 5F 1C 37 4F 14 33 38 45 EE 26 E8>)
(   2,<2025-08-29 15:52:40.43 +0400>,<she>,<DPX200>,
      <Start of raw data processing
       efp BC_mod = 2 LB = 1.5 FT_mod = 6 PKNL = 1 PHC0 = 1351.592 PHC1 = 309.5 SI = 64K 
       data hash MD5: 64K
       E7 FE B5 40 8D 6E 69 98 E6 5A 86 07 87 FA 3A A7>)
$$ ##END=
$$ 
$$ hash MD5
$$ 6B 76 26 44 E7 11 B9 7E 7B 5E 38 4E E2 A5 77 18
##$RELAX= 
##$RELAX= 
##$RELAX= 
##$RELAX= 
##$RELAX= 
##$RELAX= 
##$RELAX= 
##$RELAX= 
$$ Bruker specific parameters
$$ --------------------------
##$DU= <F:/spectra>
##$EXPNO= 2
##$NAME= <P31>
##$PROCNO= 1
##$TYPE= <nmr>
##$USER= <she>
##$AMP= (0..31)
100 100 100 100 100 100 100 100 100 100 100 100 100 100 100 100 100 100 
100 100 100 100 100 100 100 100 100 100 100 100 100 100 
##$AQSEQ= 0
##$AQ_mod= 1
##$AUNM= <au_zg>
##$AUTOPOS= <>
##$BF1= 81.014009
##$BF2= 200.13
##$BF3= 200.13
##$BF4= 200.13
##$BF5= 200.13
##$BF6= 200.13
##$BF7= 200.13
##$BF8= 200.13
##$BYTORDA= 1
##$CFDGTYP= 0
##$CFRGTYP= 5
##$CHEMSTR= <none>
##$CNST= (0..31)
1 1 145 1 1 1 1 1 1 1 1 1 1 1 1 1 1 1 1 1 1 1 1 1 1 1 1 1 1 1 1 1 
##$CPDPRG= <waltz16>
##$CPDPRG1= <>
##$CPDPRG2= <waltz16>
##$CPDPRG3= <>
##$CPDPRG4= <mlev>
##$CPDPRG5= <mlev>
##$CPDPRG6= <mlev>
##$CPDPRG7= <mlev>
##$CPDPRG8= <mlev>
##$CPDPRGB= <>
##$CPDPRGT= <>
##$D= (0..31)
0 1 0 0 0 0 0 0 0 0.06 0 0.03 2e-05 3e-06 0 0 0.0002 0 0 0 0 0 0 0 0 0 
0 0 0 0 0 0 
##$DATE= 1756468357
##$DBL= (0..7)
120 120 120 11 120 120 24 19 
##$DBP= (0..7)
150 150 150 150 150 150 150 150 
##$DBP07= 0
##$DBPNAM0= <>
##$DBPNAM1= <>
##$DBPNAM2= <>
##$DBPNAM3= <>
##$DBPNAM4= <>
##$DBPNAM5= <>
##$DBPNAM6= <>
##$DBPNAM7= <>
##$DBPOAL= (0..7)
0.5 0.5 0.5 0.5 0.5 0.5 0.5 0.5 
##$DBPOFFS= (0..7)
0 0 0 0 0 0 0 0 
##$DE= 6
##$DECBNUC= <off>
##$DECIM= 4
##$DECNUC= <off>
##$DECSTAT= 4
##$DIGMOD= 1
##$DIGTYP= 9
##$DL= (0..7)
0 0 52 120 120 21 21 25 
##$DP= (0..7)
$$ [...]
##$SUBNAM2= <"">
##$SUBNAM3= <"">
##$SUBNAM4= <"">
##$SUBNAM5= <"">
##$SUBNAM6= <"">
##$SUBNAM7= <"">
##$SUBNAM8= <"">
##$SUBNAM9= <"">
##$SW= 400.765351723535
##$SWIBOX= (0..15)
0 1 3 0 0 0 0 0 0 0 0 0 0 0 0 0 
##$SW_h= 32467.5324675325
##$TD= 32768
##$TD0= 1
##$TE= 0
##$TE2= 300
##$TE3= 300
##$TEG= 300
##$TL= (0..7)
0 120 53 12 22 120 120 120 
##$TP= (0..7)
150 150 150 150 150 150 150 150 
##$TP07= 0
##$TPNAME0= <>
##$TPNAME1= <>
##$TPNAME2= <>
##$TPNAME3= <>
##$TPNAME4= <>
##$TPNAME5= <>
##$TPNAME6= <>
##$TPNAME7= <>
##$TPOAL= (0..7)
0.5 0.5 0.5 0.5 0.5 0.5 0.5 0.5 
##$TPOFFS= (0..7)
0 0 0 0 0 0 0 0 
##$TUNHIN= 0
##$TUNHOUT= 0
##$TUNXOUT= 0
##$USERA1= <user>
##$USERA2= <user>
##$USERA3= <user>
##$USERA4= <user>
##$USERA5= <user>
##$V9= 5
##$VALIST= <valist>
##$VCLIST= <CCCCCCCCCCCCCCC>
##$VD= 0
##$VDLIST= <DDDDDDDDDDDDDDD>
##$VPLIST= <PPPPPPPPPPPPPPP>
##$VTLIST= <TTTTTTTTTTTTTTT>
##$WBST= 1024
##$WBSW= 4
##$XGAIN= (0..3)
0 0 0 0 
##$XL= 0
##$YL= 0
##$YMAX_a= 2838
##$YMIN_a= -9345
##$ZGOPTNS= <>
##$ZL1= 120
##$ZL2= 120
##$ZL3= 120
##$ZL4= 120
##$ABSF1= 0
##$ABSF2= 0
##$ABSG= 0
##$ABSL= 0
##$ALPHA= 0
##$AQORDER= 0
##$ASSFAC= 0
##$ASSFACI= 0
##$ASSFACX= 0
##$ASSWID= 0
##$AUNMP= <proc_1d>
##$AZFE= 0.1
##$AZFW= 0.5
##$BCFW= 0
##$BC_mod= 2
##$BYTORDP= 0
##$COROFFS= 0
##$CY= -3
##$DATMOD= 1
##$DC= 0
##$DFILT= <>
##$DTYPP= 0
##$F1P= 0
##$F2P= 0
##$FCOR= 1
##$FTSIZE= 65536
##$FT_mod= 6
##$GAMMA= 0
##$GB= 0
##$INTBC= 1
##$INTSCL= 9.790993e-09
##$ISEN= 30
##$LB= 1.5
##$LEV0= 0
##$LPBIN= 0
##$MAXI= 10000
##$MC2= 0
##$MEAN= 0
##$ME_mod= 0
##$MI= 50
##$NCOEF= 0
##$NC_proc= -9
##$NLEV= 6
##$NOISF1= 182.463
##$NOISF2= 159.3651
##$NSP= 0
##$NTH_PI= 0
##$NZP= 0
##$OFFSET= 198.0616
##$PC= 4
##$PHC0= 1351.592
##$PHC1= 309.5
##$PH_mod= 1
##$PKNL= yes
##$PPARMOD= 0
##$PSCAL= 0
##$PSIGN= 0
##$REVERSE= no
##$SF= 81.0140089999434
##$SI= 65536
##$SIGF1= 159.3651
##$SIGF2= -187.1042
##$SINO= 113.3802
##$SIOLD= 16384
##$SREGLST= <1H.CDCl3>
##$SSB= 0
##$STSI= 65536
##$STSR= 0
##$SW_p= 32467.5324675325
##$SYMM= 0
##$S_DEV= 0
##$TDeff= 32768
##$TDoff= 0
##$TI= <>
##$TILT= no
##$TM1= 0
##$TM2= 0
##$TOPLEV= 0
##$USERP1= <user>
##$USERP2= <user>
##$USERP3= <user>
##$USERP4= <user>
##$USERP5= <user>
##$WDW= 1
##$XDIM= 65536
##$YMAX_p= 133589986
##$YMIN_p= -438815840
$$ End of Bruker specific parameters
$$ ---------------------------------
##NTUPLES= NMR SPECTRUM
##VAR_NAME=  FREQUENCY,     SPECTRUM/REAL,   SPECTRUM/IMAG
##SYMBOL=    X,             R,               I
##VAR_TYPE=  INDEPENDENT,   DEPENDENT,       DEPENDENT
##VAR_FORM=  AFFN,          ASDF,            ASDF
##VAR_DIM=   65536,         65536,           65536
##UNITS=     HZ,            ARBITRARY UNITS, ARBITRARY UNITS
##FACTOR=    0.49542278885378, 1,            1
##FIRST=     16045.7642231865, 0,            0
##LAST=      -16421.768244346, 0,            0
##MIN=       -16421.768244346, -438815840,   0
##MAX=       16045.7642231865, 133589986,    0
$$ Real data points
##PAGE= N=1
##DATA TABLE= (X++(R..R)), XYDATA
$$ [...]
7401B9427223j3423821o468627J929826N11317o328389o964198j522556N04858
$$ 29427223 16003402 9534775 11464601 11975918 5647529 -1316669 -2839225 -2334367
7393b334367k361059k325746K486444M774598J535129j158036J05396M25145l096693
$$ -2334367 -4695426 -7021172 -4534728 239870 1774999 616963 722359 1147504 -1949189
7384a949189n292135k452130Q34655K38806q18570J367924L156993O41321k104030
$$ -1949189 -7241324 -9693454 -8858799 -8619993 -9438563 -8070639 -4913646 -4272325 -6376355
7375f376355J34012L973420K984015j405028l225871k486017l099262l253514
$$ -6376355 -6242343 -2268923 715092 -689936 -3915807 -6401824 -9501086 -12754600
7367a2754600J859909Q976508R172761K113716k366778Q24659N230794M487218
$$ -12754600 -10894691 -1918183 7254578 9368294 7001516 7826175 13056969 17544187
7359A7544187J632985J580151K092681j232147o680345r519730r224023q025486
$$ 17544187 19177172 20757323 22850004 21617857 14937512 5417782 -3806241 -11831727
7351a1831727o005749k892677j156130j980093j500155L459877R011804R305173
$$ -11831727 -17837476 -20730153 -21886283 -23866376 -25366531 -21906654 -12894850 -3589677
7343c589677N217539J979750P37796r58975k412952q31863K023293J757596m43982
$$ -3589677 1627862 3607612 4345408 3386433 973481 141618 2164911 3922507 3478525
7334C478525P27396M668226M674143m02751k944392J253967N627736L161460k698479
$$ 3478525 4205921 8874147 13548290 13145539 10201147 11455114 17082850 20244310 17545831
7325A7545831m218536j306821K60827q72759r52423Q27723R26855j848606m474692
$$ 17545831 13327295 12020474 12281301 11408542 10456119 11283842 12210697 10362091 5887399
7316E887399n143672n178776m784091k049242K549916N316263M507165K257657
$$ 5887399 743727 -4435049 -9219140 -11268382 -8718466 -3402203 1104962 3362619
7308C362619J98002k337023m307730k404594K747828M786821Q3245n979603n974069
$$ 3362619 3560621 1223598 -3084132 -5488726 -2740898 2045923 2129168 -3850435 -9824504
7299i824504o37265L145118K485593R36713J630807L663084N606984P204634O407571
$$ -9824504 -10461769 -7316651 -4831058 -3894345 -2263538 1399546 7006530 14211164 20618735
7290B0618735J80714r181326j3340954p473414K701173P695538N875990L663940
$$ 20618735 20799449 11618123 -1722831 -9196245 -6495072 1200466 7076456 10740396
7282A0740396N126122O569649K945708m253766q493004o147522m15436K807041
$$ 10740396 15866518 22436167 25381875 21128109 12635105 6487583 6072147 8879188
7274H879188J402467j482134j966046j82377N70051j176908l063691k769113j704159
$$ 8879188 10281655 8799521 6833475 6651098 7221149 6044241 2980550 211437 -1492722
7265a492722k571438m546039l989690L8317M080597N107305M232095L702722K639811
$$ -1492722 -4064160 -8610199 -12599889 -12561572 -8480975 -3373670 858425 4561147 7200958
7256G200958j036288n529822n841601m18837N851450P297495M160668J151039
$$ 7200958 6164670 634848 -5206753 -5625590 225860 7523355 11684023 12835062
7248A2835062N75664K46149j639377l255383k826941k557820n304538q780092
$$ 12835062 13410726 13656875 12017498 8762115 5935174 3377354 -1927184 -10707276
7240a0707276p342600P5403P635349R556837O231393J695110j747017l753839
$$ -10707276 -18049876 -17974473 -10339124 -782287 5449106 7144216 5397199 1643360
7232A643360l654358j454984O01175Q47956J060799L068174M276120J142812l940662
$$ 1643360 -2010998 -3465982 -2864807 -2016851 -956052 2112122 6388242 7531054 3590392
7223C590392m759767o23492K101412m44093l961136l005435J053884L242234K559296
$$ 3590392 -1169375 -1792867 308545 -135548 -4096684 -7102119 -6048235 -2806001 -246705
7214b46705J633896J226180N925j396995q03325J298859K047364J016686J117726
$$ -246705 1387191 2613371 2619296 1222301 418976 1717835 3765199 4781885 5899611
7205E899611L843664O512479N465563L27415n478679p394105l529902K635189
$$ 5899611 9743275 16255754 21721317 22048732 16570053 9175948 5646046 8281235
7197H281235M573139j2564n661057n920742j958883O1580q64362O57082O175170
$$ 8281235 12854374 12841810 7180753 1260011 -698872 -637292 -1501654 -844572 5330598
7188E330598Q553164J829713q688102j2190716o245664J084712L047984K318581
$$ 5330598 13883762 15713475 7025373 -5165343 -11411007 -10326295 -7278311 -4959730
7180d959730M692498Q906037P753530j102068j0035718r971261j909725L999611
$$ -4959730 -267232 8638805 16392335 15290267 5254549 -4716712 -6626437 -2626826
7172b626826J287664m934371n510236M93378N542116M317993n50826l941196m356481
$$ -2626826 -1339162 -6273533 -11783769 -11290391 -5748275 -1430282 -1981108 -5922304 -10278785
7163a0278785k671076O65444M026656L871227n56269m387050k853043K190128
$$ -10278785 -12949861 -12284417 -8257761 -4386534 -4942803 -9329853 -12182896 -9992768
7155i992768N258381M713708K907212P46435k392957m113090o32689N978613Q183446
$$ -9992768 -4734387 -20679 2886533 3632968 1240011 -2873079 -3505768 2472845 10656291
7146A0656291L071541l171930m273896k548818l821878p338007o793114j83901
$$ 10656291 13727832 10555902 6282006 3733188 -88690 -7426697 -14219811 -14403712
7138a4403712O940190Q508074M166183j917869n029052k626540L164598N615433
$$ -14403712 -7463522 1044552 5210735 3292866 -1736186 -4362726 -1198128 4417305
7130D417305J78835q172052r253621q59565P767106Q576163N000842M432864N760422
$$ 4417305 4596140 -3575912 -12829533 -13689098 -5921992 2654171 7655013 12087877 17848299
7121A7848299K532388m249893o334879j946673L78620m437007q950340m533967
$$ 17848299 20380687 16130794 9795915 7849242 8227862 3790855 -5159485 -9693452
7113i693452M647060P588446K755195j009249Q93398K860923R9774k885869J6182
$$ -9693452 -5046392 2542054 5297249 4288000 5181398 8042321 8142095 5256226 5272408
7104E272408O211120Q108411L942864j258585m038762n886607q060779q460263
$$ 5272408 11483528 19591939 23534803 22276218 18237456 12350849 4290070 -4170193
7096d170193n656851k221375j347192k429605k503731o60822J354387K282282
$$ -4170193 -9827044 -12048419 -13395611 -15825216 -18328947 -18989769 -17635382 -15353100
7088a5353100K910786M379925O373538P314601N671338J385335l159849m375435
$$ -15353100 -12442314 -8062389 -1688851 5625750 11297088 12682423 9522574 5147139
7080E147139j299704K358079K318763k23074R9054M379394O292715Q59273o775877
$$ 5147139 3847435 6205514 8524277 8301203 8400257 12779651 19072366 19931639 13155762
7071A3155762o882897J373998Q099150N659742k173395p053884o906674n281151
$$ 13155762 6272865 7646863 15746013 21405755 19232360 12178476 5271802 -9349
7063i349l713872p99445K649819L349037P14613k082501k578605r64941J989383
$$ -9349 -3723221 -4522666 -1872847 1476190 2190803 108302 -2470303 -3435244 -1445861
7054a445861M836977L922389k681703r413614p598213K482876R994380P343284
$$ -1445861 3391116 7313505 4631802 -4781812 -12380025 -9897149 97231 7440515
7046G440515j53072l061108j060408q23605m173954o193229m336552j916272j193353
$$ 7440515 7287443 4226335 3165927 2342322 -1831632 -8024861 -12361413 -14277685 -15471038
7037a5471038M37115M463673O748228L181942l471735o690161m283298N53289
$$ -15471038 -15033923 -10570250 -3822022 -640080 -4111815 -10801976 -15085274 -14531985
7029a4531985M962636Q740645J0872363Q488243J598715m434534m584749o91715
$$ -14531985 -9569349 -828704 10043659 18531902 20130617 15696083 11111334 10419619
7021A0419619J134868j155964l632935l001751j023248o91009j718484k432871
$$ 10419619 11554487 10398523 6765588 3763837 2740589 2049580 331096 -2101775
7013b101775k943799l192577q55543M623826Q357932N434402j427077m910663
$$ -2101775 -5045574 -8238151 -9093694 -4469868 3888064 9322466 7895389 2984726
7005B984726k886585M29858K386997M263479N332410K136013l973109n806514
$$ 2984726 98141 527999 2914996 7178475 12510885 14646898 10673789 4867275
6997D867275o25797M948008M668079J171460l62406r46875l522645n107990j216488
$$ 4867275 4241478 9189486 13857565 15029025 14666619 13719744 10197099 5089109 3872621
6988C872621N065994O381011J748260l250761n478082o307453n844318k611099
$$ 3872621 8938615 15319626 17067886 13817125 8339043 2031590 -3812728 -6423827
6980f423827J122291R44679k165041k572453J101181M408552N129643N849234
$$ -6423827 -5301536 -4356857 -6521898 -9094351 -7993170 -3584618 1545025 7394259
6972G394259P122289N435543N21126k348500r12566l57431m810968r876852q756811
$$ 7394259 14516548 19952091 20473217 18124717 17212151 16854720 12043752 2166900 -6589911
6963f589911j882295M367359N713012K713957j985879n373564m955674j161285
$$ -6589911 -8472206 -4104847 1608165 4322122 2336243 -3037321 -7992995 -9154280
6955i154280K335542K527423j78012l689433n999627m949918q0826M760985N229510
$$ -9154280 -6818738 -4291315 -4469327 -8158760 -14158387 -19108305 -19189131 -14428146 -9198636
6946i198636L375558M927413Q798066P008072j919232p849498l025056O064859
$$ -9198636 -5823078 -895665 7902401 14910473 12991241 5141743 2116687 8181546
6938H181546Q108335K528801k476544l008606j877373q69653O98362J302485p96107
$$ 8181546 16289881 18818682 16342138 13333532 11456159 10586506 11284868 12587353 11791246
6929A1791246k029541J942608O983911M491001m821201j0018420n196639K359713
$$ 11791246 9761705 11704313 18688224 23179225 18358024 8339604 3142965 5502678
6921E502678L109973k119482n200935k007649L962668O898194M324935j199771
$$ 5502678 8612651 6493169 1292234 -715415 3247253 10145447 14470382 13270611
6913A3270611m443968k905085L2001m36934l639146m610247j705046J555518K579133
$$ 13270611 8826643 5921558 5953559 5516625 1877479 -2732768 -4437814 -2882296 -303163
6904c03163K778888L489718L584563K786214K899547L899348L030418k63637k694922
$$ -303163 2475725 5965443 9550006 12336220 15235767 19135115 22165533 21901896 19206974
6895A9206974k447818j945127l092003m041425l288623k761649l817392m130330
$$ 19206974 16759156 14814029 11722026 7680601 4391978 1630329 -2187063 -6317393
6887f317393j858394P89568J536435J928730L575838M157887J552574j172036
$$ -6317393 -8175787 -7386219 -5849784 -3921054 -345216 3812671 5365245 4193209
6879D193209K38703M372444N951118K965632k102958o573579q891098p247533
$$ 4193209 4431912 8804356 14755474 17721106 15618148 9044569 153471 -7094062
6871g094062j537915M068162M829694J350265j906979l116698l825584l888904
$$ -7094062 -8631977 -4563815 265879 1616144 -290835 -3407533 -7233117 -11122021
6863a1122021q58619M685573P783072N077502q87223m990538m815998j577633
$$ -11122021 -11980640 -7295067 488005 5565507 4678284 -312254 -5128252 -6705885
6855f705885J829742K674312M93198j736549o32085K775646L809989P12831k435127
$$ -6705885 -4876143 -2201831 -1708633 -3445182 -4077267 -1301621 2508368 3221199 786072
6846G86072j332080K389698L495532M56615k750783k501489m16045n11499k962943
$$ 786072 -546008 1843690 5339222 5795837 3045054 543565 127520 -383979 -3346922
6837c346922l703447p41148K233839J118734k003874j781862J749663K950381
$$ -3346922 -7050369 -7791517 -5557678 -4438944 -6442818 -8224680 -6475017 -3524636
6829c524636J41749q50649L523471P052052K604595n414409n904945K513475Q671404
$$ -3524636 -3382887 -4233536 -710065 6341987 8946582 3532173 -2372772 140703 8812107
6820H812107M500208m203497p006567k945257M51220j176982m591236n457432
$$ 8812107 13312315 9108818 2102251 -843006 -391786 -1568768 -6160004 -11617436
6812a1617436m050639l179448l579743l367704j155986J681684K580621J602817
$$ -11617436 -15668075 -18847523 -22427266 -25794970 -26950956 -25269272 -22688651 -21085834
6804b1085834K122374N915407Q986023N874978j974778o606108l779472J675680
$$ -21085834 -18963460 -13048053 -4062030 1812948 -161830 -6767938 -10547410 -8871730
6796h871730L525576K669895L441395M986286K813452k294592l836544O28925
$$ -8871730 -5346154 -2676259 765136 5751422 8564874 6270282 2433738 3062663
6788C062663N135821L671931j548999l966325j811920Q60218P44008j302455l199544
$$ 3062663 8198484 11870415 10321416 6355091 4543171 5403389 6147397 4844942 1645398
6779A645398m263429m049729j691027J948632L733234K010059n67036l67973J904681
$$ 1645398 -2618031 -6667760 -8358787 -6410155 -2676921 -666862 -1233898 -1601871 302810
6770C02810K089395j074418l516552j409387L148452M641524J242258l298234
$$ 302810 2392205 1317787 -2198765 -3608152 -459700 4181824 5424082 2125848
6762B125848m648624k333710J051418K798264J784706o26644q87064L103856P906959
$$ 2125848 -2522776 -4856486 -3805068 -1006804 777902 151258 -735806 2368050 10275009
6753A0275009P097651l51442p272863o758430r37809K462547O97630j470597K75470
$$ 10275009 17372660 17021218 9748355 2989925 2052116 4514663 5212293 3741696 4017166
6744D017166L946540M898191J926462k364758m979065m495073j508801J256880
$$ 4017166 7963706 12861897 14788359 12423601 7444536 2949463 1440662 2697542
6736B697542R39696j969887l832367k766443j143173j534414k721087k288909
$$ 2697542 3637238 1667351 -2165016 -4931459 -6074632 -7609046 -10330133 -12619042
6728a2619042r04522o99135j190570o86504l74505k266995l580617J001006R921592
$$ -12619042 -13523564 -14222699 -15413269 -16099773 -16474278 -18741273 -22321890 -21320884 -11399292
6719a1399292J3431203N607208o463551j0601411m334084L494442N015787J748679
$$ -11399292 2031911 7639119 1175568 -9425843 -13759927 -10265485 -5249698 -3501019
6711c501019k47965J189553L470580L919417K288935k06622k148195k631295k072758
$$ -3501019 -3748984 -2559431 911149 4830566 7119501 6912879 4764684 2133389 60631
6702F0631j994371l333291n460518p009654o635657l064419L572177R823043J0741327
$$ 60631 -1933740 -5267031 -10727549 -17737203 -24372860 -27437279 -23865102 -14042059 -3300732
6693c300732N340435j468324m165045k344054N80592K431722L310730L063797
$$ -3300732 2039703 571379 -3593666 -5937720 -5357128 -2925406 385324 3449121
6685C449121J216850q70652j085715m4800l84814k041226j575791K419650O331071
$$ 3449121 4665971 3795319 2709604 2664804 2279990 238764 -1337027 1082623 7413694
6676G413694O040127J994459k605507o508158j0188053j2217580r574691k191183
$$ 7413694 13453821 15448280 12842773 6334615 -3853438 -16071018 -25645709 -27836892
6668b7836892N308085P713137M175715j359291l924952j763065K281151L538698
$$ -27836892 -22528807 -14815670 -10639955 -11999246 -15924198 -17687263 -15406112 -11867414
6660a1867414M46089l441622l200667J875784P418889Q732971N494479J482807
$$ -11867414 -11421325 -14862947 -18063614 -16187830 -8768941 -35970 5458509 6941316
6652F941316L10494J877240L035095J635033o77679n93390K260619M541172L518073
$$ 6941316 7251810 9129050 12164145 13799178 13121499 12528109 14788728 19329900 22847973
6643B2847973L54599k107919l094292l667056m219405m391679m478262m624400
$$ 22847973 23202572 21094653 18000361 14333305 10113900 5722221 1243959 -3380441
6635c380441l460565j11035L002049K337424j584634l918817j129160N130703
$$ -3380441 -6841006 -6952041 -3949992 -1612568 -3197202 -7116019 -8245179 -3114476
6627c114476J0043858R530622K488857p777285j4109864j1124684j717633N082477
$$ -3114476 6929382 16460004 18948861 11171576 -2938288 -14062972 -15780605 -10698128
6619a0698128M268711j53426j885796l06076J197431J520916K198312L163419
$$ -10698128 -6429417 -6582843 -8468639 -8774715 -7577284 -6056368 -3858056 -694637
6611f94637K489727J63467j316387o34100L75484q40555m235702o500957l861410
$$ -694637 1795090 1958557 642170 8070 383554 -457001 -4692703 -11193660 -15055070
6602a5055070L209370Q577545O874369J503835J389541P947228J1389573M392460
$$ -15055070 -11845700 -3268155 3606214 5110049 6499590 14446818 25836391 30228851
6594C0228851o565358j0427611p196753n274285o308101l675266M008253R173941
$$ 30228851 23663493 13235882 6039129 764844 -5543257 -9218523 -5210270 3963671
6586C963671P899350N900546P328748P073511O94902o082556n705952n33341J849588
$$ 3963671 11863021 17763567 25092315 32165826 32860728 26778172 21072220 20538879 22388467
6577B2388467K65390j218731k131762m796254p485183o742171m525238m892041
$$ 22388467 22653857 21435126 19303364 14507110 7021927 279756 -4245482 -9137523
6569i137523n441366r13152N775429N759555j951237q305682p542374l536906
$$ -9137523 -14578889 -15492041 -9716612 -3957057 -5908294 -14213976 -21756350 -25293256
6561b5293256l84496L802827R447622J0952021N740956L56130O37589K246606
$$ -25293256 -25677752 -21874925 -12427303 -1475282 4265674 4621804 5259393 7505999
6553G505999j362938o939291o231526O20548N550783N010818L429367M146302
$$ 7505999 6143061 -796230 -7027756 -6407208 -856425 4154393 7583760 11730062
6545A1730062M766241L140159J328921J059981L52034k633425o210244p897122
$$ 11730062 16496303 19636462 20965383 22025364 22377398 19743973 13533729 5636607
6537E636607p392775n192632j448664K185946K850031N07831j323302p31092l6581
$$ 5636607 -1756168 -6948800 -8397464 -6211518 -3361487 -2853656 -4176958 -4908050 -4944631
6528d944631r73671q65212K726541O512262N540603J147844p23013R62793O59746
$$ -4944631 -5918302 -6783514 -4056973 2455289 7995892 9143736 8420723 9383516 10043262
6519A0043262l910713o457885j554081N314467M363421l835130q684168n330280
$$ 10043262 6132549 -325336 -1879417 3435050 7798471 3963341 -4720827 -10051107
6511a0051107j198168k782084m534180J214035R566011R059458j69127n751842
$$ -10051107 -11249275 -14031359 -18565539 -17351504 -7785493 1273965 1104838 -4647004
6503d647004j581599M113262K868941j984730l487182k545920l195081l067009
$$ -4647004 -6228603 -2115341 753600 -1231130 -4718312 -7264232 -10459313 -13526322
6495a3526322J959072P896165P240047J292290j474738J350358L587259J700918
$$ -13526322 -11567250 -3671085 3568962 4861252 3386514 4736872 8324131 10025049
6487A0025049k74271Q50309K084908P08246o84032M45494J689091L59443j528120
$$ 10025049 9750778 10601087 12685995 13394241 12710209 13155703 14844794 15204237 13676117
6478A3676117j150368n988r93723l269597l800768j760549J653394N296910P198413
$$ 13676117 12525749 12519761 11526038 8256441 4455673 2695124 4348518 9645428 16843841
6469A6843841M579687j889597o614432n569884j872872r66039k568997k118163
$$ 16843841 21423528 19533931 12919499 7349615 5476743 4510704 1941707 -176456
6461a76456J295300L669023K636144M00542o75058j008032p92143J780090O473770
$$ -176456 1118844 4787867 7424011 7824553 7149495 6141463 5349320 7129410 13603180
6452A3603180Q369191L302198n243844q793260m074902K862442M599327J486072
$$ 13603180 21972371 25274569 20030725 11237465 7162563 10025005 14624332 16110404
6444A6110404n98076K20188k96288m405417p724560n953070j770744r3998J82601
$$ 16110404 15512328 15732516 15436228 11030811 3306251 -2646819 -4417563 -4511561 -4328960
6435d328960L343368P655956O629604r1582m696845k572558J105557P0845l563525
$$ -4328960 -985592 6670364 13299968 13208386 8511541 5938983 7044540 7115385 3551860
6426C551860l638099N54059M507762N286346L124597j211243n806843o572144
$$ 3551860 -86239 467820 4975582 10261928 13386525 12175282 6368439 -203705
6418b03705j868572L504155L866078P23299J24924L134794M737076K238925r99746
$$ -203705 -2072277 1431878 5297956 6021255 6146179 9280973 14018049 16256974 15257228
6409A5257228j547871p25176j328925l181891m202807l538401j919651m29564
$$ 15257228 13709357 12984181 11655256 8473365 4270558 732157 -1187494 -1617058
6401a617058K89922P56399K183668L829624K362385l320126q275212o598697N11908
$$ -1617058 -1327136 -570737 1612931 5442555 7804940 4484814 -3790398 -10389095 -9877187
6392i877187O256593P385278O738232O297914L598040k633337q207970q289955
$$ -9877187 -3620594 3764684 10502916 16800830 20398870 17765533 9557563 1267608
6384A267608l350981K370173N674402N581031K651314n87933j158074M98500Q14652
$$ 1267608 -2083373 286800 5961202 11542233 14193547 13605614 12447540 12946040 13760692
6375A3760692j323636k837091k050123j714067l656996m860777k705907J8400
$$ 13760692 12437056 9599965 7549842 5835775 2178779 -2681998 -5387905 -5369505
6367e369505l3204p59557J040732K810461M84912k786728j1762Q001634J2179578
$$ -5369505 -5402709 -6162266 -5121534 -2311073 -1826161 -4612889 -4624651 3376983 15556561
6358A5556561P634555l80671m984258n571543m504000k316028p9993q25698l975111
$$ 15556561 23191116 22810445 17826187 12254644 7750644 5434616 5354623 4528925 553814
6349E53814l452376L376740R511675P292193k51458m129519k626452j730307l753665
$$ 553814 -2898562 478178 9989853 17282046 17030588 12901069 10274617 8544310 4790645
6340D790645m421186k015950o62163j904283j152770L407809N788523J551300
$$ 4790645 369459 -1646491 -2308654 -4212937 -5365707 -1957898 3830625 5381925
6332E381925m140936m318629p77064M40135l11248J322232L614569P02376o080824
$$ 5381925 1240989 -3077640 -3854704 -3414569 -3725817 -2403585 1210984 1913360 -4167464
6323d167464q385513l659367J111584J061728L65000L362934O414511M371076
$$ -4167464 -12552977 -16212344 -15100760 -14039032 -13674032 -10311098 -3896587 474489
6315D74489n44190k464474m87372J896687K656597J655187j460112n124431n034452
$$ 474489 -69701 -2534175 -3021547 -1124860 1531737 3186924 1726812 -3397619 -8432071
6306h432071j68530M075263L678515K484681M822187O587695J994142m684676
$$ -8432071 -8600601 -4525338 -846823 1637858 6460045 13047740 15041882 10357206
6298A0357206m317312J909164L536861k411596o804244l311557K460331L486750
$$ 10357206 6039894 7949058 11485919 9074323 2270079 -1041478 1418853 4905603
6290D905603J775207K097697K983440J193935p71569Q00099L216687J670692k162975
$$ 4905603 6680810 8778507 11761947 12955882 12184313 12984412 16201099 17871791 15708816
6281A5708816l013868j063160j009327l581666m813735l197904j270763j51899
$$ 15708816 12694948 11631788 10622461 7040795 2227060 -970844 -2241607 -2393506
6273b393506J518677K839766Q01382l557952m667325l33357M457997M476048J392999
$$ -2393506 -874829 1964937 2766319 -791633 -5458958 -5792315 -1334318 3141730 4534729
6264D534729O96397L717337O161341M094912j067333m296653k878438L47905N55063
$$ 4534729 5231126 8948463 15109804 19204716 18137383 13840730 10962292 11310197 11865260
6255A1865260k518249l688591P05375P079974Q539526L523822k360965l109474
$$ 11865260 9347011 5658420 6363795 13443769 21983295 25507117 23146152 20036678
6247B0036678J405462O163840O281225J403411m014371n096140j919267P25479
$$ 20036678 21442140 27605980 33887205 35290616 31276245 26180105 24260838 24986317
6239B4986317k30334k367125k438146j893428m058140p801238q526868m729627
$$ 24986317 24755983 22388858 19950712 18057284 13999144 6197906 -2328962 -7058589
6231g058589O12640M666006O560145N232226N53338l225161q26283N767332P866614
$$ -7058589 -6445949 -1779943 4780202 10012428 10565766 7340605 6514322 12281654 20148268
6222B0148268J454545p006995r445981o164165k662990o40928K080176M994121
$$ 20148268 21602813 14595818 5149837 -1014328 -3677318 -4318246 -2238070 2756051
6214B756051M590864O21532k470226j600168J159784K114523L35102k733647n430090
$$ 2756051 7346915 7968447 5498221 3898053 5057837 7172360 7507462 4773815 -656275
6205f56275o100923l381295J737624N447587M753496J093699j302264o27687M41212
$$ -656275 -6757198 -10138493 -8400869 -2953282 1800214 2893913 1591649 963962 1405174
6196A405174j428170n415936p112809m085473O91743K449105P92602j25350K133482
$$ 1405174 -22996 -5438932 -12551741 -16637214 -15945471 -13496366 -12703764 -12829114 -10695632
6187a0695632M742995M185768J853063J609601K999776J434392m055453p840110
$$ -10695632 -5952637 -1766869 86194 1695795 4695571 6129963 2074510 -5765600
6179e765600n321453M4696J637099p16057j395259J409391K949441L47865k199076
$$ -5765600 -11087053 -11042357 -9405258 -10121315 -11516574 -10107183 -7157742 -6809877 -9008953
6170i008953k96741L525270M554420L771895M745222N499342J133134o251491
$$ -9008953 -9305694 -5780424 -1226004 2545891 7291113 12790455 13923589 7672098
6162G672098q333670k641024L578146M019278R09904j226078k284281k644894
$$ 7672098 -661572 -3302596 275550 4294828 5204732 3978654 1694373 -950521
6154i50521M27501O410303P908027Q72384o843224n630283J415995L658399n41505
$$ -950521 -523020 5887283 13795310 14667694 7824470 2194187 3610182 7268581 6727076
6145F727076l037458l73812K116390J455509J283956K561178O66471m240732m234963
$$ 6727076 3689618 3315806 5432196 6887705 8171661 10732839 11399310 7158578 2923615
6136B923615L265121Q666396L704258n968907r631815o421793k955982j497419
$$ 2923615 6188736 14855132 18559390 12590483 2958668 -3463125 -6419107 -7916526
6128g916526L23247J913327J139082O90796L987934O691050J727894p941787j1238971
$$ -7916526 -7593279 -5679952 -4540870 -3850074 137860 6828910 8556804 615017 -10623954
6119a0623954m698095K615414K309575k955617n447644k262914M010791R099533
$$ -10623954 -15322049 -12706635 -10397060 -13352677 -18800321 -21063235 -17052444 -7952911
6111g952911Q714608J678729n958844n374207L409146R779171O013413k821574
$$ -7952911 761697 2440426 -3518418 -8892625 -5483479 4295692 10309105 7487531
6103G487531o763058l714821R05812K997351K286500q26824m772560n354983q26296
$$ 7487531 724473 -2990348 -2084536 912815 3199315 2372491 -2400069 -7755052 -8581348
6094h581348L369906J265610l665147k658407M288052P000608L65599p214704
$$ -8581348 -5211442 -3945832 -7610979 -10269386 -5981334 1019274 1384873 -5829831
6086e829831o125329J95083J291191l590618m438034L246195J0249316O634896
$$ -5829831 -11955160 -11760077 -10468886 -14059504 -18497538 -15251343 -5002027 1632869
6078A632869l322757o564829Q16665Q925425Q404654K290194o63256Q25186Q44084
$$ 1632869 -1689888 -8254717 -7438052 1487373 9892027 12182221 11518965 12344151 13188235
6069A3188235k328322k903896K657182R046731R376497M602982N69577j429170
$$ 13188235 10859913 7956017 10613199 19659930 29036427 33639409 34208986 32779816
6061C2779816m945389j0122461j1767904p452473k159665j608428m712961o231197
$$ 32779816 27834427 17711966 5944062 -1508411 -3668076 -5276504 -9989465 -16220662
6053a6220662m018767J31328M489979P905799P948297L359978k140801l223822
$$ -16220662 -20239429 -20108101 -15618122 -7712323 235974 3595952 1455151 -1768671
6045a768671l06389J049310j381350l620490k412191K78840J953919L355248M352322
$$ -1768671 -2075060 -1025750 -2407100 -6027590 -8439781 -8160941 -6207022 -2851774 1500548
6036A500548J808429l662921m484199L468122J1754476R265535j481936p520201
$$ 1500548 3308977 -353944 -4838143 -1370021 10384455 19649990 18168054 10647853
6028A0647853m021530O96366R8011j586635K67797J405185k834919p385260m715016
$$ 10647853 6626323 7322689 7420700 5834065 6101862 7507047 4672128 -2713132 -7428148
6019g428148K543896N226528J355423k244594j240047J046888O16067j333292
$$ -7428148 -4884252 342276 1697699 -546895 -1786942 -740054 -123987 -1457279
6011a457279j389713J280235M517583N067787J042390n186580p844617m251698
$$ -1457279 -2846992 -1566757 2950826 8018613 9061003 3874423 -3970194 -8221892
6003h221892J497015M427317N244875O621554O455658J403513n085116n906440
$$ -8221892 -6724877 -2297560 2947315 9568869 16024527 17428040 12342924 6436484
5995F436484j060085K101159o0217l169055k838196l53133J323012J239420j216547
$$ 6436484 5376399 7477558 7417341 4248286 1410090 1056957 2379969 3619389 2402842
5986B402842n631364p245959j312659P858615J0088155L817092j204716Q26646
$$ 2402842 -3228522 -10474481 -11787140 -3928525 6159630 9976722 8772006 9598652
5978I598652L300545l11444m829991k708101K475396K021632l279208n030157
$$ 9598652 12899197 12587753 7757762 5049661 7525057 9546689 6267481 1237324
5970A237324j162243J950279O20310j623837j087553J576445M316545N337015
$$ 1237324 75081 2025360 2645670 1021833 -65720 1510725 5827270 11164285
5962A1164285K369771l946161p320584k977656L923822M444234q90104l623516
$$ 11164285 13534056 9587895 2267311 -710345 3213477 7657711 6767607 3144091
5954C144091j608181j608010o132518q238185l649462J497372J063490j040582
$$ 3144091 1535910 -72100 -6204618 -14442803 -18092265 -16594893 -15531403 -16571985
5946a6571985J467453O005362N949528K311588J850883N589708P400437L951992
$$ -16571985 -15104532 -9099170 -3149642 -838054 1012829 6602537 14002974 17954966
5938A7954966q95398k824129k641482l068132l863727k715021P66659L769243
$$ 17954966 17059568 14235439 11593957 8525825 4662098 1947077 2713736 6482979
5930F482979L041268j027652l621809q12012M268251M164158k427403p404755
$$ 6482979 9524247 8496595 4874786 4062774 8331025 12495183 10067780 2663025
5922B663025m152007K523584L172680k265453m552477Q71259P394925P118881
$$ 2663025 -1488982 1034602 4207282 1941829 -2610648 -1739389 5655536 12774417
5914A2774417J168499l779998m879507m308063l744027k590211r36390o8606L46425
$$ 12774417 13942916 10162918 5283411 975348 -2768679 -5358890 -6295280 -6363886 -6017461
5905f017461K256075N487903O749422L877036p96358l038769j546158J373931
$$ -6017461 -3761386 1726517 8475939 12352975 11556617 8517848 6971690 8345621
5897H345621L000265K326106l12882l512961m713538k222934J948776L561779
$$ 8345621 11345886 13671992 13359110 9846149 5132611 2909677 4858453 8420232
5889H420232J630156L0544J761539M155973K923806j078086l392172l317556m581271
$$ 8420232 10050388 10080932 11842471 15998444 18922250 17844164 14451992 11134436 6553165
5880F553165p940294q431122k795949M485221O590534L379092R19355K974508
$$ 6553165 -1387129 -9818251 -12614200 -8128979 -1538445 1840647 2760002 5734510
5872E734510O611908O556049J446973m869262p143685l783491J363716K941412
$$ 5734510 12346418 18902467 20349440 15480178 8336493 4553002 5916718 8858130
5864H858130m225l516994m226307k716547o76959J714832L497854J822790l350285
$$ 8858130 8853905 5336911 1110604 -1605943 -2282902 -568070 2929784 4752574 1402289
5855A402289o660358l852537J642931L575574K150001K431980M661493L275944
$$ 1402289 -5258069 -9110606 -7467675 -3892101 -1742100 689880 5351373 8627317
5847H627317l380032r093549q307090l244052P72197K570113L904753M687063
$$ 8627317 5247285 -3846264 -12153354 -15397406 -14625209 -12055096 -8150343 -3463280
5839c463280L737501K003089J247548J089293L00816n68707m67128R9708O86100
$$ -3463280 274221 2277310 3524858 4614151 4914967 4346260 3879132 3978840 4664940
5830D664940K284266M462835M001659j07786l254099j434758J601842p33060p127957
$$ 4664940 6949206 11412041 15413700 15305914 12051815 10617057 12218899 11485839 4357882
5821D357882r117665l005406N214009Q457060O379145K397864j418698l153729
$$ 4357882 -4759783 -7765189 -2551180 5905880 12285025 14682889 13264191 10110462
5813A0110462m5119O649300R935437N454843j609480l454588o63221J42682k281566
$$ 10110462 10065343 16714643 26650080 32104923 30495443 27040855 26377634 26520316 24238750
5804B4238750k500110J216834L135360o26180n762230o750387m568626k690992
$$ 24238750 21738640 22955474 26090834 25464654 19702424 12952037 8383411 5692419
5796E692419k67056M691334Q785096O681714m81271o465765q860022j0253637
$$ 5692419 5425363 10116697 18901793 25583507 25102236 18636471 9776449 -477188
5788d77188j0751960o621210J762648P412237N790561J133763k79557J272193
$$ -477188 -11229148 -17850358 -16087710 -8675473 -2884912 -1751149 -2030706 -758513
5780g58513J586476J10236k43576J362951L015011L491779K568424l95467m350466
$$ -758513 827963 938199 694623 2057574 5072585 8564364 11132788 10737321 6386855
5771F386855n081215k42814N896730P440845M852407K709184J306429k709115
$$ 6386855 1305640 1062826 6959556 14400401 19252808 21961992 23268421 20559306
5763B0559306p854833p735814j143222M889019N112956K870350L162011M722006
$$ 20559306 12704473 4968659 3825437 8714456 13827412 16697762 19859773 24581779
5755B4581779L798380J143705j40691l74622j762682l684981m325248m702303
$$ 24581779 28380159 29523864 29383173 29008551 27245869 23560888 19235640 14533337
5747A4533337o363574p224326m674555r71398j57506q84596J850545P951657J0946442
$$ 14533337 8169763 945437 -3729118 -4700516 -4858022 -5742618 -3892073 4059584 15006026
5738A5006026O648143j557199p616714r169871p428880m085244l63298K939320
$$ 15006026 21654169 20096970 12480256 3310385 -4118495 -8203739 -8567037 -5627717
5730e627717N846219Q286864Q688727N427742l86992n641967q394578q260105
$$ -5627717 218502 8505366 17194093 22621835 22234843 16592876 8198298 -61807
5722f1807m834737J027563N292271M214456k55558k539595j153934q5099j742382
$$ -61807 -4896544 -3868981 1423290 5637746 5382188 2842593 1688659 1603560 -138822
5713a38822l244900j683410J043894J493092p6355n34056J606431M441193M630320
$$ -138822 -3383722 -5067132 -4023238 -2530146 -2606501 -3140557 -1534126 2907067 7537387
5704G537387O56034m783711o494944k952377R50728N96595j340309J49649K835972
$$ 7537387 8193421 3409710 -3085234 -6037611 -5086883 -4490288 -5830597 -5680948 -2844976
5695b844976N29109m815495m093923L904753Q824733M642965r15392K69301L585089
$$ -2844976 -2315867 -7131362 -11225285 -7320532 1504201 6147166 5231774 5501075 9086164
5686I086164J378336k500004K15364O308598N692775r03124k730213K495112M584113
$$ 9086164 10464500 7964496 8179860 14488458 20181233 19278109 16547896 19043008 23627121
5677B3627121j779278q189338o235183M11013L958439L760167K636118n05611
$$ 23627121 21847843 13658505 7423322 7834335 11792774 15552941 18189059 17683448
5669A7683448o420970r625850n076715K867463N744450K679609k22000j20250
$$ 17683448 11262478 1636628 -3440087 -572624 5171826 7851435 7629435 7509185
5661G509185J01997j157431j622229k31607Q44122O51927J335067L773859M824732
$$ 7509185 7611182 6453751 4831522 4599915 5444037 6095964 7431031 11204890 16029622
5652A6029622J017662o796576j3652830j4308391p126285M102221J2308842J2870803
$$ 16029622 17047284 10250708 -3402122 -17710513 -24836798 -20734577 -8425735 4445068
5644D445068P430287J291794k015793k458124j426549j27792Q44582K099329M581989
$$ 4445068 11875355 13167149 11151356 8693232 7266683 7138891 7983473 10082802 14664791
5635A4664791O790040N052732j010829n741342l881953J849415M013862N47817
$$ 14664791 21454831 26507563 25496734 19755392 15873439 17722854 21736716 22284533
5627B2284533l188657k828294n32143k62200j757334k329453j878444k532194
$$ 22284533 19095876 16267582 15735439 15473239 13715905 11386452 9508008 6975814
5619F975814m392043m801096k152559J562797K920228J119361q57238M55550M570068
$$ 6975814 2583771 -2217325 -4369884 -2807087 113141 1232502 375264 830814 5400882
5610E400882O800433L372310l760790q469412o742102m20939N163779O156069
$$ 5400882 12201315 15573625 11812835 3343423 -3398679 -3819618 1344161 7500230
5602G500230K833023j500904l827104l918172l436810k895080j175360J402026
$$ 7500230 10333253 8832349 5005245 1087073 -2349737 -5244817 -6420177 -5018151
5594e018151K076321k26988k079245j56840K924056J675450l679801o392103k193525
$$ -5018151 -2941830 -3168818 -5248063 -5404903 -2480847 -805397 -4485198 -10877301 -13070826
5585a3070826N028670Q756170P539293M317017R82050k490033m887810l755710
$$ -13070826 -8042156 714014 8253307 12570324 13552374 11062341 6174531 2418821
5577B418821J024807O192109Q301637O525143K352106j775235l494191k132342
$$ 2418821 3443628 9635737 17937374 24462517 26814623 25039388 21545197 19412855
5569A9412855K2461m89948m353954q249877q287056l905291K135268O535450P285829
$$ 19412855 19435316 18945368 14591414 6341537 -1945519 -5850810 -3715542 2819908 10105737
5560A0105737L966443j759778o137140o014447k471360m5385r93709j979663J179027
$$ 10105737 14072180 12312402 6175262 160815 -2310545 -2355930 -3349639 -5329302 -4150275
5551d150275O425214O543855j588691j1512362j3434682n207764N087842P968716
$$ -4150275 2274939 8818794 7230103 -4282259 -17716941 -22924705 -17836863 -9868147
5543i868147K659828k849301j818600K959239L261082k672952o773213k425245
$$ -9868147 -7208319 -10057620 -11876220 -8916981 -5655899 -8328851 -15102064 -17527309
5535a7527309N080204N300747k170431o879243k626230M464312O199799L302422
$$ -17527309 -12447105 -7146358 -9316789 -16196032 -18822262 -14357950 -8158151 -4855729
5527d855729Q87360o73791l293908m278683j09432N490975N470858L42033k518526
$$ -4855729 -3968369 -4642160 -7936068 -12214751 -12324183 -6833208 -1362350 -1020317 -3538843
5518c538843o8305L408188M632587M978690M886429K408667q56680q7169L842616
$$ -3538843 -3607148 -198960 4433627 9412317 14298746 16707413 15850733 15763564 19606180
5509A9606180L383786l995066j0341536q250167j044901L383399L297488J929122
$$ 19606180 22989966 18994900 8653364 403197 -641704 2741695 6039183 7968305
5501G968305N74521q66936m69115K385824L596814K12330l558755k332263J671876
$$ 7968305 8542826 7675890 7206775 9592599 13189413 13401743 9842988 7510725 9182601
5492I182601K588066Q38026J508158M495266M311298l84351m553605m994466m135228
$$ 9182601 11770667 12608693 14116851 18612117 22923415 22539064 17985459 12990993 8855765
5483H855765m249475l915712k048971k51489O36192J808244L055188K522170Q09850
$$ 8855765 4606290 690578 -1358393 -1609882 -973690 834554 3889742 6411912 7221762
5474G221762N71307J282481k11658k926538j674128M173913Q119749N838566J113177
$$ 7221762 7793069 9075550 8863892 5937354 4263226 8437139 16556888 22395454 23508631
5465B3508631j293949k735952n621349o789654k711212K374114R27746o752719
$$ 23508631 22214682 19478730 13857381 7067727 4356515 6730629 7658375 905656
5457I05656j2503775j1090356n262301Q2330L200702M009661K451272L83633J143121
$$ 905656 -11598119 -22688475 -27950776 -27868446 -24667744 -20658083 -18206811 -17823178 -16680057
5448a6680057M956080P739677O464349L169514J735426K905864M431393M196066
$$ -16680057 -11723977 -3984300 2480049 5649563 7384989 10290853 14722246 18918312
5440A8918312J370321l566805p879008p612207k272768K981559K902298r47390
$$ 18918312 20288633 16721828 8842820 1230613 -1042155 1939404 4841702 3894312
5432C894312k231949J370872N129115L974336j109845n158581m845998j07481
$$ 3894312 1662363 3033235 8162350 12136686 11026841 5868260 1022262 914781
5424I14781O851223J1485976Q912485p2787p237344n833215L28036K006031k437967
$$ 914781 7766004 19251980 28164465 28091678 20854334 15021119 15349155 17355186 14917219
5415A4917219n777396l920952j439490k442348l503905p33519K349856N84820
$$ 14917219 9139823 5218871 3779381 1337033 -2166872 -2900391 -550535 34285
5407C4285l650159m083162l99064K534004L131320L653953L653924K70143n015903
$$ 34285 -3615874 -7699036 -8098100 -5564096 -2432776 1221177 4875101 5145244 129341
5398A29341o877021m070956o60675J231123L493743O057910N663207K307053L89613
$$ 129341 -6747680 -10818636 -11479311 -10248188 -6754445 -696535 4966672 7273725 7663338
5389G663338J207717O77909k819780m761074k098543J429827J656057K73142N06169
$$ 7663338 8871055 9548964 6729184 1968110 -130433 1299394 2955451 3228593 3734762
5380C734762J419131R69869K58281L87446m88456k606101j790972L693632P889001
$$ 3734762 5153893 6123762 6382043 6769489 6281033 3674932 1883960 5577592 13466593
5371A3466593M537549l639274q583579o909381j365145M285433O712790L138314
$$ 13466593 18004142 14364868 5781289 -1128092 -2493237 1792196 8504986 11643300
5363A1643300m235663p625951l565957P72463j800387o263195l216768M576606
$$ 11643300 7407637 -218314 -3784271 -3011808 -4812195 -11075390 -14292158 -9715552
5355i715552N217002l197052q592112k994921O094209P609435J831633k880108
$$ -9715552 -4498550 -7695602 -16287714 -19282635 -13188426 -5578991 -3747358 -6627466
5347f627466k381688N00373J983847J051273q10950n75776L405879P815550P052328
$$ -6627466 -9009154 -8508781 -6524934 -5473661 -6284611 -6860387 -3454508 4361042 11413370
5338A1413370J121720l214512j301033L527564N427711L372017J33726k275221
$$ 11413370 12535090 9320578 8019545 11547109 16974820 20346837 20480563 18205342
5330A8205342k959291j128708K153600L849445L087265K676432M255348N063906
$$ 18205342 15246051 14117343 16270943 20120388 23207653 25884085 30139433 35203339
5322C5203339K147113l053761o820496p405130n337409k324484j285509m011992
$$ 35203339 37350452 34296691 27476195 20071065 14733656 12409172 11123663 7111671
5314G111671p422281o351901j562792K83328l092429n483256k126369K566085
$$ 7111671 -310610 -6662511 -8225303 -7941975 -11034404 -16517660 -18644029 -16077944
5306a6077944K645692M23000J883501O523564Q897428P250610L693039j415558
$$ -16077944 -13432252 -13009252 -11125751 -4602187 4295241 11545851 15238890 13823332
5298A3823332p776624j0105470l271651P817990J1533857M014502o205118r435546
$$ 13823332 6046708 -4058762 -7330413 487577 12021434 16035936 9830818 395272
5290C95272m854132K089993O623060O900054L823434O67452j11752q2065j769376
$$ 395272 -4458860 -2368867 4254193 11154247 14977681 15645133 15533381 15451316 13681940
5281A3681940l598143k496765q5059k14556j405931R57491N189858M578014q63319
$$ 13681940 10083797 7587032 7501973 7287417 5881486 6838977 12028835 16606849 15743530
5272A5743530l301126n01650l19549o625566j0599468m150397O038627P996304
$$ 15743530 12442404 11940754 11621205 4995639 -5603829 -9754226 -3715599 4280705
5264D280705K435107Q3947L910775N567097K0929o551323o486399n48679N433508
$$ 4280705 6715812 6799759 10710534 16277631 16298560 9747237 3260838 2712159 8145667
5255H145667Q037884O907110K639802k374166m326389k342011j66127j250763
$$ 8145667 16183551 23090661 25730463 23356297 19029908 16687897 16521770 15271007
5247A5271007m293338n590016l880966j033719O28813K59009j180948j749757
$$ 15271007 10977669 5387653 1506687 472968 1101781 1360790 179842 -1569915
5239a569915o25189P37106Q96981J079234L184675N895516N970868L266964Q99297
$$ -1569915 -2195104 -1457998 -561017 518217 3702892 9598408 15569276 18836240 19735537
5230A9735537L0856j690123n441247q652040q687912n931755j846792K618219
$$ 19735537 19766393 18076270 12635023 3982983 -4704929 -10636684 -12483476 -9865257
5222i865257N294044L495436j321565l606702j210988J204085k78416k086397
$$ -9865257 -4571213 -1075777 -2397342 -6004044 -7215032 -6010947 -6289363 -8375760
5214h375760J136106P450032J0124802P216720K697143p67435l933391o198305
$$ -8375760 -7239654 210378 10335180 17551900 20249043 19481608 15548217 9349912
5206I349912n175665j948250o27111j153047J162377O412408P173724m15776q330219
$$ 9349912 4174247 2225997 1598886 445839 1608216 8020624 15194348 14778572 6448353
5197F448353o184599M132426J0587556O783007j239632m751385k688489K37619
$$ 6448353 263754 4396180 14983736 21766743 20527111 15775726 13087237 13324856
5189A3324856R08194l96186k536967m118062l190067K95813K723473P77984l228202
$$ 13324856 14233050 13836864 11299897 7181835 3991768 4287581 7011054 7789038 4560836
5180D560836l507711J137562M993382L163215j428455k179236J792424M718937
$$ 4560836 1053125 2190687 7184069 10347284 8918829 6739593 8532017 13250954
5172A3250954K672276j453315l197196k893401l527982m907063m114501p58324
$$ 13250954 15923230 14469915 11272719 8379318 4851336 -55727 -4170228 -4928552
5164d928552K198531K846053K180218J316717J68570n55790N41290K353756J538360
$$ -4928552 -2730021 116032 2296250 3612967 3781537 3225747 3767037 6120793 7659153
5155G659153k354538n109696l384378O44856K621816J678185N6942r40905j552157
$$ 7659153 5304615 194919 -3189459 -2544603 77213 1755398 1812340 871435 -680722
5146f80722j405829J17715J962629K439434J815030J646836K005277J574117J93250
$$ -680722 -2086551 -1968836 -6207 2433227 4248257 5895093 7900370 9474487 9667737
5137I667737q41800r06871n45726J55394J876856M367958N689321L788432j192063
$$ 9667737 8825937 7919066 7373340 7528734 9405590 13773548 19462869 23251301 22059238
5128B2059238n961904o133784r55223M312004L517043k454085o350801m348225
$$ 22059238 16097334 9963550 9008327 13320331 16837374 14383289 8032488 3684263
5120C684263q85766j048602k572569j44280N387862P734136M057698j645305l956973
$$ 3684263 2798497 1749895 -822674 -966954 4420908 12155044 16212742 14567437 10610464
5111A0610464j413599L057657M558328N96537m710489l898030L373711P693926
$$ 10610464 9196865 12254522 16812850 17409387 12698898 8800868 12174579 19868505
5103A9868505K659454m976193n292599n01901k66611m946279n632212l47643K800516
$$ 19868505 22527959 17551766 12259167 11757266 11490655 6544376 912164 564521 3365037
5094C365037P60361O32291M926440M691130m831353j3040208q749109K470084
$$ 3365037 4125398 4757689 9684129 14375259 9543906 -3496302 -12245411 -9775327
5086i775327O871083K246145k287722j950286l17047K63553J555480K858459O90089
$$ -9775327 -2904244 -658099 -2945821 -4896107 -5213154 -4949601 -3394121 -535662 154427
5077A54427m094093o194302l560548R38751N321850R673153J1785955Q246924
$$ 154427 -3939666 -10133968 -13694516 -12755765 -7433915 2239238 14025193 22272117
5069B2272117N56335n436418o775075n335129k975198P101K021313J271876l50986
$$ 22272117 22828452 17392034 10616959 5281830 2306632 2313733 4335046 5606922 5255936
5060E255936N67727L336944M449103L341077J685435j265003o350226r308723
$$ 5255936 5823663 9160607 13609710 16950787 18636222 17371219 11020993 1712270
5052A712270n419452J588530L334973o66735k775892j17746J522367j146266l057962
$$ 1712270 -3707182 -2118652 1216321 549586 -2226306 -2344052 -821685 -1967951 -5025913
5043e025913n7673L944286M007047J853088J470912K308959J704984k1966r27713
$$ -5025913 -5083586 -1139300 2867747 4720835 6191747 8500706 10205690 10183724 9256011
5034I256011m52043J491882M419893M654046j639436j0613829j2477628m506178
$$ 9256011 8803968 10295850 14715743 19369789 17730353 7116524 -5361104 -9867282
5026i867282M190879N222188J722694J116409L233028K904447J64673j19050K788979
$$ -9867282 -5676403 -454215 1268479 2384888 5617916 8522363 8687036 8567986 11356965
5017A1356965L767166n86833p248328j0384875p298874p41452L807357M121363
$$ 11356965 15124131 14537298 7288970 -3095905 -10394779 -11136231 -7328874 -3207511
5009c207511L950881O990478R528571M868057m906031r111825k843777O193448
$$ -3207511 743370 7733848 17262419 22130476 17224445 8112620 5268843 11462291
5001A1462291Q963893O087148K771169j92613l969557n991521l888826j077230
$$ 11462291 20426184 26513332 29284501 29091888 25122331 19130810 15241984 14164754
4993A4164754j934980m786021n409697l952371k708040p68934L167478O110511
$$ 14164754 12229774 7443753 2034056 -1918315 -4626355 -5395289 -2227811 3882700
4985C882700M848323J616077K10196j73117j795368k902901j252971O97512J91784
$$ 3882700 8731023 10347100 10557296 10384179 8588811 5685910 4432939 5130451 5322235
4976E322235j51909K549105M704486J699145l491102m413596p72932L014537N504329
$$ 5322235 5170326 7719431 12423917 14123062 10631960 6218364 5445432 8459969 13964298
4967A3964298P201169N450669j555716q509736q774216m162774j610882k899357
$$ 13964298 21165467 26616136 25060420 16550684 7776468 3613694 2002812 -896545
4959h96545m947745o716157p899032m869514L200799Q480000M640147j454410
$$ -896545 -5844290 -12560447 -20459479 -25328993 -22128194 -13648194 -9008047 -10462457
4951a0462457N71090P325488P057787m56502l849829N88571M169483J748202j481066
$$ -10462457 -9891367 -2565879 4491908 4035406 185577 774148 4943631 6691833 5210767
4942E210767j889508k978424n252080k819670N055441R777719N782688k022224
$$ 5210767 3321259 342835 -4909245 -7728915 -2673474 7104245 12886933 10864709
4934A0864709o981297q040950n559974Q09105P113190P198066K359429j33235
$$ 10864709 3883412 -4157538 -9717512 -8908407 -1795217 5402849 7762278 7629043
4926G629043O49456j025744m601109k464979N370022Q904442M410880K79221J897341
$$ 7629043 8278499 7252755 2651646 186667 5556689 14461131 18872011 19151232 21048573
4917B1048573L259149p89116n774104o840789n848130m268456Q0727N086972M602347
$$ 21048573 24307722 23518606 17744502 10903713 5055583 787127 867854 5954826 10557173
4908A0557173P8040l11325L419956L050196j138871k80499M148590P74698q461966
$$ 10557173 10635213 10323888 13743844 16794040 15655169 15374670 19523260 20297958 11835992
4899A1835992p480978N383628J1676506M188202j220861L881435N334137l891509
$$ 11835992 4355014 9738642 21415148 25603350 24382489 28263924 33598061 29706552
4891B9706552p259495L624268R655509j259316r243687K092851J4246356P780423
$$ 29706552 22447057 26071325 35726834 34467518 25223831 27316682 41563038 49343461
4883D9343461j387279O029690J3719142K328506q536411L377076J5112600J605648
$$ 49343461 47956182 53985872 67705014 70033520 61497109 64874185 79986785 81592433
4875H1592433n800547K4005832L3792268n6492527j96769975k27857459r1285865
$$ 81592433 75791886 99797718 133589986 77097459 -119672516 -347529975 -438815840
4868d38815840P7782646J25269092O4695165J5289013K1568998L0520912J1981084
$$ -438815840 -361033194 -235764102 -171068937 -155779924 -134210926 -103690014 -91708930
4861i1708930j68515J3540609K2733092P876830o470332j13820J0158440O974080
$$ -91708930 -91877445 -78336836 -55603744 -47726914 -54197246 -54311066 -44152626 -37178546
4853c7178546J155580M529898P703374L076867R59956O387840O248229n039012
$$ -37178546 -36022966 -31493068 -23789694 -20712827 -19752871 -13365031 -7116802 -12155814
4845a2155814j1493615k628923P817336N588560j968767k850296r65283m053420
$$ -12155814 -23649429 -26278352 -18461016 -12872456 -14841223 -17691519 -18656802 -22710222
4837b2710222p130479l504564J242031N03042l41871M681197R323375O590569
$$ -22710222 -29840701 -33345265 -32103234 -31600192 -31942063 -27260866 -17937491 -11346922
4829a1346922K385297M812000R150172O088481k689068q626617r340645p367572
$$ -11346922 -8961625 -4149625 5000547 11089028 8399960 -226657 -9567302 -16934874
4821a6934874k436835N202983R636029O624875J008953r21799p67725k487741
$$ -16934874 -19371709 -14168726 -4532697 2092178 3101131 2179332 1411607 -1076134
4813a076134l911280j782936M50770j901174o173271o658681l404334j69047K149695
$$ -1076134 -4987414 -6770350 -6319580 -8220754 -14394025 -21052706 -24457040 -24626087 -22476392
4804b2476392L962227L255690n83338l278179j521074J532798J464532p13308
$$ -22476392 -18514165 -15258475 -15841813 -19119992 -20641066 -19108268 -17643736 -18357044
4796a8357044j399378O6078K232701L632063J808711m104922q343179l818829
$$ -18357044 -19756422 -19690344 -17457643 -13825580 -12016869 -16121791 -24464970 -28283799
4788b8283799N537013P573014M51828l169952L696611J0502173O546194j486388
$$ -28283799 -22746786 -15173772 -14721944 -17891896 -14195285 -3693112 2853082 1366694
4780A366694j488438M123384M458959o63609k456581j01815j152837o233253p134907
$$ 1366694 -121744 4001640 8460599 7796990 5340409 5238594 4085757 -2147496 -9282403
4771i282403j327359L512107J886044k371829m001138l160286j627672J014715
$$ -9282403 -10609762 -7097655 -5211611 -7583440 -11584578 -14744864 -16372536 -15357821
4763a5357821M622318O927616O572393M074730j61786m986942o936614m141647
$$ -15357821 -10735503 -3807887 2764506 6839236 6677450 1690508 -5246106 -9387753
4755i387753l20781m7481j931352j701662K89409O43676l31458j06135o4049k874976
$$ -9387753 -9708534 -9756015 -11687367 -13389029 -13099620 -12455944 -12787402 -12893537 -12957586 -15832562
4745a5832562n479266k741817K816466L537680q96211k343975K650998P044302
$$ -15832562 -21311828 -24053645 -21237179 -17699499 -18595710 -20939685 -18288687 -11244385
4737a1244385M210302k226648m220762l46021L748982L638847J062992O63692
$$ -11244385 -7034083 -9260731 -13481493 -13827514 -10078532 -6439685 -5376693 -4713001
4729d713001L444811M802900P03025n044696m354613L043915P488985L149704
$$ -4713001 -1268190 3534710 4237735 -806961 -5161574 -2117659 5371326 8521030
4721H521030l201949l514203j260978l593028o980542l041928M888342M966842
$$ 8521030 5319081 1804878 543900 -3049128 -10029670 -13071598 -8183256 -3216414
4713c216414l694047q581014l093045M601648O056481L836101K674606L90617
$$ -3216414 -6910461 -15491475 -18584520 -13982872 -7926391 -4090290 -1415684 -1025067
4705a025067m945765p777335l214327M102786O608132L895992M1885l521931o145187
$$ -1025067 -5970832 -13748167 -16962494 -12859708 -6251576 -2355584 -2313699 -5835630 -11980817
4696a1980817m431955K574755R038194R474927O268799M365037L060623n87036
$$ -11980817 -16412772 -13838017 -4799823 4675104 10943903 15308940 18369563 17782527
4688A7782527m594791n343392m430959n225494n870303l019601M82280k98886
$$ 17782527 13187736 7844344 3413385 -1812109 -7682412 -10702013 -10219733 -10518619
4680a0518619k778605n5823O951651R390607L631649l441319m738519j673980
$$ -10518619 -13297224 -13353047 -6401396 2989211 6620860 3179541 -1558978 -3232958
4672c232958P95782K061242M315864O840160O389181J924149l969070p706098
$$ -3232958 -2437176 -375934 3939930 10780090 17169271 19093420 15124350 7418252
4664G418252p273303l302805J153488K870319J352335j236069l100203m250028
$$ 7418252 144949 -3157856 -2004368 865951 2218286 982217 -2117986 -6368014
4656f368014m574777k548832K487781P685539Q345500L042072l717630n388697
$$ -6368014 -10942791 -13491623 -11003842 -3318303 5027197 8069269 4351639 -1037058
4648a037058n10922N174131M981644j211417p498786r187557o847348l320666
$$ -1037058 -1547980 3626151 8607795 7396378 -102408 -9289965 -16137313 -19457979
4640a9457979j43897J883946J718707j72131j140963O07678L915512O899797R101106
$$ -19457979 -19601876 -17717930 -15999223 -16171354 -17312317 -16704639 -12789127 -5889330 3211776
4631C211776R839337P077042N86147n636177p147788m428272j950536k300867
$$ 3211776 13051113 20128155 20714302 15078125 7930337 3502065 1551529 -749338
4623g49338l381741j651907L166077P111617N869051K4971m499194k963624K175542
$$ -749338 -4131079 -5782986 -2616909 4494708 10363759 10388730 5889536 2925912 5101454
4614E101454M468648J948367j357814k277907k174612k653119k366868k92327
$$ 5101454 9570102 11518469 10160655 7882748 5708136 3055017 688149 395822
4606C95822J993485L572031N532131O853565L929464k610133n783263j350440
$$ 395822 2389307 5961338 11493469 18347034 22276498 19666365 13883102 12532662
4598A2532662N571685P790441N396367K354260j569852q228149j3759836j2073920
$$ 12532662 18104347 25894788 31291155 33645415 32075563 23847414 10087578 -1986342
4590a986342m583521Q52632M64628k346745l992383m167878k446811J777532N233737
$$ -1986342 -6569863 -5717231 -5252603 -7599348 -11591731 -15759609 -18206420 -16428888 -11195151
4581a1195151L180920k850736n786759k914572Q39504J196907J25659Q38173K729301
$$ -11195151 -8014231 -10864967 -16651726 -19566298 -18726794 -17529887 -17404228 -16566055 -13836754
4572a3836754M070004M945886M981438K771167j44203K33339L302541K704253
$$ -13836754 -9766750 -4820864 160574 2931741 2787538 3020877 6323418 9027671
4564I027671m280264j1348175j1558421o608301k874992k010281q73950J874511
$$ 9027671 4747407 -6600768 -18159189 -24767490 -27642482 -29652763 -30526713 -28652202
4556b8652202M525843O093700O724287N636863K781319J154962L244230O301997
$$ -28652202 -24126359 -18032659 -11308372 -5671509 -2890190 -1735228 1509002 7810999
4548G810999N510119J165836j663752o59078P56696j113148m963394o086879j653014
$$ 7810999 13321118 14486954 12823202 12164124 12920820 11807672 6844278 757399 -895615
4539h95615O055436J0726015P288468k242172r529144q751847l219316l75093
$$ -895615 5159821 15885836 23174304 20932132 11402988 2651141 -568175 -943268
4531i43268j828574k414536J278052N881960N999321Q86426n081146o857206l184284
$$ -943268 -2771842 -5186378 -3908326 1973634 7972955 8859381 3778235 -3078971 -6263255
4522f263255J763769J763687m064299q397646m056438N539844R569719M206048
$$ -6263255 -4499486 -2735799 -6800098 -15197744 -19254182 -13714338 -4144619 61429
4514F1429k326335j939443K185327K029767k414898m227251j479944P9496k759173
$$ 61429 -2264906 -4204349 -2019022 10745 -2404153 -6631404 -8111348 -8031852 -10791025
4505a0791025n157170k236847L103276N007265L350592K351614K862470J770458
$$ -10791025 -15948195 -18185042 -15081766 -10074501 -6723909 -4372295 -1509825 260633
4497B60633j365953k618753j31442K097969l21767n566740p550815l439628L354771
$$ 260633 -1105320 -3724073 -3855515 -1757546 -2079313 -7646053 -15196868 -18636496 -15281725
4488a5281725P488734O898552L274144q87705m173413n678085m423210n97966
$$ -15281725 -7792991 -894439 2379705 1492000 -2681413 -8359498 -12782708 -13380674
4480a3380674L461586N307781N260384N240164M714115J009082m991372p406439
$$ -13380674 -9919088 -4611307 649077 5889241 10603356 11612438 6621066 -785373
4472g85373l185147J841190N3876o560851q539693k565553L869447L618555n69305
$$ -785373 -3970520 -2129330 -2075454 -8636305 -17175998 -19741551 -15872104 -12253549 -12822854
4463a2822854j586570J848259N329013N755629L600444N93432q32324J897524
$$ -12822854 -14409424 -12561165 -7232152 -1476523 2123921 2717353 1885029 3782553
4455C782553P611659J0481169P006753J339469p92174n78392k924361p091270
$$ 3782553 11394212 21875381 28882134 30221603 29429429 28851037 25926676 18835406
4447A8835406p457641l056140N39550k36943k579577k994416j849167l24242K089820
$$ 18835406 11377765 8321625 8861175 8624232 6044655 3050239 1201072 876830 2966650
4438B966650M593795M011300m61112m875227n373829k546702Q30094L285508M127553
$$ 2966650 7560445 11571745 11110633 6235406 861577 -1685125 -855031 2430477 6558030
4429F558030K614969l91935k698901m116208o520369r446179r319621m774216
$$ 6558030 9172999 8781064 6082163 1965955 -4554414 -14000593 -23320214 -28094430
4421b8094430R00121M396352N788528N691268L498261P89554J678352O363757
$$ -28094430 -27194309 -22797957 -17009429 -11318161 -7819900 -7030346 -5351994 1011763
4413A011763Q824499N042444n47519j507635J294375K114337p03846l753360m701610
$$ 1011763 9836262 14878706 14331187 12823552 14117927 16232264 15528418 11775058 7073448
4404G073448m049481k040673J132115L076352K034320Q79961L142255O107098
$$ 7073448 3023967 983294 2115409 5191761 7226081 8106042 11248297 17355395
4396A7355395L921135k577028n773776k435290J519632M27082k637868j522272
$$ 17355395 21276530 18699502 12925726 10490436 12010068 12437150 9799282 8277010
4388H277010K740754L184208k587794q377353p399375j144079K566536k52979
$$ 8277010 11017764 14201972 11614178 3236825 -4162550 -5306629 -2740093 -2993072
4380b993072m447054k656773M040250O693708Q63538o324441n695502J008358
$$ -2993072 -7440126 -10096899 -6056649 637059 1500597 -4823844 -10519346 -9510988
4372i510988M172518Q74780j533951J984356N897605L234588l070896m652993
$$ -9510988 -5338470 -4463690 -5997641 -4013285 1884320 5118908 2048012 -2604981
4364b604981O1815N218915P268235P874828P263932K480918n465681r677792o554992
$$ -2604981 -2543166 2675749 9943984 17818812 25082744 27563662 22097981 12420189 5865197
4355E865197j334527J39894n2308K417509M637503R14257n759451o241218M21118
$$ 5865197 4530670 4670564 4618256 7035765 11673268 12587525 6828074 586856 1007974
4346A007974M716091J401731k667479m43444L848987K441402l099743n300520
$$ 1007974 5724065 7125796 4458317 4014873 7863860 10305262 7205519 1904999
4338A904999k879669n25004P47810L816069P130449N360009j033447n099368l556340
$$ 1904999 -974670 -1499674 -751864 3064205 10194654 15554663 14521216 9421848 5865508
4329E865508k19167J787392L461632M185209R83239m067347m335088R2787O14511
$$ 5865508 5646341 7433733 10895365 15080574 16063813 11996466 7661378 7754165 8368676
4320H368676n724489r592384l773412M380853M004922k493822m261009O80400
$$ 8368676 2644187 -6948197 -10721609 -6340756 -2335834 -4829656 -9090665 -8410265
4312h410265M108144K082583M7138K289712N252625M267481M93889k091904k302044
$$ -8410265 -4302121 -2219538 -2172400 117312 5369937 9637418 10131307 8039403 5737359
4303E737359j612180j195403j031699o60753k68180j377622m912586p905771n528589
$$ 5737359 4125179 2929776 1898077 1237324 969144 -408478 -5321064 -13226835 -18755424
4294a8755424J573185O132640L811513m57480j67008L144379L785805J486974
$$ -18755424 -17182239 -11049599 -7238086 -7695566 -7862574 -4718195 -932390 554584
4286E54584N6115o15513l406649o320136l845418L982993J0576646J1169204O642375
$$ 554584 610699 -4814 -3411463 -9731599 -13577017 -9594024 982622 12151826 18794201
4277A8794201l27045o913222q875325m453438Q29904R7467m504890m722289O75741
$$ 18794201 18467156 11553934 2678609 -1774829 -944925 -847458 -5352348 -10074637 -9398896
4268i398896M173497K148465K80364L048252N936715L148618l039843o143496
$$ -9398896 -5225399 -3076934 -2796570 251682 6188397 9337015 6297172 153676
4260A53676m588197j997914r79422p65832K05117K124319L878001M461351M581696
$$ 153676 -4434521 -6432435 -7411857 -8177689 -7972572 -5848253 -1970252 2491099 7072795
4251G072795N642721O213440K724251l733941n891276n30446M619438J497947
$$ 7072795 12715516 18928956 21653207 17919266 12027990 11497544 16116982 17614929
4243A7614929n189012n036195J050070K445700l460696p492557m214942P09956
$$ 17614929 12425917 7389722 8439792 10885492 7424796 -67761 -4282703 -3572747
4235c572747J913366J802913K410176N25357l813983m145387J148039L956469
$$ -3572747 -1659381 143532 2553708 3079065 -734918 -4880305 -3732266 224203
4227B24203o64876n849255m246276P54175K943352M134883Q175025J1235291P725872
$$ 224203 -440673 -6289928 -10536204 -9782029 -6838677 -2703794 5471231 16706522 24432394
4218B4432394O27146l143550l396876m406021o009854n125003k770381j950901
$$ 24432394 25059540 21915990 18519114 14113093 8103239 2978236 207855 -1743046
4210a743046j491117J028479L149347J110052l091145m400840k081898Q00875
$$ -1743046 -3234163 -2205684 943663 2053715 -1037430 -5438270 -7520168 -6719293
4202f719293K357032J820244j675647n841869n281647O49117N079010L316466
$$ -6719293 -4362261 -2542017 -4217664 -10059533 -15341180 -14692063 -9613053 -6296587
4194f296587m20752p34277J051305J956985L041038M157161J013096n836252p698589
$$ -6296587 -6717339 -7451616 -6400311 -4443326 -1402288 2754873 3767969 -2068283 -9766872
4185i766872j199369M130565P06093m296963j639243M092158L866689O29432K242199
$$ -9766872 -10966241 -6835676 -6129583 -10426546 -12065789 -7973631 -4106942 -3477510 -1235311
4176a235311N740895L751550p8875J968255N083199p68150j1317833j3219747
$$ -1235311 4505584 8257134 8178259 10146514 15229713 14461563 3143730 -10076017
4168a0076017n860984o73600r21755K54885L104654N99748n647670o254127j159732
$$ -10076017 -15937001 -16610601 -17532356 -17277471 -14172817 -13573069 -19220739 -25474866 -26634598
4159b6634598Q93278n10552J759732N534154K120173m963882m169967K062118
$$ -26634598 -25741320 -26251872 -24492140 -18957986 -16837813 -21801695 -25971662 -23909544
4151b3909544J254940m437527k318455L196338l783217j6924990j4538881l954694
$$ -23909544 -22654604 -27092131 -29410586 -26214248 -29997465 -46922455 -61461336 -65416030
4143f5416030j6030527m2080673k6016385M9424236J13946056R4472452J7079724
$$ -65416030 -81446557 -123527230 -149543615 -100119379 13826677 108299129 125378853
4136A25378853k9944699j5885687Q172687k36639k0974595k1381268q682080n408910
$$ 125378853 95434154 79548467 87721154 87484515 66509920 45128652 36446572 31037662
4128C1037662q751924m322136L247685J109467n964401m667362K410635K392755
$$ 31037662 22285738 17963602 21211287 22320754 16356353 11688991 14099626 16492381
4120A6492381m810532p357532j526204M436865M860168K798766J964546J761341
$$ 16492381 11681849 4324317 2798113 7234978 12095146 14893912 16858458 18619799
4112A8619799P96619p32864k163884k533288j164692O6802j699940n055909n098233
$$ 18619799 19416418 18683554 16519670 13986382 12821690 12888492 11188552 6132643 1034410
4103A034410r51378K620276K604765J097402j03064j819075k722867O91735O861264
$$ 1034410 83032 2703308 5308073 6405475 6302411 4483336 1760469 2452204 9313468
4094I313468Q790741L860153k424611m966958m652677l170062J46949L402244
$$ 9313468 18104209 21964362 19539751 14572793 9920116 6750054 6897003 10299247
4086A0299247J909586l567975o015896l181082j202025l182055l191564K587394
$$ 10299247 12208833 8640858 2624962 -556120 -1758145 -4940200 -8131764 -5544370
4078e544370P498841M559191k402062n516422m381657k926433q27055L290027
$$ -5544370 1954471 6513662 4111600 -1404822 -5786479 -8712912 -9539967 -6249940
4070f249940N163243P62853m629736k398744O360871J2182116J0409452N288506
$$ -6249940 -1086697 -323844 -4953580 -7352324 -991453 11190663 21600115 26888621
4062B6888621J459895j253192l922083n417180m586817j741446K244523N569271
$$ 26888621 28348516 27095324 23173241 17756061 13169244 11427798 13672321 19241592
4054A9241592N613608K387079l56067o87420k015326o798454j0334844o643077
$$ 19241592 24855200 27242279 26886212 26198792 24183466 17385012 7050168 407091
4046D07091J936556P211929N781271J474818j573971k477748j051642K427369
$$ 407091 2343647 9555576 15336847 16811665 15237694 12759946 11708304 14135673
4038A4135673M960471L404247o91323l103731k928824k072998m42906K693396
$$ 14135673 19096144 22500391 21809068 18705337 15776513 13703515 13260609 15954005
4030A5954005M067815M7698n590565n137990R63642L411135k164225q325989o912661
$$ 15954005 20021820 20069518 14478953 9340963 10304605 13715740 11551515 3225526 -3687135
4021c687135m31218L087406J654470l60035k00723J150758L112178N946868P435229
$$ -3687135 -4118353 -1030947 623523 263488 62765 1213523 4325701 10272569 17707798
4012A7707798M265777k405926o818027n406971q13995K227404K433507J667659
$$ 17707798 21973575 19567649 12749622 7342651 6528656 8756060 11189567 12857226
4004A2857226J107998R4823j818494l646965m126110l034040j083511P77271J722611
$$ 12857226 13965224 14060047 12241553 8594588 4468478 1434438 350927 1128198 2850809
3995B850809J416197M84436J74055J054643K309285K620320J421203r44362l609835
$$ 2850809 4267006 4751442 4925497 5980140 8289425 10909745 12330948 11386586 7776751
3986G776751n164027m051065j70258M120742N661935L397393p41990l661374l560474
$$ 7776751 2612724 -1438341 -1608599 2512143 8174078 11571471 10829481 7168107 3607633
3977C607633j226577O59305K41243j179292p34095J795446L358068K056020l75675
$$ 3607633 2381056 3040361 3281604 2102312 1368217 3163663 6521731 8577751 8202076
3968H202076j996282l449203m890253l707262P67324L625293P98356l597874k873448
$$ 8202076 6205794 2756591 -2133662 -5840924 -5073600 -1448307 -649951 -4247825 -7121273
3959g121273J207621J040402l476733l454412M612998J1748181Q826688p09740
$$ -7121273 -5913652 -4873250 -8349983 -11804395 -7191397 4556784 13383472 12673732
3951A2673732o355374l836348K797299Q387605J0257963P528150K170933j234924
$$ 12673732 6318358 2482010 5279309 13666914 23924877 31453027 33623960 32389036
3943C2389036q83794m58221k978114n480840m179737j209935r29648k675261k929035
$$ 32389036 31505242 31047021 28068907 22588067 18408330 17198395 16268747 13593486 10664451
3934A0664451k012426k618244l921264l310672k032793k732770l258825j3721
$$ 10664451 8652025 6033781 2112517 -1198155 -3230948 -5963718 -9222543 -9236264
3926i236264L977945K527422k375993j627444O629623J2363280P639612j831043
$$ -9236264 -5258319 -2730897 -5106890 -6734334 -104711 12258569 19898181 18067138
3918A8067138m921400m8712M364170K022710m286981p612243m756454J383782
$$ 18067138 13145738 13097026 17461196 19483906 15196925 7584682 2828228 4212010
3910D212010N276443L912652p57216m412674n064642m215206l760655l589675
$$ 4212010 9488453 13401105 12643889 8231215 3166573 -1048633 -4809288 -8398963
3902h398963k573513l57766K313753M025693L555317J459635L16082J920288M709322
$$ -8398963 -10972476 -11330242 -9016489 -4990796 -1435479 24156 340238 2260526 6969848
3893F969848N421512K803431j492379m672068m383258l99770L730578L247020
$$ 6969848 12391360 15194791 13702412 9030344 4647086 4247316 7977894 11224914
3885A1224914j295959l058511K066432Q478032P738783K42560n617526m859511
$$ 11224914 9928955 6870444 8936876 17414908 25153691 25396251 19778725 14919214
3877A4919214o19098K424861L382880K825624M00782l256151o026369p094764
$$ 14919214 14300116 16724977 20107857 22933481 23334263 20078112 14051743 6956979
3869F956979p091807n250227l80034N055240O342002K897183q84306j913232j374986
$$ 6956979 -134828 -5385055 -5765089 -709849 5632153 8529336 7645030 5731798 4356812
3860D356812q81710k84015j62013j751114l363795j724022K106852L335998J108877
$$ 4356812 3475102 3191087 3029074 1277960 -2085835 -3809857 -1703005 1632993 2741870
3851B741870k20645Q97106M29067l217077n016453j407678L265726L404156L47858
$$ 2741870 2521225 3418331 3847398 630321 -4386132 -5793810 -2528084 876072 1223930
3842A223930j333255j349113j705149r10568L318040P768345O607520J5715n356015
$$ 1223930 -109325 -1458438 -3163587 -4074155 -756115 7012230 13619750 13635465 8279450
3833H279450m821028n99279J930587n6891m882731p921697n541169Q89221N943848
$$ 8279450 3458422 2859143 4789730 4732839 -149892 -8071589 -13612758 -12723537 -6779689
3824f779689O319275M209690L260407L891921M579628M779699M003263Q44991
$$ -6779689 -460414 3749276 7009683 10901604 15481232 20260931 24264194 25109185
3816B5109185m119014p094356n812092l071632k467674l041010j545466K063495
$$ 25109185 20990171 13895815 8083723 5012091 2544417 -496593 -2042059 21436
3808B1436M769284M600055K073230p16351q16161K853623N928522K145875p030350
$$ 21436 4790720 9390775 11464005 10747654 9931493 12785116 18713638 20859513 13829163
3799A3829163j1721589o612651J106359K551447L19106K768951R060064R707127
$$ 13829163 2107574 -4505077 -3398718 -847271 -528165 2240786 11300850 21007977
3791B1007977J410417p688637r144474l638672K649280N442502M104793L83043
$$ 21007977 22418394 14729757 5585283 1946611 4595891 10038393 14143186 14526229
3783A4526229k787563l992382m817507n986008m266946K076016P348622M838597
$$ 14526229 11738666 7746284 2928777 -3057231 -7324177 -5248161 2100461 6939058
3775F939058k125407l496840K803211P844065N281518j17227j216008J293797
$$ 6939058 4813651 1316811 4120022 11964087 17245605 17128378 15912370 17206167
3767A7206167K365016Q74971p84954j660246k190170k052209j742097l482836
$$ 17206167 19571183 20446154 19661200 18000954 15810784 13758575 12016478 8533642
3759H533642p127834q055008k945666M539670P536824M017267j897368n368739
$$ 8533642 1405808 -6649200 -9594866 -5055196 2481628 6498895 4601527 -767212
3751g67212m936006k101745R03208L044086M841910O265624N149021J82488n146725
$$ -767212 -5703218 -7804963 -6901755 -3857669 984241 7249865 12398886 12581374 7434649
3742G434649n367444j91001M908237N848544L565563o7005m740546q499615p590469
$$ 7434649 2067205 1876204 6784441 12632985 16198548 16131543 11390997 2891382 -4699087
3733d699087k486792R26419l47872j727619J298834N500810M970239J39781l772007
$$ -4699087 -7185879 -6259460 -6607332 -8334951 -7036117 -1535307 3434932 3574713 -197294
3724a97294m632581m293899l595327j710215P25387K357619L862044O034672O806848
$$ -197294 -4829875 -9123774 -12719101 -14429316 -13703929 -11346310 -7484266 -1449594 5357254
3715E357254M235748N47708j167673k118687m713774o659675m310413l03386q01051
$$ 5357254 9593002 10140710 8973037 6854350 2140576 -4519099 -8829512 -9132898 -9933949
3706i933949n391898o930371k310761L595289O389382P446430Q070214N529046
$$ -9933949 -15325847 -22256218 -24566979 -20971690 -14582308 -7135878 934336 6463382
3698F463382n48877l999537l10700N491934N648541J272872Q3780L853263N550649
$$ 6463382 5914505 1914968 1604268 7096202 12744743 14017615 14101395 17954658 23505307
3689B3505307L29078o913983q398513l955180m59605k240420n877219n285776
$$ 23505307 23834385 16920402 8521889 4566709 4107104 1866684 -4010535 -9296311
3681i296311L69899N742678N797340J338425k915002m278122l836295k718980
$$ -9296311 -8926412 -3183734 2613606 3952031 1037029 -3241093 -7077388 -9796368
3673i796368J3306M177589N991201K027117n384867r954023q745082m846097k055721
$$ -9796368 -9783062 -5605473 385728 2412845 -2972022 -12926045 -21671127 -26517224 -28572945
3664b8572945M5870L559637P020267O374640J437673j994988J087359P678651
$$ -28572945 -28527075 -24967438 -17947171 -11572531 -10134858 -12129846 -11042487 -3363836
3656c363836R679395M321479j919329k105136J598711J630173l144847n523644
$$ -3363836 6315559 10637038 8717709 6612573 8211284 9841457 6696610 1172966
3648A172966j353845L556554K422172j773886j433813K840592L295348j356055
$$ 1172966 -180879 3375675 5797847 4023961 2590148 5430740 8726088 7370033
3640G370033k904087K606946P050142K492894n683986o493020J79333M296938
$$ 7370033 4465946 7072892 14123034 16615928 10931942 4438922 4618255 8915193
3632H915193J039856m161007o094010n681179l438740L302597J2097592J3002207
$$ 8915193 9955049 5794042 -299968 -5981147 -9419887 -6117290 5980302 18982509
3624A8982509J564478j1940031j4082817n186974K801369K462538k759652o719160
$$ 18982509 20546987 8606956 -5475861 -10662835 -7861466 -5398928 -8158580 -14877740
3616a4877740p107197l611342L233461R570912J0139039M692476j493258m466910
$$ -14877740 -21984937 -25596279 -22362818 -12791906 -2652867 2039609 546351 -3920559
3608c920559m755900l178496J227756P196368R932765O831569J313278j584608
$$ -3920559 -8676459 -11854955 -10627199 -3430831 6501934 13333503 14646781 13062173
3600A3062173r44380O83647J253246M85346j173470l268245n754004q632225j0070646
$$ 13062173 12117793 12801440 14054686 14540032 13366562 10098317 4344313 -4287912 -14358558
3591a4358558o606123J851561R031840Q726197L058785o57632k35953L83663k30535
$$ -14358558 -20964681 -19113120 -10081280 -1355083 1703702 1046070 810117 1193780 963245
3582I63245Q42693L130914J706889l337774m894496o01961J929705k263228n809847
$$ 963245 1805938 4936852 6643741 3305967 -1588529 -2190490 -260785 -2524013 -8333860
3573h333860k03409R878034J3110383P810696J615156j914345n469376q014305
$$ -8333860 -8537269 1340765 14451148 22261844 23877000 21962655 16493279 8478974
3565H478974m083961N099045R832117N050095k666698n400172m354524m883912
$$ 8478974 4395013 9494058 19326175 24376270 21709572 16309400 11954876 7070964
3557G070964o502755m169659K908899R137503Q967650K404358n828989j0757577
$$ 7070964 568209 -3601450 -692551 8444952 17412602 19816960 13987971 3230394
3549C230394j0769540p702126l756554O66859N232458P588447N625899J017403
$$ 3230394 -7539146 -15241272 -18997826 -18330967 -13098509 -5510062 115837 1133240
3541A133240k180225k140616l09977J396275K140854J911182K017551M373679
$$ 1133240 -1046985 -3187601 -3497578 -2101303 39551 1950733 3968284 8341963
3533H341963P909216Q117388L400560j220820j254315j68061l308383p312152
$$ 8341963 16251179 24368567 27769127 26548307 25293992 25125931 21817548 14505396
3525A4505396m139693N130245R932543N267274j720563l442402k014381k963170
$$ 14505396 10365703 15495948 25428491 30695765 28975202 25532800 23518419 20555249
3517B0555249n580790n367779j543601K880883N076264K983101l846100j0693466
$$ 20555249 14974459 9606680 8063079 10943962 16020226 19003327 15157227 4463761
3509D463761r914782p15910Q128654R393346N985406L912726K829065O524j889968
$$ 4463761 -5451021 -6166931 1961723 11355069 17340475 21253201 24082266 24088790 22198822
3500B2198822P80532M268923K152292l859643o329387l985668k678442m691451
$$ 22198822 22979354 27248277 29400569 25540926 19211539 15225871 12547429 7855978
3492G855978n626241l142571r78402j922392l337908k292382L25660K954729N390741
$$ 7855978 2229737 -912834 -1891236 -3813628 -7151536 -9443918 -9118258 -6163529 -772788
3483g72788N876294J816964m382058o089814k051546O05791l062757p619411m729754
$$ -772788 5103506 6920470 2538412 -3551402 -5602948 -4997157 -8059914 -15679325 -20409079
3474b0409079N087452J3403507J3862794O838540l045287r542208p799920J54884
$$ -20409079 -15321627 -1918120 11944674 18783214 15737927 6195719 -1604201 -1449317
3466a449317N245411J825544m043141k811318M254536O783218R24550n499310
$$ -1449317 3796094 5621638 1578497 -1232821 3021715 9804933 10729483 5230173
3458E230173n606460k623618j877821j382782K533226O071209L300446k632891
$$ 5230173 -376287 -2999905 -4877726 -6260508 -3727282 2343927 5644373 3011482
3450C011482l187792J676799L216021j229223l349262J901080O824929L157321
$$ 3011482 -176310 1500489 4716510 3487287 138025 2039105 8864034 12021355
3442A2021355l909966l702396K751335M756246m30692l660895O62346N901024
$$ 12021355 8111389 4408993 7160328 11916574 11485882 7824987 8487333 14388357
3434A4388357M443510j148438m201874m050804l349048j173398L406138N286700
$$ 14388357 18831867 17683429 13481555 9430751 6081703 4908305 8314443 13601143
3426A3601143m17365q475399q774208r92012M469046J400769m264630m214433
$$ 13601143 13183778 4708379 -4065829 -5057841 -588795 811974 -3452656 -7667089
3418g667089J242614N833016N845778J886914l879707q124983p155688j380518
$$ -7667089 -6424475 -591459 5254319 7141233 3261526 -4863457 -12019145 -13399663
3410a3399663L423816K914303j75166r08748J06661j033777l310443j178379O139992
$$ -13399663 -9975847 -7061544 -7236710 -8145458 -8038797 -9072574 -12383017 -13561396 -7421404
3401g421404J1637179R426713K315352k809774l717548k936259j725262P90788
$$ -7421404 4215775 13642488 15957840 13148066 9430518 6494259 4768997 5559785
3393E559785L066173J278855m225671p160744l251895L044072L758852k160426
$$ 5559785 8625958 9904813 5679142 -1481602 -4733497 -1689425 2069427 -90999
3385i0999p705372o820422q45405M637305O116518M030446Q75928r57741r11845
$$ -90999 -7796371 -14616793 -15462198 -10824893 -4708375 -677929 197999 -759742 -1671587
3376a671587n92608j173321r94853J712365M412008K770774j984338l364299P19065
$$ -1671587 -2264195 -3437516 -4432369 -2720004 1692004 4462778 2478440 -885859 -166794
3367a66794M009214J331927l170209k719287J299399K231954n48589j141678K315098
$$ -166794 3842420 5174347 2004138 -715149 584250 2816204 2267615 1125937 3441035
3358C441035M429235J755798j723094j685212l48904j829107m769885m703921
$$ 3441035 7870270 9626068 7902974 6217762 5868858 4039751 -730134 -5434055
3350e434055j529732K26281j837488m683657l802564J687960Q376406J1786916
$$ -5434055 -6963787 -6737506 -8574994 -13258651 -17061215 -15373255 -6996849 4790067
3342D790067J0185951N911620K818509K185325J729818j208606o367739j0626809
$$ 4790067 14976018 20887638 23706147 25891472 27621290 26412684 20044945 9418136
3334I418136j0720602o191537m14676K210009J311435J290640M899577Q085534
$$ 9418136 -1302466 -7494003 -7908679 -5698670 -4387235 -3096595 1802982 9888516
3326I888516N131749k256967o231422l608076J41366k59900k419276j377734K137585
$$ 9888516 15020265 12763298 6531876 2923800 3065166 2805266 385990 -991744 1145841
3317A145841L566382K102910J253661K658933L930372K981544R33996k20255l20316
$$ 1145841 4712223 6815133 8068794 10727727 14658099 17639643 18573639 18353384 18033068
3308A8033068l61788q06731j568421k787291m706828o614507o254153j646763
$$ 18033068 17671280 16864549 15296128 12508837 7802009 1187502 -5066651 -6713414
3300f713414N216970Q053638K835625n820405q981676m746699l33722q90287k065187
$$ -6713414 -1496444 6557194 9392819 3572414 -5409262 -10155961 -10489683 -11379970 -13445157
3291a3445157J663091O422292M059269m505679r008648l494867O461861J1921293
$$ -13445157 -11782066 -5359774 -1300505 -5806184 -14814832 -18309699 -11847838 73455
3283G3455J0142364L617887m766124j1535991j1905483m560948M587456P871154
$$ 73455 10215819 13833706 9067582 -2468409 -14373892 -18934840 -14347384 -6476230
3275f476230M434071l8064j299847m18813K87253R98671K394563L085501J781272
$$ -6476230 -2042159 -2080223 -3380070 -3798883 -3511630 -2512959 -118396 2967105 4748377
3266D748377L24538J636180N078265O552781L767175p85258l316171l558081m230896
$$ 4748377 5072915 6709095 11787360 18340141 22107316 21322058 18005887 14447806 10216910
3257A0216910o391087p345627l817352L708416J0452436J1282609N558895j855580
$$ 10216910 3825823 -3519804 -7337156 -3628740 6823696 18106305 23665200 21809620
3249B1809620n178964l553765j179916j315874k255974p60684K687511M750269
$$ 21809620 16630656 13076891 11896975 10581101 8325127 7564443 10251954 15002223
3241A5002223L974082J625877j344392m873958p634689p609179m967047j591544
$$ 15002223 18976305 20602182 19257790 14383832 6749143 -860036 -5827083 -7418627
3233g418627J805065M894273N136242O94830m388616l652275K291040N736629
$$ -7418627 -5613562 -719289 4416953 5111783 723167 -2929108 -638068 5098561
3225E098561L094065m35619l63648q4771l495960o752415m351092R75151K019469
$$ 5098561 8192626 7757007 7393359 7308588 3812628 -2939787 -7290879 -6315728 -4296259
3216d296259j802278m229626j542769M164248R712474J2667363R893294J019338
$$ -4296259 -6098537 -10328163 -11870932 -7706684 2005790 14673153 24566447 25585785
3208B5585785p375860p843847k249428O83790k012788m491761k396745J230794
$$ 25585785 18209925 10366078 8116650 8800440 6787652 2295891 -100854 1129940
3200A129940K523558K454398K836136K448819N72408m21642P88977J911667J297549
$$ 1129940 3653498 6107896 8944032 11392851 11965259 11543617 12332594 14244261 15541810
3191A5541810O38483R36580M0383l121770n812415n535106l178577k45643L005077
$$ 15541810 16180293 17116873 17157256 14035486 8223071 2687965 -490612 -736255 2268822
3182B268822N162202M187077J739555J353547J010597m991701j4169956j4978120
$$ 2268822 7431024 11618101 13357656 14711203 15721800 10730099 -3439857 -18417977
3174a8417977l378846Q392785P695676j076530m494458J70147M260201L361662
$$ -18417977 -21796823 -13404038 -5708362 -6784892 -11279350 -11109203 -6849002 -3487340
3166c487340J894214K711304K927960J358129Q52458J495628j52934l226491k270895
$$ -3487340 -1593126 1118178 4046138 5404267 6256725 7752353 7599419 4372928 2102033
3157B102033K781913M591956j37736m803540k957242K342989M205435J544781
$$ 2102033 4883946 9475902 9338166 4534626 1577384 3920373 8125808 9670589
3149I670589j840615l322597k142975J686543N082469K974542m041575p932799
$$ 9670589 7829974 4507377 2364402 4050945 9133414 12107956 8066381 133582
3141A33582l983062J703041J418904k367133k115463J809510K603284k62462R9460
$$ 133582 -3849480 -2146439 -727535 -3094668 -5210131 -3400621 -797337 -1059799 -960339
3132i60339N423371Q272699M067098j226597p61577K420490R24982n176746r304539
$$ -960339 4463032 12735731 16802829 15576232 14814655 17235145 18160127 12983381 3678842
3123C678842q786052p078873o025447k887185L161744P427588O054864K186296
$$ 3678842 -5107210 -12186083 -18211530 -21098715 -17936971 -10509383 -4454519 -2268223
3115b268223J873309N947985R583978Q842011M352038r77935m629985m744651
$$ -2268223 -394914 5553071 15137049 23979060 28331098 27353163 22723178 17978527
3107A7978527j077316L207808L602653r0551k556728K41417M970556M713536j937731
$$ 17978527 16901211 20109019 23711672 23621121 21064393 21305810 26276366 30989902 29052171
3098B9052171q802561r523660m403340J154495K870853P60763k426163m037944
$$ 29052171 20249610 10725950 6322610 7477105 10347958 11108721 8682558 4644614
3090D644614l154526q37108Q62079O54403q45717j625392q4185L096771M856356
$$ 4644614 1490088 652980 1515059 2169462 1323745 -301647 -385832 2710939 7567295
3081G567295K707973j559038k846528P92589M404423K174626l606363m385371
$$ 7567295 10275268 8716230 5869702 6662291 11066714 13241340 9634977 5249606
3073E249606K498815Q484204M575245o012550j1605665p208541K62965K845418
$$ 5249606 7748421 16232625 20807870 14795320 3189655 -4018886 -3755921 -910503
3065i10503J567827K152533N351989O937503N056337J941493j212996n514910
$$ -910503 657324 2809857 8161846 15099349 20155686 22097179 20884183 15369273
3057A5369273r648289r404023m375473j78025l86410q43275K914434O578593K679154
$$ 15369273 5720984 -3683039 -8058512 -8236537 -8622947 -9466222 -6551788 26805 2705959
3048B705959o611435j0700792n468686J260040K147837N28126K848257P307230
$$ 2705959 -3905476 -14606268 -20074954 -18814914 -16667077 -16138951 -13290694 -5983464
3040e983464P358902K703671r70574j513131k215401m409866m970214k323662
$$ -5983464 1375438 4079109 3108535 1595404 -619997 -5029863 -10000077 -12323739
3032a2323739P56617K090020L165815N546583Q098047R236142Q431333M698285
$$ -12323739 -11567122 -9477102 -6311287 -764704 7333343 16569485 25000818 29699103
3024B9699103k363922r148513j0236931n605015j287268j129414k393445j613559
$$ 29699103 27335181 18186668 7949737 2344722 1057454 -71960 -2465405 -4078964
3016d078964N4690L06446L2044P15157J344146J214316J876677L021186J030596
$$ -4078964 -4024274 -3717828 -3685784 -2970627 -1626481 -412165 1464512 4485698 5516294
3007E516294m228787o154279n31766O561077O790577J903055J31547K680722K794730
$$ 5516294 1287507 -4866772 -5398538 1162539 7953116 9856171 9987718 12668440 15463170
2998A5463170j967212n588423l670352K05404J292638K44218p06292k291659m814785
$$ 15463170 13495958 7907535 4237183 4442587 5735225 5979443 5273151 2981492 -1833293
2989a833293n164696j803420J160908m78188m355603m807415n52271M857626Q196486
$$ -1833293 -6997989 -8801409 -7640501 -8118689 -12474292 -17281707 -17833978 -12976352 -4779866
2980d779866Q332400M842045r09199m631560l264654L74957Q68004k421984n022285
$$ -4779866 3552534 8394579 7485380 2853820 -410834 -35877 832127 -1589857 -6612142
2971f612142m103421j461763O92350K753221M916450M936728J447151k523356
$$ -6612142 -10715563 -12177326 -11484976 -8731755 -3815305 1121423 2568574 45218
2963D5218k248915K928181Q451727R283520M786850j140305m173864l620913k375215
$$ 45218 -2203697 724484 9176211 18459731 23246581 22106276 17932412 14311499 11936284
2954A1936284k840622l731535k147862J590921L385779O68749l592219m368508
$$ 11936284 9095662 5364127 3216265 4807186 8192965 8861714 5269495 900987
2946I00987j159992J637126J144237m06786k74712k94715l413261o764606l856453
$$ 900987 -259005 1378121 2522358 2115572 1840860 1546145 -1867116 -8631722 -12488175
2937a2488175N127777J0808066O248514l022035o019380p95563M493648M254027
$$ -12488175 -7360398 3447668 9696182 6674147 654767 -140796 4352852 8606879
2929H606879K036611K739715M824200M228481J274781r32349j727744k056621
$$ 8606879 10643490 13383205 18207405 22435886 23710667 22778318 21050574 18993953
2921A8993953j087794J729507L347048P89034l312733m010259j961181k368759
$$ 18993953 17906159 19635666 22982714 23771748 20459015 16448756 14487575 12118816
2913A2118816n924188p021059k802225J915802K224328O70122K267909N349208
$$ 12118816 6194628 -826431 -3628656 -1712854 511474 1181596 3449505 8798713
2905H798713L536118l974751j0029405q958219l883096j671606l562260m707574
$$ 8798713 12334831 8360080 -1669325 -10627544 -14510640 -16182246 -19744506 -24452080
2897b4452080k012789J802489L161180L137063M888634P459658O445458J255485
$$ -24452080 -26464869 -24662380 -21501200 -18364137 -13475503 -6015845 429613 1685098
2889A685098k508224l90932M283851M761846J31132l912668l265030k11748J003322
$$ 1685098 -823126 -1214058 3069793 7831639 7962771 4050103 785073 573325 1576647
2880A576647j80016j451091j473890m95267J292646L696783N642565O086603N186230
$$ 1576647 1396631 -54460 -1528350 -2023617 -730971 2965812 8608377 14694980 19881210
2871A9881210L339820J64945l960770o475630n121939j618896l90451k847552
$$ 19881210 23221030 23385975 19425205 12949575 7827636 6208740 5818289 2970737
2863B970737m940116k092954M435281Q317159N649505k77417l299826k126204
$$ 2970737 -1969379 -4062333 372948 8690107 14339612 14062195 10762369 8636165
2855H636165r63084k519073m143821k934544j124644k258630m224856j699097
$$ 8636165 7673081 5154008 1010187 -1924357 -3049001 -5307631 -9532487 -11231584
2847a1231584M656524P548232L621556r78805M18091N000218N008511l42103l888210
$$ -11231584 -6575060 973172 4594728 3615923 4034014 9034232 14042743 13700640 9812430
2838I812430j304448L000882K647539k305137o419873n810076j440387L093193
$$ 9812430 8507982 11508864 14156403 11851266 5431393 -378683 -1819070 1274123
2830A274123M913484L553322Q59209p58558o05379j44044j010857k899583l562180
$$ 1274123 6187607 9740929 10600138 9841580 9236201 9092157 8081300 5181717 1619537
2821A619537j057427L418079N254289R37571o415330q699437k366208N986230
$$ 1619537 562110 3980189 9234478 10172049 3756719 -4942718 -7308926 -1322696
2813a322696P181910J098207l843814k399152J622119K529490O04606m42401n6441
$$ -1322696 5859214 6957421 3113607 714455 2336574 4866064 5470670 5028269 4971828
2804D971828p38675l257801n512635n391499k523117J719745M364484K971786
$$ 4971828 4233153 975352 -4537283 -9928782 -12451899 -10732154 -6367670 -3395884
2796c395884n24002p66727L686020P135609M585520m04662j064048J838643J567827
$$ -3395884 -3919886 -4686613 -1000593 6135016 10720536 10315874 9251826 11090469 12658296
2787A2658296k953541n088451j832212P11467k437622o160690l048205M334731
$$ 12658296 9704755 4616304 2784092 3495559 1057937 -5102753 -8150958 -3816227
2779c816227O738306J945417k516261r56630L026922L270824K8220j618664N97258
$$ -3816227 2922079 4867496 2351235 1394605 4421527 7692351 7720571 6101907 6699165
2770F699165L828608M396593J676023k094263m301443m225103l335201l061932
$$ 6699165 10527773 14924366 16600389 14506126 10204683 5979580 2644379 -417553
2762d17553k690734q29684J481404J532722q68577k661443j864307K26204K451128
$$ -417553 -3108287 -3937971 -2456567 -923845 -1792422 -4453865 -6318172 -6091968 -3640840
2753c640840N848024R693864R173311J646050o932216p546641J2574O233302M145355
$$ -3640840 2207184 11901048 21074359 22720409 15788193 8241552 8254126 14487428 18632783
2744A8632783k452943n617656l804623j680767j948794k152719M32216M322732
$$ 18632783 16179840 10562184 6757561 5076794 3128000 975281 1407497 5730229
2736E730229N555654K355493k847256n737662m477019j685176j230318l269398
$$ 5730229 11285883 13641376 10794120 5056458 579439 -1105737 -2336055 -5605453
2728e605453m400799k943290j076974l56125J354346N265898O988033J422982
$$ -5605453 -10006252 -12949542 -14026516 -14382641 -13028295 -7762397 -774364 648618
2720F48618q633339j3859439r151661R94349Q845301J1300912R799942O214154
$$ 648618 -7984721 -21844160 -30995821 -30001472 -21156171 -9855259 -55317 6158837
2712F158837J926475j174347j883076j237801j105827j863568k646866k941049
$$ 6158837 8085312 6910965 5027889 3790088 2684261 820693 -1826173 -4767222
2704d767222k767049k117189j112237k6175J191683K445829K689512J245082k60908
$$ -4767222 -7534271 -9651460 -10763697 -10789872 -9598189 -7152360 -4462848 -3217766 -3478674
2695c478674M12036K462554K884761J242417K45018Q27423N49189j676206l468095
$$ -3478674 -3066638 -604084 2280677 3523094 3768112 4595535 5144724 3468518 423
2686D23l676038m570484o300729m186144L724929J0819804R829456L509048O93362
$$ 423 -3675615 -8246099 -14546828 -18732972 -15008043 -4188239 5641217 9150265 9843627
2677I843627L646213O437077N051594J760128j002848l965632o669399o266834
$$ 9843627 13489840 19926917 24978511 26738639 25735791 21770159 15100760 8833926
2669H833926k893281n94892p69163k27613K096322K624666K72507j94562L802939
$$ 8833926 5940645 5345753 4576590 4348977 6445299 9069965 9342472 9147910 12950849
2660A2950849O960513L696766l155500o862581o199563m554081k770228Q80269
$$ 12950849 19911362 23608128 20452628 13590047 7390484 2836403 66175 946444
2652I46444N425344P613610O586101L604638j126031o657920q586714l970358
$$ 946444 6371788 13985398 20571499 24176137 23050106 16392186 7805472 3835114
2644C835114K476800L248963j513776m453787j598852L592888O900211P486939
$$ 3835114 6311914 9560877 8047101 3593314 1994462 5587350 12487561 19974500
2636A9974500M499713l366667j2276459j3757894n075641N572290Q539411L884958
$$ 19974500 24474213 21107546 8831087 -4926807 -10002448 -4430158 4109253 7994211
2628G994211r26583j237751J415069L937882M861214L334152j033972o379523
$$ 7994211 7067628 5829877 7244946 11182828 16044042 19378194 18344222 11964699
2620A1964699q956298o584942j229446K314310P22814m249356o981713l918541
$$ 11964699 3008401 -3576541 -4805987 -2491677 -1768863 -6018219 -12999932 -16918473
2612a6918473K395393O671186P104274N927689M997363M194520L582335L342956
$$ -16918473 -14523080 -7851894 -747620 5180069 10177432 14371952 17954287 21297243
2604B1297243J728015k894096p858201q449692m725660j395913l37783J315795
$$ 21297243 23025258 20131162 12272961 3823269 -902391 -2298304 -2636087 -1320292
2596a320292M362910M948545J422395k022676j972131o62949n68701L12585L297379
$$ -1320292 3042618 7991163 9413558 7390882 5418751 4755802 4187101 4499686 7797065
2587G797065M644708J758606j197947J30541K625158J046630l077655m819114
$$ 7797065 12441773 14200379 13002432 13132973 15758131 16804761 13727106 8907992
2579H907992m223127l880484j941642L866742Q431780N238767j750448k682343
$$ 8907992 4684865 804381 -1137261 2729481 11161261 16400028 14649580 11967237
2571A1967237K351402L207182l530281r156263p399505l349639k750525k398611
$$ 11967237 14318639 17525821 13995540 4839277 -2560228 -5909867 -8660392 -11059003
2563a1059003J889756N963095L912505j910824m850387l409141l83194L003329
$$ -11059003 -9169247 -3206152 706353 -1204471 -6054858 -9463999 -9847193 -6843864
2555f843864N785978M420842k006639p297245n470748M44278L192397J740976
$$ -6843864 -1057886 3362956 1356317 -5940928 -11411676 -10967398 -7775001 -6034025
2547f034025M34525O51268L52862j75040R29069K231008J386110N98524L063339
$$ -6034025 -5599500 -4948232 -4595370 -4770410 -3841341 -1610333 -224223 374301 3437640
2538C437640O005215M594493Q89195O66237K826169J282637l057725k613161L273721
$$ 3437640 9442855 14037348 14926543 15592780 18418949 19701586 16643861 14030700 17304421
2529A7304421N847110J351991k635595n59063J427538l366174r703240q487412
$$ 17304421 23151531 24503522 21867927 21308864 22736402 19370228 9666988 1179576
2521A179576j456006K119512L8973j203017J816501M888545M056773R68225j118252
$$ 1179576 -276430 1843082 1882055 679038 2495539 7384084 11440857 12409082 11290830
2512A1290830j338399m2277K097511L145776J849802M59918J684983L455863J550734
$$ 11290830 9952431 9910154 12007665 15153441 17003243 17463161 19148144 22604007 24154741
2503B4154741k845365l901545l40862J987141r69213n245674n065706j166769
$$ 24154741 21309376 17407831 17066969 19054110 18084897 12839223 7773517 6606748
2495F606748J238411K10615j348935p12713J461492K671659J176846k615126n999895
$$ 6606748 7845159 8055774 6706839 5994126 7455618 10127277 11304123 8688997 2689102
2486B689102n986959k604890Q56804J887751J490038J655795K128543J763651
$$ 2689102 -3297857 -5902747 -5045943 -3158192 -1668154 -12359 2116184 3879835
2478C879835J383186K425850L607838K025376k162999m837235k874563J629462
$$ 3879835 5263021 7688871 11296709 13322085 11159086 6321851 3447288 5076750
2470E076750L502858L23191m856428o775900l753976K64368K01391l779937o037734
$$ 5076750 8579608 8902799 4046371 -2729529 -6483505 -6219137 -6017746 -9797683 -15835417
2461a5835417k502347L734637N989401K329790k242624k263096J947229N763516
$$ -15835417 -18337764 -14603127 -8613726 -6283936 -8526560 -10789656 -8842427 -3078911
2453c078911O190582M277618K255231M90519j867357m471728n512986l910791
$$ -3078911 3111671 7389289 9644520 10135039 8267682 3795954 -1717032 -5627823
2445e627823o91945K312744M232257M770854L142490o80448l997483l331443P10517
$$ -5627823 -6319768 -4007024 225233 4996087 8138577 7458129 3460646 129203 839720
2436H39720L160038J247935j271919L23805L743031K282561m388219p752149j853366
$$ 839720 3999758 5247693 3975774 4299579 8042610 10325171 5936952 -1815197 -3668563
2427c668563P255288Q660352J130132n364021l113839L761806N884263Q27092
$$ -3668563 3586725 12247077 13377209 8013188 4899349 8661155 14545418 15372510
2419A5372510n269758o433417k947760J259911L512984L126760J1341m717336
$$ 15372510 10102752 3669335 721575 1981486 5494470 8621230 8632571 3915235
2411C915235p638870n363724J088713N919558M358820j456796m291112l45172
$$ 3915235 -3723635 -9087359 -7998646 -2079088 2279732 822936 -3468176 -3813348
2403c813348N683092O219102O93835l482700q43384M677334N311491J56875m281332
$$ -3813348 1869744 8088846 8782681 5299981 4456597 9133931 14445422 14602297 10320965
2394A0320965l764285j348813j145669j963183q15382R42644J10057j623493P64719
$$ 10320965 6556680 5207867 4062198 2099015 1283633 2226277 2336334 712841 1477560
2385A477560P093438J0355168N580016l677060j0000004j0020674n492033P0693
$$ 1477560 8570998 18926166 24506182 20829122 10829118 808444 -4683589 -4612896
2377d612896K849701J27008n755290p366691p74863P684366Q628688K650762l12689
$$ -4612896 -1763195 -1636187 -7391477 -14758168 -15533031 -7848665 780023 3430785 3118096
2368C118096M556759R991344P432097j026258o654678o116449l528834k638229
$$ 3118096 7674855 17666199 25098296 24072038 17417360 11300911 7772077 5133848
2360E133848l059582l895276n393055o106241l368237J693106L882184R82099
$$ 5133848 2074266 -1821010 -7214065 -13320306 -16688543 -14995437 -11113253 -10131154
2352a0131154k462568j104337M248073Q358943P924325L549330k229898n719062
$$ -10131154 -12593722 -13698059 -9449986 -1091043 6833282 10382612 8152714 2433652
$$ [...]
##END NTUPLES=NMR SPECTRUM
##END=
