##TITLE=31Pdec_DE--106rm_3h
, 24 sc
 5.8.2025
##JCAMPDX= 6.0         $$ Bruker NMR JCAMP-DX V2.0
##DATA TYPE= NMR SPECTRUM
##DATA CLASS= NTUPLES
##ORIGIN= UXNMR, Bruker Analytische Messtechnik GmbH
##OWNER= root
$$ XWIN-NMR		Version 3.5
$$ Wed Aug  6 14:20:43 2025 Russian Standard Time (UT+4h)  she@DPX200
##.OBSERVE FREQUENCY= 81.013821
##.OBSERVE NUCLEUS= ^31P
##.ACQUISITION MODE= SIMULTANEOUS
##.ACQUISITION SCHEME= undefined
##.AVERAGES= 64
##.DIGITISER RES= 17
##SPECTROMETER/DATA SYSTEM= spect
##.PULSE SEQUENCE= zgpg30
##.SOLVENT NAME= CDCl3
##.SHIFT REFERENCE= (INTERNAL, CDCl3, 0, 198.062)
##AUDIT TRAIL= $$ (NUMBER, WHEN, WHO, WHERE, WHAT)
$$ ##TITLE= Audit trail, XWIN-NMR		Version 3.5
$$ ##JCAMPDX= 5.01
$$ ##ORIGIN= Bruker BioSpin GmbH
$$ ##OWNER= she
$$ F:/spectra/data/she/nmr/P31/2/pdata/1/auditp.txt
$$ ##AUDIT TRAIL=  $$ (NUMBER, WHEN, WHO, WHERE, WHAT)
(   1,<2025-08-06 14:19:41.43 +0400>,<she>,<DPX200>,
      <created by zg, POWCHK disabled, PULCHK disabled
       configuration hash MD5:
       00 E9 B6 7A A2 85 ED C7 34 08 36 98 17 FE 4E 26
       data hash MD5: 32K
       CE E7 AD 6A 51 7A 41 E6 EB 9E 39 88 4A 2A 50 5F>)
(   2,<2025-08-06 14:19:44.09 +0400>,<she>,<DPX200>,
      <Start of raw data processing
       efp BC_mod = 2 LB = 1.5 FT_mod = 6 PKNL = 1 PHC0 = 1794.302 PHC1 = -44.50122 SI = 64K 
       data hash MD5: 64K
       0C B7 F8 04 D3 5B 9D 54 D6 87 4A 6A D2 F8 11 AB>)
(   3,<2025-08-06 14:19:57.03 +0400>,<she>,<DPX200>,
      <pk PHC0 = -7.467661 PHC1 = 0 
       data hash MD5: 64K
       FE 84 07 68 B6 64 D4 B3 28 9C E2 E1 45 26 C1 FA>)
(   4,<2025-08-06 14:20:00.82 +0400>,<she>,<DPX200>,
      <abs ABSG = 5 
       data hash MD5: 64K
       FB AF 2E 5E DA 19 82 86 6A E9 A4 46 21 40 EE 5D>)
$$ ##END=
$$ 
$$ hash MD5
$$ 33 75 11 5F 8F 7E 06 7C 5F E4 57 D5 4C D8 0F 0B
##$RELAX= 
##$RELAX= 
##$RELAX= 
##$RELAX= 
##$RELAX= 
##$RELAX= 
##$RELAX= 
##$RELAX= 
$$ Bruker specific parameters
$$ --------------------------
##$DU= <F:/spectra>
##$EXPNO= 2
##$NAME= <P31>
##$PROCNO= 1
##$TYPE= <nmr>
##$USER= <she>
##$AMP= (0..31)
100 100 100 100 100 100 100 100 100 100 100 100 100 100 100 100 100 100 
100 100 100 100 100 100 100 100 100 100 100 100 100 100 
##$AQSEQ= 0
##$AQ_mod= 1
##$AUNM= <au_zg>
##$AUTOPOS= <>
##$BF1= 81.014009
##$BF2= 200.13
##$BF3= 200.13
##$BF4= 200.13
##$BF5= 200.13
##$BF6= 200.13
##$BF7= 200.13
##$BF8= 200.13
##$BYTORDA= 1
##$CFDGTYP= 0
##$CFRGTYP= 5
##$CHEMSTR= <none>
##$CNST= (0..31)
1 1 145 1 1 1 1 1 1 1 1 1 1 1 1 1 1 1 1 1 1 1 1 1 1 1 1 1 1 1 1 1 
##$CPDPRG= <waltz16>
##$CPDPRG1= <>
##$CPDPRG2= <waltz16>
##$CPDPRG3= <>
##$CPDPRG4= <mlev>
##$CPDPRG5= <mlev>
##$CPDPRG6= <mlev>
##$CPDPRG7= <mlev>
##$CPDPRG8= <mlev>
##$CPDPRGB= <>
##$CPDPRGT= <>
##$D= (0..31)
0 1 0 0 0 0 0 0 0 0.06 0 0.03 2e-05 3e-06 0 0 0.0002 0 0 0 0 0 0 0 0 0 
0 0 0 0 0 0 
##$DATE= 1754475580
##$DBL= (0..7)
120 120 120 11 120 120 24 19 
##$DBP= (0..7)
150 150 150 150 150 150 150 150 
##$DBP07= 0
##$DBPNAM0= <>
##$DBPNAM1= <>
##$DBPNAM2= <>
$$ [...]
##$SUBNAM4= <"">
##$SUBNAM5= <"">
##$SUBNAM6= <"">
##$SUBNAM7= <"">
##$SUBNAM8= <"">
##$SUBNAM9= <"">
##$SW= 400.765351723535
##$SWIBOX= (0..15)
0 1 3 0 0 0 0 0 0 0 0 0 0 0 0 0 
##$SW_h= 32467.5324675325
##$TD= 32768
##$TD0= 1
##$TE= 0
##$TE2= 300
##$TE3= 300
##$TEG= 300
##$TL= (0..7)
0 120 53 12 22 120 120 120 
##$TP= (0..7)
150 150 150 150 150 150 150 150 
##$TP07= 0
##$TPNAME0= <>
##$TPNAME1= <>
##$TPNAME2= <>
##$TPNAME3= <>
##$TPNAME4= <>
##$TPNAME5= <>
##$TPNAME6= <>
##$TPNAME7= <>
##$TPOAL= (0..7)
0.5 0.5 0.5 0.5 0.5 0.5 0.5 0.5 
##$TPOFFS= (0..7)
0 0 0 0 0 0 0 0 
##$TUNHIN= 0
##$TUNHOUT= 0
##$TUNXOUT= 0
##$USERA1= <user>
##$USERA2= <user>
##$USERA3= <user>
##$USERA4= <user>
##$USERA5= <user>
##$V9= 5
##$VALIST= <valist>
##$VCLIST= <CCCCCCCCCCCCCCC>
##$VD= 0
##$VDLIST= <DDDDDDDDDDDDDDD>
##$VPLIST= <PPPPPPPPPPPPPPP>
##$VTLIST= <TTTTTTTTTTTTTTT>
##$WBST= 1024
##$WBSW= 4
##$XGAIN= (0..3)
0 0 0 0 
##$XL= 0
##$YL= 0
##$YMAX_a= 48075
##$YMIN_a= -54840
##$ZGOPTNS= <>
##$ZL1= 120
##$ZL2= 120
##$ZL3= 120
##$ZL4= 120
##$ABSF1= 198.0616
##$ABSF2= -202.7028
##$ABSG= 5
##$ABSL= 3
##$ALPHA= 0
##$AQORDER= 0
##$ASSFAC= 0
##$ASSFACI= 0
##$ASSFACX= 0
##$ASSWID= 0
##$AUNMP= <proc_1d>
##$AZFE= 0.1
##$AZFW= 0.5
##$BCFW= 0
##$BC_mod= 2
##$BYTORDP= 0
##$COROFFS= 0
##$CY= -3
##$DATMOD= 1
##$DC= 0
##$DFILT= <>
##$DTYPP= 0
##$F1P= 0
##$F2P= 0
##$FCOR= 1
##$FTSIZE= 65536
##$FT_mod= 6
##$GAMMA= 0
##$GB= 0
##$INTBC= 1
##$INTSCL= 9.790993e-09
##$ISEN= 30
##$LB= 1.5
##$LEV0= 0
##$LPBIN= 0
##$MAXI= 10000
##$MC2= 0
##$MEAN= 0
##$ME_mod= 0
##$MI= 50
##$NCOEF= 0
##$NC_proc= -9
##$NLEV= 6
##$NOISF1= 182.463
##$NOISF2= 159.3651
##$NSP= 0
##$NTH_PI= 0
##$NZP= 0
##$OFFSET= 198.0616
##$PC= 4
##$PHC0= 1786.834
##$PHC1= -44.50122
##$PH_mod= 1
##$PKNL= yes
##$PPARMOD= 0
##$PSCAL= 0
##$PSIGN= 0
##$REVERSE= no
##$SF= 81.0140089999434
##$SI= 65536
##$SIGF1= 159.3651
##$SIGF2= -187.1042
##$SINO= 113.3802
##$SIOLD= 16384
##$SREGLST= <1H.CDCl3>
##$SSB= 0
##$STSI= 65536
##$STSR= 0
##$SW_p= 32467.5324675325
##$SYMM= 0
##$S_DEV= 0
##$TDeff= 32768
##$TDoff= 0
##$TI= <>
##$TILT= no
##$TM1= 0
##$TM2= 0
##$TOPLEV= 0
##$USERP1= <user>
##$USERP2= <user>
##$USERP3= <user>
##$USERP4= <user>
##$USERP5= <user>
##$WDW= 1
##$XDIM= 65536
##$YMAX_p= 423413703
##$YMIN_p= -244312731
$$ End of Bruker specific parameters
$$ ---------------------------------
##NTUPLES= NMR SPECTRUM
##VAR_NAME=  FREQUENCY,     SPECTRUM/REAL,   SPECTRUM/IMAG
##SYMBOL=    X,             R,               I
##VAR_TYPE=  INDEPENDENT,   DEPENDENT,       DEPENDENT
##VAR_FORM=  AFFN,          ASDF,            ASDF
##VAR_DIM=   65536,         65536,           65536
##UNITS=     HZ,            ARBITRARY UNITS, ARBITRARY UNITS
##FACTOR=    0.49542278885378, 1,            1
##FIRST=     16045.7642231865, 0,            0
##LAST=      -16421.768244346, 0,            0
##MIN=       -16421.768244346, -244312731,   0
##MAX=       16045.7642231865, 423413703,    0
$$ Real data points
##PAGE= N=1
##DATA TABLE= (X++(R..R)), XYDATA
$$ [...]
46005b8191120j97474N824882N759660J390564j71488L225261N843310L742200
45997b774205O10719O8979p36488m205912n599823n06787O355652P674348M606614
45988E493097L266379L891219K216903j144194j947093j413302m718835j0487190
45980d843016j0838082l354657M845855P132945M831454K377006P79512j258077
45972c27060l750253n330348m598072j260628K339770K679966M69096J037704
45964h739825N589141P227945J894398k465755K973157J2035118J0695944j534172
45956B7675951j0120084o481299J788275M678684K296486q50681l764087n565067
45948I658178k976586L113599O057730L227542r3252o93632k547640o980107p392689
$$ y = [-28191120, -28388594, -22563712, -16804052, -15413488, -15584976, -12359715, -6516405, -2774205, -2163486, -2094507, -2830995, -7036907, -12636730, -13143517, -6787865, 886483, 5493097, 8759476, 12650695, 14867598, 13723404, 11776311, 10363009, 5644174, -4843016, -15681098, -19035755, -14189900, -7056955, -2225501, 151505, 931017, -327060, -4077313, -9407661, -14005733, -15266361, -12926591, -10246625, -9777529, -8739825, -3150684, 4077261, 5971659, 3505904, 6479061, 18514179, 29210123, 27675951, 17555867, 11074568, 12862843, 17541527, 19838013, 18987332, 15223245, 9658178, 6681592, 9795191, 15852921, 19080463, 18987211, 18293579, 15745939, 8765832, 1373143]
45939A373143p72601M650667J677865m038105l744567K04210L88135j609394J083919
45930g86728O913253P875956L209011k79736q05255l360000q087429p739168J40134
45921b919962P378221N874053k159649q534993q882732m778718J86224L401038
45913a0436518M344689M260593L648188J046535l384487n238119j046722N460551
45905a345290P296054L579184j76312n76902M32953J001022K252629M460972N157001
45896B2081311K637876k190835p853181j2416478j2167045n343108K812969M536224
45888g902267j29111l366909j116786J954541J301953l93403J069964M318990
45880d263028N833567N856297N779797L616829k123804o929533n034646J458903
$$ y = [1373143, 600542, 5251209, 6929074, 2890969, -853598, -649388, -261253, -1870647, -786728, 6126525, 14002481, 17211492, 16931756, 16126501, 12766501, 4679072, -3060096, -2919962, 4458259, 10332312, 8172663, -362330, -9245062, -14023780, -13837556, -10436518, -6091829, -1831236, 1816952, 2863487, -521000, -5759119, -6805841, -1345290, 5950764, 9529948, 9353636, 8776734, 9209687, 10210709, 12463338, 16924310, 22081311, 24719187, 22528352, 14675171, 2258693, -9908352, -15251460, -12438491, -7902267, -8031378, -11398287, -12515073, -10560532, -9258579, -9651982, -8582018, -4263028, 1570539, 7426836, 13206633, 16823462, 14699658, 7770125, 2735479, 4194382]
45872D194382M238927p8472n612348n460911k76014L584444J934109l398044p261528
45863h135455n951057R5810O855073R760477P118019J375159k863877k770725
45855E483424J21448J675929R7136j724149p5008M254115O715877M954278J470716
45846B2973766l56613m39199o62621j438093j700319j181015n43722J64646J133628
45837A7950458J056783j928974o805003r156902n906750L90938M111551L251507
45829B963608J091697N17936j48622l036821n195924j947394M946090P922934
45821G113504L827533j528780j720230J852362L717682K820720K365280L447078
45813B1895149L835870K213443l68734k546005l172239j542966n9761l474753
$$ y = [4194382, 8433309, 8354837, 2742489, -2718422, -2994436, 590008, 2524117, -873927, -8135455, -14086512, -13990702, -7135629, 2624848, 9742867, 11118026, 8254149, 5483424, 5604872, 7280801, 7377937, 5653788, 5578780, 9832895, 16548772, 21503050, 22973766, 22617153, 22177954, 21515333, 20077240, 18376921, 17195906, 16652184, 16816830, 17950458, 19007241, 17078267, 10273264, 1116362, -4790388, -4399450, -287899, 2963608, 4055305, 4573241, 4424619, 1387798, -3808126, -5755520, -809430, 7113504, 10941037, 9412257, 7692027, 9544389, 13262071, 16082791, 18448071, 21895149, 25731019, 27944462, 27575728, 25029723, 21857484, 20314518, 20254757, 16780004]
45805A6780004j1117084j3897768n824528M953377N737739j774823l184107O724810
45797a602380J5559980J1694436N03325n470946m247754k907893m188176m806333
45789D534259m163951m970615o070681l206356K839917O272895N019635K724874
45781B979977J460519p20859l771742m051432r64853R72617n93091k130048o41073
45772g459985J670456K406698L099137M313565K223070m526776r373382n914546
45764a3561763J982849N258112K494829K4066M06334n86569m401726n537807m92003
45755a4413678N787717O861286L055709j642653n996065r437907p986987P11521
45747b3061057J0416598J1554084L480429m440464m755815J88581L370583J517889
$$ y = [16780004, 5662920, -8234848, -14059376, -9105999, -3368260, -5143083, -8327190, -1602380, 13957600, 25652036, 26155361, 20684415, 16436661, 13528768, 9340592, 4534259, 370308, -4600307, -10670988, -13877344, -11037427, -4764532, 255103, 2979977, 4440496, 3719637, -52105, -4103537, -5068390, -4095773, -4688864, -6818912, -7459985, -5789529, -3382831, -283694, 4029871, 6252941, 1726165, -7647217, -13561763, -11578914, -6320802, -3825973, -3801907, -3395573, -3982142, -8383868, -13921675, -14413678, -8625961, -1764675, 1291034, -351619, -6347684, -15785591, -23772578, -23061057, -12644459, -1090375, 2390054, -2050410, -6806225, -6617644, -3247061, -1729172]
45739a729172l146083n956418l391851L295565P690331M977332j141048k866952
45731b268296O17099K539544l57218l433783l203272k780609l894670j515622
45723a4296827O664898J2431978P771484j703276m296545M8457Q95552m783684
45715B732037p956238l053961L101973K979770l03187l7087K699173K419460o04295
45706A977645j367078R10231J822797p04513l597017l793907j857279M83596K915666
45697c209859N146737N237060J467331m447372p624528m887812Q63463L364097
45689d090883R87136j039674J068581L071588k58862m800021k056573O297544
45681h21164Q791713J600614m451864j54760P684172O779727k021005o951022
$$ y = [-1729172, -4875255, -10831673, -14223524, -10927959, -3237628, 1739704, 598656, -2268296, -1651197, 888347, 531129, -2902654, -6105926, -8886535, -12781205, -14296827, -7631929, 4800049, 12571533, 10868257, 6571712, 6620169, 7515721, 2732037, -5224201, -8278162, -5176189, -2196419, -2499606, -2536693, 162480, 2581940, 1977645, 610567, 1520798, 3343595, 2639082, -957935, -4751842, -6609121, -6125525, -3209859, 1936878, 7173938, 8641269, 4193897, -3430631, -8318443, -7454980, -4090883, -3103747, -4143421, -3074840, -3252, -262114, -5062135, -7118708, -821164, 7970549, 9571163, 5119299, 4964539, 12648711, 19428438, 17407433, 10456411]
45673A0456411k882966L596921N808582M066654L66153m984370q992249o409027
45665A026109J515116N561831Q53972m982444k184569O524439R083324Q26783
45657A8224561r166263j0382395l864579J157285J57631k640101k494435o96802
45649i705098n09579j018852O08150L404682M270068L866176N014751N778792
45641A1709090J296893o202367p333285M52115O593426J986491o488354n234257
45633c220248N862658J2930209P624227k580174o106436j421746M407680N501012
45625B2997182J318432m966278q581290o445499r86725J839613N7598j942979
45617C290054k26052L273093M726607M166302L697622K707593r42837o087853
$$ y = [10456411, 7573445, 11170366, 16978948, 21045602, 21411755, 16427385, 7435136, 1026109, 2541225, 8103056, 8957028, 3974584, 1790015, 8314454, 17397778, 18224561, 9058298, -1324097, -5188676, -4031391, -3873760, -6513861, -9008296, -9705098, -10214677, -11233529, -10625379, -7220697, -2950629, 915547, 5930298, 11709090, 13005983, 6803616, -529669, -77554, 6515872, 8502363, 2014009, -3220248, 2642410, 15572619, 23196846, 20616672, 14510236, 13088490, 17496170, 22997182, 24315614, 19349336, 10768046, 4322547, 3335822, 5175435, 5233033, 3290054, 3064002, 6337095, 11063702, 15230004, 18927626, 21635219, 20692382, 14604529]
45609A4604529q400135n643332m11310L015907L409801L539805O207411R541224
45601B5863900Q037341m7801q373034r122313k846125K757190L478253K383746
45593B2131157K085962q036n161357q109673m260580J880085K087560l786936
45585F858182p920069n896133j714693m18781j259324o57802K028753M698448
45577d281419O037616O158276N032767K491389o89105l029157l525396k216205
45569E978766j62006J058084P81070K37511R25200K083246J563542m07554o19956
45560A1437903K457853N353190L575312j810670m685148j709251L082137L583099
45552B1284425l34191l091890j244802K296612K915749L10573k218647k507572
$$ y = [14604529, 6204394, 561062, 149752, 3165659, 6575460, 10115265, 16322676, 25863900, 33901241, 33853440, 25480406, 16358093, 13511968, 16269158, 19747411, 22131157, 24217119, 24209083, 19047726, 10938053, 6677473, 8557558, 10645118, 6858182, -1061887, -6958020, -8672713, -9091494, -10350818, -11008620, -8979867, -4281419, 1756197, 7914473, 12947240, 15438629, 14749524, 11720367, 8194971, 5978766, 5816760, 6874844, 7655914, 7893425, 8818625, 10901871, 12465413, 12057859, 11437903, 13895756, 19248946, 22824258, 21013588, 16328440, 14619189, 17701326, 21284425, 20950234, 17858344, 16613542, 18910154, 21825903, 22136476, 19917829, 17410257]
45544A7410257j039220R85431K385975J571274j795046m928207m537650j460324
45536H592490J42385j313702k761086j477209P43823N19683j955362l015603j17140
45527f41721N085811P914581M679392l326529r837263r494971l925113L56777
45519i189036L13318n76912J324481M254158M381656J558662j464822l163215
45511b561710l305968j143530K799605N029369L260080P67531K126575N869186
45503A2841138O602551L796262K185759K623230l35430q322392j3259681p791734
45495a660297K609988N638503j077175p012618l967555K969588L916621j588907
45487a71852n147106k095389L020633M251202J987147L56998Q67498K051855K896238
$$ y = [17410257, 16371037, 17356468, 19742443, 21313717, 19518671, 14590464, 10052814, 8592490, 8734875, 7421173, 4660087, 3182878, 3926701, 4446384, 2491022, -524581, -641721, 4444090, 12358671, 17038063, 13711534, 3874271, -5620700, -9545813, -9189036, -8875718, -9452630, -8128149, -3873991, 507665, 2066327, 601505, -2561710, -5867678, -7011208, -4211603, 817766, 4077846, 4845377, 6971952, 12841138, 19443689, 23239951, 25425710, 28048940, 27713510, 19391118, 6131437, -1660297, 949691, 6588194, 5511019, -1501599, -5469154, -2499566, 1417055, -171852, -5318958, -7414347, -4393714, -142512, 1844635, 2201633, 3069131, 5120986, 8017224]
45478H017224L058339J410268j944785l480214l23432L925240K296475n600353
45470G358762j1399834q197775P76769O809822O111219K027333r96311j562844
45462I27141j79070K279585M366223M568811K570063q62395m450821n991332l370152
45453a41947K030562N075471K848664j024005j392091R88411J443720n27718o67511
45444H633556K340905M248695K076988j351337k304189j423236j117672j224680
45436I879030o47140m71282j945459l549099l377342k454588k419143k002132
45428f987155L71945K223044j97665n355923p180635k926307L430668O643760
45420i978268N950180M117129L189685K739719J230389j508342k868596M7661
$$ y = [8017224, 11075563, 12485831, 10541046, 7060832, 6737400, 10662640, 12959115, 7358762, -4041072, -12238847, -11462078, -4652256, 1458963, 3486296, 2489985, 927141, 748071, 3027656, 7393879, 11962690, 14532753, 13670358, 9219537, 3228205, -141947, 1888615, 6964086, 9812750, 8788745, 7396654, 8385065, 9828785, 9301067, 8633556, 10974461, 15223156, 17300144, 15948807, 13644618, 12221382, 11103710, 9879030, 9231890, 8760608, 6815149, 3266050, -111292, -2565880, -4985023, -6987155, -6615210, -4392166, -4589831, -9945754, -17126389, -20052696, -16622028, -9978268, -4028088, 89041, 3278726, 6018445, 7248834, 5740492, 2871896, 2919557]
45412B919557N148685N389841k078441r244058n883882N652862J1695776N211024
45404A8811364m953255p062411j903619J478316K77353m81849J484951K594555
45396A0245405J269589Q92875K855434L604152J517223L88924K263457K685495
45388B5722554j782911o262466m267571J550506K729261k027086m646285J98200
45380A1214202P171141P773052J392926n138198o599923l999238r41119R55435
45372A1828278J983743J947502m1648l452685n626127m440502j180931Q68923
45364A886553Q33266J222172L478480M658535Q12526p359609j4449068j5529667
45356b4446812r863600m54619P946972J1208372Q778585M327504J738159J159556
$$ y = [2919557, 8068242, 13458083, 11379642, 2135584, -3748298, 1904564, 13600340, 18811364, 13858109, 6795698, 4892079, 6370395, 6647748, 6165899, 7650850, 10245405, 11514994, 12407869, 15263303, 18867455, 20384678, 20773602, 23037059, 25722554, 23939643, 17677177, 13409606, 14960112, 17689373, 15662287, 11016002, 11214202, 18385343, 26158395, 27551321, 22413123, 15813200, 11813962, 10872843, 11828278, 13812021, 15759523, 15717875, 12265190, 6639063, 2198561, 1017630, 1886553, 2719819, 3941991, 7420471, 12079006, 12891532, 5531923, -8917145, -24446812, -34310412, -34765031, -26818059, -15609687, -6831102, -2503598, -765439, 394117]
45348C94117Q28083J060598L037126M790340K889043j744469m145035k313261
45340D796542M10689J269938J759843L194544L275864N04800j931178q25365J603324
45331A4059001J412563m11438J0238K283973J849504k876080p915992q842247
45323d30478n151773N44761M689191M614629J520499P04436M815651Q130671L255306
45314B2692893o778132j0409143l557557L845217J857949n779400q773081n686528
45306a2587782l196779k826281R49553Q382351J0531484K406882p759749q985978
45298a3086299k144007K986151K040319l9457J615724N561534Q017522P583884
45290A2535371M781040J304603L44697L053122M510613r90089r833043j1357905
$$ y = [394117, 1222200, 2282798, 5319924, 10110264, 12999307, 11254838, 7109803, 4796542, 5207231, 6477169, 8237012, 11431556, 14707420, 15212220, 13281042, 12455677, 14059001, 15471564, 15060126, 15070364, 17354337, 19203841, 16327761, 8411769, -430478, -5582251, -5037490, -348299, 4266330, 5786829, 6491265, 11306916, 19437587, 22692893, 15914761, 5505618, 1948061, 5793278, 7651227, 1871827, -6901254, -12587782, -15784561, -18610842, -17661289, -9278938, 1252546, 3659428, -4100321, -13086299, -15230306, -12244155, -10203836, -10243293, -8627569, -3066035, 4951487, 12535371, 17316411, 18621014, 18965711, 22018833, 26529446, 25539357, 15706314, 4348409]
45282D348409k796619N704199N586725J763054K981258P135891N857777p47203
45274B9833491n075728n760811q611733j3219146j0713289J238304J1839332J1605568
45266A1135988M856171R76267N17211j998320o820039r080357p157327l537096
45258a1107502N12611M632081N914161K309421k212565k296025M50727J79161
45250a617930l349780m552908j289773K591551M436598N795625P062258N558061
45242A4633702J082952k207886j877673m09851l03857p30201j187237l484507
45234E515442p186851p688016k442939M430091P214713N330914K070886k58760
45226F985480p47174J419850M811155M831316p47905o925700o515887M97412O688206
$$ y = [4348409, 1551790, 7255989, 12842714, 14605768, 17587026, 24722917, 30580694, 29833491, 24757763, 18996952, 10385219, -2833927, -13547216, -12308912, -469580, 11135988, 15992159, 16968426, 17485637, 15487317, 8667278, -413079, -7570406, -11107502, -10594891, -5962810, -48649, 2260772, 48207, -2247818, -1797091, -1617930, -4967710, -9520618, -10810391, -8218840, -3782242, 2013383, 9075641, 14633702, 15716654, 13508768, 11631095, 11221244, 10917387, 10187186, 8999949, 5515442, -1671409, -9359425, -11802364, -7372273, -157560, 5173354, 7244240, 6985480, 6238306, 7658156, 12469311, 17300627, 16552722, 9627022, 3111135, 3608547, 10296753]
45217A0296753O581754K685250Q11456K248376L129999O02742l130270m036672
45209A9189388j827398J46001K16394K73428J047796n33867n716582q979458m447120
45200f31418M233639P129319J732785l327975q08923N114281N624341n89207p093262
45191A1383580q727667n936330j761238J138157J327117q1660K67561L563679
45183A173199O063792L792463j422915m260919l403716k723564m690366o267981
45175a1740007l073813M303718R908948Q367943J039553m398763k036712M769794
45167G140661O859559J113194n073355l974708J715905L454317j26953j426187
45159I682433M231118J1073169J0532597K455447n514638p947839o788021o250872
$$ y = [10296753, 16878507, 19563757, 20375213, 22623589, 25753588, 26356330, 23226060, 19189388, 17361990, 17507991, 17724385, 17997813, 19045609, 18511742, 12795160, 3815702, -631418, 3602221, 10731540, 12464325, 9136350, 8327427, 13441708, 19066049, 18476842, 11383580, 2655913, -3280417, -5041655, -3903498, -2576381, -2658041, -2390480, 1173199, 7236991, 11029454, 9606539, 5345620, 1941904, -781660, -5472026, -11740007, -14813820, -10510102, -601154, 7766789, 8806342, 4407579, 2370867, 7140661, 14000220, 15113414, 10040059, 6065351, 7781256, 11235573, 11108620, 9682433, 13913551, 24986720, 35519317, 37974764, 32460126, 24512287, 17724266, 11473394]
45151A1473394o243877l497114K124429N915639M289363k7626j561778M98695
45143A2971125K201401J809208K042163L785882K752254l544874r458334p579302
45135D979523M43810N501970L214348j464581l059894l055150n151407p649178
45127f240559n752188M14770N174924M942587K439519J802071K652999J766609
45119G200732j095757k517337q27315R99582l24531l337233l842604j013374J598089
45110c159748J308276l62965p05228K31643M64534n75449j208172N65939N121870
45101A680700J0443045J2892732R955716K905918m051419p457538o671172l163594
45093A6534388L02726O18164k681508n639327m169867J99570K571708K220389
$$ y = [11473394, 5229517, 1732403, 3856832, 9772471, 14061834, 14034208, 12472430, 12971125, 15172526, 16981734, 19023897, 22809779, 25562033, 22017159, 12558825, 4979523, 5423333, 10925303, 14139651, 12675070, 9615176, 6560026, 1408619, -6240559, -11992747, -11577977, -6403053, -1460466, 979053, 2781124, 5434123, 7200732, 6104975, 3587638, 2760323, 3759905, 3435374, 98141, -3744463, -4757837, -3159748, -1851472, -2214437, -2919665, -2688022, -2223488, -2798937, -4007109, -3441170, 1680700, 12123745, 25016477, 34972193, 37878111, 33826692, 26369154, 19697982, 16534388, 16837114, 17455278, 14773770, 9134443, 4964576, 5164146, 7735854, 9956243]
45085I956243K850456M994892M473458M50146j743067L18660Q03596m987616j1487278
45076E629490j0261040k595041K924098K823966J050799M01920n01818j794713
45068b322339j121800J326277K526325K034179K239504L105852K361441Q35375
45060A0984814J347989K347675k12715m167227k419765N193243R675937N828922
45052B8578873o46177l459655n111571r569984j2533541p373590L291440J0045780
45044C221575Q699034L273004j262785l056984j628593J811812K990807r06339
45036A3141531n790788m995668J259986N914140M565029j56421l967221n444594
45028D525994m272909k19460M212842M575337L83068l235969k123574J697027
$$ y = [9956243, 12806699, 17801591, 22275049, 22725195, 20982128, 21300788, 22104384, 17116768, 5629490, -4631550, -7226591, -4302493, -1478527, -427728, -25808, -527626, -2322339, -3444139, -2117862, 408463, 2442642, 4682146, 7787998, 10149439, 10984814, 12332803, 14680478, 14467763, 10300536, 7880771, 13074014, 22749951, 28578873, 27932696, 24473041, 19361470, 9791486, -2742055, -10115645, -6824205, 3221575, 11920609, 15193613, 13930828, 10873844, 9245251, 11057063, 14047870, 13141531, 7350743, 2355075, 3615061, 9529201, 14094230, 13937809, 9970588, 4525994, 253085, 33625, 4246467, 8821804, 9204872, 5968903, 3845329, 5542356]
45020E542356L670888K775412J335757R64843J411528K107215K507418J665790
45012B1981207q16916l974641o474842p370339n449750p8190O057776P684683
45004A1558988K967473l093618m284665q49759J824058J243332K46314R74685
44996A0586808J008750k040187n572061n251633j376320J656481J481408r5693
44988C97553j022841j606738k292065j832047O34673L694664N435492N595059
44980I003750M730061K958476R20118K08350J100934J471563r1736j658753q17557
44971A7825206J168114R60292j737248l745493l295660k504730l934261o727355
44963a991135p584472m625023O79875M999690O142334M752680L046307K057700
$$ y = [5542356, 9213244, 11988656, 13324413, 14289256, 15700784, 17807999, 20315417, 21981207, 21164291, 17189650, 10714808, 3344469, -2105281, -2183471, 3874305, 11558988, 14526461, 11432843, 7148178, 6298419, 8122477, 9365809, 9612123, 10586808, 11595558, 9555371, 3983310, -1268323, -2644643, -988162, 493246, 397553, -625288, -2232026, -4524091, -6356138, -5721465, -2026801, 3408691, 9003750, 13733811, 16692287, 17612405, 17820755, 18921689, 20393252, 20301516, 18642763, 17825206, 18993320, 19953612, 18216364, 14470871, 11175211, 8670481, 4736220, -1991135, -9575607, -14200630, -13520755, -8521065, -2378731, 2373949, 5420256, 7477956]
44955G477956J017018n45611j710899j832585j504467r16870O97890K724780K797826
44946H205038P35333J27539L163175O394883N269969Q46088k123719k313580k554631
44937A7750095m232176n467433m862777l123869r32023J289802J923051J01842
44929B446512j682272q79127M59322r49517l068481j368033K808964L880138J885902
44920C533408K447954N629817M126478l802405q756611l717842M498515N079031
44912I038345j247303n099337k998457O0672Q65121J792079L657386K629190k877868
44903E819828p770104o345941L35240O288308Q097085P692295P848231P549351
44895B9514293L999912j562207l766367p69799J724519j533387o429205n166110
$$ y = [7477956, 8494974, 7949363, 6238464, 4405879, 2901412, 1984542, 2682432, 5407212, 8205038, 8940371, 9067910, 12231085, 18625968, 23895937, 24742025, 22618306, 20304726, 17750095, 13517919, 8050486, 3187709, 63840, -868183, 421619, 2344670, 2446512, 764240, -114887, 344435, -605082, -3673563, -5041596, -2232632, 1647506, 3533408, 5981362, 11611179, 15737657, 11935252, 3178641, -539201, 3959314, 9038345, 7791042, 2691705, -306752, -246080, 619041, 2411120, 6068506, 8697696, 5819828, -1950276, -8296217, -7960977, -1672669, 6424416, 14116711, 21964942, 29514293, 33514205, 31951998, 28185631, 27415832, 29140351, 27606964, 21177759, 16011649]
44887A6011649Q88973K596930k149808m556450Q09430P060530N942699q6861l568427
44878B2948665l252549k190248k85870L241963M499531O8373o034671p851919
44870A1143275o141488m460961j520019M056941O456961O85043o164650l557040
44862D98062N066282O453055j579459p131487l739837Q27590l79175k314483J421837
44853h77615P005906P245937K559870j837443l652151k694515J627911O675323
44845A6053223O559672J002012k215049Q60739L125826j961104q448148o525909
44837H451262J993918O665431L932661p0306j076250j574904l268402l032375
44829A2021035Q07035M356405L665000K57113j751818j196680P3893Q04493J434914
$$ y = [16011649, 16900622, 19497552, 17347744, 12791294, 13600724, 20661254, 26603953, 26517092, 22948665, 19696116, 17505868, 17219998, 20461961, 24961492, 25029865, 18995194, 11143275, 5001787, 540826, -979193, 3077748, 9534709, 10219752, 4055102, 498062, 5564344, 12017399, 10437940, 3306453, -433384, 394206, 15031, -2299452, -877615, 6128291, 13374228, 15934098, 14096655, 10444504, 7749989, 9377900, 16053223, 22612895, 23614907, 21399858, 22260597, 25386423, 23425319, 14977171, 8451262, 10445180, 17110611, 21043272, 20972966, 19896716, 18321812, 15053410, 12021035, 12828070, 17184475, 20849475, 21106588, 19354770, 18158090, 18231983, 19036476, 20471390]
44820B0471390J887044K02562m964157j0383317r309270N33810J1460732J3030820
44812B2929614N003950k260706j899690J132783m99590m845292m810615j15669
44804A4634785K328474j075558o145848p300695l435133L000093Q409795R023372
44796A9439285L631938l549360o157799k935917J112204J558538n77891k112618
44788A0408380k757037m228865n852938m168209K350785R938603J2689506R011311
44780B7391536L272619K17281l86406j563988l426891l219498o45673Q25084j075401
44771B1388663m404779o132001n361773k427323K139129O395624P578834N220285
44763B4396659J369226k542407n982949o781434k816301L350000O434799N645347
$$ y = [20471390, 22358434, 22560996, 17596839, 7213522, -2095748, -1561938, 9898794, 22929614, 27933564, 25672858, 23773168, 24905951, 24406361, 19561069, 14750454, 14634785, 16963259, 15887701, 9741853, 2441158, -993975, 2006118, 10415913, 19439285, 23071223, 19521863, 13364064, 10428147, 11540351, 13098889, 12520998, 10408380, 7651343, 3422478, -2430460, -6598669, -4247884, 5690719, 18380225, 27391536, 30664155, 30881436, 30495030, 28931042, 25504151, 22284653, 21638980, 22464064, 21388663, 16983884, 10851883, 5490110, 3062787, 5201916, 11597540, 19176374, 24396659, 25765885, 23223478, 17240529, 10459095, 7642794, 10992794, 17427593, 23072940]
44755B3072940M556317L499570q38592o904110p721273j917474L219168L694163
44747B0660709M478278P847259O668689k231052q371158k953576M765371N76859
44739C1441379j1456718j4779349o023187J870013J964659J802614O458327R113350
44731B0391088M773210j47699M08499K050930m57506l367645j966392K68472r68082
44722B0984875k061348J104208L945785P33429m532484m435852n85431J2999k724493
44713A2441688l149204p32452R4252o81848R17464L844784L037076m88624l06103
44704A4977033L405322K534484n013497r508816l198900P469271J0398841L761715
44696B4825453l685976n338555k834666j86289J822709L754382M352217K078962
$$ y = [23072940, 27629257, 31128827, 30290235, 23386125, 15664852, 13747378, 16966546, 20660709, 25138987, 32986246, 39654935, 37423883, 29052725, 26099149, 30864520, 31441379, 19984661, 5205312, -817875, 1052138, 3016797, 4819411, 11277738, 20391088, 25164298, 25016599, 25425098, 27476028, 27018522, 23650877, 21684485, 21952957, 20984875, 18923527, 20027735, 23973520, 24706949, 20174465, 15738613, 15153182, 15166181, 12441688, 9292484, 8560032, 8654284, 7972436, 8889900, 12734684, 15771760, 15283136, 14977033, 18382355, 20916839, 15903342, 6394526, 3195626, 10664897, 21063738, 24825453, 21139477, 15800922, 12966256, 12779967, 14602676, 18357058, 22709275, 24788237]
44688B4788237j878201m391889l990249k320850j638835j859534j353075j93077
44680G162527l64327j905053j394313L338169Q830570R503737M627368j473297
44672B8325381n414119p109282o515279k918475J450817K123716q64877j657965
44664G419917K554943O018327K873169k794277k422252L494597N653802M69468
44656B3267694m079471q17061N614720O167592P94933k912536j888411n53868
44648B5593592j726279j995069J449264N063855L748803j962001o877393p406258
44640A5888514m355168p97335J071959J711556L302448N949277N934554P77182
44632B9482987n185130n350738r53819j16910n104521p951613k989235L521213
$$ y = [24788237, 22910036, 18518147, 14527898, 12207048, 10568213, 8708679, 7355604, 7162527, 6798200, 4893147, 3498834, 6837003, 15667573, 25171310, 29798678, 28325381, 22911262, 15801980, 9286701, 6368226, 7819043, 9942759, 9077882, 7419917, 9974860, 15993187, 18866356, 16072079, 13649827, 17144424, 22798226, 23267694, 19188223, 18371162, 23985882, 30153474, 30948407, 28035871, 26147460, 25593592, 23867313, 21872244, 23321508, 28385363, 32134166, 30172165, 23294772, 15888514, 11533346, 10736011, 11807970, 13519526, 16821974, 22771251, 28705805, 29482987, 24297857, 18947119, 17993300, 17876390, 12771869, 4820256, 1831021, 5352234]
44624E352234K962338k295768l556975J64707K204667M93456P5688L157220N673028
44615A4230595N415859N349465O352596M391287j660166o281488n357161j940729
44607B0500258k8688J503892M266286N363431K445200j027426j193079k61807
44599C1568067j732261l169012n62422L248847K250340k229938k783802J975793
44591B8565612M442341l99863p027158p175544j078055L950368L808390J639524
44583B6725615J785696L842374M543552L134270J947736K033445J218033k160698
44575D3070023o004786p246906o006814m086658j226686L050401N336152J649155
44567B8533881n162650p407476l181442J192111J393482Q71786K784058L401435
$$ y = [5352234, 8314572, 6018804, 2461829, 2626536, 4831203, 5324659, 5400347, 8557567, 14230595, 19646454, 24995919, 31348515, 35739802, 34079636, 27798148, 22440987, 20500258, 20471570, 21975462, 26241748, 31605179, 34050379, 33022953, 31829874, 31568067, 29835806, 26666794, 26104372, 29353219, 31603559, 29373621, 26589819, 28565612, 33007953, 32608090, 25580932, 18405388, 17327333, 21277701, 25086091, 26725615, 28511311, 32353685, 36897237, 40031507, 41979243, 44012688, 45230721, 43070023, 37065237, 29818331, 23811517, 19724859, 18498173, 21548574, 26884726, 28533881, 23371231, 15963755, 12782313, 13974424, 15367906, 16239692, 19023750, 22425185]
44559B2425185n75758m358536k184001K676208L280485P51644J433823M517161
44551B7966211K735727m354082p907751l241174L073673L687059O54198j336J992323
44542B4604848K801736J859945J601601J925311K46364l402064n268065k310677
44534B2058999M319196J0191240J1002126N945880j428919o598868q370733q309899
44526B8809022o710547k620233K001930K839132j34435j096497L159515P158388
44518C3406275L934636m302832q447191m924957k32223j493553p018342r491911
44510A429902o019566j066459L77607q53788k63585L822651Q586080J1004218
44502A7017060J0842473Q643609L923261k319043n940572m161888l31746j01841
$$ y = [22425185, 21849427, 17490891, 15306890, 17983098, 21263583, 22015227, 23449050, 27966211, 30701938, 26347856, 18440105, 15198931, 18272604, 21959663, 22613861, 22612525, 24604848, 27406584, 29266529, 30868130, 32793441, 33039805, 29637741, 24369676, 22058999, 26378195, 36569435, 47571561, 53517441, 52088522, 45489654, 37118921, 28809022, 22098475, 19478242, 21480172, 24319304, 24184869, 23088372, 26247887, 33406275, 37340911, 33038079, 24590888, 19665931, 19433708, 17940155, 10921813, 1429902, -4589664, -5656123, -5278516, -6132304, -6395889, -2573238, 6012842, 17017060, 27859533, 36503142, 40426403, 38107360, 32166788, 28004900, 27673154, 27571313]
44494B7571313l304528m102932J08112M519954L735860q99123l680882j774649
44486B2173125K761404O417196P008520M121634q33071n325726p663358p625024
44478B1034700m977628M63115O351611Q193121M435487q96699l048220k146917
44470B9408570j322732j093523O51420L649145M175611K00350m880919n562597
44462B5225325n58719N417221O480485J866493l361080m389772k142113p83100
44454B7754740j033878J91338L238833L676487o42058m713118k756793L355808
44446B9071359O674335M451463K23711k300865k617441j028375K197541M600266
44438D1271994K906306k086655n676319n389966l349850j576660Q83929M429765
$$ y = [27571313, 24266785, 20163853, 20271965, 24791919, 28527779, 27628656, 23947774, 22173125, 24934529, 31351725, 38360245, 42481879, 41648808, 36323082, 28659724, 21034700, 16057072, 16520187, 22871798, 31064919, 35500406, 34603707, 31555487, 29408570, 28085838, 26992315, 27643735, 31292880, 35468491, 35668841, 30787922, 25225325, 24666606, 30083827, 36564312, 38430805, 35069725, 30679953, 28537840, 27754740, 26720862, 26912200, 30151033, 33827520, 33185462, 28472344, 25715551, 29071359, 35745694, 40197157, 40420868, 38120003, 35502562, 34474187, 36671728, 41271994, 44178300, 42091645, 36415326, 31025360, 27675510, 26098850, 26982779, 31412544]
44430C1412544O624028N886908L871955J767032j770607n858365n023841L294845
44422D0204499J2014900J1417707J828874o610174o935537k463296K10754l19234
44414D9348493j681895l131147n214154o240506l376327K721106P162486N707040
44406D5295096n22641n764381n256677l40889K897793J005365k363766j751937
44398C3197963J832332K309646j812113m618388j891846K086669J062567l661344
44390B8505486n484655k112804K472459M663214M757636M033399K948423K496827
44382D2279985L216913K857828p04776m595721m162717r65277j139425m791048
44374C1995762m509030K506253Q465800O405649P86771l27029K038433J661959
$$ y = [31412544, 38036572, 43923480, 47795435, 49562467, 47791860, 41933495, 36909654, 40204499, 52219399, 63637106, 65465980, 58855806, 51920269, 49456973, 49667727, 49348493, 47666598, 44535451, 39321297, 33080791, 29704464, 32425570, 39588056, 45295096, 44772455, 39008074, 33751397, 33410508, 36308301, 37313666, 34949900, 33197963, 35030295, 37339941, 35527828, 30909440, 29017594, 31104263, 32166830, 28505486, 23020831, 20908027, 23380486, 28043700, 32801336, 36834735, 39783158, 42279985, 45496898, 48354726, 47649950, 43054229, 38891512, 37926235, 36786810, 31995762, 27486732, 29992985, 38458785, 44864434, 45651205, 45324176, 47362609, 49024568]
44366D9024568m48504J896504P028571N841145k850297q144717l065062M505211
44358E3787419L980489k114626l576371P80242K293179k550331o469967l427072
44350D2702962K073690K857341K14773L83449L228575K178502m510300r565709
44342C9563283o770512o5511K065526j594491m136613q52173M642253N972557
44334C8824319J904535l606556o750532o729593m704855k205814k38191J292243
44326A7785556K948954M262569M077954K746410K145138K765903K826852J320098
44318D0879434k89950p59183j057372j944984k042615m79552R87858J074647J797321
44309C8165604N121794Q751658Q566401L918512k152902o212924n575956P84605
$$ y = [49024568, 48576064, 50472568, 57501139, 63342284, 60491987, 52347270, 49282208, 53787419, 57767908, 55653282, 52076911, 52857153, 55150332, 52600001, 46130034, 42702962, 44776652, 47633993, 47848766, 48232215, 51460790, 53639292, 49128992, 39563283, 32792771, 32727260, 34792786, 33198295, 29061682, 28209509, 32851762, 38824319, 40728854, 37122298, 30371766, 23642173, 18937318, 16731504, 16493313, 17785556, 20734510, 24997079, 29075033, 31821443, 33966581, 36732484, 39559336, 40879434, 40589484, 39830301, 38772929, 36827945, 34785330, 34305778, 35293636, 36368283, 38165604, 43287398, 52039056, 60605457, 64523969, 62371067, 56158143, 50582187, 51366792]
44301E1366792Q905928J0732203L245814o048085q221056m671818l086048m333404
44293D7890326k393947L173349M869937j01540m250255j625989K688592J143573
44285E1394046m358849o167848k460094J740911K703967J052113j823364m936309
44277C7144573n941849k851327K427563N555204M639972J490470r39316l90863
44269D1134427L557072P884657P832109K814865j705441j202011J600356R83961
44261F2899995l449704o901093o292349k907525Q96891L573909L469838j45784
44253E1144178m956235p404018o630156m383796j734218J583285N170947P741414
44245D0531401Q437678O778118K663589j924087l575181k175084k159977n808086
$$ y = [51366792, 60272720, 71004923, 74250737, 68202652, 59981596, 55309778, 52223730, 47890326, 45496379, 48669728, 53539665, 53438125, 49187870, 47561881, 50250473, 51394046, 47035197, 40867349, 38407255, 40148166, 42852133, 43904246, 42080882, 37144573, 31202724, 28351397, 30778960, 36334164, 40974136, 42464606, 41525290, 41134427, 44691499, 52576156, 60408265, 63223130, 61517689, 60315678, 61916034, 62899995, 59450291, 52549198, 46256849, 43349324, 44246215, 47820124, 51289962, 51144178, 46187943, 38783925, 32153769, 27769973, 26035755, 27619040, 32789987, 40531401, 48969079, 55747197, 58410786, 56486699, 52911518, 50736434, 48576457, 42768371]
44237D2768371q402236m749387K028407M165117O38099j477186K283945P546610
44229D4801740P788282K908014j674134j817227J769237N219282N252416K047510
44221F6295120j140114j828623j093104j373106k762628l344377k139190J85378
44213E2799356K480121L393364K055860l8120j05063J496898J225971j415808
44205F1892579k333241n54788j481775p139308r570334k053194Q375482R837255
44197E6972676L492037Q22119M749439O523091K384374l15505K322656K999871
44189G9950758l255756r069380o703669p61962M32950j650858j019106N23688
44181E8446665k353843o157369k447513P245281J1533647N355136l213941m776422
$$ y = [42768371, 34366135, 29616748, 31645155, 35810272, 36448371, 34971185, 37255130, 44801740, 52590022, 55498036, 53823902, 52006675, 53775912, 58995194, 64247610, 66295120, 65155006, 63326383, 62233279, 60860173, 58097545, 54753168, 52613978, 52799356, 55279477, 58672841, 60728701, 60690581, 60585518, 62082416, 63308387, 61892579, 59559338, 59004550, 57522775, 50383467, 40813133, 38759939, 47135421, 56972676, 60464713, 61286832, 66036271, 72559362, 74943736, 74628231, 76950887, 79950758, 76695002, 67625622, 60921953, 60159991, 60592941, 58942083, 57922977, 58446665, 56092822, 49935453, 47487940, 54733221, 66266868, 71622004, 68408063, 63631641]
44173F3631641N0925M125799L193108j192973m662521l847434O40307M467676
44165F6406528M562445K799720K362583K581992J170025m43034J135401N199151
44157H5774811P370010N547629J326703l370284o648240n354078R46074N973585
44149I1566210L226998l925779n663461K00287M988731J999541m749596q074288
44141G9568643p339749n881179m007370k27530L843987N099563L740763K543929
44133G7341057K756186L625370M232704L339309k69335m781266n492328r30291
44125G9821406M010700M467677K174578J493345J804766o14623m756618n167336
44117H3233895m07584M325097M606094K315674J608892K946370L782622K845150
$$ y = [63631641, 63682566, 67808365, 71001473, 69808500, 65145979, 61298545, 61938852, 66406528, 70968973, 73768693, 76131276, 78713268, 79883293, 79440259, 80575660, 85774811, 93144821, 98692450, 100019153, 96648869, 90000629, 84646551, 85592625, 91566210, 94793208, 90867429, 85203968, 85404255, 90392986, 92392527, 87642931, 79568643, 72228894, 66347715, 62340345, 62112815, 65956802, 71056365, 74797128, 77341057, 80097243, 83722613, 87955317, 91294626, 91025291, 86244025, 80751697, 79821406, 83832106, 88299783, 90474361, 91967706, 93772472, 93157849, 88401231, 83233895, 82826311, 87151408, 91757502, 94073176, 95682068, 98628438, 102411060, 105256210]
44109A05256210J215373L48375O46060J213264M89546j559481j947619K037933
44101A07699661P415240O858000k070877j1721216j2053736k565702O872656P109060
44093A07543086j221114j0033532j2314538p186821R73879O375982O052873K207852
44085I2397667o7823J640420M709052N485493L808424J644430p52848l860629
44077A05004186n198289j403322N254498P510343K965564j309437J467519P131688
44069A21422750O054287k432708q635196o534015j840521k354871o300020o003151
44061I3376555L06215O516808P264500L484210m10795r42766K496817O622732
44053A18714276N939216p96092o882635n050879K367002O282961L665024O36156
$$ y = [105256210, 106471583, 106819958, 107466018, 108679282, 109168828, 107609347, 105661728, 107699661, 115114901, 121972901, 119902024, 108180808, 96127072, 93561370, 100434026, 107543086, 106321972, 96288440, 83973902, 76787081, 77760960, 84136942, 90189815, 92397667, 92329844, 93970264, 98679316, 104164809, 107973233, 109617663, 108864815, 105004186, 99805897, 98402575, 103657073, 111167416, 114132980, 112823543, 114291062, 121422750, 127477037, 125044329, 116409133, 109875118, 108034597, 105679726, 99379706, 93376555, 93682770, 100199578, 107464078, 110948288, 110537493, 109594727, 112091544, 118714276, 124653492, 123857400, 116974765, 111923886, 114290888, 120573849, 124238873, 124875029]
44045A24875029J396190J798856j957609n258332k133473M472376O737462L374601
44037A33305100j03785q05527j004504j788970j143660Q51458J113041p22725
44029A29700428j109124J293593L401695L340916L268474M385636L949821Q6375
44021A48317814m436467o036232m572278j642738J796333M153718L426891P35573
44013A41742614l00752O84710M47860r55264P57503N375481N948328m4122m764832
44004A48891526j854357K898661J216650l551777k505605K965132L381824k473090
43996A48968964n536801j528585L270873L577062K010150J154650j381424n409058
43988A45125831m719064L002064J0381726J0598214O860440N401123N119601J538972
$$ y = [124875029, 126271219, 128070075, 126112466, 120854134, 118720661, 123193037, 129930499, 133305100, 133201315, 132395788, 131391284, 129602314, 128458654, 129310112, 130423153, 129700428, 128591304, 129884897, 133286592, 136627508, 139895982, 144281618, 148231439, 148317814, 143881347, 137845115, 133272837, 131630099, 133426432, 137580150, 141007041, 141742614, 141441862, 142126572, 142574432, 141619168, 142376671, 147752152, 153700480, 153656358, 148891526, 147037169, 149935830, 151152480, 147600703, 145095098, 148060230, 151442054, 148968964, 143432163, 141903578, 145174451, 148751513, 150761663, 151916313, 150534889, 145125831, 140406767, 143408831, 153790557, 164388771, 171249211, 176650334, 181769935, 183308907]
43980A83308907l524674m147274J64630L949558L833959J745679O09030R43878
43972A86883693J468509N31416k126923l772995j339712L275397M713090K648535
43964A92281010L199232Q500354J1084983M419565n989146r198511l428348L159585
43956B04028724M489245K287495K01899j216651k439644k578018o87277K969805
43948B07055578P174616R733440Q595524M717740J548330l8834k733948o510754
43940B29541692o400795m75309N256525N313793K943767L310167L742412o64888
43932B42567364n890175l686766M487416Q680964N389769J236349Q43441R85379
43924B54613741r02694j749487J30012J180625l93838r74512J445912L452202
$$ y = [183308907, 179784233, 175636959, 175801589, 179751147, 183585106, 185330785, 185939815, 186883693, 188352202, 188883618, 186756695, 182983700, 181643988, 184919385, 189632475, 192281010, 195480242, 203980596, 215065579, 219485144, 213495998, 204297487, 200869139, 204028724, 208517969, 210805464, 211007363, 209790712, 207351068, 204773050, 204085773, 207055578, 214230194, 223963634, 232559158, 237276898, 238825228, 238786394, 236052446, 229541692, 223140897, 222665588, 227922113, 233235906, 236179673, 239489840, 243232252, 242567364, 236677189, 232990423, 237477839, 246158803, 251548572, 252784921, 253628362, 254613741, 253711047, 251961560, 252091572, 253272197, 252878359, 251903847, 253349759, 256801961]
43916B56801961L072274L493508N839444N281698n75792n901948n033588j068316
43908B61909241J08460n28340J700048N988444P083386L722799K7574p44391P83091
43899B80050312K642935L578246L457269L933908O664394R046710N576298l455185
43891C11494887r097469m439103N484715J0154846P118733K811983J721250J718535
43883C26968377K66333j161773o48960P73625J273627O61632n21056j702341j430959
43874C24478505J329066M304817L202987k742252q680644r145445l892841K357537
43866C11211730N148761M248961K554618J797638N43688k519079m618848j442305
43858C16925164N865466J0035245O470100l04301k528596N00539K429068l72171
$$ y = [256801961, 259874235, 263367743, 269207187, 274488885, 273913093, 268011145, 262977557, 261909241, 262017701, 261489361, 263189409, 269177853, 276261239, 279984038, 280011612, 279267221, 280050312, 282693247, 286271493, 289728762, 293662670, 300327064, 309373774, 314950072, 311494887, 302397418, 297958315, 303443030, 313597876, 320716609, 323528592, 325249842, 326968377, 327234710, 326072937, 325423977, 326197602, 327471229, 328132861, 327611805, 325909464, 324478505, 325807571, 330112388, 333315375, 330573123, 321892479, 312747034, 308854193, 311211730, 316360491, 320609452, 323164070, 324961708, 325505396, 322986317, 318367469, 316925164, 322790630, 332825875, 339295975, 338991674, 336463078, 336963617, 339392685, 339020514]
43850C39020514l681081j822191L999523O893445L168226k754021l819653O04665
43842C41609427M067113K121527j357904j67297M511758N649051J003752l774724
43834C53662703l999875j985797j356696q65203J654346L662330J820961j446208
43826C51146561j152232K141760L110452l5892l415193l967335l212479l378265
43818C41237377l883296l380701k143519o21747J906790N400762P606340O443199
43810C52565205K783529q04102l459774o365803r433561r646926m788381J914506
43802C22764693M120759N18123k816804r98142K235965N03380m581639n612695
43794C16133640j272614J934186Q42593J63195K912028M591004J812489q05545
$$ y = [339020514, 335339433, 333517242, 337516765, 344410210, 347578436, 344824415, 341004762, 341609427, 345676540, 347798067, 346440163, 346272866, 350784624, 356433675, 357437427, 353662703, 349662828, 347677031, 346320335, 345455132, 347109478, 350771808, 352592769, 351146561, 349994329, 352136089, 355246541, 355210649, 351795456, 347828121, 344615642, 341237377, 337354081, 333973380, 331829861, 331208114, 333114904, 338515666, 346122006, 352565205, 355348734, 354544632, 351084858, 344719055, 335285494, 325638568, 320850187, 322764693, 326885452, 327403575, 324586771, 323588629, 325824594, 326327974, 321746335, 316133640, 314861026, 316795212, 317637805, 317801000, 320713028, 325304032, 327116521, 326310976]
43786C26310976J290804M146270K185980k103090l398527l408509o356268q650767
43778C10016869l610261N454957P761117Q62511o175267o818057m606832m022168
43770B98862869l018703R33131M850346N271076L590955K069506k32421l384778
43762C08941981l655101O20200M631707L456671q48592l301177l670685m720467
43754C01454537n481118k480614L153985N732620L127446K10568K052701O850467
43746C14620592Q419501M245369j824907m962632m735290l503162j636543K151447
43738C12774375O168621N926336O98385m054782l677854k90338J634353K102679
43730C21281775L481509M702591L182646L15593q26030j394077l989476n768839
$$ y = [326310976, 327601780, 331748050, 333934030, 331830940, 328432413, 325023904, 318667636, 310016869, 306406608, 311861565, 319622682, 320485193, 314309926, 307491869, 302885037, 298862869, 295844166, 296777297, 301627643, 306898719, 310489674, 312559180, 312326759, 308941981, 305286880, 305907080, 310538787, 313995458, 313146866, 309845689, 306175004, 301454537, 295973419, 293492805, 296646790, 302379410, 305506856, 305717424, 307770125, 314620592, 323040093, 327285462, 325460555, 320497923, 315762633, 312259471, 310622928, 312774375, 318942996, 324869332, 325567717, 321512935, 317835081, 317544743, 319179096, 321281775, 324763284, 329465875, 332648521, 332964114, 332138084, 330744007, 326754531, 320985692]
43722C20985692j999111M230765M549610j420206m183625J467615Q769002R607361
43714C42007103N309533J622983m84656k823230l942306j700874J514600J925591
43706C43428744O3212j515813l212497o001311o898218k470941M800925Q822005
43698C37016106P513803L966061J360398Q10270K604640N190607M385824j655346
43690C61192363p709667o706519N70087N898415M293926k94545j360520K030173
43682C57913713N793322O808524N554061L740676J707203j140648m248177n594008
43674C70534666m074398j323168R8433k81816j095242j473103j032908J305009
43666C62657473N348067P448412M428663p46842k129076L65012J212697o93818
$$ y = [320985692, 318986581, 323217346, 327766956, 326346750, 322163125, 323630740, 332399742, 342007103, 347316636, 348939619, 348454963, 345631733, 341689427, 339988553, 341503153, 343428744, 343491956, 341976143, 338763646, 332762335, 325864117, 323393176, 328194101, 337016106, 344529909, 348495970, 349856368, 350666638, 353271278, 358461885, 362847709, 361192363, 353482696, 346776177, 347346264, 353244679, 357538605, 357244060, 355883540, 357913713, 363707035, 370515559, 376069620, 379810296, 381517499, 380376851, 376128674, 370534666, 366460268, 365137100, 365235533, 364953717, 363858475, 362385372, 361352464, 362657473, 368005540, 375453952, 379882615, 379135773, 377006697, 377371709, 378584406, 377890588]
43658C77890588M84418P038280J1989248R028434J970734k058639l561514p142962
43650C95638587j0925651q312239P87319Q397153Q770407M219992J01968q58836
43642C97818700J167204L878045L642646m21830l819194k429643N96851o24754
43634C99808025m552144l871447K327315N968616K121325l588978l899795r5235
43626C94217682K161688K388828M061720O470353M822329j455216o367323n121948
43618D01178113j73866K828850K163729K65575j105206k273129k713229o00564
43610C99570273L471044N678886M207982K374213L265061M090452P55792l941609
43602D19472094l319181K055779L667174k354064r181368r798245o776094n869733
$$ y = [377890588, 378375006, 385413286, 397402534, 406430968, 408401702, 406343063, 402781549, 395638587, 384712936, 376400697, 377188016, 385585169, 394355576, 398575568, 398677536, 397818700, 398985904, 402863949, 406506595, 406084765, 402265571, 399835928, 400432779, 399808025, 395255881, 391384434, 393711749, 399680365, 401801690, 398212712, 394312917, 394217682, 396379370, 398768198, 402829918, 409300271, 414122600, 412667384, 406300061, 401178113, 401004247, 403833097, 405996826, 406262401, 405157195, 402884066, 400170837, 399570273, 403041317, 408720203, 412928185, 415302398, 418567459, 422657911, 423413703, 419472094, 416152913, 418208692, 421875866, 419521802, 410340434, 400542189, 393766095, 387896362]
43594C87896362n764585j724485M481641O485073L250161n16618k847234n810538
43586C85449777q429147o100329J205650O895869O577669L515342K420083K558720
43578C94093634O51710k743362l682048m15895M170819N718883L146577P6289
43570D01016607O71574L738438L415435k501531q086516o714780l37335L378333
43562C94580225J467921j935107k806775j649690o44818q53113k416423l926878
43554C81815342k430665K107856M201080k73763o625758p156441k784820j176979
43546C67675852l827710l816539K118133P911727P699659L500775k82933l215551
43538C77763413n562991m881898m73316L774636M938860M614565L676682o17775
$$ y = [387896362, 382131777, 380407292, 384888933, 391374006, 394624167, 394107549, 391260315, 385449777, 377020630, 370920301, 372125951, 379021820, 385599489, 389114831, 391534914, 394093634, 394745344, 392001982, 388319934, 387904039, 392074858, 397793741, 400940318, 401016607, 401688181, 405426619, 408842054, 406340523, 398254007, 391539227, 391201892, 394580225, 396048146, 394113039, 391306264, 389656574, 389011756, 388158643, 385742220, 381815342, 379384677, 381492533, 385693613, 385419850, 378794092, 371637651, 368852831, 367675852, 363848142, 360031603, 362149736, 370061463, 377761122, 381261897, 380978964, 377763413, 372200422, 367318524, 366845208, 370619844, 375558704, 380173269, 383849951, 383232176]
43530C83232176q109098j2295834q779749k198299O46311n1727l30505j91778
43522C51921497j637342k671639j34746L886364M877530L323536L296699N032883
43514C67894782M768124J222084l032622o163275q262720q439036n315355l34105
43506C42337877L330946M907838N757137N938886M716972L472806M066840M829906
43498C79359208K159493l835671q582953q145643k834312L629422O579226L644465
43490C71973235k057852m016020l17984L170897J142232k932516k126389K984631
43482C67820234N287806K153795j437430j630976j073689l107838n824295n420292
43474C56767315k142666N34682Q67377L18918R19805K871215M532086M174643
$$ y = [383232176, 375123078, 362827244, 354047495, 351849196, 352495507, 352443780, 352113275, 351921497, 350284155, 347612516, 347477770, 351364134, 356241664, 359565200, 362861899, 367894782, 372662906, 373884990, 370852368, 364689093, 356426373, 347987337, 342671982, 342337877, 345668823, 350576661, 356333798, 362272684, 366989656, 370462462, 374529302, 379359208, 381518701, 377683030, 369100077, 360954434, 358120122, 361749544, 368328770, 371973235, 369915383, 365899363, 365581379, 368752276, 369894508, 366961992, 364835603, 367820234, 373108040, 375261835, 373824405, 372193429, 371119740, 368011902, 362187607, 356767315, 354624649, 355159331, 356026708, 356345626, 357265431, 360136646, 364668732, 368843375]
43466C68843375J962890j34327r32827j564191l364025n487082o207883n445444
43458C47670486m273532l066934j876161j373551j615757j201205O42297K726309
43450C37631952M132515N426405N991087L573960p89048j469731L703053P813158
43442C66013351L366278n962732r116816k592124N385365O512164J741769l224334
43434C62122921o012338p389892o844803k819747L533842P749040O032931l37143
43426C56034811n038978k664692M714241R197004O506572O46574k940772m577502
43418C61877258o799786q009046n543258j758279l75446N02450M304308P445473
43410C51643674L872560l162073m171643J221064L089787k069894n030355L02519
$$ y = [368843375, 370806265, 370671938, 369739111, 368174920, 364810895, 359323813, 353115930, 347670486, 343396954, 340330020, 338453859, 337080308, 335464551, 334263346, 334905643, 337631952, 341764467, 347190872, 353181959, 356755919, 355966871, 354497140, 358200193, 366013351, 369379629, 363416897, 354300081, 351707957, 357093322, 363605486, 365347255, 362122921, 356110583, 348720691, 341875888, 339056141, 342589983, 350339023, 356371954, 356034811, 350995833, 348331141, 353045382, 362242386, 368748958, 369395532, 366454760, 361877258, 355077472, 347068426, 341525168, 339766889, 339391443, 339893893, 344198201, 351643674, 355516234, 352354161, 348182518, 349403582, 352493369, 350423475, 345393120, 345695639]
43402C45695639N701274J821316o139215o509634Q04550N415659K759203j385633
43394C48163159k220850j917994k567983j523306K727164O095326M272729j370189
43386C51658056o562420r646295j1062128r847442m617219K522787O417163M356556
43378C23219058n67264l027153j661264K2232q28023k169811m31068L199837L324718
43369C21081262k012918p333033n884706J650303P432136N565230j348052o059718
43361C13090504n571236l476574l205413k687254R84878M632688K942311j480948
43353C05228956j76851O878464Q286471j626902j1660165r352156l89249O15503
43345B97804071n844640n351196N267160J1010804K340946r393375r323594q372
$$ y = [345695639, 351396913, 353218229, 347079014, 340569380, 341373930, 346789589, 349548792, 348163159, 345942309, 344024315, 341456332, 339933026, 342660190, 348755516, 353028245, 351658056, 345095636, 335449341, 324387213, 314539771, 309922552, 312445339, 318862502, 323219058, 322651794, 319624641, 317963377, 317985609, 317157586, 314987775, 314556707, 317756544, 321081262, 319068344, 311735311, 305850605, 307500908, 314933044, 320498274, 319150222, 313090504, 307519268, 304042694, 300837281, 298150027, 299134905, 303767593, 306709904, 305228956, 305052105, 311930569, 320217040, 318590138, 306929973, 297577817, 297188568, 297804071, 291959431, 286608235, 291875395, 302886199, 305227145, 295833770, 286510176, 286501804]
43337B86501804N786604M295867J234159o88094l372927o104330o400083n429600
43329B75823400m875440k235678L127846M463976k565629r731821o956179J090729
43321B58141204J825603m605874n890252J439875O602078L069697j920844j738952
43313B56922535q15115l048507j927504P364408J5429394J0421617l417114j0934248
43305B69995466o796679J01418J935168Q94869J196720J398588j189093m606649
43297B62929808n413961m280076m438021o368639p259482n227443j709437P56584
43289B28989333J674495K388187L198457K473040k77032k078792J74812M664725
43281B41207225O065590K499667k045490l372442k022746p19749J45957J559718
$$ y = [286501804, 292288408, 296584275, 297818434, 297130340, 293757413, 287653083, 281253000, 275823400, 270947960, 268712282, 271840128, 276304104, 273738475, 264006654, 257050475, 258141204, 259966807, 255360933, 249470681, 250910556, 257512634, 260582331, 258661487, 256922535, 256107420, 253058913, 251131409, 258495817, 273925211, 284346828, 280929714, 269995466, 263198787, 263300205, 265235373, 266130242, 267326962, 268725550, 267536457, 262929808, 257515847, 253235771, 248797750, 242429111, 235169629, 229942186, 228232749, 228989333, 230663828, 233052015, 236250472, 238723512, 238446480, 236367688, 236542500, 241207225, 247272815, 249772482, 247726992, 244354550, 242331804, 241612055, 241758012, 243317730]
43273B43317730K406045M10170l828959o525626n117145j520056o2439k391440
43265B26688280n172442l948406O27672K636210j354156o846703p105183k370518
43257B03154754J265321J149269M75164J127421N42080k213702l276974k42120
43249B01981213L602145M968249N578282P359074P545776L591262j422450l710224
43241B29493327m912016p323550p421071j686726M694303L876145j990813l752024
43233B10977575j44125Q66523l046497l580100L776155J0351795O613773l449804
43225B22365295q526706n695953j599211p92385j165552l06184O92349O67815
43217B05639468L93074J45033p37574j372449j25518J751542R86713k560285n131587
$$ y = [243317730, 245723775, 246133945, 242304986, 235779360, 230662215, 229142159, 229079720, 226688280, 221515838, 217567432, 218195104, 220831314, 219477158, 212630455, 205525272, 203154754, 204420075, 205569344, 206044508, 207171929, 207714009, 205500307, 202223333, 201981213, 205583358, 210551607, 216129889, 223488963, 231034739, 234626001, 233203551, 229493327, 224581311, 217257761, 209836690, 208149964, 212844267, 216720412, 214729599, 210977575, 210833450, 211699973, 208653476, 205073376, 208849531, 219201326, 225815099, 222365295, 213838589, 208142636, 206543425, 205751040, 204585488, 204279304, 204971653, 205639468, 206032542, 206177575, 205440001, 204067552, 203942034, 205693576, 206680289, 204120004, 198988417]
43208A98988417m436217k514205j823726j348136J282504N514923P870365N912792
43200B09446717J121038k439393k287605q8519P65198k75440q78125m66691j370100
43191B03527080l750487l607650O78929L893036J305442k929431j557026L822233
43183B01382126M921990M41448j849556J426875L511591k34655l636979n07938
43175B05454902L689679N91302o028446n151649L626569Q472616K809773n457412
43167B08007334n854457J102085O901430O344505J289007l556796m847239k585936
43159B06799933m7495j4801p99123R49520L880002L400706j08065r65294J969694
43150B15065077K324756k874552o510509k079855M869055M529750j780477l836029
$$ y = [198988417, 194552200, 192037995, 190214269, 188866133, 190148637, 195663560, 203533925, 209446717, 210567755, 208128362, 205840757, 205752238, 206517436, 206241996, 205363871, 204897180, 203527080, 199776593, 196168943, 196847872, 200740908, 202046350, 199116919, 197559893, 201382126, 206304116, 206745564, 204896008, 206322883, 209834474, 209599819, 205962840, 205454902, 209144581, 209735883, 203707437, 198555788, 202182357, 210654973, 213464746, 208007334, 202152877, 203254962, 210156392, 216500897, 217789904, 214233108, 209385869, 206799933, 206752438, 206737637, 205938514, 206888034, 210768036, 214168742, 214060677, 213095383, 215065077, 217389833, 214515281, 208004772, 205924917, 210793972, 215323722, 213543245, 209707216]
43142B09707216J111420M438803N28314m439502k852438K624593M516902K878642
43134B18513950M032831Q494171Q496511K2053r131382q719457l86817M014100
43126B25335960j122947p011576k933825Q063717J3144465P746617J150952J862153
43118B46235516N587183L494057l556312o964881l607002J191581L318443M508575
43110B50207160N823454L789620l319886j0550110j1812930p157870j165811L017825
43102B28831452M720538L468292k84729l345007k287488K258754O111690O185835
43094B45659337L054978n72918k328430j558787L58701J322434R24313Q39674
43086B47699302K076689L098088K006303m43446j670620o34767J119433J780936
$$ y = [209707216, 210818636, 215257439, 215785753, 211346251, 208493813, 211118406, 215635308, 218513950, 222546781, 231040952, 239537463, 239559516, 230428134, 221708677, 221321860, 225335960, 224213013, 217201437, 214267612, 222331329, 235475794, 243222411, 244373363, 246235516, 251822699, 255316756, 251760444, 244795563, 241188561, 242380142, 245698585, 250207160, 256030614, 259820234, 256500348, 245950238, 234137308, 226979438, 225813627, 228831452, 233551990, 237020282, 236735553, 233390546, 231103058, 233361812, 239473502, 245659337, 248714315, 248141397, 245812967, 244254180, 244612881, 245935315, 246859628, 247699302, 249775991, 252874079, 254880382, 254436936, 252766316, 252131549, 253250982, 255031918]
43078B55031918J610291K614848N930177R413218Q633012J760160o823905j0088197
43070B68081522o170389l68125J755780O44227Q8357R15705R12610k36076k32768
43061B65390843J082335K84626m113457p595786m558885L718909R576009Q045548
43053B71830142K412132j007639r64105q69473j730704k30862M855837Q578690
43045B82874018N676437j695470o109775m186943j94026R1947l841432p606116
43037B65008640o934703j392851N345595Q280125N462406p7999l846124m740105
43029B67104984m600335l887059j082402L341135N799613L947548k36423l076439
43021B67310622k975249o66584K066539K867174K70183m004701o125655m486921
$$ y = [255031918, 256642209, 259257057, 265187234, 274600452, 283233464, 284993624, 278169719, 268081522, 261911133, 261543008, 263298788, 263943015, 264031372, 264947077, 265859687, 265623611, 265390843, 266473178, 266757804, 262644347, 255048561, 250489676, 254208585, 263784594, 271830142, 274242274, 273234635, 272270530, 271401057, 269670353, 269439491, 274295328, 282874018, 288550455, 286854985, 280745210, 276558267, 276364241, 276456188, 272614756, 265008640, 258073937, 256681086, 262026681, 270306806, 275769212, 275691213, 271845089, 267104984, 262504649, 258617590, 257535188, 260876323, 266675936, 270623484, 270387061, 267310622, 264335373, 263668789, 265735328, 268602502, 268872685, 264867984, 258742329, 254255408]
43013B54255408j092295J775711L617344M019447K387830M52698J188234L586208
43005B70190585K772469k229896n522720k835070J524226J340021j755874j757204
42997B61726537J046796O70442l569856m646751J192214P686608P074634Q58385
42989B72039009k861350m45012L721707M343437J785660k1265R0942j004217n656730
42980B71992181j0953756j1575257o675349j029539J479775K216420L463693L290128
42972B52208296r61519o298576o777532k350029N31172j577913m170469k032802
42964B28570628K905585M891932K743400N35479R33954J859825L78114k797150
42956B40021767l977404p26328N128984Q498311N584121j914201p891644q019050
$$ y = [254255408, 253163113, 254938824, 258556168, 262575615, 264963445, 265416143, 266604377, 270190585, 272963054, 270733158, 265210438, 262375368, 263899594, 265239615, 263483741, 261726537, 262773333, 263443775, 259873919, 255227168, 256419382, 264105990, 271180624, 272039009, 269177659, 268732647, 272454354, 276797791, 278583451, 278562186, 278653128, 277648911, 271992181, 261038425, 249463168, 242787819, 241758280, 243238055, 245454475, 248918168, 252208296, 251246777, 244948201, 238170669, 235820640, 236351812, 234773899, 230603430, 228570628, 231476213, 236368145, 239111545, 239647024, 240580978, 242440803, 242818917, 240021767, 236044363, 235318035, 240447019, 248945330, 254529451, 252615250, 244723606, 236704556]
42948B36704556l965810l20467J391819L147729N283766M455012j278810p866288
42940B37551507r275403n343598j768737j688956j594883J899949N433007L867933
42932B29080819q18063k026027P48646R03863l928434o842375k188694M968171
42924B19897906O005109J128162k222677p87150J853182L078382M578255P004483
42916B40535652P317108L563596j854348n361999n633119l386351r59423j739794
42908B32481322o104265q584769l999377M013414O505959J594541l324035l053490
42900B19529300j029150j427637k154626l65995J278209m28792k979242k692573
42892B09729494j353321k418970m321865l635092j531548p53608N50752M886479
$$ y = [236704556, 232738746, 232418279, 233810098, 236957827, 242241593, 246696605, 245417795, 237551507, 228276104, 222932506, 221163769, 219474813, 217879930, 219779879, 225212886, 229080819, 228262756, 226236729, 226985375, 227889238, 223960804, 217118429, 214929735, 219897906, 225903015, 227031177, 224808500, 224021350, 225874532, 228952914, 233531169, 240535652, 247852760, 251416356, 249562008, 244200009, 238566890, 235180539, 234221116, 232481322, 226377057, 217792288, 213792911, 217806325, 224312284, 225906825, 222582790, 219529300, 218500150, 217072513, 214917887, 214551892, 215830101, 215401309, 212422067, 209729494, 208376173, 205957203, 201635338, 198000246, 196468698, 195715090, 196265842, 201152321]
42884B01152321Q287164N333573o54449j567817J873882L77132q412062j4574468
42876A91815276j0260229p94627M264337M028325L354362K738930n66994m488236
42868A90091144l602913J851561N573746M459716K161405K009458K005369m97852
42860B04051634l622916m052527k457969k268356m495735o806104o929692m513235
42852A68905100l62699L583877M227382M91284l387156j534767N174723Q283251
42844A85380995K360622o806948r270828m039789Q69546R59741L94902K428737
42836A72276978K610275k611272o872396k286086O558074P244629j993227r084845
42828A65842130o387507j741441m643678j0108956o596961M725753J0414324M257180
$$ y = [201152321, 209439485, 214773058, 214118609, 212550792, 214424674, 214801806, 206389744, 191815276, 181555047, 180760420, 185024757, 189053082, 192407444, 195146374, 194579380, 190091144, 186488231, 188339792, 193913538, 198373254, 200534659, 202544117, 204549486, 204051634, 200428718, 196376191, 193918222, 191649866, 187154131, 180348027, 173418335, 168905100, 168542401, 172126278, 176353660, 176844944, 173457788, 171923021, 177097744, 185380995, 187741617, 180934669, 171663841, 167624052, 168493598, 169453339, 169848241, 172276978, 174887253, 172275981, 165403585, 163117499, 169675573, 176920202, 174926975, 165842130, 159454623, 157713182, 153069504, 142960548, 136363587, 141089340, 151503664, 155760844]
42820A55760844m402116n077881j34767J200260l245643p382462o529167k126275
42812A28062793K209072M394021L808939J479109M21362K478255M833600K988719
42804A50675870k753360p306018p588208n363165k506280J818142O820054P561284
42796A41358319J252520o859461r010591m845419p25155Q0528O35071L042541
42788A24928353M170212J659539j027351q1012K006171O70149k491147k089374
42780A27745540J408781J513552l383911n874149m32993O900033N968643l064076
42772A30781420r626004p112275q31101R01456j757113k364717J060116L379935
42764A14431717P41792l369005l241475P24664K465138j468073p256152q557275
$$ y = [155760844, 151358728, 146280847, 146146080, 147346340, 144100697, 136718235, 130189068, 128062793, 130271865, 134665886, 138474825, 139953934, 140375296, 142853551, 147687151, 150675870, 147922510, 140616492, 133028284, 127665119, 125158839, 126976981, 133797035, 141358319, 142610839, 135751378, 126740787, 121895368, 121170213, 121250741, 121885812, 124928353, 129098565, 130758104, 129730753, 129649741, 131655912, 132326061, 129834914, 127745540, 129154321, 130667873, 127283962, 121409813, 120976820, 127876853, 133845496, 130781420, 121155416, 114043141, 113212040, 114113496, 112356383, 109991666, 111051782, 114431717, 115173509, 111804504, 108563029, 109287693, 111752831, 110284758, 103028606, 94471331]
42756I4471331l895996K423586N729850N162520K472810r35135m156251n457192
42748I5815523l437804K77988J831795k28319k856220k583427k6693J881170K655671
42739I3329684L866327M517937J214931n667279j0059934p358717m38231M857539
42731H4262257P328938R009357Q651594L209409m348880o004770j47467M290027
42723A06250465j55349q274875r253499j918614M270486K825019k331294m566415
42715H6845924l294714j538732L76480L813933P122207O798588K628231k044077
42707A00707840m792621n618520m512131j473005N78564k701303j0395365j4721184
42699E7072275r822114j05955M588019J695314r61568L585500J1312184J2278948
$$ y = [94471331, 90575335, 92998921, 98728771, 103891291, 106364101, 105428966, 101272715, 95815523, 92377719, 92655707, 94487502, 94259183, 91402963, 88819536, 88792843, 90674013, 93329684, 97196011, 101713948, 102928879, 97261600, 87201666, 79842949, 79404718, 84262257, 91591195, 100600552, 109252146, 112461555, 108112675, 102107905, 101960438, 106250465, 106095116, 97820241, 88566742, 86648128, 90918614, 93743633, 91412339, 86845924, 83551210, 82012478, 82388958, 86202891, 93325098, 100123686, 102751917, 100707840, 95915219, 90296699, 85784568, 84311563, 84890127, 82188824, 71793459, 57072275, 47250161, 47144206, 51732225, 53427539, 52465971, 56051471, 67363655, 79642603]
42691G9642603L910858n497724p054233j029746N637905Q299795P511445M887499
42683I6308402Q47103k909876l149887N1806J430362k839550q716284q977660
42675G2044416l425663Q83767K36739r00615J447893L157656j137527p646955
42667F4659711p647970p86527M101812K540140N01219L385456O550221L180012
42659G6484074l802614n559803n22333L955133K742783j060043k314176n19530
42651F9403491J373268P28559l400842r098645j1269105o423946J777334O028649
42643D9118763M787378L217017M052803L652718n33805m671499m625921k288587
42635E2708867j332436r78364J068527L183961K785454J848477L715671O368698
$$ y = [79642603, 83553461, 78055737, 71001504, 69971758, 75609663, 83909458, 91420903, 96308402, 97155505, 94245629, 91095742, 91147548, 92577910, 89738360, 81022076, 72044416, 68618753, 69502520, 69739259, 68838644, 70286537, 73444193, 72306666, 64659711, 57011741, 56225214, 60327026, 62867166, 63368385, 66753841, 73304062, 76484074, 72681460, 67121657, 66599324, 70554457, 73297240, 72237197, 69923021, 69403491, 70776759, 71505318, 68104476, 59005831, 47736726, 41312780, 43090114, 49118763, 53906141, 57123158, 61175961, 64828679, 64294874, 59623375, 54997454, 52708867, 51376431, 50398067, 51466594, 54650555, 57436009, 59284486, 63000157, 69368855]
42627F9368855M762002r99051n274925m622133j203908J678251L167844L459132
42619G0336067K470768O79342j121460k721896l306815j106398L104507M758623
42611G3092738J600350j872994j178902N9139m112611j0350606r317084p39709
42603D7180321M740667J544334k642349Q7833N135417L470314l578322o592151
42595D9346064k175230L710770N772323N199472M529067L014520m23916l856138
42587F5116932m787996l815699l700926n590916p341837n750278n62785M180999
42579C7747494M224539M22931k268797j389028O62145J832941L835015P739321
42571E2806561J0125974P577477K027285k523028n781334q927785r492265m767097
$$ y = [69368855, 74130857, 73131806, 67856881, 63234748, 62030840, 63709091, 66876935, 70336067, 72806835, 73486177, 72364717, 69642821, 66336006, 65229608, 68334115, 73092738, 74693088, 72820094, 71641192, 71700331, 67587720, 57237114, 47920030, 47180321, 51920988, 53465322, 50822973, 50910806, 56046223, 59516537, 55938215, 49346064, 47170834, 50881604, 56653927, 61853399, 66382466, 69396986, 68973070, 65116932, 60328936, 56513237, 52812311, 47221395, 39879558, 34129280, 33566495, 37747494, 41972033, 42394964, 40126167, 38737139, 39399284, 41232225, 45067240, 52806561, 62932535, 70510012, 72537297, 70014269, 64232935, 55305150, 45812885, 41045788]
42563D1045788J232937J440348l320244m285720K254191Q723984P070612L27623
42555E4489519k308475J257854M064712R77148m180450m583794Q709L170722O00365
42546E3496310m246432m886590k06675M790464O128323M982172L510635P71337
42538F4339544l848292o542840l553866J900434K738875k035252n890062m192455
42530D2916086R5098K042093J342760M83562J88465p0666J00696O18263l61612
42521D7354745l590475o602635o771915m475132j330389K054220M486694L695346
42513C4820459M62873q9690M596488R092004O256240k728524r354655p954006
42505C5101189o78703O695963R613324O286318q40570n449979l598996Q45663
$$ y = [41045788, 42278725, 43719073, 40398829, 36113109, 38367300, 47091284, 54161896, 54489519, 52181044, 53438898, 57503610, 58480758, 54300308, 49716514, 49725223, 52895945, 53496310, 49249878, 44363288, 44156613, 48947077, 55075400, 60057572, 63568207, 64339544, 60491252, 53948412, 50394546, 52294980, 55033855, 52998603, 47108541, 42916086, 43011184, 45053277, 46396037, 46879599, 47068064, 46997398, 47098094, 47716357, 47354745, 43764270, 37161635, 30389720, 25914588, 24584199, 26638419, 31125113, 34820459, 35283332, 35193642, 39790130, 48882134, 55138374, 52409850, 43055195, 35101189, 34422486, 41118449, 50731773, 57018091, 56177521, 50727542, 47128546, 47974209]
42497D7974209J619863j99747J757154P450200Q750311K129506m591618l321499
42489F1568379K366989K867504l670970j0033824j0669828p322519m014249j802362
42481B9289120K69436K649147M942876N944011L861820j337929o080587o053297
42473C3484597j082758M496959O123875K637123l066727n744577k302962L624673
42465C8170203M454291j410293o115433l051185K923958K481451l723066o075982
42457B7653944j087037L747418K395076j067659o34122K247784L252796L066714
42449C9574914L971793L305027k107890q106962p706353k019410J045224j099653
42441B6856690k527457P76384M406207K865926j999026m244367k071252J397586
$$ y = [47974209, 49594072, 49394325, 51151479, 58601679, 67351990, 69481496, 64889878, 61568379, 63935368, 66802872, 63131902, 53098078, 42428250, 35105731, 31091482, 29289120, 29558556, 32207703, 37150579, 43094590, 46956410, 45618481, 39537894, 33484597, 32401839, 36898798, 43022673, 45659796, 42593069, 36848492, 34545530, 38170203, 42624494, 41214201, 35098768, 32047583, 34971541, 37452992, 33729926, 27653944, 26566907, 30314325, 32709401, 31641742, 31007620, 33255404, 36508200, 39574914, 43546707, 46851734, 44743844, 36636882, 28930529, 26911119, 27956343, 26856690, 24329233, 25105617, 29511824, 32377750, 30378724, 26134357, 24063105, 25460691]
42433B5460691L541955M463460M454757K576370j539771o077799p970472n394632
42425A9514559J30675M116055K991342j568360l590842M72770O898486Q458569
42417C7423254K921580m259013o661021m423807k765851l864360l889057M18372
42409A4900097N758018O567408L190754Q96496J383678R10204k054403l286725
42401B8265527n393L649098K854635l57079j173653l33594k094230n757345o014911
42392A9033055j704108J992714J287125j450658k354743j185116J81374J051730
42384A6851373J887178L267760N700953Q369035Q427073M466422q5352q66424
42376D8018018Q19296k986l781038n870128m555297l251498l111686k88514O131144
$$ y = [25460691, 29002646, 33466106, 37920863, 40497233, 38957462, 32879663, 24909191, 19514559, 19645234, 23761289, 26752631, 25184271, 21593429, 22066199, 28964685, 37423254, 40344834, 36085821, 29424800, 25000993, 22235142, 18370782, 14481725, 14900097, 20658115, 27225523, 30416277, 31312773, 32696451, 33606655, 31552252, 28265527, 28260134, 31909232, 34763867, 34406788, 33233135, 32899541, 30805311, 25047966, 19033055, 17328947, 19321661, 20608786, 19158128, 16803385, 15618269, 15799643, 16851373, 18738551, 22006311, 27707264, 36076299, 44503372, 48969794, 48884442, 48018018, 48837314, 48834328, 45053290, 39183162, 34627865, 31376367, 28264681, 27976167, 34107311]
42367C4107311R895478O196326n77290l226047j929370k135169n129474o970622
42359C0231143n475047k426762Q74395M905200Q115740O717381L23281n561786
42351C7703545n387465l62065L027377J117648k512292k187980J778254L563544
42343C6740566Q30368j451491O35325K626228j055201o160951l942108L722481
42335C1945217N151296l072593r672525n532178K878188M707640J214241J274993
42327B8894279O011022Q515601O143105L114764J796609J38207k279304l404058
42319D8930225m057927o861206r581022o913530J02860L639750J62200m246503
42311B1174847k527619M084229Q366166N701623j534606o302094l338435M909138
$$ y = [34107311, 44002789, 50199115, 49621825, 46395778, 44466408, 42331239, 37201765, 30231143, 24756096, 22329334, 23203729, 28108929, 36224669, 42942050, 43265331, 37703545, 32316080, 31954015, 34981392, 36099040, 33586748, 31398768, 33177022, 36740566, 37570934, 36119443, 36754768, 39380996, 38325795, 32164844, 28222736, 31945217, 37096513, 34023920, 24351395, 18819217, 21697405, 26405045, 27619286, 28894279, 34905301, 43420902, 49564007, 52678771, 54475380, 54613587, 52334283, 48930225, 44872298, 38011092, 28430070, 21516540, 21619400, 25259150, 25421350, 21174847, 18647228, 22731457, 31097623, 36799246, 35264640, 28962546, 25624111, 30533249]
42303C0533249R916994O809357K7033l596575l556020k888270j248190K337310
42295C8334888L712083r12622o584903o129419k638165m537859r609668o894189
42287D740146M314128J1179837P124586J555656L249768O550630L242994k600245
42279C9357500k755784M09698p05845m628261l960613O57938J452152l072801
42271B6753984o244967m654415j984398p33553J218968M214889M655160J559611
42263B4785279r69798k05817J460926J328240L67218L47139Q18984Q40299O13508
42254B9385978Q9623j275991k571293k038806k17006L96978n82696n36692K124026
42245B4774121N381188N971111K842322j883061m292601k004776K342513K656248
$$ y = [30533249, 40450243, 47259600, 47286633, 43690058, 40134038, 37245768, 35997578, 38334888, 42046971, 41134349, 34549446, 28420027, 25781862, 21244003, 11634335, 4740146, 9054274, 20234111, 27358697, 28914353, 32164121, 38714751, 41957745, 39357500, 36601716, 37011414, 36305569, 31677308, 27716695, 28374633, 29826785, 26753984, 20509017, 15854602, 13870204, 13136651, 14355619, 18570508, 23225668, 24785279, 23815481, 23609664, 25070590, 26398830, 26766048, 27113187, 27932171, 28772470, 29385978, 29475601, 28199610, 25628317, 23589511, 23372505, 23769483, 23186787, 22650095, 24774121, 30155309, 36126420, 38968742, 37085681, 32793080, 30788304, 33130817, 35787065]
42237C5787065l144168r146989q248069j329234M269557M341426J569769J59000
42229B4258357J133014L267897M671467K946297k345459o861630n311722P98624
42221B2556845L564871j120512p670653q148004k603628J669005j29098m999632
42213C119194o855405l681203J529302N468393P816080R497541R797113P416376
42205C4107391L689803K015785L509715N494939N117093K273402j707286n501101
42197D8999741o899907l995123P53206J286614m145671r102620o763747J054241
42189B1186734O832030O933612L589602p31454n309598q032282n883122K23097
42181A8808619N197647N696688L225559O14222j390420k859657k803717l25971
$$ y = [35787065, 32642897, 23495908, 15247839, 13918605, 18188162, 22529588, 24099357, 24258357, 25391371, 28659268, 33330735, 36277032, 33931573, 27069943, 21758221, 22556845, 26121716, 25001204, 17330551, 9182547, 6578919, 8247924, 8118826, 3119194, -3736211, -7417414, -5888112, -419719, 7396361, 16893902, 26691015, 34107391, 37797194, 39812979, 43322694, 48817633, 53934726, 56208128, 54500842, 48999741, 42099834, 38104711, 38857917, 40144531, 35998860, 26896240, 20132493, 21186734, 28018764, 34952376, 38541978, 37810524, 32500926, 24468644, 18585522, 18808619, 24006266, 29702954, 32928513, 33542735, 32152315, 29292658, 26488941, 26162970]
42173B6162970L615327O560355O217004K170699l214846o327259n617786k575175
42165B6991289P07937K964914K817743j18375k623890r52187K214939j62153p818838
42156B4021379j0808637l802640M632249M561080k29833M20670N739626O011406
42148C0545300m55785m768802k174420K137794L575467L714748K971477j691771
42140C3854008q257801q954980k474697K458698M86481k613044r34120K058752
42132A5623297J774500J537407N243392Q322352N011756j037879k462310q4423
42124C3928092k70468l755750n773285n078625m639951m559173j751516L581478
42116A1680802P100202N764312O9664p241625j0911127n535683O297342J2603883
$$ y = [26162970, 29778297, 36338652, 42555656, 44726355, 41511509, 35184250, 29566464, 26991289, 27699226, 30664140, 33481883, 33363508, 30739618, 29787431, 32002370, 31840217, 24021379, 13212742, 9410102, 14042351, 18603431, 18373598, 18794268, 24533894, 30545300, 30089515, 25320713, 23146293, 25284087, 28859554, 32574302, 35545779, 33854008, 25596207, 16641227, 14166530, 16625228, 17111709, 14498665, 13564545, 15623297, 17397797, 18935204, 24178596, 32500948, 37512704, 36474825, 34012515, 33928092, 33657624, 29901874, 24128589, 19049964, 14410013, 9850840, 8099324, 11680802, 18781004, 24545316, 24614980, 17373355, 6462228, 926545, 7223887, 19827770]
42108A9827770O053731m268787l880633O881956J3665002Q560399p45756m273675
42100D1820007k366301n86500M9342J573757K766623N62840m305161p638047p050636
42091B4825924m136879j836225j444418k100674k349449j842455r17313J168672
42083A1367183N229455Q673886O657876q07850o616034n245037k27590J779917
42075B0811806Q49034J441360L164522J794987j723229j991762O10647o68237
42067B4289128o964800j0005182m806879J590972N16480n181273o117652q24384
42059g503590L297138K600376K373857O960517J1343819P895047j605345o837555
42051A8524264k382137M896946N176516j142843m879437j479938L420263L329690
$$ y = [19827770, 25881501, 21612714, 17732081, 24614037, 38279039, 46839438, 46093682, 41820007, 39453706, 38867206, 38916548, 40490305, 43256928, 43819768, 39514607, 31876560, 24825924, 20689045, 18852820, 17408402, 15307728, 12958279, 11115824, 10198511, 11367183, 16596638, 25270524, 31928400, 31120550, 24504516, 19259479, 19031889, 20811806, 21660840, 23102200, 26266722, 28061709, 26338480, 24346718, 24957365, 24289128, 17324328, 7319146, 2512267, 4103239, 4619719, -561554, -6679206, -7503590, -4206452, -1606076, 767781, 7728298, 19072117, 26967164, 25361819, 18524264, 16142127, 21039073, 26215589, 25072746, 20193309, 18713371, 22133634, 25463324]
42043B5463324l43401k388044j455691R00520M236218O974007M649855l062289
42035C4974499p682378k316713O480600O716750j016632m454049J057282N974448
42027C9733807K611896l519392m610159l116900n009175p658485m338005L028126
42019A7121713N284566m12074o284746m537107L065824Q343102O595375J350485
42011C0527138m87530K601101M810614J489899l500107l813199j527639m079009
42003B6021268j0544646j0836419j531286P325353O731899J160073n79874J175047
41995A8921415J088795n04130n75712j198927m342971m277133L626611J1139660
41987B3877608P020948m332790p943426r92361M054846L49337m177755k504440
$$ y = [25463324, 25119923, 22731879, 21276188, 22176708, 26412926, 33386933, 38036788, 34974499, 27292121, 24975408, 31456008, 38172758, 37156126, 32702077, 33759359, 39733807, 42345703, 38826311, 34216152, 31099252, 26090077, 18431592, 14093587, 17121713, 22406279, 21994205, 15709459, 11172352, 14238176, 22581278, 29176653, 30527138, 30039608, 32640709, 37451323, 38941222, 35441115, 31627916, 30100277, 26021268, 15476622, 4640203, 3108917, 10434270, 17166169, 18326242, 17746368, 18921415, 20010210, 19506080, 18930368, 17731441, 13388470, 9111337, 12737948, 23877608, 30898556, 26565766, 18622340, 17629979, 21684825, 22034162, 17856407, 15351967]
41979A5351967Q06199Q50269J402584M898794N165745o64426l747824K233441
41971B6296749Q024750K559019p989573r184103j209229K600261j929595m710211
41963A4458068r6284M185562J680857j946077N5150L641565J683349l574715m592615
41954A5494860n68172K773878K652156J152834n54154k970332l898739P2216O954754
41945B1109301R827392N586652j149566m731316n155973n525515o023587m044522
41937I892866R18592N822117P748882O784122M548297J698523j688624m356718
41929C1368057m581887k769673j393843j471627j008003J338205K858187P6031
41921B4415447n297996p328721l483386J958640L609497J258035j475556k197790
$$ y = [15351967, 16158166, 17008435, 18411019, 23309813, 28475558, 27811132, 24063308, 26296749, 34321499, 36880518, 28890945, 19706842, 18497613, 21097874, 19168279, 14458068, 14361784, 18547346, 20228203, 18282126, 18337276, 21978841, 23662190, 20087475, 15494860, 14926688, 17700566, 20352722, 21505556, 20951402, 17981070, 14082331, 14154547, 21109301, 30936693, 36523345, 35373779, 30642463, 25486490, 19960975, 13937388, 9892866, 10811458, 16633575, 24382457, 31166579, 35714876, 37413399, 35724775, 31368057, 26786170, 24016497, 22622654, 21151027, 20143024, 21481229, 24339416, 24415447, 19117451, 11788730, 8305344, 10263984, 13873481, 15131516, 13655960, 11458170]
41913A1458170r94982J267371L110366K474306o29452k847592j696768L79376
41905A2520795m71366l165280l073287N23959K972599J234846j890228k434867
41897F217171n28318J426790K692314L325904J962048j869830m720608k451891
41889F053580L653960P400155M996458p58197m630512m966568l813656k658767
41881E276453o62869K693113N339356M550251M97114l593143m860215l202967
41873F037093k61808K301148K993160J015475k012889k699124j20088K324630
41865I577597J622629j72171P26302L292442K832211j547993n139090m267898
41857F924029p85289J523694J543633K65630j207560j519948J10519J635327k5260
$$ y = [11458170, 10463188, 11730559, 14840925, 17315231, 16685779, 13838187, 12141419, 12520795, 12049429, 8884149, 5810862, 6334821, 9307420, 10542266, 8652038, 6217171, 5688853, 7115643, 9807957, 13133861, 15095909, 13226079, 8505471, 6053580, 9707540, 17107695, 22104153, 21345956, 16715444, 11748876, 7935220, 5276453, 4613584, 7306697, 12646053, 17196304, 17693418, 14100275, 9240060, 6037093, 5775285, 8076433, 11069593, 12085068, 10072179, 7373055, 7252967, 9577597, 11200226, 11028055, 11754357, 15046799, 17879010, 16331017, 11191927, 6924029, 6138740, 7662434, 9206067, 9471697, 8264137, 6744189, 6854708, 8490035, 8464775]
41848H464775l774490m817634j891617M71968o86031j851182R38654N415410O797596
41839I067449M827688K639647J376573K36988o33166j350909l721276p455196
41831D987798q106228l268742K493187L880238K383556J851077O77524l978455
41823I19955p575179l177419O264412J0370486O509341K985388N207388P974200
41815B9478572N198378p52600m171303m127035k824670j089442K12508j163821
41807B0760587m788529o293417l700385r75366j871332m164238l484529N52482
41799c964727N043582P377180N894682P76338l716041k303690L713629O589763
41791A9410716K357656l851133n274760j393088M113092P900289P006874M54548
$$ y = [8464775, 4690285, -127349, -2018966, -1546998, -2233029, -4084211, -3145557, 2269853, 9067449, 13895137, 16534784, 17911357, 18148345, 17515179, 16164270, 12442994, 4987798, -3118430, -6387172, -3893985, -13747, 2369809, 4220886, 4898410, 919955, -6655224, -9832643, -3568231, 6802255, 13311596, 16296984, 21504372, 29478572, 34676950, 33924350, 29753047, 25626012, 22801342, 21711900, 21924408, 20760587, 15972058, 9678641, 5978256, 5002890, 3131558, -1032680, -4517209, -3964727, 1078855, 8456035, 14350717, 15127055, 11411014, 9107324, 12820953, 19410716, 21768372, 17917239, 12642479, 11249391, 15362483, 23262772, 30269646, 30724194]
41783C0724194o345524n460001K029935N727038Q87351m877407m871830l511168
41775A4302588n753049o201969P58746Q171749O195412j464332l850065r50676
41767A1208404j701199o514443o518171j79487L485746L89269k843975j758795
41759d432651p91523k900813l355555J082337O145762P946112Q047072O486504
41751A8227245n29776j0546337j2380773j315796J1345295J2214830K980817m346071
41743A5649434l745155J462071O829791R623510O557429k770578j1510562j1795948
41735A0299992m707628J707340L124263J849484J32542l064413p889492j1136562
41727i684474r552821l124747N071881J0458888R663967M103669n16374o37913
$$ y = [30724194, 24378670, 18918669, 20948604, 26675642, 27562993, 22685586, 17813756, 14302588, 8549539, 2347570, 3106316, 11278065, 17473477, 16009145, 12159080, 11208404, 9507205, 2992762, -3525409, -3704896, -219150, 170119, -2673856, -4432651, -5224174, -8124987, -11480542, -10398205, -4252443, 3693669, 11740741, 18227245, 17697469, 7151132, -5229641, -6545437, 4799858, 17014688, 19995505, 15649434, 11904279, 13366350, 20196141, 29819651, 36377080, 33606502, 22095940, 10299992, 5592364, 7299704, 10423967, 12273451, 12405993, 9341580, 1452088, -9684474, -19237295, -22362042, -17290161, -6831273, 2832694, 6936363, 6419989, 5782076]
41719E782076J096373P47029o38330M80519L336759L235737j573741p244378r019462
41710c797418o014275j025217K626455L908926M594220O525038Q467553P520919
41702B2806201L563194o60398m019073p481455r465237o179930J080949M829907
41694D474158J570045k274464J85357N664237N898296p9392n834113p440962o455844
41685d292682m153312J30335M578454N022179R12859l276757l715260r91049J917471
41676c867762K472064j4659k930035j839093L395784O434998K631649l397987
41668B884959l755586J734095O704185Q029652P186136L919773k693424p703370
41660A6306420m624770K707773K733567o699338j3834332j0000777j371848K432614
$$ y = [5782076, 6878449, 7625478, 6987148, 7467667, 10804426, 14040163, 12466422, 5222044, -3797418, -9811693, -10836910, -8210455, -4301529, 292691, 6817729, 15285282, 22806201, 26369395, 25708997, 21689924, 14208469, 4743232, -1436698, -355749, 4474158, 6044203, 3769739, 3955096, 9619333, 15517629, 15438237, 9604124, 2163162, -4292682, -8445994, -8315659, -3737205, 1284974, 2197833, -1078924, -4794184, -5785233, -3867762, -1395698, -1410357, -4340392, -6179485, -2783701, 3651297, 6282946, 2884959, -870627, 863468, 7567653, 15597305, 22783441, 26703214, 24009790, 16306420, 11681650, 14389423, 17122990, 10423652, -3410680, -13411457, -14783305, -12350691]
41652a2350691K417976M564074P372281M977837j610621n841560n713529m212994
41644a0397227j913619K346090N024757J356518m767464l703903N380583J1606180
41636D931915P492258p61363k984628J339345N196175N145465L487009J785174
41628B5631350j003146m189958m819542k562993r01360j972791l661485l497822
41620C022253k413113k300379k267106l89651K096190J779639j675813m349989
41612f497969l197181K01436K713331M173979O090109P341882M973972m74332
41604A5325227m091116k816054J76687j51988l735872n803272l600952K37676
41596d459664J524228m95300k922494k640796P12894M277654M329084L18549l526883
$$ y = [-12350691, -9932715, -5368641, 2003640, 6981477, 5370856, -470704, -6184233, -10397227, -12310846, -9964756, -4939999, -3583481, -8350945, -12054848, -6674265, 4931915, 12424173, 11662810, 8678182, 10017527, 15213702, 20359167, 23846176, 25631350, 24628204, 20438246, 15618704, 13055711, 12154351, 10181560, 6520075, 3022253, 609140, -1691239, -3958345, -4347996, -2251806, -472167, -2147980, -6497969, -9695150, -9493714, -6780383, -2606404, 3483705, 10825587, 15799559, 15325227, 11234111, 8418057, 8594744, 8442756, 4706884, -1096388, -4697340, -4459664, -2935436, -3430736, -6353230, -8994026, -8281132, -4003478, 325606, 644155, -2882728]
41587b882728k473973K592916N695906L441493m86859p31321K184132L215397
41579A0554963N76408k036316j484910M45366M91501j284790k456842j855868
41571B949512M9145K634459M730735M388858J403732j476790k242964k578584
41563I858103m140655m230967K33814N871299N693641r07990o744420o816204
41555a183379m100933k882375j994053J013360L657453K223380j015033k38378
41547d519958N018458Q563736N624900j576926p055949p192905l266971J50134
41539d255481m97375l567901l648381R43906M444491J004392o088593p491650
41531a9156592J9993R281651J1897150P670706K697233Q17567r7834l750906r143997
$$ y = [-2882728, -5356701, -2763785, 2932121, 6373614, 5886755, 5155434, 7339566, 10554963, 11131371, 9095055, 7610145, 8055511, 8547012, 7262222, 4805380, 2949512, 2998657, 5633116, 10363851, 14752709, 16156441, 14679651, 12436687, 9858103, 5717448, 1486481, 1720295, 7591594, 13285235, 12377245, 5632825, -1183379, -5284312, -8166687, -10160740, -9147380, -5489927, -3266547, -4281580, -4519958, 498500, 9062236, 14687136, 13110210, 6054261, -1138644, -4405615, -4255481, -4752856, -8320757, -11969138, -11025232, -6580741, -5576349, -11664942, -19156592, -19136599, -9854948, 2042202, 9712908, 12410141, 13227708, 13129874, 9378968, 234971]
41522B34971j0360307l983158M389993N175595k422769p897662l525072M360127
41514a4028282M841746j017433k475881L387916P096216J931940n946384p265219
41506a3475381j901112M088674P406853P645386L990262j742435l335442J725130
41498D401935O185696K424015n183924n670993K246574Q228879N301563j712874
41490A6220871n275439m999968m153137k517261J345264M494843K562386l009462
41482D668097n943279l290868J737849N539495Q287860J0523019R619645L536892
41474C4678710l933134o295173k887715o6181k315042o103152n678001j844212
41466E556100m10366l338004o406998n855799k815158n5141J677050K473896J913503
$$ y = [234971, -10125336, -14108494, -9718501, -4542906, -6965675, -14863337, -18388409, -14028282, -9186536, -10203969, -12679850, -9291934, -2195718, -263778, -6210162, -13475381, -15376493, -11287819, -3880966, 3764420, 7754682, 6012247, 2676805, 4401935, 10587631, 13011646, 7827722, 2156729, 4403303, 12632182, 17933745, 16220871, 10945432, 5945464, 1792327, -724934, 620330, 5115173, 7677559, 4668097, -1275182, -4566050, -2828201, 2711294, 10999154, 21522173, 31141818, 34678710, 30745576, 24450403, 21562688, 21496507, 19181465, 13078313, 7400312, 5556100, 5145734, 1807730, -4599268, -10455067, -13270225, -13325366, -11648316, -9174420, -7260917]
41457g260917P11492P40353J802760J396729p99616j534320J145526M965585P144898
41448H312490P410687N591807Q19951m316214m124390J699665N133253N89811
41440B1117060o224624o560822j330834K120781K403982M031203O709551M789071
41432B7055368j781669n465517k728298O99238l80730l095419l013148j503180
41424I786645j651171k437040k065087k176204l587369k457331L579925R329810
41416H322178Q162314J389204m221891n802477n496476m525137k407780o62939
41408e243004j057855j043498K870610P764875P000792N53625m216972l419844
41400C208729j301396j610107j362422K309975N110682J705503m716648n741067
$$ y = [-7260917, -6549425, -5809072, -4006312, -2609583, -3409199, -4943519, -3797993, 1167592, 8312490, 15723177, 21314984, 22134935, 17818721, 13694331, 15393996, 20527249, 21117060, 14892436, 8331614, 7000780, 9121561, 11525543, 15556746, 22266297, 27055368, 25273699, 19808182, 17079884, 17779122, 17398392, 14302973, 11289825, 9786645, 8135474, 5698434, 3633347, 1457143, -2130226, -4587557, -1007632, 8322178, 16484492, 17873696, 13651805, 7849328, 2352852, -2172285, -4580065, -5243004, -6300859, -7344357, -4473747, 3291128, 10291920, 10845545, 6628573, 3208729, 1907333, 297226, -1065196, 1244779, 6355461, 8060964, 3344316, -2396751]
41392b396751N68668P029431O714808M94628n734858p856033o073602k888221
41384a0141930j46732K368095N581597Q342714P661724L070537j311680j691347
41376A3732978P4699m96642l382559m410223k623658k081006m599041n695894
41368i481346j299861N220391P268942M097643R41687J013349K089048J432897
41360A1282750j79994q11099l64961N99356K411560M624070M991304K444984m49672
41351B4548298m54106J808840K672377N42783k031402j989685O9789M49799l239046
41342B2377647q902536j1657327q926478l266938Q80582K755737N526955J0513634
41334I301276J3785217J0710847K300989n720427r470058r699691q268600n326237
$$ y = [-2396751, -1828083, 5201348, 11916156, 12410784, 6675926, -1180107, -7253709, -10141930, -10288662, -7920567, -2338970, 6003744, 13665468, 16736005, 15424325, 13732978, 13807677, 13311035, 9928476, 5518253, 2894595, 813589, -3785452, -9481346, -10781207, -5560816, 1708126, 5805769, 6747456, 7760805, 9849853, 11282750, 11102756, 10291657, 9926696, 10526052, 12937612, 17561682, 22552986, 24997970, 24548298, 24094192, 25903032, 28575409, 29118192, 27086790, 25097105, 25166894, 25616693, 22377647, 13475111, 1817784, -7108694, -10375632, -9495050, -6739313, -1212358, 9301276, 23086493, 33797340, 36098329, 30377902, 20907844, 11208153, 2939553, -2386684]
41326b386684j334772J178212N67473j019428o68010L98381j481309n686699o422600
41317a6855436o88184O246657P051873K044081j824147r56061J198431J380803
41309b401983J631164L839464M430987J46802m362364j863549N760476Q802674
41301A5983671L746595j555072K3368M385852L349262k577175n538655k386342
41293A5431504J473611O08256l635608o532429o106804l548551j64408L447095
41285I72666O093541N959620K595274j444134k029926K053767O318223M621210
41277B5140241l160569j0083931j0384249o042253k639292j511942J0550K444904
41269f226541L223495J878649J539337L878055O009838M379027l32777l837417
$$ y = [-2386684, -3721456, -2543244, -1975771, -2995199, -3663209, -3264828, -4746137, -10432836, -16855436, -17543620, -11296963, -4245090, -2201009, -4025156, -4981217, -3782786, -2401983, -770819, 3068645, 7499632, 7646434, 3284070, 1420521, 7180997, 15983671, 19730266, 18175194, 18198562, 22584414, 25933676, 23356501, 17817846, 15431504, 16905115, 17513371, 13877763, 7345334, 1238530, -2310021, -2474429, 972666, 7066207, 13025827, 15621101, 14176967, 12147041, 14200808, 20519031, 25140241, 21979672, 11895741, 1511492, -4530761, -7170053, -8681995, -8671445, -6226541, -3003046, -1124397, 414940, 4292995, 10302833, 14681860, 14349083, 10511666]
41261A0511666k809027J807200N352092L706458j931408n527388l113821K149699
41253A0145471M134092J474753j932005k834168j170747K404134O944013R101883
41245B8267426N473233j739420n702938l217386J765517M268127L756396J648497
41237C4519452k066440o597742q531205n940153j643757Q04443J645782K298836
41229A4489216J493528j649192l400903K40901O175866O796971M27525n779341
41221A8794571m986744J112475N352093L592887k076856o748749p073400l265441
41213D700836J276168K558543m22878m463519n163812j356807L731992N827621
41205F688144L973226J358062J632325M654525O563225M291862o75172l820191
$$ y = [10511666, 7702639, 9509839, 14861931, 18568389, 16636981, 11109593, 7995772, 10145471, 14279563, 15754316, 13822311, 10988143, 9817396, 12221530, 19165543, 28267426, 33740659, 32001239, 26298301, 23080915, 24846432, 29114559, 32870955, 34519452, 32453012, 25855270, 17324065, 11383912, 9740155, 10544598, 12190380, 14489216, 15982744, 14333552, 10932649, 11173550, 17349416, 24146387, 24573912, 18794571, 13807827, 14920302, 20272395, 23865282, 21788426, 15039677, 7966277, 4700836, 5977004, 8535547, 8112669, 3649150, -1514662, -2871469, 860523, 6688144, 10661370, 12019432, 13651757, 18306282, 24869507, 29161369, 28486197, 24666006]
$$ [...]
##END NTUPLES=NMR SPECTRUM
##END=
