##TITLE=31Pdec_DE-106oil_TFA2
CDCl3, 64 sc
 15.8.2025
##JCAMPDX= 6.0         $$ Bruker NMR JCAMP-DX V2.0
##DATA TYPE= NMR SPECTRUM
##DATA CLASS= NTUPLES
##ORIGIN= UXNMR, Bruker Analytische Messtechnik GmbH
##OWNER= root
$$ XWIN-NMR		Version 3.5
$$ Fri Aug 15 14:14:13 2025 Russian Standard Time (UT+4h)  she@DPX200
##.OBSERVE FREQUENCY= 81.013821
##.OBSERVE NUCLEUS= ^31P
##.ACQUISITION MODE= SIMULTANEOUS
##.ACQUISITION SCHEME= undefined
##.AVERAGES= 64
##.DIGITISER RES= 17
##SPECTROMETER/DATA SYSTEM= spect
##.PULSE SEQUENCE= zgpg30
##.SOLVENT NAME= DMSO
##.SHIFT REFERENCE= (INTERNAL, DMSO, 0, 198.062)
##AUDIT TRAIL= $$ (NUMBER, WHEN, WHO, WHERE, WHAT)
$$ ##TITLE= Audit trail, XWIN-NMR		Version 3.5
$$ ##JCAMPDX= 5.01
$$ ##ORIGIN= Bruker BioSpin GmbH
$$ ##OWNER= she
$$ F:/spectra/data/she/nmr/P31/2/pdata/1/auditp.txt
$$ ##AUDIT TRAIL=  $$ (NUMBER, WHEN, WHO, WHERE, WHAT)
(   1,<2025-08-15 14:13:03.23 +0400>,<she>,<DPX200>,
      <created by zg, POWCHK disabled, PULCHK disabled
       configuration hash MD5:
       00 E9 B6 7A A2 85 ED C7 34 08 36 98 17 FE 4E 26
       data hash MD5: 32K
       81 3B D5 7A 86 FA A1 82 AA A7 59 5F 82 49 0D 0E>)
(   2,<2025-08-15 14:13:05.73 +0400>,<she>,<DPX200>,
      <Start of raw data processing
       efp BC_mod = 2 LB = 1.5 FT_mod = 6 PKNL = 1 PHC0 = 1358.196 PHC1 = 161.6995 SI = 64K 
       data hash MD5: 64K
       F4 5A C7 04 6D B5 A3 42 A8 9A C1 C6 7E C4 BC 52>)
(   3,<2025-08-15 14:13:37.48 +0400>,<she>,<DPX200>,
      <pk PHC0 = 51.84091 PHC1 = -137.6 
       data hash MD5: 64K
       1D CA 66 71 99 B0 71 DE 45 2B E4 F2 C8 6F 1F B0>)
(   4,<2025-08-15 14:13:40.95 +0400>,<she>,<DPX200>,
      <abs ABSG = 5 
       data hash MD5: 64K
       C4 AD 7E BF 51 0D 2B E6 B6 DB 71 00 D6 06 18 89>)
$$ ##END=
$$ 
$$ hash MD5
$$ 80 16 03 C4 68 9A C5 71 AF 82 D3 17 2A E2 8C 11
##$RELAX= 
##$RELAX= 
##$RELAX= 
##$RELAX= 
##$RELAX= 
##$RELAX= 
##$RELAX= 
##$RELAX= 
$$ Bruker specific parameters
$$ --------------------------
##$DU= <F:/spectra>
##$EXPNO= 2
##$NAME= <P31>
##$PROCNO= 1
##$TYPE= <nmr>
##$USER= <she>
##$AMP= (0..31)
100 100 100 100 100 100 100 100 100 100 100 100 100 100 100 100 100 100 
100 100 100 100 100 100 100 100 100 100 100 100 100 100 
##$AQSEQ= 0
##$AQ_mod= 1
##$AUNM= <au_zg>
##$AUTOPOS= <>
##$BF1= 81.014009
##$BF2= 200.13
##$BF3= 200.13
##$BF4= 200.13
##$BF5= 200.13
##$BF6= 200.13
##$BF7= 200.13
##$BF8= 200.13
##$BYTORDA= 1
##$CFDGTYP= 0
##$CFRGTYP= 5
##$CHEMSTR= <none>
##$CNST= (0..31)
1 1 145 1 1 1 1 1 1 1 1 1 1 1 1 1 1 1 1 1 1 1 1 1 1 1 1 1 1 1 1 1 
##$CPDPRG= <waltz16>
##$CPDPRG1= <>
##$CPDPRG2= <waltz16>
##$CPDPRG3= <>
##$CPDPRG4= <mlev>
##$CPDPRG5= <mlev>
##$CPDPRG6= <mlev>
##$CPDPRG7= <mlev>
##$CPDPRG8= <mlev>
##$CPDPRGB= <>
##$CPDPRGT= <>
##$D= (0..31)
0 1 0 0 0 0 0 0 0 0.06 0 0.03 2e-05 3e-06 0 0 0.0002 0 0 0 0 0 0 0 0 0 
0 0 0 0 0 0 
##$DATE= 1755252782
##$DBL= (0..7)
120 120 120 11 120 120 24 19 
##$DBP= (0..7)
150 150 150 150 150 150 150 150 
##$DBP07= 0
##$DBPNAM0= <>
##$DBPNAM1= <>
$$ [...]
##$SUBNAM3= <"">
##$SUBNAM4= <"">
##$SUBNAM5= <"">
##$SUBNAM6= <"">
##$SUBNAM7= <"">
##$SUBNAM8= <"">
##$SUBNAM9= <"">
##$SW= 400.765351723535
##$SWIBOX= (0..15)
0 1 3 0 0 0 0 0 0 0 0 0 0 0 0 0 
##$SW_h= 32467.5324675325
##$TD= 32768
##$TD0= 1
##$TE= 0
##$TE2= 300
##$TE3= 300
##$TEG= 300
##$TL= (0..7)
0 120 53 12 22 120 120 120 
##$TP= (0..7)
150 150 150 150 150 150 150 150 
##$TP07= 0
##$TPNAME0= <>
##$TPNAME1= <>
##$TPNAME2= <>
##$TPNAME3= <>
##$TPNAME4= <>
##$TPNAME5= <>
##$TPNAME6= <>
##$TPNAME7= <>
##$TPOAL= (0..7)
0.5 0.5 0.5 0.5 0.5 0.5 0.5 0.5 
##$TPOFFS= (0..7)
0 0 0 0 0 0 0 0 
##$TUNHIN= 0
##$TUNHOUT= 0
##$TUNXOUT= 0
##$USERA1= <user>
##$USERA2= <user>
##$USERA3= <user>
##$USERA4= <user>
##$USERA5= <user>
##$V9= 5
##$VALIST= <valist>
##$VCLIST= <CCCCCCCCCCCCCCC>
##$VD= 0
##$VDLIST= <DDDDDDDDDDDDDDD>
##$VPLIST= <PPPPPPPPPPPPPPP>
##$VTLIST= <TTTTTTTTTTTTTTT>
##$WBST= 1024
##$WBSW= 4
##$XGAIN= (0..3)
0 0 0 0 
##$XL= 0
##$YL= 0
##$YMAX_a= 28333
##$YMIN_a= -15380
##$ZGOPTNS= <>
##$ZL1= 120
##$ZL2= 120
##$ZL3= 120
##$ZL4= 120
##$ABSF1= 198.0616
##$ABSF2= -202.7028
##$ABSG= 5
##$ABSL= 3
##$ALPHA= 0
##$AQORDER= 0
##$ASSFAC= 0
##$ASSFACI= 0
##$ASSFACX= 0
##$ASSWID= 0
##$AUNMP= <proc_1d>
##$AZFE= 0.1
##$AZFW= 0.5
##$BCFW= 0
##$BC_mod= 2
##$BYTORDP= 0
##$COROFFS= 0
##$CY= -3
##$DATMOD= 1
##$DC= 0
##$DFILT= <>
##$DTYPP= 0
##$F1P= 0
##$F2P= 0
##$FCOR= 1
##$FTSIZE= 65536
##$FT_mod= 6
##$GAMMA= 0
##$GB= 0
##$INTBC= 1
##$INTSCL= 9.790993e-09
##$ISEN= 30
##$LB= 1.5
##$LEV0= 0
##$LPBIN= 0
##$MAXI= 10000
##$MC2= 0
##$MEAN= 0
##$ME_mod= 0
##$MI= 50
##$NCOEF= 0
##$NC_proc= -9
##$NLEV= 6
##$NOISF1= 182.463
##$NOISF2= 159.3651
##$NSP= 0
##$NTH_PI= 0
##$NZP= 0
##$OFFSET= 198.0616
##$PC= 4
##$PHC0= 1410.037
##$PHC1= 24.09949
##$PH_mod= 1
##$PKNL= yes
##$PPARMOD= 0
##$PSCAL= 0
##$PSIGN= 0
##$REVERSE= no
##$SF= 81.0140089999434
##$SI= 65536
##$SIGF1= 159.3651
##$SIGF2= -187.1042
##$SINO= 113.3802
##$SIOLD= 16384
##$SREGLST= <1H.CDCl3>
##$SSB= 0
##$STSI= 65536
##$STSR= 0
##$SW_p= 32467.5324675325
##$SYMM= 0
##$S_DEV= 0
##$TDeff= 32768
##$TDoff= 0
##$TI= <>
##$TILT= no
##$TM1= 0
##$TM2= 0
##$TOPLEV= 0
##$USERP1= <user>
##$USERP2= <user>
##$USERP3= <user>
##$USERP4= <user>
##$USERP5= <user>
##$WDW= 1
##$XDIM= 65536
##$YMAX_p= 498126765
##$YMIN_p= -112343726
$$ End of Bruker specific parameters
$$ ---------------------------------
##NTUPLES= NMR SPECTRUM
##VAR_NAME=  FREQUENCY,     SPECTRUM/REAL,   SPECTRUM/IMAG
##SYMBOL=    X,             R,               I
##VAR_TYPE=  INDEPENDENT,   DEPENDENT,       DEPENDENT
##VAR_FORM=  AFFN,          ASDF,            ASDF
##VAR_DIM=   65536,         65536,           65536
##UNITS=     HZ,            ARBITRARY UNITS, ARBITRARY UNITS
##FACTOR=    0.49542278885378, 1,            1
##FIRST=     16045.7642231865, 0,            0
##LAST=      -16421.768244346, 0,            0
##MIN=       -16421.768244346, -112343726,   0
##MAX=       16045.7642231865, 498126765,    0
$$ Real data points
##PAGE= N=1
##DATA TABLE= (X++(R..R)), XYDATA
$$ [...]
##PAGE= N=2
##DATA TABLE= (X++(I..I)), XYDATA
9203 8192687 10363021 11345630 8470812 1403227 -5161836 -6439687 -3450987 -1116430
9195 -1116430 -1577578 -2228251 -33823 4537100 8142760 7954422 4648693 2464147 4951519
9186 4951519 10001658 11171884 5225664 -3971512 -10676059 -13516734 -14117731 -12750138
9178 -12750138 -9411739 -7036409 -8849929 -13246783 -15449892 -13905952 -11305090 -9826741
9170 -9826741 -9428741 -10490727 -13698996 -17005393 -17046973 -14278057 -12483498 -12367189 -10147415
9161 -10147415 -4068741 2083630 4240388 3067756 1389710 158446 -398923 922012
9153 922012 3660776 4263557 774894 -3465278 -4523670 -4200813 -7250413 -13257888 -16126289
9144 -16126289 -12543601 -6903064 -5369035 -7542995 -7404204 -2243047 2634598 194416
9136 194416 -9091295 -17629420 -20312499 -19785352 -20337608 -20823099 -17948538 -13564380 -12692075
9127 -12692075 -15245294 -15913696 -12803461 -10105979 -10472087 -10593609 -7344937 -3342980 -2686495
9118 -2686495 -4834800 -6038027 -3865281 1880518 8906160 11152097 3194304 -10754763
9110 -10754763 -18124040 -13081462 -4613862 -3465683 -6919715 -5055676 2435355 6408763
9102 6408763 3620173 831895 2276923 3176832 -772090 -5996562 -7771416 -7474670 -8130696
9093 -8130696 -8415583 -6381222 -4506069 -5645235 -7660451 -7387407 -6771541 -9378092 -13024550
9084 -13024550 -11885199 -5309540 699458 1191751 -2632472 -6499589 -7637724 -5519762
9076 -5519762 -1227353 2536162 2895478 -349263 -4213159 -5283172 -2352621 3175927
9068 3175927 8205539 9595027 6346667 358784 -5466958 -9274949 -10253131 -8571355
9060 -8571355 -6610556 -7845477 -11820731 -12267575 -4301681 7121562 10584796 1349422
9052 1349422 -12617557 -19872587 -17669904 -12074397 -8423448 -5942905 -1727234 3716476
9044 3716476 6839626 5443050 1031284 -3051510 -5275421 -7729048 -13804849 -23147380
9036 -23147380 -29485506 -25799700 -12685169 338389 3827163 -2311400 -10456152 -14877773
9028 -14877773 -16400392 -17585770 -17558852 -14154296 -8493212 -4072146 -2359553 -2069614 -2094204
9019 -2094204 -2458627 -2765716 -2349590 -1822219 -1904065 -1029369 2694826 6957403 6416675
9010 6416675 -199957 -7430834 -9452505 -6336426 -1934332 1437597 3222783 2132797
9002 2132797 -2541641 -8193357 -11112217 -11079208 -10621893 -10004593 -6348200 1727572 11324298
8993 11324298 17781756 17921729 11050205 -169720 -9467067 -11159128 -6269769 -1874962
8985 -1874962 -2950739 -7594249 -11755792 -14999848 -18386086 -19750343 -15922927 -8660917
8977 -8660917 -3803567 -4092290 -6420434 -6842072 -4885273 -1833055 1874257 5528367 7010600
8968 7010600 4998689 680622 -4231577 -9147984 -12729163 -12215581 -7511029 -3619079
8960 -3619079 -5227986 -10219326 -12590355 -11047152 -10093107 -12317609 -14519967 -13273961
8952 -13273961 -10091294 -8426312 -9062875 -11460208 -16385714 -23334424 -27899959 -26406353
8944 -26406353 -21927195 -21024015 -24780066 -27638191 -25658622 -21339971 -18519955 -16570903
8936 -16570903 -12684944 -7384878 -4496720 -6502170 -12003278 -17151737 -18377580 -15077913
8928 -15077913 -11226314 -12878721 -21769764 -32002506 -35307706 -29616331 -20697112 -15147340
8920 -15147340 -13390884 -10354492 -2204707 8459906 14387346 10840273 756455 -8169847
8912 -8169847 -11559716 -11822692 -12854161 -13708267 -10326092 -2512976 4284689 4949770 -82906
8903 -82906 -6681922 -11768401 -14438932 -14355524 -11927092 -9688913 -10833230 -15587137 -20667152
8894 -20667152 -23011643 -22569211 -20549882 -16685511 -10304224 -3459416 -427765 -2987946
8886 -2987946 -7579656 -8787734 -5547283 -2664575 -5552376 -13991004 -21968081 -23793217
8878 -23793217 -19537491 -13871075 -10498940 -9280177 -8388830 -6821298 -3810032 1742924
8870 1742924 8882966 13267719 11289256 5130426 924872 1847769 5524567 8038642
8862 8038642 7312168 2405976 -6395384 -15163111 -17705688 -12007158 -2760927 4550841
8854 4550841 9172614 12451165 13396715 10644822 6067395 2272579 -1288820 -5541050
8846 -5541050 -7534206 -4237650 1058702 2080509 -1221107 -2919136 -1049188 -1077739 -7529350
8837 -7529350 -17429111 -24556528 -25961835 -22205659 -15518081 -9970183 -8936318 -9636184
8829 -9636184 -4754940 7095106 17020343 16412294 8124091 1805466 768075 -429844
8821 -429844 -6111517 -13112408 -15661212 -12564385 -7412621 -3865857 -2720643 -2869012 -3517239
8812 -3517239 -4554360 -4993465 -2934338 1243614 3350250 282608 -4436505 -4215898 1471048
8803 1471048 6227975 5799337 2784922 719657 -750714 -1911887 -96762 4922398
8795 4922398 7782444 4748616 -349019 -2433658 -2820063 -4705400 -5595591 -1425752 5124147
8786 5124147 7929282 6549884 4763146 2513991 -2559670 -7423839 -6172047 504270
8778 504270 6631512 10650245 14578192 14483770 3325464 -14931560 -25659914 -22272926
8770 -22272926 -14336415 -12136557 -13552138 -12981394 -13262360 -19182815 -26530409 -28018015
8762 -28018015 -25342516 -25438523 -28018650 -26473600 -19387636 -12263414 -8544647 -6884828
8754 -6884828 -6786487 -9014762 -10170513 -4677542 6230879 14033769 13220022 6540865 -1223372
8745 -1223372 -8716818 -15204450 -18175709 -17063335 -15056204 -14137649 -11954370 -6516298
8737 -6516298 -665469 1301910 -1089119 -5418850 -10186274 -14708475 -17152088 -15951736
8729 -15951736 -12398032 -9374176 -8233409 -8876625 -11593354 -15874479 -17939503 -13164265
8721 -13164265 -2544459 5844683 4677039 -3940914 -10129109 -6977355 2609141 10848580
8713 10848580 14362509 15869588 18178708 20281963 19709796 15548132 8267138 -565836
8705 -565836 -7523765 -9521395 -8248692 -9130898 -13953644 -17952480 -16769969 -12742065 -10817099
8696 -10817099 -11553898 -12575254 -14286106 -18918856 -25334845 -29813353 -31186788 -30542017
8688 -30542017 -26947156 -18946785 -9763180 -4815163 -3424211 641251 8528421 12598057
8680 12598057 6871413 -4139193 -11519548 -12727125 -11274941 -8918754 -4312434 1546920
8672 1546920 4513727 3279312 1868716 3767106 6178605 3049667 -6934130 -17921332
8664 -17921332 -23184345 -22112339 -19293644 -17786827 -16383321 -14042927 -13105555 -14993381
8656 -14993381 -15735104 -10816787 -3500761 -2639697 -11028518 -20905963 -23472716 -18849087
8648 -18849087 -13606296 -11934485 -13094404 -15164678 -16985853 -17344018 -15987364 -15234539
8640 -15234539 -17389655 -20477510 -19565652 -13088205 -5413238 -1858551 -2769416 -3955133
8632 -3955133 -2191512 1100598 1807441 -2062875 -8264669 -12965194 -14474343 -13561289 -11223002
8623 -11223002 -8137255 -5963650 -6474600 -8448392 -7871822 -3112005 1852524 1678638 -3800621
8614 -3800621 -9561018 -11420572 -9632111 -6308113 -2064137 3027863 6981974 7304968
8606 7304968 4968309 4326560 7516888 10818540 9077092 2713255 -2869473 -4745697
8598 -4745697 -5544982 -8028235 -10726107 -11503836 -11615628 -12442603 -11457379 -6192938 246928
8589 246928 3027598 3090958 4855034 7803584 7458014 4489304 4786225 8806807 9080449
8580 9080449 1860330 -6386220 -9106176 -9251074 -12200752 -15041230 -11163604 -2042798
8572 -2042798 4010899 3480888 475602 -1699708 -4696627 -9851092 -14603493 -15916150
8564 -15916150 -13315739 -7894860 -1983835 391466 -2814075 -7401800 -7035177 -2201197
8556 -2201197 -344889 -5848179 -14240223 -18017842 -14490674 -6420054 1358732 4233748
8548 4233748 361325 -6773345 -10778762 -8865867 -3822578 797323 4074501 5726064
8540 5726064 5007568 3431350 4580667 8656007 10607369 6579882 -534104 -4752409
8532 -4752409 -3781346 451960 5490184 9443737 10315523 7527378 3385642 935949 1228194
8523 1228194 3738066 7294454 9144637 6183472 -262945 -3782156 -368333 5967934
8515 5967934 8931288 8782048 10368325 13896636 13993897 8676506 3150504 1758603 807111
8506 807111 -6169496 -18372394 -27491451 -27179085 -19226579 -9703743 -2096189 3778440
8498 3778440 8207090 10325947 10620234 11686139 14594894 16317580 13398473 7416665
8490 7416665 3876405 5516507 9559854 12235868 12863150 11795373 7466713 -1242330
8482 -1242330 -11142462 -16494263 -14674144 -8237976 -1658044 2411642 4173932 5729028
8474 5729028 8853194 12577101 13690214 10836710 6918473 5713114 7208065 8259299
8466 8259299 6796486 3092722 -2037972 -7338370 -9996496 -8017792 -4400056 -5747241
8458 -5747241 -14908814 -26800113 -33164785 -30611135 -23074834 -17171467 -15792591 -15920405
8450 -15920405 -12818543 -6527846 -2657283 -5215393 -10583729 -11817064 -7780674 -3642059
8442 -3642059 -2211185 -166556 4711662 7520496 2339433 -8083892 -14072339 -10447886
8434 -10447886 -2142519 2521763 1003959 -2504109 -3025686 352692 4749738 6912171
8426 6912171 5998073 3507058 1200191 -166430 -338497 489110 465352 -3103939 -9582028
8417 -9582028 -13173856 -8623204 1297746 7324469 3781823 -5727013 -14133395 -19135183
8409 -19135183 -22551540 -23965568 -20011252 -10549061 -1510960 804194 -3527314 -8826953
8401 -8826953 -10145898 -7421596 -4489965 -5538556 -11723010 -19775449 -24490228 -23742409
8393 -23742409 -20206534 -17006359 -13393101 -7137692 279731 4648015 5099548 5151805 6540311
8384 6540311 6030844 852968 -6052459 -9595584 -8889370 -6360097 -2672017 2706267 6830476
8375 6830476 4711086 -3331651 -10207712 -10131664 -4806651 616384 4370108 7529631 8899445
8366 8899445 4593009 -7037947 -22259646 -34064456 -36812699 -30178989 -20042151 -14061649
8358 -14061649 -14306671 -15323153 -11489838 -4743056 -1901105 -5247556 -9818874 -10715617
8350 -10715617 -9259065 -9736348 -12816639 -15231339 -14806574 -12958416 -12133986 -12855401 -13907642
8341 -13907642 -14025700 -12431955 -8572950 -2846397 2059070 1960142 -4855653 -14447491 -19983156
8332 -19983156 -18769210 -14961480 -13905043 -15683629 -16730341 -16088592 -16133806 -17435776 -17370776
8323 -17370776 -15024417 -13330321 -14119139 -14717557 -12432952 -9181561 -8015703 -7871838 -6235910
8314 -6235910 -4861033 -7434356 -12443826 -14155583 -11275184 -9139063 -11573832 -15511881
8306 -15511881 -16192022 -13377701 -9456335 -5369845 -2023372 -2122179 -6145181 -9146623 -6431112
8297 -6431112 -787899 725782 -3748447 -9348269 -11896228 -11835805 -10539821 -7898185 -5099643
8288 -5099643 -5204373 -8525925 -10977894 -9420154 -5617647 -2643543 -544406 1620165
8280 1620165 2465280 682442 -1346078 -243030 3225398 5384917 5304647 5515377 7245088
8271 7245088 8672778 8555830 8116843 7949909 6074582 1186796 -4293375 -6829204 -6195682
8262 -6195682 -5034886 -4688086 -3830403 -1336404 1719815 3844766 5133496 5894664 4528404
8253 4528404 -656909 -7398706 -10039583 -5888847 804912 3553410 1027581 -3073751
8245 -3073751 -6610863 -11346944 -17870780 -22300235 -20767914 -14575193 -7986392 -2772435
8237 -2772435 2117681 6907311 10141632 10771736 8612126 3844567 -1285445 -2008990 3692068
8228 3692068 10289785 10097367 3846643 750050 6140545 13871695 14491003 7403830 465995
8219 465995 -729185 1344143 1082462 -2969695 -7089502 -7102081 -2982327 1493956 3898302
8210 3898302 6811888 13828313 22059245 22898298 12729477 -823060 -7469322 -6567449
8202 -6567449 -5885546 -9604010 -13802007 -14565470 -14171695 -15851244 -17187924 -13647962 -6262636
8193 -6262636 -857073 -179000 -1024069 194650 2504327 2667336 245115 -1716468 -559034
8184 -559034 2639396 3822890 148788 -6294723 -9525581 -5520472 3055388 9043904
8176 9043904 7739087 647693 -7301333 -12350245 -13293946 -10659189 -6514301 -3934195
8168 -3934195 -4379737 -5691853 -4420210 -193797 3944630 5753516 6160089 6318211 4585120
8159 4585120 -799560 -6852076 -7175634 448079 10201729 14286563 11490686 7013939
8151 7013939 4493536 1982927 -2996116 -8169623 -9590229 -7859647 -7218422 -9079036
8143 -9079036 -10612357 -10174208 -9889464 -11260905 -12163543 -10701275 -8513018 -7155838 -4732942
8134 -4732942 -282329 1805693 -2436947 -8379628 -7235067 1577208 9582829 11922255
8126 11922255 13442869 18982669 24654775 24323822 19576151 16688018 16722858 14981764 8749598
8117 8749598 152131 -7526306 -11522761 -9084962 -533545 8325616 12217720 13645690
8109 13645690 18143722 23450526 21089424 9501056 -2321872 -6846761 -6225528 -4873323
8101 -4873323 -1382764 6016182 11725939 8388712 -2286503 -11125504 -12868837 -10291208
8093 -10291208 -7728384 -6173086 -5303401 -5527435 -6424760 -6175736 -3683327 489995 4974278
8084 4974278 7297025 3962332 -5731342 -16321981 -20332162 -16464807 -10779197 -9069425
8076 -9069425 -10768701 -11256576 -7787070 -1929757 2340656 2311437 -556906 -1529331 2081181
8067 2081181 6962355 7117068 621343 -9133020 -18177381 -24861952 -28297312 -27787148 -25021551
8058 -25021551 -23575240 -24305971 -23720312 -19085974 -13355429 -12475426 -18250257 -25608723 -27229834
8049 -27229834 -20430823 -9608841 -1948715 -664755 -3165382 -6060218 -9869883 -16795678
8041 -16795678 -25572796 -31730851 -32444898 -28296379 -20948700 -12585535 -7259237 -8368668
8033 -8368668 -13702352 -16719571 -14133259 -8947646 -5029853 -2720202 -1435647 -2180846
8025 -2180846 -4713614 -6126083 -5361440 -5365808 -7276060 -6658427 -462661 5868534 4597184
8016 4597184 -2940681 -7824139 -5786203 -1206552 1637458 4082879 7187244 6930764
8008 6930764 335491 -7871961 -10456285 -7580547 -6178172 -9826858 -14136761 -13381246
8000 -13381246 -7755625 -1606241 2876399 6675446 9428322 7906666 1082125 -5777302
7992 -5777302 -5898948 39563 3486831 -1514047 -10503984 -14595545 -12091871 -9309869
7984 -9309869 -10221091 -11028113 -7535489 -3195847 -5064902 -13821484 -22609259 -25559752 -23357428
7975 -23357428 -19743121 -16441549 -13499206 -11684594 -11772211 -12848755 -13464056 -13277046 -11764795
7966 -11764795 -7153972 416564 6099712 4851096 -1245480 -4528828 -1865535 1236573
7958 1236573 -812544 -5297132 -5647917 -1125072 3266211 4603320 3771608 175436 -8258756
7949 -8258756 -18487885 -22745665 -18992477 -15110670 -18013789 -23541569 -23094934 -16559254
7941 -16559254 -11533476 -11529510 -12388989 -10663335 -8570148 -8625478 -9229814 -8773925 -9658211
7932 -9658211 -14403197 -20566612 -23066087 -19992838 -13522386 -6501683 -575985 3324092
7924 3324092 4949635 5119609 5137905 6089469 8535574 11454720 11864377 8202367 4263455
7915 4263455 6025862 13047711 16970524 11564258 971136 -5982841 -7249994 -8568562
7907 -8568562 -13934123 -19841407 -19938086 -12308733 -1236915 6264974 5648089 -1318845 -8037909
7898 -8037909 -10326761 -11194271 -15760833 -22890876 -26200351 -23165251 -18371700 -16507634
7890 -16507634 -16579150 -15110869 -11173961 -5850612 -293243 3172971 1831869 -2396272
7882 -2396272 -2723984 3360879 8343743 3711964 -7855398 -15865250 -16160205 -14302929
7874 -14302929 -14678100 -14416895 -10983677 -8251905 -9822364 -11982273 -9629507 -5166586
7866 -5166586 -4404011 -5977903 -2657079 6782389 14341062 13519006 7248266 2032699 -773850
7857 -773850 -3584360 -6124360 -5553731 -1717258 2238805 4546067 6550939 8978134 9201777
7848 9201777 3882479 -6697448 -17891502 -24053519 -22814050 -16782300 -11027602 -8413879
7840 -8413879 -7686545 -6391581 -4554331 -4291980 -6557510 -9854575 -12080541 -12365475 -11010090
7831 -11010090 -8662269 -5791624 -2391703 1703391 5770882 8053454 7453790 4777832
7823 4777832 1430379 -2236308 -5977417 -8067588 -6759777 -3062721 38302 1227982
7815 1227982 1625810 1635914 -384737 -4939947 -8952850 -8724080 -4586399 -811254 -991640
7806 -991640 -4745701 -9046742 -11867350 -14032054 -17530444 -22215662 -24991565 -23259044
7798 -23259044 -18640371 -15517602 -15656331 -16209056 -13829905 -8763055 -3502803 514051
7790 514051 2642899 1257093 -4394433 -11084042 -14043397 -13311824 -14223001 -19620529 -24624361
7781 -24624361 -22598060 -14784420 -9776150 -12800848 -19114442 -20133519 -13807404 -6125695
7773 -6125695 -3315080 -5362002 -7503867 -5928066 -1171469 2654561 1257375 -6009767
7765 -6009767 -14999571 -20395979 -20727311 -18417905 -15022285 -9343392 -1642618 3557072
7757 3557072 2215903 -3598261 -8650377 -11902234 -16415458 -22170340 -24520272 -21735725
7749 -21735725 -18935009 -20604802 -23096509 -19907764 -12398061 -9063594 -13610165 -19284215
7741 -19284215 -17668080 -9218100 -1559617 330244 -1627877 -3163295 -2405589 538125
7733 538125 5182867 9673152 10484345 6050346 -142423 -2924068 -1907787 -1770816 -5375006
7724 -5375006 -9660097 -10316020 -7807937 -5654269 -4744121 -3567876 -3256397 -7274808 -14887491
7715 -14887491 -19678614 -17529678 -12613385 -11814074 -15557100 -18167114 -15967572 -10925794
7707 -10925794 -6653908 -4733962 -5494615 -8917766 -13520854 -16850138 -18069610 -17898276
7699 -17898276 -15644280 -9478223 -893339 4532183 3450401 -594232 -1787627 409009
7691 409009 1600936 -731454 -4388886 -6409385 -6437072 -5247784 -2883238 114189 1811708
7682 1811708 1136126 -495004 -1532153 -2802249 -5445149 -7424834 -5021847 1902636
7674 1902636 8561146 10254283 7232052 3520246 2072339 2260089 1507324 -1674610 -6195741
7665 -6195741 -9533514 -10531198 -10784587 -12415471 -14959645 -16253734 -16318671 -17655767 -20641238
7656 -20641238 -21575873 -17691732 -11745203 -8506002 -8382797 -8094887 -6382188 -4737680 -2886309
7647 -2886309 1512746 7503918 9682053 4741116 -4051747 -11022943 -13759412 -12723345
7639 -12723345 -8763906 -4002509 -2300875 -5381307 -10350189 -13730099 -15492183 -16199039
7631 -16199039 -13450041 -5821259 1967647 3345049 -1452519 -6186003 -7861729 -9885836
7623 -9885836 -15222076 -21363291 -23867417 -21113138 -14157700 -5548198 400463 63725
7615 63725 -4827762 -8330544 -7746701 -6379884 -7188046 -8065747 -6427013 -4436570 -5501202
7606 -5501202 -8407936 -9437820 -8507119 -8758363 -10871727 -11859865 -9571308 -5279035 -1705276
7597 -1705276 -912605 -3768140 -8901892 -12482491 -11640624 -8064700 -5823621 -5788786 -4852351
7588 -4852351 -977941 3503390 4613477 1197847 -3982245 -6669917 -4697998 -304906
7580 -304906 1395003 -2583342 -10079623 -16774421 -20935402 -23397691 -24227059 -22353974 -18265355
7571 -18265355 -14286773 -11739218 -9790221 -7293209 -4051623 -542049 1780001 675264
7563 675264 -3908539 -7938759 -7668780 -5398043 -6743605 -11757411 -13442020 -7128548 2689033
7554 2689033 7858534 5957431 1079765 -2381240 -3318049 -2802231 -2764523 -5137398 -9576580
7545 -9576580 -12479061 -10638202 -5472358 -1423633 -567368 -1096328 -986314 -741075 -1866993
7536 -1866993 -4295728 -6146957 -5373901 -1609816 2945540 4857724 2608492 -1830680
7528 -1830680 -5158481 -5756842 -3912931 -377954 3800377 6882323 7486615 5735432 2635496
7519 2635496 -547575 -1628434 1352383 6189742 6154826 -2745899 -15245096 -21380869
7511 -21380869 -17435532 -8960594 -3191975 -2419926 -5240925 -9894521 -14454695 -17124338
7503 -17124338 -18404970 -20318119 -22142554 -20374512 -14829135 -10904970 -12676893 -17075400
7495 -17075400 -18634371 -17024471 -15360840 -13489862 -8709560 -2547319 -1124846 -7581422
7487 -7581422 -18346002 -28095073 -34446739 -36340966 -32150533 -22683414 -13487436 -10561515
7479 -10561515 -14227616 -19294907 -21063928 -19968323 -20380894 -25102976 -30752801 -29696298
7471 -29696298 -18617307 -4507049 1174677 -5013219 -15009077 -19342343 -17012940 -12984730
7463 -12984730 -9695898 -5733440 -1414840 -621721 -5819234 -14049214 -19374784 -18287254
7455 -18287254 -12398349 -6793703 -5737339 -9134965 -13318808 -15510831 -16323608 -17378822
7447 -17378822 -18727701 -20446142 -24512349 -31893254 -38880847 -39803627 -33325601 -23170341
7439 -23170341 -12778928 -2618424 6761473 12763393 13825208 11943994 9937192 7868001
7431 7868001 4278847 -230901 -2972932 -2636595 -1209865 -1908059 -5641427 -9806923 -10762374
7422 -10762374 -7664869 -3412058 -1324617 -1647580 -2242985 -1824025 -939893 -331304 -100885
7413 -100885 -295399 -753142 -908543 -1567546 -5886243 -15546973 -26128233 -29902502 -24456636
7404 -24456636 -15601979 -10197372 -8830961 -7684005 -5113807 -3112472 -2984577 -2554290
7396 -2554290 1316055 8506422 15032148 17225068 16296493 17245472 22445109 28426813 31010453
7387 31010453 30983357 30770555 27715497 16931679 942372 -10281231 -11237919 -6943219
7379 -6943219 -3916088 -1167342 4769195 10900587 10893013 4971358 376893 2372231 9432511
7370 9432511 16692843 19858082 16482519 7938279 84592 -1907279 467278 1148034
7362 1148034 -3233622 -11177386 -19571373 -25029759 -23946951 -16816789 -11616860 -16481507
7354 -16481507 -28182356 -33925639 -26656100 -13469005 -6269940 -8522379 -14347654 -17193348
7346 -17193348 -15706316 -12728893 -11321311 -11590748 -11002325 -8603430 -7532841 -10384151
7338 -10384151 -13354748 -9769141 304492 8871740 9731102 4896197 -164614 -2977185
7330 -2977185 -3504816 -1694125 1158443 1823715 -1125916 -5309490 -7938208 -8405362 -6518445
7321 -6518445 -2254526 1135533 -1538479 -10408644 -19063078 -22373500 -21274947 -17705020
7313 -17705020 -11017335 -3294087 -1665523 -9146252 -18088537 -19469254 -14804771 -11953185
7305 -11953185 -12557629 -11527582 -7042234 -3148896 -2710661 -4450265 -6968052 -9830985
7297 -9830985 -11013626 -8997744 -6915373 -8824707 -12610262 -12828118 -9853053 -9114307 -11371237
7288 -11371237 -11534708 -8214093 -6548466 -9199913 -11854997 -10876142 -8901061 -9318230 -11090003
7279 -11090003 -12604604 -14931977 -17510311 -16345933 -10818576 -6803026 -8167196 -10283725
7271 -10283725 -7434456 -2017685 -248088 -2478448 -4378325 -4981211 -6756355 -9185237
7263 -9185237 -8822061 -5516132 -3021353 -3127730 -3789754 -3427033 -3139879 -4310772 -7174022
7254 -7174022 -11565045 -16203154 -18123028 -16100346 -13626667 -14897964 -18799499 -20564821
7246 -20564821 -18276247 -13572669 -7080305 1787505 10801844 16029565 17572769 19165019
7238 19165019 21088289 18734722 10103666 -233119 -7409127 -12221599 -17510165 -22174118
7230 -22174118 -22755244 -18753059 -12754778 -6733758 -1393157 1833844 1117335 -3577871
7222 -3577871 -10342659 -16717595 -20047178 -18133048 -11724363 -5163092 -2202714 -2034735
7214 -2034735 -1785251 -1964642 -6059359 -14189878 -20307416 -17929384 -7612019 2989675
7206 2989675 6331511 1305110 -7254821 -13852737 -16313065 -15526387 -13186235 -10547029
7198 -10547029 -8280454 -6370731 -4647921 -4196695 -7105415 -13226645 -18277907 -17897462
7190 -17897462 -13659118 -12139275 -16790397 -23183420 -24300175 -18862318 -12063147 -8956501
7182 -8956501 -9709971 -11557771 -13020013 -14545295 -15888597 -14917454 -10073132 -3165562 1965449
7173 1965449 3741863 3920948 3542299 348357 -7144998 -14944283 -16980904 -12852759 -8108789
7164 -8108789 -6532885 -6665516 -7046349 -9361148 -13055086 -11894843 -1527845 12312702
7156 12312702 19087063 15943498 9715816 6951017 7290225 7212762 5178639 1558879 -2278002
7147 -2278002 -3338931 439314 5508056 4963630 -2409591 -9701606 -11047742 -8635957
7139 -8635957 -7074273 -5641612 -1610056 2335814 848614 -5249748 -9420475 -8838371
7131 -8838371 -7561704 -9427924 -13267699 -16868850 -20598584 -24408627 -25414223 -21684138
7123 -21684138 -15482774 -9864508 -4579151 1869048 8301228 11746913 10569421 4685951
7115 4685951 -5047818 -15336550 -20971302 -20167834 -17534590 -18491766 -22473764 -25103683
7107 -25103683 -25263666 -25558612 -26614859 -25777270 -22112658 -18647399 -18262878 -20236295 -21853238
7098 -21853238 -21047285 -17043355 -11138783 -7288749 -8911354 -14290841 -17872177 -16705629
7090 -16705629 -12665197 -7929770 -2308041 3381585 5352716 1336645 -5468189 -9668252
7082 -9668252 -9217573 -5931205 -2681038 -1900853 -4397408 -7547552 -7184061 -3426850 -1699379
7073 -1699379 -5223750 -9752474 -9615777 -6169025 -5211000 -7526001 -7432719 -1054623 8227779
7064 8227779 13423079 10110303 -939265 -14093287 -21804621 -20487428 -13808813 -7726443
7056 -7726443 -3256305 2251802 7925128 9048522 4740840 566085 1165157 4484997
7048 4484997 5796213 3648767 -831067 -6840479 -12691797 -14792589 -11802855 -7922954
7040 -7922954 -8425869 -13156939 -17475228 -18267747 -15970651 -12089474 -8437753 -8124010 -13225869
7031 -13225869 -20779559 -24256295 -20360170 -12369209 -5805607 -2694296 -1413861 -766542
7023 -766542 -2021926 -6362131 -11408236 -12165247 -6592459 938408 4084184 2169239 319285
7014 319285 1238096 730916 -5717300 -14889883 -18620304 -13557551 -4341162 2558938 4479768
7005 4479768 1986232 -3320356 -8840191 -11599806 -10716872 -7851103 -4566592 -1235991
6997 -1235991 829065 -1066705 -7403577 -14305873 -17186754 -15453512 -11765493 -7799525
6989 -7799525 -3262469 1179232 2816140 136649 -4395987 -6714484 -6011524 -5478377 -7610561
6980 -7610561 -10396003 -9860586 -5633450 -1781174 -1933475 -5686709 -10386937 -14057589 -15326759
6971 -15326759 -13133922 -8947296 -7209128 -10477844 -15383871 -16584225 -13802231 -11433918
6963 -11433918 -11634139 -11744327 -9173149 -5362864 -3887102 -7310632 -16175448 -27691090
6955 -27691090 -35199315 -33511108 -26248030 -23212858 -28108979 -33645080 -32151639 -25965306
6947 -25965306 -22027527 -20483483 -15975376 -8428258 -4759797 -8995514 -17013707 -22871265
6939 -22871265 -25012402 -24116682 -19865827 -12959025 -6450218 -1964988 2164408 6145405
6931 6145405 5721004 -2075590 -12724906 -18194291 -15918804 -10169474 -5603056 -3320252
6923 -3320252 -2847348 -4093826 -6605194 -9460397 -12265735 -14306194 -13455427 -8752547 -3311973
6914 -3311973 -996669 -468279 2925234 8550750 9037192 404492 -10626371 -13946334
6906 -13946334 -8271989 -1422116 426977 -973303 -596377 3287880 8717474 12903712
6898 12903712 13386431 8727883 573729 -6295864 -8384730 -7414755 -7752299 -10213200 -11012819
6889 -11012819 -7792006 -4201418 -5759792 -11952792 -15897195 -13181456 -8052668 -7647765
6881 -7647765 -11765948 -12939548 -7195410 -30625 1123868 -3129901 -5753298 -2720684
6873 -2720684 3624024 9623860 13721780 14450693 10134831 2786554 -1672702 10656
6865 10656 4475403 7050834 8031030 10125607 12258204 10827485 6389392 4110638 6537328
6856 6537328 9863612 9305930 5326115 2232639 2439375 4437025 5623463 5159756 3948348
6847 3948348 2912773 1884785 432678 -326510 1798151 6308396 8183411 2996420
6839 2996420 -6228571 -11013264 -7521831 -951466 2423477 3631627 7286520 12683040
6831 12683040 14852607 13775067 15611040 22510297 27035564 21178719 7342332 -4565621
6823 -4565621 -9033256 -9080288 -9386879 -10469729 -10658187 -9562908 -7474839 -4239578 -814259
6814 -814259 371758 -1266634 -2642350 -568819 4338961 9125794 11959277 11827000 6938683
6805 6938683 -2782185 -12470288 -15867463 -12937254 -10447240 -13467286 -19285896 -21909253
6797 -21909253 -20119813 -18026684 -18701984 -20356058 -19327514 -15000107 -10745364 -10405337
6789 -10405337 -14122646 -17759397 -16991236 -11951594 -6659942 -3573563 -587832 5107695
6781 5107695 11731365 13854458 8439506 -1824860 -11155275 -15149307 -12979232 -7253145
6773 -7253145 -2252279 -664629 -1265885 -865877 1325119 2966511 2545360 1586244 1410726
6764 1410726 208416 -3646268 -6946479 -4650269 2025686 4916332 -1093532 -10592509
6756 -10592509 -13941948 -9150466 -2952600 -683295 -438974 1225543 3138683 2973428
6748 2973428 3038235 7097238 12877855 13406041 6415881 -2277265 -6381662 -6304257 -6737153
6739 -6737153 -10327795 -16179973 -21979810 -24739018 -21245536 -10793250 3084879 15377614
6731 15377614 23270495 26077502 23733100 17691763 11567399 7881595 4954676 -398524
6723 -398524 -7841746 -13888126 -16704822 -17464136 -16801003 -13152098 -5973860 1664139 5707272
6714 5707272 5591377 4546267 5140228 5409050 911243 -8554224 -16147817 -15142289 -8468638
6705 -8468638 -6403964 -12859107 -18962032 -14672923 -2861402 4485661 2204871 -2972547
6697 -2972547 -3631831 -1074909 -972749 -5095428 -11095572 -16776725 -20615087 -20336038 -14782468
6688 -14782468 -6519262 -159201 1590849 -765986 -4818695 -7684169 -7650530 -5851220
6680 -5851220 -5334237 -7559905 -10850846 -12777377 -12730140 -11834327 -11850126 -14151847 -17881894
6671 -17881894 -19410870 -16255506 -11350056 -10155735 -13377564 -16326393 -15962901 -14021180
6663 -14021180 -11913238 -7906958 -2374348 -868897 -7287612 -17189108 -22643091 -21610774
6655 -21610774 -18205390 -15527852 -13038101 -10393699 -9389823 -11129723 -13804530 -14121425
6647 -14121425 -10209062 -3822506 -40013 -2643549 -8884950 -11564615 -7501651 -636238
6639 -636238 4499443 7722709 9354576 7166809 1424869 -2454446 -1857524 -2492327 -9153320
6630 -9153320 -15756176 -13184624 -3663270 2410403 2090164 1851934 4155798 3161100 -3872846
6621 -3872846 -11288795 -15081599 -18915887 -25102525 -28159225 -23717460 -16657116 -13392808
6613 -13392808 -12085813 -7988814 -3479222 -4403102 -9473371 -11417593 -7384027 -1273170
6605 -1273170 3490555 7044272 9122967 8086815 4762513 2411885 1857549 473612
6597 473612 -3311933 -7939046 -11622904 -14265844 -16192371 -17815493 -20555592 -25189142
6589 -25189142 -29345081 -29665185 -26570526 -23894547 -23454910 -22856871 -19255589 -12702960 -5077499
6580 -5077499 1913709 6734226 7984290 5532845 762531 -4596676 -9042312 -11218309
6572 -11218309 -10827916 -9448795 -8862786 -8523991 -6084777 -737257 4867292 6431071 1879448
6563 1879448 -6060915 -11601439 -11623136 -9195463 -9223333 -11490033 -12076899 -11592056 -15790394
6554 -15790394 -25237014 -30598938 -23889323 -10160552 -1473852 -1968493 -5789812 -8112750
6546 -8112750 -10481263 -14683057 -18291597 -18489794 -15441305 -10230804 -3703720 1628046
6538 1628046 3006236 1809487 2018362 3407180 1375465 -5016433 -10442584 -11253890 -10623369
6529 -10623369 -12195503 -13440849 -10075991 -3752192 -275909 -1701363 -4293154 -3759690
6521 -3759690 307167 4710663 5609795 2062872 -2490462 -3922037 -2965876 -4190107 -8679524
6512 -8679524 -11687772 -9536388 -4934403 -2726164 -4008861 -7434214 -12342366 -16687594
6504 -16687594 -15800827 -8477133 -1431990 -1881875 -7479748 -9630059 -5843837 -2333319
6496 -2333319 -3853156 -7392165 -8283282 -7286438 -7943103 -10339151 -11488063 -10285541 -8541577
6487 -8541577 -7313092 -4967407 157499 6612300 10763634 10688669 7833942 4220251 -373571
6478 -373571 -6529154 -11953712 -13717540 -13557956 -16410982 -22160563 -23685126 -16559727 -6669347
6469 -6669347 -3337921 -7421520 -11339091 -9485348 -3513106 2181891 5290166 5468623
6461 5468623 3447446 993629 -1105133 -4705010 -10882231 -15941785 -15100479 -9630366
6453 -9630366 -5672173 -5917965 -7296818 -7315109 -7469967 -9081089 -10726000 -11706581 -13548245
6444 -13548245 -16068597 -16384699 -14035359 -12710227 -14414342 -16261416 -15786178 -14917932 -15348077
6435 -15348077 -14468988 -10118207 -5391132 -4038754 -4528845 -3775349 -3688502 -8053685 -14744820
6426 -14744820 -17198698 -13293062 -7611195 -4985925 -6445144 -11307191 -18200544 -23355357
6418 -23355357 -22660210 -16918625 -11419248 -9192211 -8209962 -6224819 -4466463 -4746749 -6198137
6409 -6198137 -6944511 -6407775 -4261324 197240 5695381 8663431 7719062 6321756 8155511
6400 8155511 11414119 10871504 5164017 -1118297 -3400668 -2761605 -3671547 -7149848 -8830535
6391 -8830535 -4953785 1691492 4574225 1699340 -2393888 -3850300 -4669748 -7697505
6383 -7697505 -10134745 -7234207 -717954 2433066 -265353 -4004446 -5026263 -6092418
6375 -6092418 -10627295 -16238848 -18386600 -17233868 -16310113 -16546123 -16277220 -15922701 -17859704
6366 -17859704 -21549570 -23031391 -20356751 -16227721 -13759035 -12289571 -9392089 -5308998
6358 -5308998 -3120136 -4889211 -9205550 -12720975 -13223354 -10956859 -7738367 -5621437
6350 -5621437 -6123154 -9345212 -13058738 -13810680 -10407146 -5652587 -3141990 -3205796 -4094256
6341 -4094256 -5984160 -10156304 -14292803 -13268578 -6538634 -602857 -978489 -4942888
6333 -4942888 -5892336 -2273758 1927015 3507168 2265101 -1687438 -7749063 -12287070
6325 -12287070 -11342386 -6628708 -4326488 -6641739 -8684593 -5427913 1936451 8521947
6317 8521947 11262953 9837641 5318418 448599 -1398733 -153845 228897 -2712332
6309 -2712332 -6033217 -5588294 -2010969 464514 -352302 -2856318 -4358405 -3368747 -635176
6300 -635176 224464 -4561106 -13098255 -17545887 -13232672 -5474528 -2884489 -6232733 -9469948
6291 -9469948 -10073335 -11390682 -14611930 -15844001 -13359125 -11044905 -11184862 -9791501 -3644220
6282 -3644220 3186039 5259462 4041308 4214982 5000798 1991660 -4202039 -8218698 -8398363
6273 -8398363 -8221565 -8987711 -7934278 -5106924 -5253989 -9960764 -13992948 -13291844 -11181962
6264 -11181962 -12061087 -13880006 -12552935 -9756925 -9647488 -10666258 -8183994 -4004266
6256 -4004266 -4882195 -10503023 -11147138 -1136246 11921967 16859943 13674317 12277806
6248 12277806 18405326 26915331 29733717 25646353 19922156 16930337 15805166 12699720
6240 12699720 5271134 -5645932 -17629484 -28304886 -35132273 -35514651 -29304114 -20663116
6232 -20663116 -15036870 -13889355 -14284696 -13716462 -12916072 -13500690 -15668999 -19062777 -22797020
6223 -22797020 -23440218 -16830212 -4426286 5791086 8263349 6498322 6659388 7842774
6215 7842774 4731308 -1930122 -4743212 -279027 6088460 8019321 5414671 1144170
6207 1144170 -4234137 -10512936 -14572400 -13829059 -10778425 -9941591 -11703863 -12882113 -12268565
6198 -12268565 -11839888 -12861604 -14239550 -14998000 -15634633 -16550591 -17239378 -17309618 -16575701
6189 -16575701 -14297831 -10339193 -6927112 -6835757 -9312303 -10094173 -6638603 -1638181 192002
6180 192002 -2098263 -4721252 -3959739 -673631 965165 -1039649 -3720187 -2979043 693463
6171 693463 2415680 -1056610 -7729690 -13641511 -17454994 -20092745 -21647147 -21074561 -18283641
6162 -18283641 -14644942 -11680282 -10189739 -9687555 -7808541 -2093184 5954666 10516766
6154 10516766 7646843 389370 -4956776 -6506173 -7797684 -11992707 -18121909 -22744292
6146 -22744292 -22702601 -16906983 -8163944 -2268578 -2033930 -3299402 -619559 4574732 6690770
6137 6690770 5746093 7317312 11848417 12114240 5070701 -1318125 650321 6227172 5369030
6128 5369030 -1562213 -4533557 323119 4710018 531427 -8913768 -14434309 -12962029
6120 -12962029 -9382454 -8913436 -11885739 -15211624 -15883653 -13022083 -8358723 -4872825
6112 -4872825 -4257325 -6164162 -9903510 -15024001 -19368122 -18882424 -11725008 -1531466
6104 -1531466 5696967 7687768 7141339 7335523 8673362 9791107 9754367 7938940 3552212
6095 3552212 -2703203 -7349879 -6922203 -2410171 1095940 284278 -2533455 -3158773 -1648912
6086 -1648912 -1915774 -5499537 -9147487 -9908823 -9532056 -11020070 -12984981 -11420156 -6718867
6077 -6718867 -4787373 -9587238 -17490704 -21389234 -18671597 -12768583 -8007037 -5760964
6069 -5760964 -5515356 -6771752 -8557528 -8901254 -6616556 -2875225 384808 2944801 5531938
6060 5531938 6996883 4738237 -1020950 -5406454 -3563157 3414191 9173802 8838056
6052 8838056 3564947 -1689168 -3255438 -1006319 2825481 5665786 6066440 4385714
6044 4385714 2253273 1279481 2431377 6020709 10961527 14135062 12373098 6022560
6036 6022560 -668019 -3641857 -2708679 -789698 -809895 -3714367 -7750179 -8988221 -4763224
6027 -4763224 2145420 5224897 2019219 -2492316 -3194343 -2750378 -7614305 -17574148 -24874798
6018 -24874798 -24379269 -19458435 -15968008 -15080030 -14975923 -15468962 -16791788 -16724364 -13677027
6009 -13677027 -10896322 -12503512 -15905853 -13647593 -4022418 5243806 6715963 2568509
6001 2568509 182637 1382953 1425361 -2037820 -4667248 -1950483 4219450 8463604 8613269
5992 8613269 6191218 2197118 -3657759 -10085822 -14273565 -15260389 -14489407 -12727135 -9371201
5983 -9371201 -5317580 -3297416 -4195813 -5955339 -7355091 -9697456 -13171274 -15135461
5975 -15135461 -14428629 -13764921 -14649229 -13639655 -8180243 -2935422 -4334356 -10430990 -12643779
5966 -12643779 -7588169 -1044447 934992 -910091 -2949095 -4444318 -6408130 -8630731
5958 -8630731 -10891855 -14015835 -17054278 -16389109 -10396957 -2557787 2365683 2787865 -727676
5949 -727676 -7410525 -14671966 -18252907 -17441013 -17021951 -20437456 -24151193 -23008772 -18233961
5940 -18233961 -15108756 -14984284 -15052309 -14524120 -15202275 -16395115 -14982359 -11045009 -8447323
5931 -8447323 -9120412 -11298305 -13891382 -17731529 -21619150 -22182912 -19193823 -16363963 -15304614
5922 -15304614 -13439400 -9607332 -6506427 -5185846 -2582122 2174317 4467224 1487281
5914 1487281 -2393757 -2792212 -2928069 -7510912 -13191659 -13153912 -8658982 -7105231 -9307054
5905 -9307054 -8098970 -1112284 4228143 2393332 -1249990 1432259 9969560 17828531
5897 17828531 21790877 22671182 20203615 14014626 7954468 6999658 10161894 11848538
5889 11848538 10059427 7960431 7138174 4801145 -906586 -7383189 -11016849 -10458115
5881 -10458115 -5597554 2282017 8149286 6272552 -1812948 -7287556 -5321227 -1593978
5873 -1593978 -3267185 -8127939 -8783535 -4336271 -639271 -236238 517693 3640733 5679658
5864 5679658 3968944 1167513 452903 505008 -1419975 -4885188 -8172934 -11977235 -17459666
5855 -17459666 -22359809 -22587593 -17030090 -8313829 328322 6681915 9147231 7562090
5847 7562090 4384941 2894561 3908034 5630720 6666962 7783135 10449985 14563476
5839 14563476 18080515 18985987 17731985 16985268 17807472 16937853 10276837 -925216 -10215390
5830 -10215390 -13135216 -11496928 -9176040 -6627617 -1955929 4686184 10343973 11889834
5822 11889834 8113067 864148 -4973137 -5346276 -2298397 -2225977 -7099360 -11305835 -9878731
5813 -9878731 -5354071 -2394012 -273920 3405574 5521377 1586628 -5128749 -6936758
5805 -6936758 -3561506 -2111682 -4536846 -4112161 2735005 9600041 9954606 6775230 6242887
5796 6242887 7258466 4216986 -2998559 -8509599 -8608717 -5120218 -1343246 1082574 1854698
5787 1854698 1946400 3025917 4400854 2664277 -2470377 -4918233 367286 8828781 10911956
5778 10911956 4490501 -3174951 -6149567 -6406343 -7919306 -9887333 -9488419 -7423082
5770 -7423082 -6361071 -5954830 -3541826 835773 3714589 3018956 781475 -333140 -1272486
5761 -1272486 -5016635 -11219823 -15204394 -13839511 -10497811 -11317750 -17086075 -22050198
5753 -22050198 -21339741 -16353378 -11520211 -9130214 -9606995 -13434924 -19113847 -21682163
5745 -21682163 -17789826 -11203509 -9048316 -12901262 -17463901 -17962457 -14930048 -11232013
5737 -11232013 -8205085 -5899880 -4073692 -1856002 1054105 2517595 324008 -3383180
5729 -3383180 -3993968 -1682812 -2389367 -9444212 -18273022 -22432131 -21454961 -19166813 -17227208
5720 -17227208 -14758512 -12470731 -12261292 -13016188 -11106989 -5773005 -613954 1350196
5712 1350196 1313043 1973950 3416075 3524341 1279205 -2120897 -5030064 -6877912 -7741425
5703 -7741425 -7369110 -5478901 -2968676 -1953385 -3891350 -8110201 -12961210 -17809882
5695 -17809882 -22540111 -25624187 -24842085 -20256072 -14432722 -9133746 -4009902 517317
5687 517317 1720613 -2118626 -8759843 -14320480 -16900707 -16367033 -13169914 -10001759 -11734499
5678 -11734499 -19392269 -25992076 -23582175 -13981566 -7132331 -8254632 -12500627 -14254167
5670 -14254167 -15256126 -18821665 -21327697 -16873915 -8421975 -6367555 -14551808 -24107691
5662 -24107691 -24784674 -18006989 -14078617 -18762950 -27584339 -33106847 -33143022 -30030016 -25422537
5653 -25422537 -19377985 -13346129 -10222670 -10277095 -9540334 -4499282 2574747 5337293 616598
5644 616598 -7935597 -14122114 -15405643 -13642687 -11310979 -9288862 -7784032 -6961677 -6134702
5635 -6134702 -4158326 -1222718 1369357 3551498 6324907 8405783 6175815 -513108
5627 -513108 -5331780 -2556920 4155447 5173908 -2508137 -11212970 -13017715 -9246122
5619 -9246122 -5986051 -4602308 -2280507 628649 566476 -2015593 -1756086 3417041 8357330
5610 8357330 7781560 3094630 -1180257 -4143070 -7415124 -9822009 -8201249 -2929116
5602 -2929116 1697966 3062246 2843123 3417746 4677033 5495843 5840001 5910330 4843387
5593 4843387 1675478 -3128692 -7627922 -9291084 -6475345 -593908 3666465 2523148
5585 2523148 -2504483 -6621280 -7942784 -8466548 -8563011 -4889967 3747470 12127700 14052007
5576 14052007 9950673 5248885 2707525 746494 -1180490 -410803 4409393 10431334
5568 10431334 14385057 16666071 19438554 22519593 23433003 20592242 14709047 7821851
5560 7821851 2332149 145095 1209096 3367294 4838101 6202904 8693004 11340921
5552 11340921 11737754 9507881 7098867 6469424 6535030 5183350 2969587 2970075 6453756
5543 6453756 10183840 9797790 5581798 2560687 3693621 5227874 1579222 -6341602
5535 -6341602 -11432566 -9522336 -4576860 -3093818 -6451406 -11458489 -15964462 -20359224
5527 -20359224 -24694895 -27734410 -28555119 -26397775 -19546318 -7600353 5149964 12074336
5519 12074336 11053400 6610551 4412295 5898015 8947317 11077628 10544415 6549799
5511 6549799 116326 -6639970 -12988695 -19466731 -24637465 -24912047 -19507903 -12976644
5503 -12976644 -10199952 -10931251 -12080293 -13180209 -15459943 -16596131 -11552724 -1047
5495 -1047 11236065 15848910 15336134 15301509 16360812 13467719 4925176 -2715407 -2477647
5486 -2477647 2942842 4185765 -1657112 -6591498 -3082074 5090816 8405270 4792982
5478 4792982 674088 -114317 -1034332 -4876585 -7789247 -5112997 1455737 6594549 7885156
5469 7885156 6094573 2307836 -1371716 -1397714 2635949 5523301 2807506 -2778140 -5547006
5460 -5547006 -4937967 -4374504 -4555908 -3940406 -4289406 -8893492 -15384476 -16947880 -11812023
5451 -11812023 -5819510 -4265287 -6541240 -10208406 -14695434 -18654110 -18731126 -13880386
5443 -13880386 -7097589 -899093 4900467 9353849 9240181 4172308 -1741793 -5799975
5435 -5799975 -9527264 -13063973 -12296325 -5564081 1676955 3452040 369255 -4129156
5427 -4129156 -9901260 -17190602 -22024471 -21054775 -17910266 -18211923 -20669697 -19617601 -14237948
5418 -14237948 -8311728 -2472570 5528070 13204703 14014190 7143388 -166858 -2154497
5410 -2154497 -679759 -80872 -1637616 -5252787 -10872785 -15458794 -14080937 -7549694
5402 -7549694 -3878469 -7861994 -13580499 -12332512 -4713991 878940 45880 -3031625
5394 -3031625 -2901803 80569 1650277 -465648 -4765943 -8812256 -11772266 -13808565
5386 -13808565 -14372318 -12944541 -11433630 -13100429 -17300124 -18082856 -11728996 -3779788
5378 -3779788 -3452364 -11410110 -18696174 -18865391 -15451778 -15018844 -18397959 -22708587 -27237484
5369 -27237484 -32040808 -33854697 -28986264 -18997509 -9232078 -2926760 -441660 -2249701
5361 -2249701 -7775990 -12348426 -10566042 -3111351 3854830 6288700 5397026 3245467
5353 3245467 -169193 -4379151 -7124934 -7490399 -7449133 -8808229 -11070668 -13168688 -14569135
5344 -14569135 -14114589 -11210903 -8994662 -12110288 -19444952 -23396408 -19481674 -12869767
5336 -12869767 -11273924 -14367260 -15265016 -10883661 -5505181 -4054921 -6578514 -10552547
5328 -10552547 -14896920 -19721074 -24272652 -26693288 -24867088 -17704887 -7431748 47586
5320 47586 94222 -5288475 -10207310 -13013376 -17335662 -23952875 -27041562 -22064622 -13004445
5311 -13004445 -6831251 -4017185 -474148 3162506 1469058 -6123983 -12680194 -13419721
5303 -13419721 -12285727 -15051770 -20555584 -23623181 -23280956 -22378547 -20901205 -15870558
5295 -15870558 -8184170 -3913009 -6663531 -12692925 -16223339 -16493928 -16409641 -16456747 -13994024
5286 -13994024 -8287221 -2674394 -546565 -1568385 -3447133 -5500243 -8073938 -9579544
5278 -9579544 -7526821 -3224109 -2260541 -7915847 -16027395 -19338911 -16014667 -10915184
5270 -10915184 -9012973 -10898555 -14798514 -19084834 -21473126 -19393380 -13580216 -8738899
5262 -8738899 -8225740 -9971947 -9676804 -6117731 -1491842 1377071 481199 -4066934 -8295288
5253 -8295288 -7267637 -2290368 -1385226 -8876663 -18429992 -21365017 -18147659 -15289598
5245 -15289598 -14066655 -10610473 -5941063 -6543012 -13363785 -18730203 -17561843 -14388765
5237 -14388765 -14894226 -16777221 -14439672 -8117807 -2764103 -1010319 -2278500 -6348193
5229 -6348193 -12803632 -18355539 -19021608 -14496124 -7764670 -1740535 1475611 222632
5221 222632 -4829677 -10063178 -12769228 -14021517 -15804110 -17811890 -19400666 -21735397
5213 -21735397 -25041957 -26558361 -24402049 -20701663 -17764382 -14476845 -10254641 -8766433
5205 -8766433 -12581501 -17135506 -15852418 -9344157 -4028321 -3399563 -6174169 -11044524
5197 -11044524 -16934246 -20118672 -18012861 -14842942 -16339330 -19662909 -17018002 -9370789
5189 -9370789 -6799263 -12816865 -18258810 -15551665 -10004251 -10070718 -14011628 -14829282 -13021521
5180 -13021521 -14835745 -20571854 -23817125 -21620297 -17295713 -12925449 -6897577 -255556
5172 -255556 2067510 -616620 -1843339 2550347 7276897 5194987 -1620611 -4619124
5164 -4619124 -1097465 2497463 350703 -5150208 -8295108 -8361457 -8925259 -11055286 -11943546
5155 -11943546 -10291715 -8723462 -9242644 -9745001 -7712911 -4983436 -5473413 -9172345 -11633246
5146 -11633246 -9508472 -4157515 427185 1197271 -2567764 -9344349 -16291104 -21398624
5138 -21398624 -24623746 -25854402 -23231760 -16028428 -7877394 -3463606 -2550612 -1457555
5130 -1457555 -245558 -2965508 -9357552 -12302969 -7321166 164317 1985924 -1853630
5122 -1853630 -5031261 -5217864 -5987327 -8898981 -10291719 -7796962 -4852217 -5750627 -9714824
5113 -9714824 -13021641 -14676410 -16847065 -20778473 -24829994 -26341762 -24123319 -19678359
5105 -19678359 -16742198 -18176717 -22059263 -22654500 -17457627 -11640304 -12082352 -17503641
5097 -17503641 -18864112 -11203327 -1219055 542667 -7144865 -15275619 -16316854 -11886486
5089 -11886486 -7269060 -3172839 2726989 8647293 8758209 1178524 -8093462 -11249298
5081 -11249298 -6411430 2283977 10171524 15297098 17443190 16721484 13608012 8829936
5073 8829936 2600997 -5119918 -13122062 -18582759 -19286668 -16159605 -12669250 -11311833
5065 -11311833 -11549140 -11956656 -13143301 -16368725 -19654191 -18465305 -11732997 -4542703
5057 -4542703 -2383283 -4699130 -7119997 -8437869 -11321151 -16396700 -19905820 -18608580
5049 -18608580 -13970332 -10005452 -9378769 -12688445 -18665930 -23312219 -21715875 -13524408
5041 -13524408 -4824822 -1853486 -4024127 -5694782 -3679836 -1896 2313584 2788061
5033 2788061 2038632 -308645 -4240274 -7443762 -7106661 -3544877 -384589 -589139 -3304606
5024 -3304606 -5264679 -4441779 -1398434 2064526 3909150 1935935 -4672794 -13040463
5016 -13040463 -18022122 -17516345 -14652435 -13019715 -11698228 -7652057 -1574680 2080047
5008 2080047 686018 -3893969 -8360032 -10974783 -11288095 -9745930 -8448934 -9909291
5000 -9909291 -13949810 -17572880 -18574993 -17594959 -16229689 -15159891 -14725715 -15359230 -16631591
4991 -16631591 -17403332 -17298240 -16494435 -14239625 -9826890 -5110924 -3438187 -5484533 -8535862
4982 -8535862 -10506736 -12253115 -15151824 -18791578 -22052211 -24394028 -25192637 -23647177
4974 -23647177 -19981029 -15084531 -8990085 -1756494 4597449 7961631 9762112 13296997
4966 13296997 18102760 19571265 15168207 7943046 2969946 3076739 8229200 15457152
4958 15457152 18888853 14045537 3475639 -5401580 -8993835 -10286550 -12266676 -13510813
4950 -13510813 -12277198 -10421839 -10333661 -11220511 -10901286 -8775533 -5523393 -2385200 -1337381
4941 -1337381 -3001030 -4463081 -2758828 363121 1848942 3926943 10501340 17841447
4933 17841447 17325985 8271601 -660560 -4392307 -6593929 -9833347 -10777476 -8890430
4925 -8890430 -9616947 -14047352 -15551212 -12168417 -11716163 -17832424 -21680482 -15717045 -5583952
4916 -5583952 410074 3364815 5843748 2830829 -7628770 -14760149 -9260626 1286859
4908 1286859 4486843 2269769 3627577 6165011 1020135 -9578712 -15627159 -15723109
4900 -15723109 -15147371 -12345520 -2443404 10482133 19516165 27563786 38597093 43831662
4892 43831662 34616138 21607592 21014536 28903714 30868114 29238615 35503420 43240456
4884 43240456 37742466 26901672 30493968 43255397 44204614 38611411 48953211 66649167
4876 66649167 63788329 54258175 76022755 93784354 -264434 -232972019 -461481997
4869 -461481997 -516646858 -400520343 -263036392 -204961663 -191389476 -159227890 -116595388
4862 -116595388 -99857380 -101359706 -91192714 -71455252 -64149774 -69187989 -70262519 -65295194
4854 -65295194 -62290180 -59278530 -52233553 -49394089 -56854988 -63332921 -58306407 -51146353
4846 -51146353 -53054258 -54464871 -41493483 -22410175 -15692477 -21237124 -24812549 -23377323
4838 -23377323 -24764082 -27916945 -24460479 -17010822 -16635824 -23348324 -26535841 -24152641
4830 -24152641 -25008082 -31538166 -35652877 -33358168 -30013671 -29185015 -28380713 -27715090 -31583833
4821 -31583833 -39426952 -44450118 -43415212 -39432246 -34449263 -27364147 -19882627 -15963997
4813 -15963997 -15238778 -14648139 -15744402 -21976872 -29823492 -31874799 -28244829 -25608240
4805 -25608240 -25394898 -22984365 -18693434 -18617260 -22890770 -23914691 -19374042 -16965729 -21905441
4796 -21905441 -28586011 -29517668 -25042152 -19457243 -14293061 -10123479 -8931582 -10113183
4788 -10113183 -9596417 -6899572 -7344450 -13127488 -18152247 -16747091 -12150452 -10795990
4780 -10795990 -12874842 -14653027 -16361134 -21141868 -28343774 -34037204 -37110361 -39435481
4772 -39435481 -40717930 -38694895 -34835505 -34517877 -39320557 -42900586 -37867790 -25292732
4764 -25292732 -14286623 -11798772 -15148013 -16323646 -12275939 -7973105 -8957075 -14207628
4756 -14207628 -18419171 -18554620 -15107046 -9173059 -2284909 2230301 2121183 -99034
4748 -99034 -550041 -399961 -3663137 -8512790 -7370991 1674528 9488079 6804562 -3324388
4739 -3324388 -9673335 -7559222 -3461086 -4571280 -9321627 -11433193 -9889103 -9895812 -14024980
4730 -14024980 -17216244 -13703857 -6073676 -2605107 -6099447 -10669456 -11067892 -9621851
4722 -9621851 -10184944 -10216294 -5019120 2977158 6234074 2936322 -738434 -187638 1579296
4713 1579296 -444668 -6324781 -12340017 -15327007 -13505692 -6341229 3755986 12076717
4705 12076717 16195245 17841494 18701032 17121025 11180705 2582584 -5153761 -10681918
4697 -10681918 -14541689 -16269811 -14613790 -10432573 -7086785 -6974166 -8505082 -7725121
4689 -7725121 -3607571 -816122 -4853151 -14005296 -19427247 -15660888 -8058162 -5908710
4681 -5908710 -10479792 -14653230 -12981180 -6714938 540056 6349988 8341639 5533578
4673 5533578 1991526 3472960 8815170 10325372 4596218 -3147845 -7832550 -10732646
4665 -10732646 -13114228 -11062122 -2995747 3552029 592776 -8441370 -13293081 -11104113
4657 -11104113 -8189420 -8586770 -8941383 -6042631 -2618680 -2878262 -6793325 -11134886 -13019418
4648 -13019418 -11173021 -6793227 -4011422 -6285731 -11518461 -13884450 -11149964 -6909579
4640 -6909579 -5026757 -5647590 -7784834 -11781451 -17101253 -21070103 -22348397 -23068598 -25172425
4631 -25172425 -26975986 -25874055 -22564604 -20117468 -20242072 -22519045 -25829707 -28460532
4623 -28460532 -28266561 -24996466 -21243574 -18945326 -16304735 -10692191 -3368656 1667174
4615 1667174 2834778 1865302 -82704 -3686525 -8392912 -11607123 -12291664 -12394073 -13100680
4606 -13100680 -12677116 -10274409 -8875859 -10946909 -13175974 -9901119 -1434573 4999048
4598 4999048 3417294 -4786197 -13583041 -18382995 -18462390 -16116957 -14855585 -16352689 -18125961
4589 -18125961 -16359057 -11645217 -8884017 -10327780 -12484446 -12193413 -11773862 -14277288
4581 -14277288 -16888859 -14233893 -6713889 -421163 913304 -669170 -2071473 -2896292
4573 -2896292 -3792349 -4888812 -6825147 -10100636 -12788752 -12173985 -9132844 -7397330 -8037155
4564 -8037155 -8631654 -8597260 -10691081 -15487987 -18906925 -17946148 -15108396 -14215336 -15202303
4555 -15202303 -16126804 -17112526 -18764652 -19426905 -17901663 -16805849 -19232439 -23475583 -24964606
4546 -24964606 -22729746 -20415529 -21048922 -23831763 -26340116 -27470059 -27602538 -27215201 -25733127
4537 -25733127 -21645381 -14711548 -8085869 -6114542 -9225084 -13295072 -15012599 -15107331
4529 -15107331 -15148925 -14641160 -13200295 -11906938 -10055731 -4715475 3126552 6418855 761303
4520 761303 -8603358 -13989614 -15791014 -19053171 -22538624 -19764520 -10435184 -2475078
4512 -2475078 -1368041 -4754398 -9186618 -14572249 -18932167 -16375921 -5535093 5581683
4504 5581683 8816931 5833709 3410564 2548494 -1056421 -7563771 -11118040 -8352370
4496 -8352370 -3459649 -2636775 -6791764 -11919969 -14645542 -15251596 -15992917 -18080068 -20685288
4487 -20685288 -22284989 -22233658 -20766498 -18228222 -15196688 -12675269 -10786665 -7926353
4479 -7926353 -3094538 1517990 2815520 1407763 758381 1437415 81609 -4521682 -8391215
4470 -8391215 -8188114 -6655921 -8455208 -13021543 -15876479 -15640834 -15159460 -15804339 -15029554
4461 -15029554 -10752650 -4875202 -848479 -23271 -1796418 -5333205 -9392863 -11799952
4453 -11799952 -11056418 -8294812 -6390615 -6812569 -7820309 -6274011 -1498433 3170016
4445 3170016 3956509 1880415 2406837 8526592 16090145 18402268 14053112 7079338 299141
4436 299141 -7137599 -14786807 -18218332 -14540728 -7729760 -4452429 -5728313 -6498960 -3411739
4427 -3411739 495860 19875 -5787218 -12929690 -16720868 -15532739 -11486366 -8539002
4419 -8539002 -9088700 -11663245 -12666127 -10783207 -8458922 -8423585 -10297291 -11828098 -12171905
4410 -12171905 -12363582 -13412195 -15492296 -18360566 -21041649 -21641592 -19010165 -14259038
4402 -14259038 -9444254 -5458700 -2523237 -1550913 -2941828 -4947772 -5625380 -5622408 -6302187
4393 -6302187 -5978274 -1782596 4657086 7589331 4467777 -792721 -3631299 -4393326 -5839989
4384 -5839989 -8528294 -11666825 -15675639 -20348614 -22684589 -20404599 -16125920 -14062305
4376 -14062305 -13461773 -9613252 -1685189 4465347 3135828 -3946069 -9294965 -7941813
4368 -7941813 -2641469 -367007 -4000157 -8894179 -8981994 -4760240 -1992968 -3222484 -5495942
4359 -5495942 -7453110 -12521530 -21447926 -27459923 -24920005 -18617736 -17201103 -20141347
4351 -20141347 -19603604 -14301550 -12128437 -17009630 -21707539 -18233572 -9085756 -2769109
4343 -2769109 -2558348 -5195099 -7809633 -10554921 -13400825 -14924621 -14599769 -13511810 -12769518
4334 -12769518 -13071218 -15202397 -18896114 -21649505 -20787432 -16933558 -13910505 -14468877 -16606116
4325 -16606116 -14856924 -6005867 6282421 13691620 11119117 1298226 -9350714 -17337770
4317 -17337770 -22289162 -23036306 -18158657 -10108496 -4312844 -3116568 -3874961 -3660811 -2462250
4308 -2462250 -1086621 354783 677367 -2160881 -7645171 -12530741 -15057884 -16095179
4300 -16095179 -15492027 -11580556 -5779930 -3269738 -6725671 -13111943 -18728248 -23264497
4292 -23264497 -26433482 -25341970 -19122184 -12443371 -10144894 -11111161 -11274811 -9981949
4284 -9981949 -9394375 -9959744 -10520024 -10924200 -10690904 -7121664 1039339 9581966 12744855
4275 12744855 10458726 8122496 9764647 14473073 18763231 19451231 14931687 6574557
4267 6574557 -1405453 -5483613 -5603698 -3416790 -33290 2706434 1783543 -3114444 -7737104
4258 -7737104 -8486925 -7093055 -6821550 -6854017 -4695449 -1927431 -2735705 -7769334 -13543060
4249 -13543060 -16979505 -17052935 -13530209 -7976582 -4411318 -4888787 -6071244 -4388667 -2453164
4240 -2453164 -4969248 -9804121 -9487227 -1809697 6774493 9451479 6161078 1384076
4232 1384076 -1008489 540938 5198273 9942510 11989861 11276346 8983997 5225246
4224 5225246 786179 -1409605 -718410 -2084041 -9377919 -17369051 -17169847 -9293812 -4163288
4215 -4163288 -8370869 -16837509 -20791115 -17998249 -12344722 -7816394 -6031078 -6770764
4207 -6770764 -8453198 -9555934 -10041475 -9720631 -6588923 -19418 6115016 7867208 7053073
4198 7053073 7539896 7738388 3462421 -3196751 -5924896 -4941661 -6941918 -13071536 -16036928
4189 -16036928 -11941951 -6159051 -3465403 -951922 3896488 6136341 1496561 -4667870
4181 -4667870 -4330795 1541638 5670815 5773886 6019157 8852012 12041656 13762060 15189563
4172 15189563 17002668 16973119 12755802 5787278 1219807 3095961 9162871 12400909
4164 12400909 9464352 4718388 2711137 880408 -4230451 -7662747 -1862468 10727318
4156 10727318 21100452 28023654 37141803 46642412 48053298 42803443 42472063 48986503
4148 48986503 51231086 46721348 47934417 58900601 66921770 70627810 91745835 135494845
4140 135494845 160322220 121106583 33731975 -37650410 -57149083 -48729587 -47727448
4133 -47727448 -55016831 -54001795 -44848157 -39343361 -38542968 -36303356 -34536636 -37538618
4125 -37538618 -39340157 -32481768 -22904664 -21418500 -25519542 -24058332 -16641716 -14358927
4117 -14358927 -21850224 -30808662 -32564460 -27793874 -22362033 -20794848 -24644685 -31301312
4109 -31301312 -34345145 -30282872 -24009637 -22410571 -24415664 -23796098 -20462266 -21389005
4101 -21389005 -29346214 -37337790 -37089239 -29032246 -21125481 -19719189 -23409468 -25521812
4093 -25521812 -22100761 -16421474 -13933963 -14169466 -12021354 -6815797 -3861846 -5277245
4085 -5277245 -6397595 -5045260 -6918106 -15634805 -24052342 -23517244 -16706061 -12344388
4077 -12344388 -11040036 -6476998 1247012 4190762 -860965 -7912830 -11757639 -13990320
4069 -13990320 -16501248 -17102021 -15552213 -16970033 -24255073 -32178133 -33782376 -28885146
4061 -28885146 -22227522 -16896490 -13791005 -14176863 -17685633 -19750877 -16049901 -8915030
4053 -8915030 -5023691 -6582794 -8853049 -7658894 -5694546 -8322307 -14990588 -18961408
4045 -18961408 -16336080 -11730247 -12179599 -17826256 -22675723 -23240892 -21218320 -17613539
4037 -17613539 -10710239 -2212982 1246963 -2425978 -5326374 45216 8987914 10591179
4029 10591179 2933700 -5514707 -8384347 -7240217 -5022930 -1978748 257378 -1786876
4021 -1786876 -6916861 -8803638 -5094764 -1153886 -1694289 -4558230 -6233122 -7530406
4013 -7530406 -9457641 -9206730 -5581515 -3408453 -6580811 -10992265 -10843550 -8194129 -8848962
4004 -8848962 -11635587 -10448443 -6084421 -6778620 -15020690 -22119072 -20093016 -12615112
3996 -12615112 -8662606 -9680343 -9403367 -4500982 920560 2024669 -560569 -3408956
3988 -3408956 -5694242 -8751824 -11872937 -11961164 -7674985 -1458454 3443874 6065831 6733779
3979 6733779 5212738 2124511 649993 3497739 8235942 8834416 2971931 -4550228
3971 -4550228 -7163277 -3720138 991728 1824655 -1679945 -5130135 -3815559 1902130
3963 1902130 6287329 4801097 -79706 -2329830 -760451 132386 -2264878 -5328487
3955 -5328487 -6953963 -9324049 -13687137 -16124585 -12993782 -6934273 -2754810 -688795
3947 -688795 1069900 547710 -4566558 -9941805 -8796109 -2479627 952489 -718013 -1015299
3938 -1015299 3369509 6252371 1990514 -5267047 -8280273 -7120941 -6325353 -6094089 -3831275
3929 -3831275 -1773002 -5183935 -13413887 -19565187 -19541524 -15617729 -10619081 -4744387 403292
3920 403292 803752 -3899762 -8041317 -7076925 -3453870 -2063049 -3074266 -3015621 -681615
3911 -681615 1727273 2006405 -557835 -5964612 -13017739 -18873580 -21314864 -20755476 -18541280
3902 -18541280 -14946167 -10657539 -7977086 -7809194 -7452753 -4628645 -2065909 -4454559
3894 -4454559 -11854184 -19499374 -23081806 -20963809 -13107366 -2613600 3050923 -1454326
3886 -1454326 -11142628 -14785622 -8422303 825503 5835920 7719101 9810410 10234105
3878 10234105 6165947 659289 -1399044 -1293843 -4149504 -10396520 -15619733 -17911237
3870 -17911237 -19438254 -20875401 -20047143 -16912286 -14775299 -15098401 -15343538 -13393854 -10267840
3861 -10267840 -6974114 -2411655 3616096 8327959 9005120 6078305 1918898 -1533719
3853 -1533719 -3406590 -4544199 -7824788 -14967151 -22779577 -26032792 -24478387 -22843351
3845 -22843351 -22860725 -20274268 -12283533 -3376887 -40061 -3053342 -8667124 -14193139
3837 -14193139 -18331409 -18940219 -15597103 -12728851 -15096670 -20683277 -22519013 -17408378
3829 -17408378 -8749063 -873657 4843814 7561700 5314764 -1958150 -10786348 -17679542
3821 -17679542 -22069396 -24342378 -23757189 -20703597 -18729743 -20936195 -25024251 -25039702 -18564944
3812 -18564944 -9775875 -4181858 -2320020 -840076 1299361 1109482 -2981616 -7125450
3804 -7125450 -6430494 -1580042 2553841 4153248 6102245 10060782 13480960 14161169 13344655
3795 13344655 11810821 7476013 653805 -2711921 1529051 8332360 9711837 6136493
3787 6136493 4704705 7228633 8250422 5544539 4001033 6088768 6553407 1761092
3779 1761092 -2519303 407463 6820353 7640004 2027609 -2330986 -1714720 -797300 -3109375
3770 -3109375 -4746934 -1541228 3068377 2486980 -3775738 -10146442 -12759539 -12752377 -12160946
3761 -12160946 -10696356 -7869113 -5448046 -5618475 -7653862 -8094701 -4450384 1801665
3753 1801665 6112507 4848781 -1453802 -8809364 -13536364 -14690497 -12945221 -8858578
3745 -8858578 -3796175 -1344511 -4909138 -13131167 -19831157 -20036701 -14834724 -8988187
3737 -8988187 -5276633 -3254397 -2448568 -3738499 -7133510 -10596923 -12190795 -11956805 -10973076
3728 -10973076 -9840129 -8439221 -5689059 377964 9833324 17801004 17533815 8166061
3720 8166061 -3662049 -11822000 -16640706 -19925701 -18769987 -10464863 -854550 179882
3712 179882 -7890681 -14619211 -12656776 -6996719 -6435963 -11307899 -14775977 -12526929 -5939521
3703 -5939521 1641853 6524054 4757957 -3491993 -10581207 -8371805 889905 6024196
3695 6024196 544226 -10065434 -16697623 -17551859 -17289645 -18665853 -19401068 -16383682 -9640164
3686 -9640164 -2050781 2924685 3262438 -571524 -6627970 -13912664 -22729982 -31939722
3678 -31939722 -37659475 -36530197 -29382568 -20150180 -12169385 -7250500 -7028560 -12100673
3670 -12100673 -19534534 -24004510 -22861558 -18579420 -15083947 -13268115 -11759102 -10559875
3662 -10559875 -10893846 -11349647 -7608474 1591441 10277902 10689881 2789711 -5343617 -7814087
3653 -7814087 -7746326 -10856226 -15667239 -15545003 -9377406 -4034316 -4723877 -8448489 -10192194
3644 -10192194 -10744249 -13402219 -16240140 -14094827 -7645308 -4477166 -9463624 -18267988
3636 -18267988 -22418383 -17937288 -7485174 3032438 8058515 5277370 -2532517 -9900669
3628 -9900669 -14438702 -18619478 -24805176 -31230755 -35042228 -36687239 -38134049 -38519679
3620 -38519679 -35167696 -28243178 -21188964 -16709755 -14947730 -15169246 -16309501 -16100601
3612 -16100601 -13007121 -9493908 -10118428 -15225212 -19312969 -17221403 -9897679 -2730190
3604 -2730190 -16891 -2211525 -6756742 -10372529 -12017201 -14285030 -20006883 -27184812
3596 -27184812 -30391902 -28390378 -26694710 -29895306 -34569231 -33507745 -24895817 -13384348
3588 -13384348 -3530218 3517760 7436812 7525647 5104286 3590191 4605924 6130647
3580 6130647 5308395 1213736 -5212115 -11528167 -14190022 -11818328 -8568418 -10597750
3572 -10597750 -17809828 -22729083 -19796752 -12427587 -7716176 -6901439 -5229471 -54734
3564 -54734 5088498 4862242 -2307403 -13511720 -23930440 -29674956 -30164744 -28549524 -28527839
3555 -28527839 -30331077 -30865729 -27653845 -21120507 -13110323 -5216564 849398 3372199
3547 3372199 2647849 1556005 2393467 3880247 3157210 493965 -264273 3059229 7120277
3538 7120277 6576596 763328 -5749464 -9670164 -13051087 -18695334 -23954720 -23095436 -15510272
3529 -15510272 -7503892 -4554526 -5121287 -4361462 -1293193 902471 308628 -1244783 -1027615
3520 -1027615 1527810 4669451 5656658 2660472 -2972521 -6841814 -5747792 -1543800
3512 -1543800 900707 -1023335 -6228943 -12634541 -18407980 -21147880 -19522827 -16214266
3504 -16214266 -15554583 -17078147 -15300842 -8103186 -1423127 -1788071 -6996815 -9097202
3496 -9097202 -5271325 -350658 1664035 2706824 4838020 4679908 -1322802 -9196258
3488 -9196258 -11263182 -7156572 -4686403 -8116486 -11824206 -9729944 -5609747 -7125858
3480 -7125858 -12686109 -13112154 -6737210 -3593534 -10684585 -21199357 -24940574 -22942510
3472 -22942510 -22738986 -23415214 -16740445 -2960253 5978527 2637737 -5829416 -9113831
3464 -9113831 -7210554 -5642480 -4375339 -799813 725848 -6882544 -20413577 -27605780
3456 -27605780 -23318778 -16086500 -15359549 -19598833 -21721292 -20336460 -19403734 -20377856 -20998935
3447 -20998935 -20326626 -19427093 -17427001 -11888690 -3942713 1120054 299108 -2824055 -2498750
3438 -2498750 1963406 5647143 4547114 681128 -604620 2223310 4593590 1975690
3430 1975690 -3373703 -4657720 780413 8301210 12227989 11722210 8589499 3032298
3422 3032298 -4698134 -11064740 -12416843 -10427258 -9899272 -11583386 -11974877 -10544759 -11579566
3413 -11579566 -16611123 -20175206 -17129734 -10496970 -7168819 -8137070 -8411111 -5877283
3405 -5877283 -4590792 -8039501 -13878800 -17859430 -19410886 -20043722 -18610826 -12226498
3397 -12226498 -1641823 7477041 9646844 4554622 -3317502 -8772340 -9487536 -7005716
3389 -7005716 -4900512 -5418255 -7729047 -9662967 -10249993 -9493956 -7000152 -3362045 -2263625
3380 -2263625 -7488360 -16773972 -22311766 -19842570 -14197788 -12455094 -14369503 -14418761 -11693120
3371 -11693120 -11547303 -16720664 -22807022 -25104997 -24897879 -25328497 -25411796 -22862004 -19599310
3362 -19599310 -19001641 -19664031 -17523957 -13212648 -11511929 -13429559 -14494291 -11938880
3354 -11938880 -8188763 -5537755 -2676411 848023 1617250 -2642797 -8914128 -13336147
3346 -13336147 -16233913 -18957939 -19442380 -15809304 -11565676 -11691246 -15126699 -16416702
3338 -16416702 -13811279 -10575751 -8943458 -8127261 -8076426 -9462183 -9474844 -3847572 5116994
3329 5116994 8513159 2033644 -7640550 -11277903 -7803360 -2794645 -408527 -1782298
3321 -1782298 -8231010 -19666107 -30618453 -33703350 -28176068 -20934502 -17904547 -18136671
3313 -18136671 -17966082 -17290154 -18509026 -21219038 -21757958 -18320693 -13699223 -11425670 -11020747
3304 -11020747 -9457624 -6519681 -5371657 -6988378 -7684573 -4934286 -2482287 -5202956
3296 -5202956 -10875336 -12701858 -9377706 -6250055 -5707840 -3659807 1555162 4070977
3288 4070977 -380852 -6356776 -6686865 -3992316 -6014391 -12168017 -13815645 -7775192
3280 -7775192 -1055049 -329815 -3791047 -6127600 -5755723 -4113138 -2549657 -2737681 -6053639
3271 -6053639 -10153717 -10183766 -5541494 -1198229 -192000 307916 2585705 3215060 -1371670
3262 -1371670 -8196919 -11265584 -8850664 -3367606 2792598 7294104 7340647 3984490 3674173
3253 3674173 10137505 17778449 19164709 16096613 15811418 18260222 16199519 8185465
3245 8185465 1959992 1814733 1074781 -7428271 -19803439 -26577846 -25589739 -22659682 -21625509
3236 -21625509 -20414669 -16932603 -13055661 -11039562 -9843651 -7287166 -3681645 -1285709
3228 -1285709 -1132565 -1970654 -2241546 -2120294 -3043253 -5463509 -8061176 -9843753 -11946960
3219 -11946960 -15639765 -19144516 -18954459 -14745122 -10540506 -9958832 -12423253 -15152333
3211 -15152333 -16439481 -15321763 -10695375 -3579569 1616961 1372646 -2329929 -4709261
3203 -4709261 -4834118 -6275206 -11215414 -17367385 -21512980 -22948844 -22106890 -18772762 -13877475
3194 -13877475 -10688940 -11228507 -12603754 -9948370 -3144437 1908297 -95747 -7290075
3186 -7290075 -12025932 -8787031 -37678 6379934 5855087 2224507 3008825 9656801 15060804
3177 15060804 12287341 3350078 -3880024 -6046727 -7086299 -10374776 -13377549 -13070635
3169 -13070635 -12401289 -16399549 -24020465 -29143030 -28948626 -26006947 -21959810 -15175031
3161 -15175031 -6594629 -1973976 -4269353 -8222579 -7296726 -2735063 -659906 -2810845
3153 -2810845 -5844667 -7953435 -9730286 -9191788 -3118573 5476615 8166286 2401433
3145 2401433 -3721462 -1843486 6126440 12107158 12505722 9775209 6104169 1147268
3137 1147268 -4598971 -8565818 -8703246 -5030349 688264 5032670 4704698 815158 -816945
3128 -816945 3253487 9142697 11414054 10886901 11538033 12152213 7994489 62202 -4890769
3119 -4890769 -4715583 -4880720 -8451888 -10159495 -5078153 2551490 5061312 1976108 -1193676
3110 -1193676 -2106269 -3149608 -4983949 -4823960 -1947311 -7564 -2258096 -7682781 -12785881
3101 -12785881 -14350733 -10052413 54452 11276718 16675452 13898492 7809868 4852602
3093 4852602 6628804 10315604 12944653 12743643 7994626 -1783284 -13069731 -19558011
3085 -19558011 -18001380 -11989060 -8574110 -11505100 -18834342 -26568738 -32407278 -35114206
3077 -35114206 -32901832 -25529759 -17014299 -12505230 -11925942 -10304246 -5722429 -2904975
3069 -2904975 -6047229 -11834459 -14114711 -12864727 -12778364 -14094241 -11559677 -3883958 1923277
3060 1923277 -872330 -9961916 -17456317 -19015099 -15859931 -10392197 -4338568 -161694
3052 -161694 -90347 -3393169 -7243299 -10186915 -12512800 -13828187 -13116988 -11151595 -10145008
3043 -10145008 -10657738 -11135159 -10820911 -10925099 -12515422 -15323464 -18960181 -23127870 -26247040
3034 -26247040 -26358552 -24289497 -23571992 -25903247 -28690499 -28566808 -25557320 -22091046 -19379232
3025 -19379232 -16702585 -13487212 -10504345 -9320578 -11128791 -15112966 -17702249 -15633527
3017 -15633527 -10970468 -10577340 -18192624 -28856476 -33973961 -30494217 -22243385 -13981100
3009 -13981100 -8338610 -7570347 -12671472 -19494872 -20972597 -16044963 -12158504 -15346104
3001 -15346104 -21649710 -23161723 -19610477 -17704605 -19993757 -21283015 -17651929 -12968152
2993 -12968152 -13062501 -17955398 -23896439 -29452089 -34541539 -35877943 -29517364 -17984885
2985 -17984885 -9431705 -8100635 -9823063 -9001109 -6216845 -5844968 -8944706 -12319772
2977 -12319772 -13334387 -12162046 -9719171 -6684226 -4932815 -6908645 -12162308 -16511290
2969 -16511290 -16312771 -12505350 -8977050 -7661583 -6924815 -4853984 -2416994 -1957732 -3199707
2960 -3199707 -2903394 384313 2940306 -218904 -8307341 -14522464 -13788301 -8248584 -3580257
2951 -3580257 -2455573 -4060333 -7648980 -12883987 -17844443 -20573851 -22254378 -25095091
2943 -25095091 -27197115 -23907313 -15247846 -7648611 -6266329 -9318430 -12340259 -14190889
2935 -14190889 -15587502 -15352918 -12750937 -11154273 -14194728 -19275775 -20035013 -15319085
2927 -15319085 -10850162 -11046366 -13807794 -15340404 -15989545 -18119124 -20977743 -21338029 -18293205
2918 -18293205 -14676543 -13905626 -17077453 -22765624 -28246303 -31224703 -31480130 -30649854 -29935521
2909 -29935521 -28771408 -26185987 -22240675 -17399470 -11980196 -7282663 -5395349 -6041977
2901 -6041977 -5498133 -1638306 1059904 -4378729 -17581545 -28918848 -29820684 -22324865
2893 -22324865 -15268174 -12942766 -11784835 -7908529 -2819500 563550 3254831 7207904
2885 7207904 9459024 4947043 -4707722 -10733171 -7694600 -60614 4820471 6382792
2877 6382792 8984948 13243253 15067764 12677631 8894988 5621465 1234278 -4606031
2869 -4606031 -8302573 -7567441 -5605074 -6340261 -8170351 -6600560 -1549436 2167285 1335962
2860 1335962 -2293291 -5603426 -8059605 -10882733 -14275187 -16953214 -17751103 -16752828 -14706261
2851 -14706261 -11507047 -6063608 1208884 6510180 5896013 891224 -2161092 76869
2843 76869 3720679 3495134 -357966 -4290833 -7568903 -11498290 -14489047 -13435508 -9615249
2834 -9615249 -7801156 -8879985 -8416032 -3803929 1966862 5404372 6639077 6181961 2321872
2825 2321872 -4871526 -10940661 -12326134 -11136091 -10939328 -11005584 -9075405 -6958671 -8132051
2816 -8132051 -11641708 -13871498 -15201267 -18940896 -23702741 -23193326 -15505522 -7383123
2808 -7383123 -6316274 -12121050 -19056721 -22944858 -23113805 -20028966 -14697787 -9337493
2800 -9337493 -5864960 -4123624 -2958593 -1812499 -76454 3133205 6746001 7346605
2792 7346605 3311907 -2542758 -7043464 -11413765 -18470020 -26382029 -29422561 -25042449
2784 -25042449 -16614893 -8722658 -3249863 -927608 -2726252 -7274167 -9776204 -6699810
2776 -6699810 -395995 3355926 1789536 -2640454 -5846460 -6153388 -4915636 -4319156 -4684156
2767 -4684156 -3835817 -27672 4523627 5097653 527249 -4404086 -4622048 -966545 1927846
2758 1927846 2553697 3828554 7540802 10859619 9682615 3570117 -3666955 -7206994
2750 -7206994 -5022264 -34743 1622894 -3511220 -11942286 -16812528 -15788023 -12912580
2742 -12912580 -12410374 -13738257 -13959864 -12192411 -9930385 -9129458 -11483652 -17358139 -23854637
2733 -23854637 -26245704 -23041060 -17397671 -12226660 -7160136 -2214036 -102568 -1243085
2725 -1243085 -574435 5429910 11812525 11478829 6246587 4236486 7019034 7421020 1398234
2716 1398234 -5737306 -8035869 -7056619 -7174925 -8527880 -9436943 -11035552 -14224102 -15832519
2707 -15832519 -13045275 -8413686 -5407629 -2371578 3312823 8168774 6602388 8137
2699 8137 -5265757 -7981439 -12408163 -18655071 -20869000 -17145735 -13639698 -15210986 -18387516
2690 -18387516 -17896372 -14513348 -11283264 -6729832 1911225 11565808 15633767 12403132
2682 12403132 6333748 1797263 -154607 350489 2896584 5657440 7147165 8771932
2674 8771932 11981652 13630566 8858775 -1167139 -9203082 -10778768 -8600304 -6495284
2666 -6495284 -3813648 937310 4891681 3818243 -1624769 -6719817 -8867631 -9467551
2658 -9467551 -10185391 -10708002 -10393059 -9457547 -8232706 -7412484 -8840572 -13370136 -17881029
2649 -17881029 -17582122 -12168884 -6680953 -4847019 -4626681 -2534700 560945 1346399 -203710
2640 -203710 -1044908 -362258 -727733 -3744981 -8142627 -12717191 -17220713 -19063647 -13709125
2631 -13709125 -1652383 8512542 8585924 591091 -6312694 -7600304 -6952690 -7944969
2623 -7944969 -8022953 -3703050 2453201 4545343 1335762 -2596856 -3717327 -4137729 -7847381
2614 -7847381 -14186930 -17411775 -13375798 -5514740 -2219784 -7397473 -15343203 -17140450
2606 -17140450 -11080755 -3754680 -1312429 -3752265 -8762604 -16387272 -26493039 -35060002
2598 -35060002 -37523154 -34280656 -29012531 -22830352 -14264941 -4333986 2932403 5468962
2590 5468962 4825346 2332639 -2449348 -8539943 -12863094 -14479549 -15872817 -18067507
2582 -18067507 -18156524 -14371863 -10203817 -9981356 -13014820 -15911447 -18350645 -21830488 -23900375
2573 -23900375 -19116243 -6848101 5965342 11769700 9402848 2631284 -5482486 -13986240
2565 -13986240 -21180897 -23636709 -19416848 -11424346 -6074510 -7482388 -12880999 -15050680
2557 -15050680 -10161577 -2133911 2031157 158260 -3702556 -4974940 -3160495 -586576
2549 -586576 1047180 1733027 2170717 2909316 4072740 5575478 7708615 10737145 13128696
2540 13128696 11570834 4787944 -3533714 -8153011 -8163939 -6781730 -5788697 -4002362 -1725389
2531 -1725389 -2173201 -6126219 -8935334 -6356612 -929295 1121814 -2113080 -6766339
2523 -6766339 -8878284 -8344473 -7515026 -8645372 -12722877 -18597433 -23365762 -25323580 -25835405
2514 -25835405 -26542053 -26181857 -22790268 -17602119 -13459056 -10577934 -7826779 -7060076 -10934149
2505 -10934149 -16276706 -15534128 -6810270 2736883 6261031 5068555 3618723 1831275
2497 1831275 -2076928 -4846539 -1435212 5882409 8285512 1447332 -9087262 -15070636
2489 -15070636 -14162363 -9891615 -6681735 -6864692 -9605276 -10596687 -5252849 5520777
2481 5520777 14590152 15802702 10554335 5261342 3737020 4493800 4850343 4893933 6395080
2472 6395080 9211758 10282159 6598048 -1268813 -9439399 -14667377 -16843924 -17045317
2464 -17045317 -15154299 -11490958 -8907626 -9706737 -11323149 -9350009 -4993275 -4538095
2456 -4538095 -9769379 -14021708 -11147103 -4208451 -825274 -3024651 -6686597 -8812625
2448 -8812625 -9878551 -10110137 -8947612 -8075079 -9840781 -12462451 -12003267 -9620969 -11036142
2439 -11036142 -17221212 -21730240 -20380803 -17857865 -20102799 -24905450 -25877095 -22464517
2431 -22464517 -19501720 -18466348 -15899602 -10649362 -6453289 -5628322 -5313101 -2586597
2423 -2586597 619173 820160 -1506688 -2872809 -1737752 195590 913326 153958 -1259994
2414 -1259994 -2698641 -4375133 -7428488 -12820616 -19357790 -23412867 -21769318 -15013917
2406 -15013917 -7798440 -5354176 -8991313 -14538516 -16053747 -12034984 -7091220 -6291834
2398 -6291834 -9310420 -12402720 -14669989 -18435055 -23433895 -25113501 -20563997 -12717996
2390 -12717996 -6370733 -2834311 -782415 567001 1960843 4975584 8866247 9026844
2382 9026844 2822732 -4860802 -6688672 -2554942 835524 -135276 -1987056 -1099561 769122
2373 769122 590769 -750030 -1028187 -1436660 -5015558 -11982660 -19542470 -24893545 -26101993
2364 -26101993 -22130900 -15158154 -11063526 -13714415 -19471790 -21019946 -16330721 -10072441
2356 -10072441 -6034727 -2539723 2971722 8686347 10883167 9372386 7051095 4918918
2348 4918918 828039 -6274915 -13283120 -15559360 -11761665 -5073766 44221 1753739
2340 1753739 1697312 2494849 4599607 5705382 3373834 -1881195 -6568996 -7561106 -5200595
2331 -5200595 -2624090 -2055169 -2467169 -1398290 1406405 3134739 1043173 -3997741 -7661017
2322 -7661017 -6163243 -235539 5059301 4963778 -355755 -6324590 -9252558 -10225316 -13136455
2313 -13136455 -19874126 -28513455 -35261108 -36734765 -31538994 -22124465 -14631209 -13842235
2305 -13842235 -17766675 -20044783 -18374536 -17019636 -19258523 -21371556 -17964727 -10542971
2297 -10542971 -5795787 -6281767 -8033842 -8180885 -9880508 -16785772 -26090249 -31171026
2289 -31171026 -29961471 -26884016 -26030247 -25729487 -22095070 -16101383 -13593450 -17524464
2281 -17524464 -23253152 -24237616 -20551738 -17842647 -18320842 -17798798 -13434785 -9447172 -11012925
2272 -11012925 -15956951 -17763825 -14976541 -11978238 -11057569 -9680441 -6677175 -5522763
2264 -5522763 -8830204 -13837240 -16485244 -16813794 -17078071 -16869086 -13598872 -6982616 -489721
2255 -489721 1715835 -1464093 -6673813 -8623033 -5705402 -2613309 -4543966 -9395852
2247 -9395852 -10170816 -5513369 -2092284 -4149621 -6633464 -3227210 3577648 6045527
2239 6045527 1493724 -6559444 -14637266 -20568599 -20831316 -13731446 -4714633 -1991360
2231 -1991360 -6527419 -11988858 -14382221 -15225665 -14790480 -9880842 -1030784 4800125 2722357
2222 2722357 -3899576 -9355210 -12843146 -15880289 -17213294 -15409097 -13119371 -13603314
2214 -13603314 -15358041 -14969484 -13291828 -13821271 -16027590 -15082494 -8312790 1503457 9242998
2205 9242998 11340906 7454496 912887 -3335706 -3564325 -2846559 -3874908 -4751311 -2984742
2196 -2984742 -729477 -1503360 -3911720 -3942458 -2090511 -2379825 -4764385 -4581668 -327862
2187 -327862 3548408 2982118 -1285858 -6623427 -11066619 -12207322 -8979383 -5693674 -8246898
2178 -8246898 -14622623 -16037404 -10339779 -6570944 -11330553 -18224323 -18130520 -13544953 -13341336
2169 -13341336 -17421391 -17202858 -10259182 -4271830 -5073870 -9422711 -12055416 -12442265 -11526530
2160 -11526530 -8353415 -3571031 -984983 -2298043 -4858847 -7053293 -10626084 -15037243
2152 -15037243 -15792871 -12419168 -11846320 -18355244 -25691302 -25799487 -20748144 -18248959 -18709998
2143 -18709998 -15478975 -6705816 1579702 4757547 4505997 3220287 539173 -2569452
2135 -2569452 -2656971 516437 2536760 1325899 527410 2926949 5283049 3234506 -2662795
2126 -2662795 -9134428 -14482083 -17204478 -14411485 -6085139 2110426 4706232 2773198
2118 2773198 504233 -1741322 -6194655 -11541718 -13336834 -10096663 -4901811 -1329200
2110 -1329200 -1058751 -4384947 -9489649 -12302681 -10717995 -7763930 -7097273 -7393908 -5703846
2101 -5703846 -4011054 -6246873 -10157386 -9532552 -4758423 -3335641 -8020512 -12283848
2093 -12283848 -11228893 -9665433 -13663845 -19893966 -20365166 -14258520 -8182693 -6606966
2085 -6606966 -8358378 -11484575 -15269214 -17261672 -14152425 -7128587 -1981849 -2249282
2077 -2249282 -5640329 -8433180 -9869549 -10581780 -10042315 -7999506 -6100323 -5749401 -6129235
2068 -6129235 -6471100 -8511117 -13960036 -20567673 -23745146 -22113278 -18595216 -15251965
2060 -15251965 -10049324 -1134392 7782495 10194256 5025558 -1634336 -4590540 -5905232
2052 -5905232 -10189443 -16371195 -18919891 -16329331 -13162950 -12853064 -13349233 -11860816 -9338333
2043 -9338333 -7187787 -3601285 2683018 8062910 8343215 5337543 4149616 4990592 3123258
2034 3123258 -2936709 -8523727 -9533048 -7388189 -5170235 -2964380 -236951 359721
2026 359721 -4227822 -11981226 -16810547 -15453761 -11096726 -9414571 -12431306 -17129718
2018 -17129718 -19395275 -18285399 -16062326 -14639970 -13274142 -10279765 -5849138 -1968176
2010 -1968176 -307765 -1409754 -4972456 -9219847 -10958628 -8693458 -5265242 -4711034
2002 -4711034 -6572669 -6472677 -2984956 -368648 -2376559 -6200261 -5715944 588707 7833032
1993 7833032 10327563 6344116 -2512568 -13718645 -24178706 -30038825 -28678568 -21418526
1985 -21418526 -13120927 -8195669 -7204347 -7762355 -7906432 -7215012 -5356826 -2323434 -757390
1976 -757390 -4641579 -13073925 -18187454 -13459666 -2688013 4047552 3061106 486527
1968 486527 2118132 5584831 5778489 3130470 1457430 626400 -2719677 -7888321 -9253292
1959 -9253292 -4100185 2686080 4228990 -221663 -5033411 -5079809 -1100568 1713333 -619943
1950 -619943 -7039676 -12916594 -14687175 -12448096 -8382538 -4106788 -291668 2245385
1942 2245385 2425538 -187139 -4765315 -9090263 -10133213 -6209335 618132 5370424
1934 5370424 4367791 -1974238 -10672750 -18881606 -24476701 -26168991 -24863292 -23505397
1926 -23505397 -23792278 -24206427 -22957531 -21331429 -21768554 -23795234 -24750217 -24207830 -24794725
1917 -24794725 -28035232 -31538492 -31197909 -24962778 -14160621 -2373807 6721477 11536429
1909 11536429 13006034 12545356 10278279 6083792 1223857 -2557656 -4559855 -4245457
1901 -4245457 -449536 5987531 10236962 7892801 1207114 -2936539 -2011518 -928781
1893 -928781 -4339821 -9438297 -9619242 -3246747 4607349 8437098 7419779 4258639 1448550
1884 1448550 -303223 -1355087 -2180163 -3166062 -4912133 -8244326 -13320614 -18525420 -20888901
1875 -20888901 -18401646 -12191582 -6257856 -4548006 -7524940 -11428033 -11729948 -7761924
1867 -7761924 -3058417 -753303 -244479 371013 400984 -2415763 -7829044 -12611302 -14002865
1858 -14002865 -11540018 -6116063 -32593 2463200 -1493184 -8541720 -11070715 -5949837
1850 -5949837 1353946 3415568 -709370 -5968916 -8250424 -8021456 -7994650 -9728742 -12548662
1841 -12548662 -14297830 -13148229 -9419671 -5203235 -1878942 953004 3772580 5918485
1833 5918485 6631821 5683501 2538180 -2902404 -8073585 -9134831 -6070341 -3567978 -4831645
1824 -4831645 -7402709 -7693498 -6785871 -8320107 -12920686 -18407870 -23571556 -27718977 -28204118
1815 -28204118 -23064411 -15273896 -9861826 -7309254 -4267114 -221219 1806596 1297536
1807 1297536 1232472 1880336 -655340 -7397356 -13284846 -14057227 -11763494 -10196414 -9351885
1798 -9351885 -8139615 -8067214 -9587554 -8957071 -4321929 -1340271 -6054936 -14623035 -17624117
1789 -17624117 -13548365 -10020472 -11066433 -11526237 -6959366 -1427000 -406553 -1801879
1781 -1801879 -76296 4613340 7764478 8589512 10307437 13232329 13569224 9495218 3228302
1772 3228302 -3765687 -12365014 -20772082 -23084889 -16510826 -6467376 -522599 214398
1764 214398 -459145 -1679021 -6057121 -12494096 -14643427 -9545994 -3497614 -4820088 -12804328
1755 -12804328 -18533819 -16498098 -10960630 -9361325 -13032284 -17199421 -17867960 -15315387
1747 -15315387 -11632347 -8159267 -5741374 -4814033 -4325791 -2811584 -1631391 -4813191
1739 -4813191 -13624084 -22852646 -25065000 -18286438 -7614077 554254 4056095 4796368
1731 4796368 5163365 5629708 4987059 2292609 -1158838 -2262187 449327 4307900 5205548
1722 5205548 2680882 199686 -44004 -117059 -2726878 -6778066 -8840770 -7828392 -5718596
1713 -5718596 -3990873 -1716220 2342446 7441530 11507031 13270495 13322153 13445127 14765255
1704 14765255 16086502 14680737 9630924 3565447 -436340 -2932074 -6839977 -12138318
1696 -12138318 -14703612 -11836730 -6671763 -4648191 -6609763 -8023772 -5265578 -459062
1688 -459062 1215458 -2099644 -6850192 -8370303 -6004828 -3085060 -2357572 -2730543 -947814
1679 -947814 4550874 12272631 19251700 22649600 20509195 13167466 4457860 -528870
1671 -528870 -358284 1289755 564127 -1361241 -285125 4402303 8201812 7731436 5756661
1662 5756661 7394364 12748125 16616821 15465386 11269365 7262279 3258953 -2071277
1654 -2071277 -6900907 -8222960 -6990707 -6965875 -8513535 -8135752 -5149881 -3808713 -6088061
1645 -6088061 -7006934 -1574233 6826435 10219971 6468013 745303 -2414059 -3077534 -2068392
1636 -2068392 790535 2940927 -859387 -11375701 -21467549 -23251892 -16432069 -7134652
1628 -7134652 -1088158 -489756 -4782142 -10870595 -14007269 -11698798 -6200518 -1289814
1620 -1289814 1895294 3733588 3076275 -1259049 -7086561 -10406813 -10184328 -8929721 -8899369
1611 -8899369 -10366793 -13303545 -17713391 -21807936 -22505974 -18923736 -13803906 -10580868
1603 -10580868 -9996819 -10078971 -8650435 -5424450 -1851090 930460 3258518 5052679 3921384
1594 3921384 -1890681 -8883162 -10881509 -7592327 -5842059 -9444099 -12977177 -10666836
1586 -10666836 -6912253 -10605120 -21200724 -28455952 -25979836 -17577332 -9193056 -2174447
1578 -2174447 2949871 3237244 -1790597 -7497441 -10788072 -14758027 -22169133 -28717150
1570 -28717150 -28282962 -21673537 -14590814 -9423063 -4857918 -1813254 -3234798 -8040177
1562 -8040177 -11123813 -10359277 -8561687 -7280339 -3930278 2215640 5803952 1581064
1554 1581064 -7584473 -13329362 -11841791 -7466385 -5984647 -8022689 -10825080 -13260930
1546 -13260930 -15507932 -15478807 -10359614 -2396288 1498067 -1444374 -5251102 -3321594
1538 -3321594 2031624 3457147 -87977 -2486549 -672984 1544445 1525651 2352833 5614612
1529 5614612 6250580 215318 -7795298 -10893987 -10673963 -13996120 -20948954 -23628855 -17394643
1520 -17394643 -7005474 -11601 1021175 -2021041 -6920951 -12440482 -17915852 -22836211
1512 -22836211 -25457611 -22713192 -14291581 -5600281 -2564810 -3949599 -3306510 1575775
1504 1575775 6210547 6913138 5235987 3305692 296861 -3587494 -4632197 -1001354
1496 -1001354 3278073 3858660 2449906 3292423 5764117 5404314 1211832 -2740734 -3358404
1487 -3358404 -2786955 -5563844 -13170117 -21915339 -25805840 -22484209 -16830154 -16506566 -22544351
1478 -22544351 -27052810 -22941222 -13514805 -8522285 -11753622 -16734438 -15191291 -6456635
1470 -6456635 2772026 5790234 1656075 -5055826 -8978498 -8583671 -6472689 -5548365 -6045158
1461 -6045158 -6582544 -6430903 -5655940 -4511294 -3850119 -4559595 -5508370 -4282270 -1562219
1452 -1562219 -2001505 -8039124 -15418855 -18460800 -17641336 -17559925 -18965601 -18153122 -14055895
1443 -14055895 -10391764 -9562749 -9415685 -8093449 -7600255 -9687158 -11895032 -11101997 -8396688
1434 -8396688 -7148318 -8191483 -9954159 -11673704 -13420686 -14240756 -13372588 -12516779 -13998435
1425 -13998435 -17092071 -18762986 -17816176 -15976607 -15102002 -15625465 -17541022 -20397036 -22008360
1416 -22008360 -19494130 -12436215 -3658670 3271724 6003624 3560698 -2936306 -9685889
1408 -9685889 -13112301 -13984280 -15944314 -19172807 -18939165 -12573696 -4761659 -2466780 -6439126
1399 -6439126 -11443991 -13818760 -14646641 -15372374 -14556152 -10633068 -4752175 1048730 5865329
1390 5865329 8096727 4442902 -5856512 -17244694 -21937480 -17826709 -9930051 -4438700
1382 -4438700 -3961258 -8081023 -14880547 -20998288 -23459021 -23181897 -24238625 -28031587 -30670638
1373 -30670638 -28112845 -21589846 -15496905 -11922640 -10118940 -9667528 -10681753 -11681052
1365 -11681052 -10723996 -8534918 -7476929 -7530136 -6427760 -3821662 -1825004 -873049 1277583
1356 1277583 5236645 8307103 8832576 8484697 7701916 2685255 -8885580 -21602087
1348 -21602087 -26677286 -21999203 -13881268 -8955727 -8120346 -8869829 -9687659 -10394008 -10799279
1339 -10799279 -10983061 -11537352 -12379658 -12476211 -11367074 -9738251 -8171231 -6700045 -5633846
1330 -5633846 -5128356 -4139190 -2058290 -1164655 -4283448 -9564290 -11329301 -7581167 -2924021
1321 -2924021 -1846685 -3074464 -3891570 -6090715 -12585118 -20881271 -25936649 -28132817
1313 -28132817 -31901345 -36500946 -35285026 -26247877 -16880578 -14809578 -18597897 -21854665
1305 -21854665 -21734854 -18277109 -9635439 4836452 18499455 21839937 13872589 3512537
1297 3512537 -1651934 -2772384 -4266103 -6357689 -6650956 -5349615 -4697729 -5119101 -5389694
1288 -5389694 -5460075 -6126606 -6652079 -5350628 -2333442 165630 -33359 -3572556 -9148803
1279 -9148803 -13450251 -13263059 -9472138 -7152200 -9353205 -12724200 -12434512 -9599991 -9382841
1270 -9382841 -12421893 -13435403 -9535444 -5001341 -4970978 -8153113 -9512311 -7792747 -6413619
1261 -6413619 -8000900 -11705379 -15749420 -19386350 -21823832 -21861666 -19582988 -16578383 -13739403
1252 -13739403 -10481576 -6868831 -4743012 -5506970 -8055606 -10227601 -11335812 -11785603
1244 -11785603 -10883665 -6979904 -169464 6650625 10527166 11628271 12487674 14090684
1236 14090684 14075020 9878205 2861705 -2596341 -4462381 -5437682 -8409522 -11265899 -9338757
1227 -9338757 -2792639 2104744 879944 -2916147 -2578769 2241648 4871555 579331
1219 579331 -7606240 -13594573 -15605909 -16230206 -17281417 -17962907 -17456607 -16172156 -14172553
1210 -14172553 -11029166 -7864856 -6999698 -8386728 -8686375 -5687040 -1957190 -1995819 -6782979
1201 -6782979 -13178590 -17961110 -20300438 -20629168 -19399692 -17207388 -14190946 -9105081
1193 -9105081 -1182940 6653397 9293018 5871358 2272702 4451695 10777346 14325524
1185 14325524 12135141 8272841 6959526 6749707 4193752 181394 -1393536 80145
1177 80145 1234392 242819 -1104871 -1648462 -2802832 -4191304 -1796617 5520115 11083670
1168 11083670 7550673 -2571008 -9578352 -9676743 -8939409 -12418663 -16039367 -13935071
1160 -13935071 -8772393 -8280348 -13816051 -18817977 -18283018 -14073498 -10127030 -7768876
1152 -7768876 -7648277 -11458130 -18341504 -22868379 -20545286 -13901245 -9792629 -11249568
1144 -11249568 -14767150 -15600316 -13181793 -10436443 -9426280 -9130416 -7215011 -2930005
1136 -2930005 2257222 6366013 8154364 6661353 1308173 -6202638 -11650290 -12361325
1128 -12361325 -10820311 -11565439 -14734488 -15851779 -12622814 -8601941 -8365581 -11690780
1120 -11690780 -14728508 -15039896 -13350915 -11894004 -12971451 -17539821 -23051490 -24198679
1112 -24198679 -18274172 -8833305 -1934531 97906 -946813 -3299626 -6453476 -9090010
1104 -9090010 -9317502 -7318935 -5131790 -3675864 -2500478 -2222441 -3936787 -5807804 -3878907
1095 -3878907 2149264 6929109 5375282 -1550769 -8910522 -13653490 -16078457 -16894064
1087 -16894064 -15569336 -11516197 -5236500 1660231 6639133 7126582 2550858 -4750667
1079 -4750667 -11471477 -15662862 -16689306 -14423890 -10033608 -6299087 -4919266 -4044625
1071 -4044625 -839208 3610670 4626083 -8733 -6794124 -10974318 -12275481 -13849834
1063 -13849834 -16818854 -18957096 -18725182 -17388774 -15965861 -13059424 -8229538 -5415240
1055 -5415240 -9435690 -19506006 -29476951 -34853925 -36533765 -36840561 -35340551 -30826546
1047 -30826546 -24932379 -20924855 -20067339 -21131145 -22075365 -20397169 -13971818 -4433191
1039 -4433191 1991186 515526 -6195148 -11190402 -11304920 -8531240 -4816500 -695065
1031 -695065 1020745 -3719136 -13264678 -19337927 -16284720 -7755378 -1331138 48963
1023 48963 -1808439 -5216518 -9206102 -11484893 -10292594 -7570672 -7060866 -9969357 -14765269
1014 -14765269 -19434503 -21212162 -16630158 -6001782 3828535 5796819 904539 -3900683
1006 -3900683 -4955645 -4086038 -2453025 1560513 7208574 10002451 8095497 5517991
998 5517991 6259885 9004191 10529093 10574988 10048541 7823287 3285777 -490499 -266542
989 -266542 2318807 3103430 1642738 1390379 4305911 8632530 11563571 10978160 5110927
980 5110927 -5821768 -17301834 -23078009 -21103930 -14882981 -8828580 -4841900 -3493285
972 -3493285 -5073877 -8025744 -9134788 -7288153 -5153565 -5396904 -7008655 -7288226 -5826847
963 -5826847 -4084267 -2089629 1425937 5390491 5743644 267234 -7250269 -9959412 -5456598
954 -5456598 1168576 2913978 -1436174 -6916328 -9349585 -10142612 -12956289 -18020603 -22301649
945 -22301649 -23804969 -22580160 -18374668 -11321311 -5253836 -5729144 -12500911 -17760089
937 -17760089 -15209490 -8050484 -4085150 -5242352 -6872941 -6153317 -5285816 -5733303 -5257733
928 -5257733 -3296181 -4069780 -10143597 -16785210 -17870915 -14801371 -13707776 -15144806 -13344663
919 -13344663 -6556024 -1248339 -2519093 -5715071 -2949533 5068818 9503447 4919949
911 4919949 -4648954 -11697916 -13222761 -11422459 -9695284 -9923602 -11969288 -14319056 -15916562
902 -15916562 -17346805 -18831757 -17836802 -11657188 -2536044 3412430 3733722 2541559 3579992
893 3579992 3795929 -2313252 -13924899 -23801026 -26598252 -23568352 -18720281 -13860720
885 -13860720 -8855864 -4277563 -1758329 -2517373 -6397177 -11694395 -15813315 -17227330
877 -17227330 -16992399 -17123613 -17351703 -15017897 -8830249 -1520499 2205240 60975 -5709446
868 -5709446 -10392472 -11305593 -10606313 -12809746 -18978672 -24951494 -26656335 -25117845 -23629530
859 -23629530 -22033809 -18097721 -13718111 -14320357 -20775052 -26880202 -27481615 -24755271 -22951387
850 -22951387 -20957983 -15172679 -7192923 -2599225 -2435232 -1522117 3424228 8617489 8551028
841 8551028 3259025 -2520812 -5260553 -4871760 -2353217 1612794 5476401 6758462 4689933
832 4689933 1858821 1499166 3066972 2202430 -3749695 -11548097 -15585317 -14933069 -13696632
823 -13696632 -13934664 -12362442 -6738126 -1856832 -4368744 -13115180 -19679890 -18713475 -13227850
814 -13227850 -8865952 -7446797 -7975587 -9711277 -11114716 -8990503 -2371101 4751340
806 4751340 8013044 8420644 9934667 12504685 11781654 6068043 -327474 -2229282 559197
797 559197 4241217 5859691 5194795 3068127 -88334 -3865157 -7187437 -8361986 -5821597
788 -5821597 588124 8692736 14995487 17271253 15999865 13140583 10225828 8020649
780 8020649 6951099 6696866 6026332 4505128 3953805 6127599 8639575 5956030 -3412027
771 -3412027 -12750181 -13819579 -7531753 -4109494 -10979163 -23540937 -30567269 -26614576
763 -26614576 -16029540 -6288050 -1324728 -1173023 -3973209 -6718091 -6767863 -4428928 -2321228
754 -2321228 -1180763 1490390 7150893 12873261 14535129 11966907 8725953 7670548
746 7670548 8837473 11034752 13251186 14344935 13159190 9736004 5743260 3330795
738 3330795 3625370 5941226 8211606 8787315 8099147 7909835 8914862 10132198 10588733
729 10588733 10008467 7719723 3003988 -2893398 -7433643 -10346564 -13918780 -18574514
721 -18574514 -21430486 -21319296 -21586568 -24349812 -25296488 -19363415 -9726002 -5144090 -8276079
712 -8276079 -12240134 -10264771 -3908612 743414 1101491 -906669 -3137294 -5077004 -6511929
703 -6511929 -7125141 -7273191 -7520790 -7448877 -5880965 -2339622 1905223 4133255 2239859
694 2239859 -2522156 -5737370 -4413668 -706705 816117 -1158056 -4106443 -5920008
686 -5920008 -6659630 -6501706 -5551504 -5937319 -10258114 -16992072 -21037391 -20010715 -16515851
677 -16515851 -13106911 -9318772 -5682682 -5950324 -11555247 -17369458 -17375527 -12465801 -8581044
668 -8581044 -8579086 -9792324 -8831621 -5317215 -944816 2553307 4394855 5108073 5406646
659 5406646 4208288 -236051 -6413192 -9822112 -8942419 -7553814 -8715221 -10249167 -9524749
650 -9524749 -8614967 -10042201 -11158446 -8624772 -5482926 -6896149 -10733524 -9967982 -4013159
641 -4013159 7551 -1821128 -5447325 -6964571 -8325543 -11651462 -14126474 -13034142
633 -13034142 -11243142 -13110918 -18049574 -21831917 -21682114 -17392420 -10538905 -5243871
625 -5243871 -6138914 -12338497 -16695752 -14328067 -8678665 -5822365 -6391234 -7251415 -7657477
616 -7657477 -8579455 -8504604 -5490134 -1857449 -1427597 -3020412 -2077196 1630317 3402505
607 3402505 1235904 -1173811 -509815 1548463 1788178 -7317 -2085604 -3523785 -4149387
598 -4149387 -3890868 -3582611 -4275307 -4830337 -2888652 608868 1079261 -3384064 -8298290
589 -8298290 -8484947 -5338697 -4652349 -8164541 -11426084 -10793516 -8835751 -10315246 -14876171
580 -14876171 -16971495 -13007112 -5856510 -1095907 -684758 -2268101 -3341730 -3196871 -930226
571 -930226 4865997 12524088 16080789 10912598 -75922 -8635504 -9717284 -5793562
563 -5793562 -2470968 -2045669 -2540705 -1602766 412086 1232465 -340787 -2753496 -3190234
554 -3190234 -716350 2483482 3308940 899772 -2706645 -4866261 -5072856 -5387132 -7762141
545 -7762141 -10858465 -10794958 -6136904 -535148 1852355 2039838 3708153 5987475 3996266
536 3996266 -2514327 -6846443 -4640340 -264750 293981 -1824424 -2287202 -2176058 -5466825
527 -5466825 -10251552 -10485139 -6213722 -4289988 -7672291 -11320462 -11164846 -10326903 -12684241
518 -12684241 -16080089 -16599976 -15094946 -14526787 -14307213 -12297726 -9808764 -9434688 -9517895
509 -9517895 -5919952 952215 5233961 2395236 -5946905 -14406261 -18741750 -18230216 -15197399
500 -15197399 -12760008 -12201770 -12786727 -14222430 -17386194 -21572163 -23467164 -21035263 -16464456
$$ [...]
##END NTUPLES=NMR SPECTRUM
##END=
