##TITLE=31Pdec_DE-106_oil
CDCl3, 64 sc
 11.8.2025
##JCAMPDX= 6.0         $$ Bruker NMR JCAMP-DX V2.0
##DATA TYPE= NMR SPECTRUM
##DATA CLASS= NTUPLES
##ORIGIN= UXNMR, Bruker Analytische Messtechnik GmbH
##OWNER= root
$$ XWIN-NMR		Version 3.5
$$ Mon Aug 11 15:35:44 2025 Russian Standard Time (UT+4h)  she@DPX200
##.OBSERVE FREQUENCY= 81.013821
##.OBSERVE NUCLEUS= ^31P
##.ACQUISITION MODE= SIMULTANEOUS
##.ACQUISITION SCHEME= undefined
##.AVERAGES= 64
##.DIGITISER RES= 17
##SPECTROMETER/DATA SYSTEM= spect
##.PULSE SEQUENCE= zgpg30
##.SOLVENT NAME= CDCl3
##.SHIFT REFERENCE= (INTERNAL, CDCl3, 0, 198.062)
##AUDIT TRAIL= $$ (NUMBER, WHEN, WHO, WHERE, WHAT)
$$ ##TITLE= Audit trail, XWIN-NMR		Version 3.5
$$ ##JCAMPDX= 5.01
$$ ##ORIGIN= Bruker BioSpin GmbH
$$ ##OWNER= she
$$ F:/spectra/data/she/nmr/P31/2/pdata/1/auditp.txt
$$ ##AUDIT TRAIL=  $$ (NUMBER, WHEN, WHO, WHERE, WHAT)
(   1,<2025-08-11 15:34:40.10 +0400>,<she>,<DPX200>,
      <created by zg, POWCHK disabled, PULCHK disabled
       configuration hash MD5:
       00 E9 B6 7A A2 85 ED C7 34 08 36 98 17 FE 4E 26
       data hash MD5: 32K
       93 A2 EC AC 3E EC 48 9F AA 29 6E 1C F4 CB 5C BB>)
(   2,<2025-08-11 15:34:45.34 +0400>,<she>,<DPX200>,
      <Start of raw data processing
       efp BC_mod = 2 LB = 1.5 FT_mod = 6 PKNL = 1 PHC0 = 1754.174 PHC1 = 102.8994 SI = 64K 
       data hash MD5: 64K
       CC 4B A0 4B 77 E4 AB 88 2A 2C E2 72 1E AE 5A 75>)
(   3,<2025-08-11 15:35:08.57 +0400>,<she>,<DPX200>,
      <pk PHC0 = 11.25138 PHC1 = -62.80001 
       data hash MD5: 64K
       9D 31 9F 63 7B CF 8A 93 01 BE 45 D0 FC A7 A6 E2>)
(   4,<2025-08-11 15:35:12.87 +0400>,<she>,<DPX200>,
      <abs ABSG = 5 
       data hash MD5: 64K
       23 78 FB 33 68 30 D4 19 32 95 DA 7D DA 30 C4 D0>)
$$ ##END=
$$ 
$$ hash MD5
$$ 06 A5 76 0D 63 49 5A 15 DC 30 57 DD 91 D6 85 85
##$RELAX= 
##$RELAX= 
##$RELAX= 
##$RELAX= 
##$RELAX= 
##$RELAX= 
##$RELAX= 
##$RELAX= 
$$ Bruker specific parameters
$$ --------------------------
##$DU= <F:/spectra>
##$EXPNO= 2
##$NAME= <P31>
##$PROCNO= 1
##$TYPE= <nmr>
##$USER= <she>
##$AMP= (0..31)
100 100 100 100 100 100 100 100 100 100 100 100 100 100 100 100 100 100 
100 100 100 100 100 100 100 100 100 100 100 100 100 100 
##$AQSEQ= 0
##$AQ_mod= 1
##$AUNM= <au_zg>
##$AUTOPOS= <>
##$BF1= 81.014009
##$BF2= 200.13
##$BF3= 200.13
##$BF4= 200.13
##$BF5= 200.13
##$BF6= 200.13
##$BF7= 200.13
##$BF8= 200.13
##$BYTORDA= 1
##$CFDGTYP= 0
##$CFRGTYP= 5
##$CHEMSTR= <none>
##$CNST= (0..31)
1 1 145 1 1 1 1 1 1 1 1 1 1 1 1 1 1 1 1 1 1 1 1 1 1 1 1 1 1 1 1 1 
##$CPDPRG= <waltz16>
##$CPDPRG1= <>
##$CPDPRG2= <waltz16>
##$CPDPRG3= <>
##$CPDPRG4= <mlev>
##$CPDPRG5= <mlev>
##$CPDPRG6= <mlev>
##$CPDPRG7= <mlev>
##$CPDPRG8= <mlev>
##$CPDPRGB= <>
##$CPDPRGT= <>
##$D= (0..31)
0 1 0 0 0 0 0 0 0 0.06 0 0.03 2e-05 3e-06 0 0 0.0002 0 0 0 0 0 0 0 0 0 
0 0 0 0 0 0 
##$DATE= 1754912079
##$DBL= (0..7)
120 120 120 11 120 120 24 19 
##$DBP= (0..7)
150 150 150 150 150 150 150 150 
##$DBP07= 0
##$DBPNAM0= <>
##$DBPNAM1= <>
$$ [...]
##$SUBNAM3= <"">
##$SUBNAM4= <"">
##$SUBNAM5= <"">
##$SUBNAM6= <"">
##$SUBNAM7= <"">
##$SUBNAM8= <"">
##$SUBNAM9= <"">
##$SW= 400.765351723535
##$SWIBOX= (0..15)
0 1 3 0 0 0 0 0 0 0 0 0 0 0 0 0 
##$SW_h= 32467.5324675325
##$TD= 32768
##$TD0= 1
##$TE= 0
##$TE2= 300
##$TE3= 300
##$TEG= 300
##$TL= (0..7)
0 120 53 12 22 120 120 120 
##$TP= (0..7)
150 150 150 150 150 150 150 150 
##$TP07= 0
##$TPNAME0= <>
##$TPNAME1= <>
##$TPNAME2= <>
##$TPNAME3= <>
##$TPNAME4= <>
##$TPNAME5= <>
##$TPNAME6= <>
##$TPNAME7= <>
##$TPOAL= (0..7)
0.5 0.5 0.5 0.5 0.5 0.5 0.5 0.5 
##$TPOFFS= (0..7)
0 0 0 0 0 0 0 0 
##$TUNHIN= 0
##$TUNHOUT= 0
##$TUNXOUT= 0
##$USERA1= <user>
##$USERA2= <user>
##$USERA3= <user>
##$USERA4= <user>
##$USERA5= <user>
##$V9= 5
##$VALIST= <valist>
##$VCLIST= <CCCCCCCCCCCCCCC>
##$VD= 0
##$VDLIST= <DDDDDDDDDDDDDDD>
##$VPLIST= <PPPPPPPPPPPPPPP>
##$VTLIST= <TTTTTTTTTTTTTTT>
##$WBST= 1024
##$WBSW= 4
##$XGAIN= (0..3)
0 0 0 0 
##$XL= 0
##$YL= 0
##$YMAX_a= 14567
##$YMIN_a= -6698
##$ZGOPTNS= <>
##$ZL1= 120
##$ZL2= 120
##$ZL3= 120
##$ZL4= 120
##$ABSF1= 198.0616
##$ABSF2= -202.7028
##$ABSG= 5
##$ABSL= 3
##$ALPHA= 0
##$AQORDER= 0
##$ASSFAC= 0
##$ASSFACI= 0
##$ASSFACX= 0
##$ASSWID= 0
##$AUNMP= <proc_1d>
##$AZFE= 0.1
##$AZFW= 0.5
##$BCFW= 0
##$BC_mod= 2
##$BYTORDP= 0
##$COROFFS= 0
##$CY= -3
##$DATMOD= 1
##$DC= 0
##$DFILT= <>
##$DTYPP= 0
##$F1P= 0
##$F2P= 0
##$FCOR= 1
##$FTSIZE= 65536
##$FT_mod= 6
##$GAMMA= 0
##$GB= 0
##$INTBC= 1
##$INTSCL= 9.790993e-09
##$ISEN= 30
##$LB= 1.5
##$LEV0= 0
##$LPBIN= 0
##$MAXI= 10000
##$MC2= 0
##$MEAN= 0
##$ME_mod= 0
##$MI= 50
##$NCOEF= 0
##$NC_proc= -8
##$NLEV= 6
##$NOISF1= 182.463
##$NOISF2= 159.3651
##$NSP= 0
##$NTH_PI= 0
##$NZP= 0
##$OFFSET= 198.0616
##$PC= 4
##$PHC0= 1765.425
##$PHC1= 40.09939
##$PH_mod= 1
##$PKNL= yes
##$PPARMOD= 0
##$PSCAL= 0
##$PSIGN= 0
##$REVERSE= no
##$SF= 81.0140089999434
##$SI= 65536
##$SIGF1= 159.3651
##$SIGF2= -187.1042
##$SINO= 113.3802
##$SIOLD= 16384
##$SREGLST= <1H.CDCl3>
##$SSB= 0
##$STSI= 65536
##$STSR= 0
##$SW_p= 32467.5324675325
##$SYMM= 0
##$S_DEV= 0
##$TDeff= 32768
##$TDoff= 0
##$TI= <>
##$TILT= no
##$TM1= 0
##$TM2= 0
##$TOPLEV= 0
##$USERP1= <user>
##$USERP2= <user>
##$USERP3= <user>
##$USERP4= <user>
##$USERP5= <user>
##$WDW= 1
##$XDIM= 65536
##$YMAX_p= 252726389
##$YMIN_p= -326801952
$$ End of Bruker specific parameters
$$ ---------------------------------
##NTUPLES= NMR SPECTRUM
##VAR_NAME=  FREQUENCY,     SPECTRUM/REAL,   SPECTRUM/IMAG
##SYMBOL=    X,             R,               I
##VAR_TYPE=  INDEPENDENT,   DEPENDENT,       DEPENDENT
##VAR_FORM=  AFFN,          ASDF,            ASDF
##VAR_DIM=   65536,         65536,           65536
##UNITS=     HZ,            ARBITRARY UNITS, ARBITRARY UNITS
##FACTOR=    0.49542278885378, 1,            1
##FIRST=     16045.7642231865, 0,            0
##LAST=      -16421.768244346, 0,            0
##MIN=       -16421.768244346, -326801952,   0
##MAX=       16045.7642231865, 252726389,    0
$$ Real data points
##PAGE= N=1
##DATA TABLE= (X++(R..R)), XYDATA
$$ [...]
46476 -2234159 -1424839 -1343973 -2796489 -4604910 -4981097 -3617658 -1719306 -600369 -789124
46467 -789124 -1968528 -3225253 -3522796 -2261150 413121 3527650 5561999 5523953 4043418
46458 4043418 2682726 1934379 942719 -510454 -1373162 -1516045 -2655232 -5467142 -7506568
46449 -7506568 -6226109 -2747945 -90792 1294730 3246308 5759104 6496129 4624551
46441 4624551 1958281 -319228 -2901000 -5303007 -4840849 -635742 3866966 4627741
46433 4627741 1541672 -2552656 -5544449 -6762931 -5880752 -3642205 -2497938 -4001000
46425 -4001000 -6268960 -6311943 -4322595 -3299325 -4553108 -5842990 -4393294 -140835
46417 -140835 4423326 6489896 4942587 1296443 -1319897 -1068785 897841 2471804
46409 2471804 3506661 5130231 6772884 6109242 2264122 -2745968 -6282074 -7262649
46401 -7262649 -5721838 -2073851 2205295 4755699 4615855 3437485 3291387 4090835 4327934
46392 4327934 3493856 2246036 717027 -1423232 -3000235 -1420453 3876803 9093759
46384 9093759 9094584 3036779 -4269473 -7293647 -5246880 -1886093 -737580 -1858263 -3004489
46375 -3004489 -2334942 508155 4547960 7732383 8101230 5869686 3660232 3499322 4179381
46366 4179381 2989941 -271611 -2697174 -2020096 430029 1332839 -904180 -4816846
46358 -4816846 -7671846 -7700581 -4856735 -445345 3515005 5166385 4005359 1528831
46350 1528831 157564 926527 2442485 2685286 1597731 1035500 2159580 3922537 4531739
46341 4531739 3523567 1858175 734571 884526 2311783 4096515 5047195 4996943 4739235
46332 4739235 4396662 3055266 646535 -1223373 -1425818 -971073 -1117214 -1071947 619122
46323 619122 3364952 5277062 6028584 6816310 7743972 7467722 5633472 3659691 2624429
46314 2624429 2044494 1290618 849332 1666611 4127713 7600943 10029303 8722431 3315809
46305 3315809 -2654232 -5320190 -5240719 -6091461 -8869778 -10513505 -8728948 -4985683 -1649956
46296 -1649956 862538 2733810 3427717 3213572 3113098 1846464 -3644063 -12323644 -17487876
46287 -17487876 -14612289 -7691147 -3622533 -2982445 -1348939 2227801 4106535 3052796
46279 3052796 2396245 4030002 5364119 4139182 1926347 668384 -371073 -1814125
46271 -1814125 -1992391 -397068 -25959 -3008995 -6597566 -6974404 -4732718 -2849434 -1261138
46262 -1261138 2193559 6675490 8894099 8587367 8940347 10903927 11410124 8705269 5526828
46253 5526828 4720765 4970502 3624156 1099045 -697757 -2288519 -5327858 -8526926
46245 -8526926 -8688728 -5694776 -2892436 -1952402 -782142 2088285 4258000 2976382
46237 2976382 -410082 -2395263 -2246929 -1942491 -1909487 -221931 3463261 6155452 5177246
46228 5177246 1603102 -1412362 -2267518 -1497851 -97649 1082492 1160819 28915 -1255100
46219 -1255100 -2109594 -3551966 -6161756 -7996479 -6814688 -3898947 -3050482 -5473198
46211 -5473198 -8186471 -8458268 -7453674 -7774755 -9108886 -8572645 -4785454 294124 3687929
46202 3687929 4380942 3851514 4317543 6444760 8454421 7885778 4557627 1049821 -293883
46193 -293883 86737 304736 -59190 159808 1363781 2373276 2224151 1573383 1724641
46184 1724641 2845113 3602674 2468533 -580439 -3621152 -4528858 -3378633 -2371590
46176 -2371590 -3044347 -4695920 -6236552 -7913600 -9585817 -8912344 -4022317 2645020
46168 2645020 6181812 5051744 2204538 -8871 -2512210 -5630138 -6216306 -1819084
46160 -1819084 4675667 8260352 8406740 8752001 10752957 11644116 9341766 5703712 3262630
46151 3262630 1645655 -540097 -2450027 -2285746 -636012 64237 -927012 -1831004 -1169285
46142 -1169285 372815 1324863 1285502 808093 463493 708928 2005252 4278318 6446956
46133 6446956 7095069 5884618 4198053 4047957 6036217 8584597 9711884 9385677 9153751
46124 9153751 9370797 8269492 4719497 587338 -1325118 -992949 -836931 -1718102 -1376057
46115 -1376057 2192361 7258981 9684952 7295108 2044483 -2026404 -2522763 -542160
46107 -542160 951111 579404 -127873 490955 1049854 -1211920 -5450572 -6651719 -1905390
46098 -1905390 4735992 6585340 2782523 -795970 399862 3809296 4012091 381675
46090 381675 -2729729 -2735190 -2184529 -4164757 -7052894 -6540265 -1893534 2700871 3523979
46081 3523979 1631971 348601 353743 -265115 -1765942 -1458062 2418921 7561811 9930692
46072 9930692 8110475 3863771 -821420 -5349370 -9242554 -11102186 -9802263 -5941631
46064 -5941631 -1348149 2501476 5092233 6322956 6144656 4976459 4001263 4325621 5530030
46055 5530030 5571883 2962067 -1005201 -3152978 -1878303 1223145 3677579 4892829
46047 4892829 5547825 5419386 3765929 1507861 805776 1871145 2059053 -655494 -4605088
46038 -4605088 -6369662 -5150408 -3635805 -4440048 -6890072 -7870333 -5247636 22007
46030 22007 4875228 6733152 5155476 1519008 -2264454 -4690810 -5221442 -4715365 -4910095
46021 -4910095 -6492511 -7771557 -6335365 -2231194 1582108 2446097 708911 -1428534
46013 -1428534 -2829160 -4163011 -6294946 -9005879 -11166413 -11437095 -9067210 -4828475
46005 -4828475 -1007297 335435 -902301 -3394463 -6278983 -9595312 -13038626 -15496971
45997 -15496971 -16171480 -15271315 -13275841 -10440086 -7531838 -6063423 -6790813 -8489838
45989 -8489838 -9236173 -8682495 -8072040 -8033658 -7553780 -5688564 -3361920 -2426609 -3245753
45980 -3245753 -4213727 -3782517 -2126477 -515256 165281 -242489 -1545044 -3089920 -3778604
45971 -3778604 -3137635 -2079946 -1639407 -1316990 -34033 1459930 1066480 -1147962 -1887727
45962 -1887727 1371748 6671078 9769949 9263636 7415585 6248649 5224183 3367755
45954 3367755 1528705 1095194 1706656 1739622 564648 -784577 -931096 634770 3371909
45945 3371909 5969356 6933685 5483208 1956405 -2672834 -7278211 -10557126 -11388063
45937 -11388063 -9796890 -7068238 -4478256 -2454305 -1169025 -832613 -719298 761978
45929 761978 3658871 5241156 3155885 -700826 -1828083 998234 3724816 2108869
45921 2108869 -2785984 -5787871 -3559169 2032300 6168807 5684384 1623302 -1939947
45913 -1939947 -1655840 2070919 5963166 7818413 8659636 10422188 12685042 13044417 10138846
45904 10138846 4922480 -718372 -5176711 -7135294 -6046847 -3052100 -197676 1689096
45896 1689096 3284782 4685143 4477658 1746332 -2037994 -4148378 -3157033 115953
45888 115953 3507733 4965172 4031744 2466324 2473963 3811681 3822240 1019205 -2802279
45879 -2802279 -5085007 -5565671 -5284074 -4187451 -2051782 -591809 -1691027 -3885530
45871 -3885530 -3681940 -708428 1480822 664581 -980278 -770541 174966 -981547 -4161729
45862 -4161729 -6542116 -6483187 -4858769 -2953625 -1312077 -510784 -889743 -1265997 188796
45853 188796 3266810 5410446 4623100 1550696 -1635464 -3238747 -2692146 -618202 1223192
45844 1223192 1274915 83177 -258129 881822 1550368 42816 -2391908 -3070727 -1314637
45835 -1314637 1140766 2749698 3540118 3829503 3219383 1694736 619915 1456329 3860849
45826 3860849 6012533 6648373 5820530 3744742 366047 -3171249 -4020992 -478518 4952346
45817 4952346 7319284 4712915 502052 -848712 1137365 3311450 3171856 991573
45809 991573 -1742499 -4055588 -5463795 -5730603 -5125910 -4093809 -2639131 -841009 466099
45800 466099 798379 1349947 3468721 6012380 6324071 4007650 1341406 -706315 -4126440
45791 -4126440 -9895456 -14786513 -14723196 -9919836 -4116724 395588 4274807 7982732
45783 7982732 10008107 8994529 5632967 1484853 -2647946 -6305473 -8533277 -8584980
45775 -8584980 -7000185 -5344745 -5101962 -6828257 -9663472 -11449494 -10189639 -6062928
45767 -6062928 -1658874 323614 -363109 -1423727 -577428 1772081 2728046 211262 -4300621
45758 -4300621 -7385993 -7827012 -7408770 -7181125 -5254077 18660 6563266 10653546 11187092
45749 11187092 9480993 6172405 1576026 -1744462 -902341 2390563 2920710 -598799
45741 -598799 -3014495 105620 6168362 9392970 8258131 5690200 3877139 2777661
45733 2777661 2632263 3896720 4787070 2603021 -1857983 -4329946 -2535828 931427
45725 931427 2258297 683111 -2049033 -4361847 -5372230 -4327804 -1337640 2037501
45717 2037501 4152650 4723195 4184487 2447611 -753908 -4786096 -8159871 -9471801
45709 -9471801 -8206609 -5262058 -2731656 -2198127 -3015644 -3248462 -2386960 -1780333 -2081306
45700 -2081306 -1936166 -113491 2471049 4008108 4023613 3280009 2388870 1575285 981123
45691 981123 245384 -1307278 -3134882 -3303806 -1126612 1132849 820392 -1622398 -3427971
45682 -3427971 -3195292 -2059757 -1507305 -1790561 -2458149 -2834882 -1982182 196630 1777274
45673 1777274 558205 -2628939 -4140541 -1822080 2456464 5521843 6715326 7613654
45665 7613654 8943656 9514915 8140988 5268150 2224483 -432727 -3218807 -6516192
45657 -6516192 -9566536 -11059058 -10685382 -9620481 -9166985 -9315287 -9026368 -7541619 -4989982
45648 -4989982 -2227666 -658341 -1516370 -4306191 -6421495 -5586307 -2636762 -800211
45640 -800211 -2146084 -5616789 -8449232 -8576615 -5830079 -1979241 394055 161939 -1233764
45631 -1233764 -1919847 -2336657 -4203804 -7121869 -8533586 -7467053 -5977048 -5923064 -6563966
45622 -6563966 -6783615 -7545569 -9914595 -12089998 -11078626 -7009030 -3503171 -3323609 -5207069
45613 -5207069 -5725042 -3394135 -116246 1384731 970087 1131662 3351767 5636588 5198715
45604 5198715 2811053 2126849 4612847 7736509 8853895 8208997 6861092 4457319
45596 4457319 1083699 -1147524 -896962 -49302 -817008 -2223133 -2215837 -1460693 -1793284
45587 -1793284 -2445314 -1498660 -29364 -829267 -3486192 -4727831 -3561428 -2016605 -575101
45578 -575101 2744957 7760996 10858248 10100305 7949579 6999277 6438097 4911256 3619634
45569 3619634 3962080 4793637 4633352 4271648 4748673 5035107 4226522 3846450 5366292
45560 5366292 7449709 8168669 7862511 7275812 5306938 1687435 -519890 1174006 4233250
45551 4233250 4535287 2632535 2293799 4097520 5237173 5062681 5759564 7302665 6768479
45542 6768479 3745814 1765302 2658136 3722365 2619170 1195047 1732185 2645584 1041440
45533 1041440 -2690987 -5722811 -6590891 -5772683 -4001476 -2300409 -2353556 -4575596 -6729685
45524 -6729685 -6325901 -3577562 -553744 1501833 2627634 3203364 4008722 5932008 8207602
45515 8207602 8389174 5598420 2244180 828572 707709 -40391 -1316055 -2047226 -3048471
45506 -3048471 -5925796 -9895793 -12348594 -12108698 -9902919 -6408942 -2375939 110934
45498 110934 -524295 -2448385 -2144270 951568 3988228 4588808 2568284 -1670308 -7070825
45489 -7070825 -10374223 -8511498 -3257600 178854 130313 136491 2400010 4110349 2761632
45480 2761632 723728 844885 1278301 -741204 -2955516 -1274053 2986707 4833613
45472 4833613 3808888 4450383 8030445 9831924 6661076 1796227 -501307 -862475
45464 -862475 -1556882 -1402741 1267072 3276876 -233174 -8155741 -13934391 -13985469 -11179958
45455 -11179958 -9083720 -7117496 -3595705 -43686 722088 -1061993 -2704568 -3139656
45447 -3139656 -3734532 -5138116 -5664798 -3602431 224765 3165110 3571652 2309866 1423437
45438 1423437 1642892 1732785 552279 -978858 -1037449 327562 1093161 166813 -1172013
45429 -1172013 -1364437 -557793 465305 1796789 3419684 4033264 2663945 581726 -230304
45420 -230304 99953 -94214 -1103113 -1539898 -821915 50284 319110 222204 -216178 -1209113
45410 -1209113 -1776670 -381860 2479033 4413240 4558985 4682568 5894339 6667006 5677140
45401 5677140 4324201 4234378 4130088 1833162 -1855930 -4054697 -3857420 -2719738 -1106565
45392 -1106565 2272967 7367401 11513434 12391095 10466866 7554558 4591379 1906413
45384 1906413 179528 -344090 -755581 -2271946 -4462180 -5592428 -4577253 -2097397
45376 -2097397 -57137 -197420 -2707184 -5787485 -7020459 -5548043 -2626336 -24326
45368 -24326 1477214 1910583 1410961 273191 -903802 -1774261 -2622524 -3738854 -4734677
45359 -4734677 -4927201 -4257767 -3483405 -3360996 -3628901 -3003614 -812178 1288887 512501
45350 512501 -3103882 -5276589 -2188261 3917081 6602137 3200265 -1834231 -2903083
45342 -2903083 -18129 2744930 3576900 4474600 7002728 9638403 9993245 7497903 3083093
45333 3083093 -2039288 -6373745 -8456684 -8340975 -7734285 -7638321 -6809834 -3776213 337144
45324 337144 2492034 1228611 -1729762 -3707852 -4035244 -4162345 -5320039 -6904417 -7389742
45315 -7389742 -6354154 -5086463 -5212492 -7123102 -9836553 -11943962 -12420505 -11038199
45307 -11038199 -8669264 -7032601 -7398625 -9275805 -10759307 -10425662 -8681938 -7065627
45299 -7065627 -6328213 -5449492 -2834570 1333979 4352667 3477384 -703128 -4381468 -4650062
45290 -4650062 -2593647 -1370600 -2236273 -4042822 -5973832 -8466249 -11091527 -11750687
45282 -11750687 -9191464 -4795572 -589702 3123583 6579059 8326627 6608327 2712075
45274 2712075 628656 2687959 7101194 10510379 11519356 10756487 8843047 6004555
45266 6004555 3229721 2060333 2655937 3026754 1043072 -2978531 -6290622 -6478194 -3863261
45257 -3863261 -841355 873527 1582823 2071148 1853219 30329 -2666705 -4214498 -3901884
45248 -3901884 -3244794 -3628134 -4169526 -3010581 -57811 2751773 3712339 2908858 1579205
45239 1579205 803455 994327 2034242 3559872 5198056 6445371 6411227 4461598 1573013
45230 1573013 120146 1291204 3391434 3978496 3093683 2697786 3223407 2897754 952455
45221 952455 -743958 -508126 586541 735132 565564 2041485 4928847 6730574 6172838
45212 6172838 4648877 3769591 3438885 3222136 3849540 5891596 8065848 8501609 7172977
45203 7172977 5547869 4053444 1626216 -1755734 -3734262 -2153467 1774038 4469179
45195 4469179 4138597 2461375 1757117 2102571 2401481 2802805 3948844 4616750 2846407
45186 2846407 -346242 -1247293 1345008 3835694 2774259 -274707 -1633652 -1393187
45178 -1393187 -2620359 -5560404 -6956535 -5604753 -4284705 -4527577 -3494384 1074002
45170 1074002 6073039 7052424 4967644 4697935 7743614 10716750 11240043 11031859 11724136
45161 11724136 11488324 8548374 5385427 5989202 9964314 12539470 10520369 5749668
45153 5749668 2103950 1156466 1884166 3023884 4052018 4542259 4213355 3679325 3886920
45144 3886920 4464782 3779746 1390302 -500203 665222 4337938 7053328 6370071 3506297
45135 3506297 1501554 1723664 2997446 3435469 2165010 -240314 -2054300 -1553827 993144
45126 993144 2767881 1122944 -3075537 -6080669 -5535328 -2910427 -1172506 -1239414 -1743209
45117 -1743209 -1491172 -913007 -1218768 -2999568 -5650925 -7565841 -7038646 -3766179 380026
45108 380026 2710785 2220467 406700 -665406 -706038 -1053204 -2377698 -3465446 -2875237
45099 -2875237 -1189080 -499832 -1673724 -3365397 -4256120 -4941305 -6368974 -7459278 -6237407
45090 -6237407 -3093982 -750536 -361808 390120 3985709 9284803 12795409 12966629 11419799
45081 11419799 10125738 9132063 7466931 4833103 1619077 -1774047 -4714821 -6139803
45073 -6139803 -5660613 -4682006 -5318618 -7784590 -9606151 -8253255 -4366773 -1442791 -1929688
45064 -1929688 -4389226 -5310604 -3245599 -40207 1899569 2203705 1967227 1841288 1645810
45055 1645810 1135220 220330 -1086352 -2228009 -2213319 -959332 99533 -437348 -2491313
45046 -2491313 -5407602 -9094384 -12797057 -13975922 -10743259 -4898044 -72675 2900687
45038 2900687 5972162 9184407 9626778 6444257 3400631 3902540 6245199 6940661 6476510
45029 6476510 7820932 10557189 10993473 8106669 5107130 4076497 2891233 -620388
45021 -620388 -4577565 -5651592 -3822594 -2143781 -2816789 -5172638 -6671863 -4946195
45013 -4946195 -206229 3688518 2747735 -1444048 -2391001 2867785 9055199 9722398 6239582
45004 6239582 4988673 7250841 7768996 3716893 -764978 -1229778 746320 1269151 439545
44995 439545 825766 2001082 1060031 -2229932 -4676563 -4176022 -1941049 97383 1475202
44986 1475202 2288103 2548667 3326284 6445934 11796287 16343700 17011732 13684484 8651449
44977 8651449 4114688 1071400 -371578 -837440 -1463020 -2805428 -3921039 -3123504 243041
44968 243041 5013797 9069794 10792239 9892494 7288694 4442868 2727541 2964602 4962991
44959 4962991 7366101 8447350 7413620 4761002 1462767 -1508955 -2916894 -1889913
44951 -1889913 413016 1076006 -1203828 -3909075 -3664840 -966645 173808 -2410033
44943 -2410033 -6096842 -6911963 -4308233 -1048087 680058 1241098 1784340 2174243 1595727
44934 1595727 508293 756229 3269587 6341658 7247267 5636277 4179455 5195449
44926 5195449 7686220 8899647 8071494 6985622 7006856 7293379 6421550 4448043 2662024
44917 2662024 2155308 3089608 4541114 4753742 2573303 -863112 -2838710 -2082201 -258591
44908 -258591 126500 -1564943 -4122768 -6236141 -7231521 -6760292 -4959562 -2864799 -1882273
44899 -1882273 -2677631 -4704642 -6544823 -6670395 -4561389 -1430910 759086 1381130 1649331
44890 1649331 2722129 4079559 4388232 3376577 2177567 2109606 3486461 5316904 6110298
44881 6110298 5545146 5236319 6850653 9460046 10173352 7779683 4201837 1578658 -442705
44872 -442705 -3260085 -6658346 -9287731 -10751077 -11417288 -10885648 -8539861 -5324825 -3186562
44863 -3186562 -2703680 -2722210 -2374649 -2094558 -2484368 -3389115 -4328104 -4916203 -4768793 -3776331
44853 -3776331 -2352945 -682720 1786577 5027039 7192174 6254070 2718118 -843682
44845 -843682 -2993907 -4586951 -6508045 -7927363 -7561981 -5498520 -2951001 -917440
44837 -917440 407089 1424733 2566748 3475905 3030663 1008590 -772351 -395105 1286705
44828 1286705 1473321 -616461 -2344418 -914636 3369260 7825776 10098447 9446974
44820 9446974 6671398 3676879 2077877 1479535 187632 -1854023 -2425564 -400070
44812 -400070 1854452 1189475 -2195495 -5165478 -5644591 -4415992 -3133343 -2317377 -1694318
44803 -1694318 -1139483 -557781 446911 2165311 4264826 5876761 6126176 4807344 2832517
44794 2832517 1686461 1944303 2550364 2057107 371375 -1273727 -1949720 -2020960 -2385747
44785 -2385747 -3194374 -3699034 -3364030 -2799242 -3123271 -4325582 -4948580 -3968099 -2359660
44776 -2359660 -1832405 -2454506 -2762811 -1955710 -496384 1374647 3869715 5959416 5365307
44767 5365307 1322522 -4011835 -7825955 -9015538 -7649704 -4114809 -188892 1113715
44759 1113715 -938545 -2847033 -998426 3161135 4691678 1430346 -3950176 -7991681
44751 -7991681 -9707369 -9350488 -6834621 -2854534 379133 1115508 -352806 -3006335
44743 -3006335 -6573343 -10530253 -12990351 -12210291 -8640838 -4360676 -1015100 817670
44735 817670 1072333 327893 27161 1175243 2777672 2652661 67896 -3177460 -4639841
44726 -4639841 -3738787 -2048157 -1333806 -1710938 -1925783 -1248413 -529059 -1041756 -2676595
44717 -2676595 -3844573 -3044677 -167350 3368046 5287576 3997785 530071 -1558252
44709 -1558252 320480 4490741 6665872 4913197 1442497 -532654 282170 3707116
44701 3707116 8755651 12580085 11485513 5507194 101285 295567 4286837 6027179
44693 6027179 3515389 814647 1484924 3903790 4805339 4136957 3683053 3249393 1522846
44684 1522846 -604965 -1091284 -781867 -2876037 -7628713 -10775761 -8967447 -4325039
44676 -4325039 -1283214 -640550 422885 3260105 5898196 6674807 6817175 7896247 8895073
44667 8895073 7999625 6019564 5506293 6775908 7222418 5065801 1739359 -401751 -1030755
44658 -1030755 -1197555 -1182400 -799783 -925067 -2584990 -4695226 -4777146 -2390114 -89223
44649 -89223 -147665 -1791227 -2726563 -2149433 -930792 184272 988962 984041 -275516 -2142481
44639 -2142481 -3506024 -4332237 -5321374 -6289271 -6464500 -6309675 -7148497 -8629084 -8545114
44630 -8545114 -5969094 -2653822 -282002 1631214 3596108 4110507 2156168 -19187
44622 -19187 319223 1900031 1243669 -1325766 -1357171 3086743 8026691 8783595 5919270
44613 5919270 3667301 4443401 7326475 10483249 12536956 12365761 9877018 6655307
44605 6655307 4157560 1887650 -1009675 -3312153 -3049291 -669053 1405938 2125445
44597 2125445 2533657 3342224 4066139 4520704 4737657 3314080 -1278472 -7044438 -9170254
44588 -9170254 -5989793 -1670557 -856698 -2821705 -3559315 -1995657 -805310 -1513377 -2053974
44579 -2053974 -3155 4108724 7887484 9813103 9640076 7417463 3816194 883214
44571 883214 692291 2855724 4581484 3879536 1785319 411481 -422218 -2869521 -7249557
44562 -7249557 -10478369 -9541779 -5320627 -1427047 38451 -1946 222405 1460237 3597390
44553 3597390 5888907 6898767 5878433 4340086 4438886 5548702 4554804 205173 -4970549
44544 -4970549 -8066880 -8979894 -8866398 -7641187 -4998957 -2225464 -775898 -235126 318212
44535 318212 161452 -1691542 -4121918 -5293832 -5402579 -5529819 -4862283 -2225512 264435
44526 264435 -1152260 -6237565 -10371439 -10735693 -9357808 -8518464 -6809990 -2488978 2145355
44517 2145355 3296088 1074278 -1019011 -1287754 -1355330 -2562265 -3738705 -3196730 -789199
44508 -789199 2722724 6643288 10034312 11916591 12419569 12482323 11970822 9509551 4821495
44499 4821495 -141618 -3222897 -3985277 -2837351 232800 4620669 8007538 8254933
44491 8254933 6036707 3905257 2858848 1500515 -1202347 -3994457 -4881432 -3400724
44483 -3400724 -632048 2009448 3262977 2430809 392389 -609552 608186 2515622
44475 2515622 2741633 983630 -1247603 -3137768 -4994764 -6356220 -5844031 -3565542
44467 -3565542 -1823321 -2349237 -4249676 -5819762 -6975469 -8368369 -9307267 -8614923 -7048026
44458 -7048026 -6778154 -8292897 -9536882 -8612604 -5957554 -3276875 -1548119 -848442 -1137931
44449 -1137931 -2154861 -2973889 -2561504 -778273 1522687 3246903 3714610 2915074 1511919
44440 1511919 525402 751382 2329594 4656799 6598331 7144484 6310153 5234135 4997592
44431 4997592 5501893 5794925 5079661 2960534 -621808 -4779415 -7546639 -7636586 -6184539
44422 -6184539 -5532197 -6346758 -7225782 -7109794 -6510740 -6076272 -5616648 -5175092 -5411984
44413 -5411984 -6046666 -5592352 -3877619 -3194177 -5208050 -8090683 -8888174 -7838937 -7823346
44404 -7823346 -9748392 -11089556 -9618253 -6342540 -3604137 -1979176 -540160 936982
44396 936982 1621397 1017804 -599510 -3035595 -6429013 -10487918 -14093680 -15898166 -15183917
44387 -15183917 -12349738 -8837859 -6309497 -5427539 -5449379 -5160554 -3978070 -1992244 554538
44378 554538 3217476 4979140 4678635 2191461 -998955 -2709206 -1780443 903145 3167032
44369 3167032 3586578 2786924 2423909 3005539 3416481 2783078 1915359 2144107 3311500
44360 3311500 3952935 3347526 2411959 2376420 3352182 4505049 5020111 4586638 3515705
44351 3515705 2761342 3298675 5004491 6542241 6808391 6139624 5616353 5530678 5182058
44342 5182058 4054803 2587064 1676235 1748157 2294312 2093981 131970 -3238225 -6165161
44333 -6165161 -6871783 -5438416 -3632751 -2919735 -3060523 -2867842 -2013551 -1649120 -3008336
44324 -3008336 -5487212 -6656455 -4759099 -882513 2293247 3782838 4935521 6571072
44316 6571072 7527630 7320958 8083137 11278414 13965539 11910847 6219270 2985893 5257771
44307 5257771 8991456 9146929 6530879 5271056 5814023 4689978 600585 -3375320
44299 -3375320 -4424139 -3620954 -3522640 -4565070 -5572500 -6176035 -6869765 -7525262 -7450876
44290 -7450876 -6641866 -5839613 -5424865 -5037172 -4301053 -3353555 -2481548 -1529297 4476
44281 4476 2108747 3731891 3681285 2094021 257738 -1216163 -2946546 -4995178 -5969686
44272 -5969686 -5150850 -4188634 -4785684 -5562939 -3547471 1374190 5729628 6583892 4603135
44263 4603135 2580833 2499185 4406431 6605690 6537129 3025764 -1896894 -4820355 -4777766
44254 -4777766 -3619742 -2633334 -1154973 930767 1952602 1051333 -170432 -143973 427880
44245 427880 435816 616680 2053255 3965474 4948906 5107129 5034308 3956223 1041616
44236 1041616 -2366548 -3972919 -3413834 -2128329 -999979 132906 1295257 2468115
44228 2468115 4243460 6718664 8460190 8291749 7330158 7421495 8379311 8710805 8165441
44219 8165441 7380073 5964225 3544986 1923421 3137349 5682501 5891664 3274660
44211 3274660 1252181 1954597 3541387 3848435 3562692 3956198 4122906 2763036 841797
44202 841797 213504 887754 1648030 2332515 3579604 5005375 5360894 4182794 2110196
44193 2110196 39638 -1076535 -354255 1894244 3709067 3349344 1353299 -97013
44185 -97013 473990 2752178 5320448 6657331 5975527 3927311 2251162 2166802 3316658
44176 3316658 4435362 4477978 2984921 337197 -1864508 -1640096 1383317 5373001 8103254
44167 8103254 8727602 7554335 5139667 2193742 -513864 -2787478 -4859713 -6335883
44159 -6335883 -6320297 -5014756 -4025044 -4414455 -5426274 -5684930 -4688406 -2764526 -788803
44150 -788803 -233262 -1806515 -3464573 -1786531 3507315 8293839 8797065 5892638 2992556
44141 2992556 1377864 -132161 -2175543 -4095644 -5647189 -7208843 -8535453 -9157564
44133 -9157564 -9671490 -10754022 -11193267 -8917244 -4103448 423047 2167375 1175136 -619878
44124 -619878 -1136866 377609 2393900 2171654 -853379 -3472017 -2131930 2709095 7422241
44115 7422241 9587491 9389009 7440885 4060958 710038 -542222 522041 2404728
44107 2404728 4409789 6568881 7341825 4816936 753611 -262642 2878566 5875616
44099 5875616 5353118 3609694 4202160 6066183 5964924 4412095 4438986 5517459 3663541
44090 3663541 -1964840 -7014032 -7973209 -6628418 -6379085 -7102487 -6512922 -4685286 -4031158
44081 -4031158 -5384038 -6883276 -7005078 -6557120 -6940363 -7961666 -8302460 -7188373 -4731076
44072 -4731076 -1344924 2204600 4577869 4753232 3288873 2043594 2452477 4450163
44064 4450163 6968884 8787911 8869605 6880212 3985488 2412859 3432368 6105590
44056 6105590 8491678 9464051 8784393 6423015 3051717 397119 -559489 -1227477 -3311150
44047 -3311150 -5402549 -4262976 61578 3352799 2952705 1576492 2813658 5153569
44039 5153569 4328161 630900 -545411 3639521 9127079 10384817 7352298 4254162
44031 4254162 3407249 3364677 2399476 714610 -973095 -2418543 -2801154 -972172 2287334
44022 2287334 4207983 3438129 1864655 1776681 2893612 3835378 4865579 6822544 8466043
44013 8466043 7731971 5304040 4053349 4619345 4435020 2125132 104116 1010731 3752715
44004 3752715 5344212 5151283 4917111 5520616 6117739 6112251 5809050 5163486 3721379
43995 3721379 1773554 -105765 -2467862 -5997677 -9215790 -9577385 -7472317 -6724392
43987 -6724392 -9624890 -13227571 -12529291 -6519125 679006 4454243 4091705 2409071
43979 2409071 2188157 3618701 4836734 4222539 1789298 -1342573 -3997452 -5262976
43971 -5262976 -4755601 -3337961 -2762520 -3618542 -4414881 -3861747 -3039714 -3472492 -3915195
43962 -3915195 -1718878 2639510 5312794 4265302 2033495 1769599 2849253 2561688
43954 2561688 444223 -1619912 -2718598 -3749878 -4996319 -5018665 -2622844 1252449
43946 1252449 4135166 4038166 1074314 -2298936 -3049191 -483866 2802964 3616888 1451751
43937 1451751 -1653172 -4003452 -5804715 -7886209 -9966418 -10642161 -8763041 -4725892
43929 -4725892 -509373 1882058 2216020 1913095 2123926 2720753 3347526 4247177 5372385
43920 5372385 5871560 5502268 5508556 6770825 7926217 6957281 4293236 2707318 3966486
43911 3966486 6819347 8656832 8288075 6643035 5240721 4500436 3814058 3229393 4156789
43902 4156789 7267218 10329014 10276372 7682368 6640330 8994231 11225508 9221148
43894 9221148 4014902 -33392 -1213236 -1290107 -1213922 258240 3332591 5949303 6948955
43885 6948955 7889589 10287001 12918142 13220547 10104047 4515941 -1523978 -5775460
43877 -5775460 -6959352 -5795399 -3967927 -2084046 -48951 900015 -1031022 -4954465
43869 -4954465 -7414403 -6843306 -5586424 -6073031 -7243745 -6772724 -5014274 -4352463 -5662115
43860 -5662115 -7562793 -8559919 -8135854 -6318214 -3899971 -2644367 -3660158 -5868955
43852 -5868955 -7412244 -8062634 -8786252 -9472682 -8877846 -6681018 -3932898 -1384973 1049702
43843 1049702 2872282 2544886 -717209 -5460533 -8939144 -9353257 -7208389 -4862365
43835 -4862365 -4451146 -5657798 -5870001 -3265905 727631 3091012 2967133 2409735 3331842
43826 3331842 5122558 5875660 4896678 3127718 1724737 1128386 1347148 2347637 3883174
43817 3883174 5305431 5970182 5911125 5853329 6334437 7028414 7282981 7056513 6736273 6301734
43807 6301734 5602379 5308826 6158565 6891929 4662851 -1199442 -7076815 -8491450 -5202407
43798 -5202407 -1336861 -669892 -3251355 -6576956 -8328011 -7436912 -3987156 760407
43790 760407 4800599 6642041 6049846 3588872 195069 -2623867 -3255746 -1521631 808499
43781 808499 1900608 1960043 2608428 4337351 5713440 5575335 5019486 5989101 8135046
43772 8135046 8562415 5416104 638435 -2094617 -1640502 -162993 179865 -342098 -287904
43763 -287904 912752 3030995 5721379 7958763 8050428 5747837 3430754 3441584 4824668
43754 4824668 4637637 2291599 460126 1229157 3313102 4155686 3293719 2196577 1696033
43745 1696033 1258586 701065 1143220 3553415 7024471 9350334 9375805 8211728 7724861
43736 7724861 8165715 7986381 5960027 2533884 -1309483 -5445507 -9770750 -12679078
43728 -12679078 -12002492 -7740796 -2685016 249663 647755 233194 689212 2416104 4792108
43719 4792108 6729168 7033574 5006792 1144342 -2942616 -5643289 -6496501 -6162444 -5341446
43710 -5341446 -4113686 -2570066 -1570832 -2064967 -3671963 -4759134 -4277835 -2997325 -2581198
43701 -2581198 -3767771 -5583745 -6060225 -3968894 -448222 1581705 756045 -488896
43693 -488896 1177928 5010340 6620087 3977976 174333 -1272650 -997010 -1272079 -1587276
43684 -1587276 -224874 1631412 1594566 1064416 3999264 10381190 15249680 15462097 13446077
43675 13446077 12432642 11799288 9873972 8061465 8488145 9607017 8053577 4017022
43667 4017022 1231163 1691435 3369024 3512217 1678292 -1095745 -3932662 -6092965
43659 -6092965 -7079283 -7620957 -9074653 -11002816 -10767058 -6675433 -534840 4082649 5426863
43650 5426863 4389793 2478168 480396 -914892 -741020 1164113 3486408 4758630
43642 4758630 5021681 5381681 6193317 6712365 6586719 6506934 6908688 7172512 6905931 6868138
43632 6868138 7355272 6666610 3043766 -2199116 -5411575 -4672589 -1452203 2024588 5143171
43623 5143171 7853968 9155506 8192698 5865093 3914682 2965634 2556624 2498506 2905400
43614 2905400 3102778 1769069 -1463376 -5194335 -7481660 -7777524 -7409160 -7954975 -9302118
43605 -9302118 -9948275 -9353357 -8829113 -9219630 -8959345 -6179147 -1964973 621539 468697
43596 468697 -881993 -2304276 -4151255 -5835140 -5335241 -2484021 -216156 -758423 -2584507
43587 -2584507 -2980537 -1883021 -1270016 -2182630 -4112268 -6038465 -6560011 -4525833 -1116849
43578 -1116849 403193 -1218254 -3175971 -2635554 -882145 -1027523 -3365854 -5797302
43570 -5797302 -7357843 -8304301 -7918777 -5463001 -2547361 -1461526 -1711532 -1075920 611264
43561 611264 1681739 1806077 1792444 1140062 -683343 -1504319 820925 3610240 2197244
43552 2197244 -2380010 -3905702 -237069 3477951 2953102 824629 1286070 3269973
43544 3269973 3213086 1258610 242991 711834 1065358 1123361 1797779 2348734 1380352
43535 1380352 -281864 -758167 -331684 -592245 -1180036 -401887 1392531 2019057 1004845
43526 1004845 359009 1629897 4254814 6892076 8624891 8951777 8171205 7552441 7836953
43517 7836953 8184595 7752445 7039826 6149682 3523053 -1206399 -4793470 -3985911 -491741
43508 -491741 1034474 -644150 -2523338 -2633486 -2274029 -2492464 -2214585 -1270056 -1856263
43499 -1856263 -4880095 -7406515 -6100375 -1577416 2704931 4732214 5312399 5910632
43491 5910632 6695621 6738374 5487971 3936992 3892895 5485823 6322916 4637289 2383357
43482 2383357 2834727 5536392 6604886 4362493 1508450 595639 460298 -876635 -2310995
43473 -2310995 -1261577 2311947 5844488 7249904 6252515 3478519 -58666 -3102112
43465 -3102112 -5068276 -6270531 -6479792 -4534164 -558171 2807149 3048048 744058
43457 744058 -1546666 -2397715 -2024587 -747756 1167482 2696533 2809747 1786496 493055
43448 493055 -1139000 -3561276 -6049282 -7140606 -6402037 -4693389 -3095439 -2480387 -3346124
43439 -3346124 -4901966 -5098253 -2809858 727111 3667299 5578391 6496489 5577029 2635279
43430 2635279 -369501 -1676395 -2298311 -3746302 -4579864 -2542698 798954 1530723 -539277
43421 -539277 -1399188 834110 3207093 3108913 2256277 3069954 4340746 3511566 872994
43412 872994 -1509863 -3098655 -4133348 -3398363 -161118 2838625 1966738 -2072322 -4894418
43403 -4894418 -4430266 -3137299 -3668041 -5255574 -5595685 -4048233 -1597507 673372 1777376
43394 1777376 872471 -1542230 -3338358 -2766651 -312160 2002979 2644697 1645890 374564
43385 374564 404158 1876666 3017540 2174116 56196 -1402774 -2135568 -3903191 -6875920
43376 -6875920 -8456181 -6577228 -2471350 929943 1766662 -529279 -5671164 -11426355
43368 -11426355 -13953541 -11620527 -7372598 -5047097 -4382133 -2303281 1539928 3663593
43360 3663593 1544705 -3115126 -6756394 -7529108 -5732000 -2719854 -463547 -511561 -2146795
43351 -2146795 -2790427 -1181477 1089266 2078394 2078219 2504096 3443683 3765554 2887933 1188785
43341 1188785 -723307 -2099528 -2062724 -522534 1508383 3270321 5070008 6947736
43333 6947736 7754517 6855695 5675857 5924162 7043137 7124768 5840982 4743633 4962132
43324 4962132 6254954 8120652 10161820 11405412 10915986 9204922 7599841 6255190
43316 6255190 4315873 1945448 394040 -25520 -102611 332716 2423445 5591218 7135138
43307 7135138 5793962 3733101 3375668 3927024 2992477 441037 -1497150 -1438081 -200867
43298 -200867 933639 1703453 2426098 3249987 4056187 4396824 3697930 2258285 1646609
43289 1646609 3072841 5577320 6907943 6149264 4469700 3250240 2590602 2000496 1544948
43280 1544948 1531799 1574353 863530 -486497 -1000136 567655 3246371 4388842 2908240
43271 2908240 1220278 2572254 6635082 9435457 8093311 3989215 424530 -1158289
43263 -1158289 -1246406 -140528 2056649 4067981 4357118 3506232 3755484 5654886 6698697
43254 6698697 4121531 -1813362 -7880235 -10612871 -8724481 -3687701 1483133 4426629
43246 4426629 4922355 4353602 4045829 4466249 5544785 6921096 7929229 8009060 7172603
43237 7172603 5714845 3766363 1547542 -468208 -2204007 -4047465 -5487403 -4700920
43229 -4700920 -899969 3687473 5937131 5497516 4497883 3996365 3125467 1958801 2446550
43220 2446550 5216442 7744523 7643986 6175141 6268358 7976602 8260044 5277600 950621
43211 950621 -1285982 -11124 3436418 6698517 8113231 7281684 4859548 2031552
43203 2031552 -69941 -755673 92402 2069620 4409091 6176753 6503692 5054064 2584465
43194 2584465 752069 798820 2352298 3813238 3831422 2148255 -588873 -3134968 -4011546
43185 -4011546 -2552675 141161 1952388 1763719 337927 -889891 -1360545 -1493931 -1619172
43176 -1619172 -1168836 852185 4378914 7564749 8442689 7377805 6571146 6674224 5679163
43167 5679163 2409821 -821378 -1258747 137898 482375 -129523 935886 3706928 4860184
43158 4860184 3018488 1085186 1624060 3252281 3828904 4143297 5509198 6156754 3552590
43149 3552590 -974760 -3158591 -810554 4517303 10101966 13815145 14081195 10836903
43141 10836903 6485668 3762781 2801592 2060075 1375815 1766077 2776800 2725186 1565805
43132 1565805 1058425 1930157 3144466 4144466 5536286 7250348 8201747 8116035 7668050
43123 7668050 6680952 4388244 1525149 -377904 -1912626 -5029561 -8874546 -9800045
43115 -9800045 -6824566 -3722518 -3667604 -4880041 -4186500 -2079294 -844352 210249 3552576
43106 3552576 8308928 10444306 8496977 5747704 5533223 7045914 7330045 5487561
43098 5487561 3083201 1578472 1235663 2067518 4031014 5960336 5816515 3085195 148678
43089 148678 -149054 1814791 2796125 1211256 -527727 376962 2867923 3839163 3136417
43080 3136417 3576039 6008018 7778537 7090931 5653859 5245511 4631433 2380171 215655
43071 215655 442870 1819561 1391416 -624014 -1219699 579728 2561419 3003041 2464146
43062 2464146 1697965 801086 864469 3269899 6441258 6601189 3379232 1501100 4398044
43053 4398044 8708134 8406744 2965001 -1998395 -1840151 2303203 6072096 6620204 3984994
43044 3984994 -72006 -3131431 -3284669 -741539 2080740 2940865 1995395 1083431 1171233
43035 1171233 1272941 -4611 -2312095 -3333316 -961222 4168865 8665666 9527298
43027 9527298 7271477 5119390 4811190 4360454 1071555 -3992244 -6513128 -4343099
43019 -4343099 -599502 192329 -2062303 -3293133 -1350527 696818 -1125587 -5740548
43011 -5740548 -7826330 -4413000 1577334 5208655 5193773 4151578 4337707 5332514 6041546
43002 6041546 6757515 7915637 8326359 6748506 4707306 5349086 8897938 11423171 9638554
42993 9638554 5349457 3053180 4008774 5079443 3327167 -660631 -4536178 -6968314
42985 -6968314 -7520501 -5806217 -2580073 -317126 -673280 -2064726 -1676684 548480 2001890
42976 2001890 1580964 1562780 4179726 7865394 8745923 5553646 1400505 111115 2043160
42967 2043160 4768559 7052832 9909410 13198151 13729946 9107231 2072925 -2001495
42959 -2001495 -1732274 -778451 -1907274 -3375734 -2669472 -657511 434830 711161 1338329
42950 1338329 1463215 -358495 -2811536 -3158750 -1357749 135124 212427 -219805 -999677
42941 -999677 -2770083 -4261500 -3106883 -51473 1173746 -555541 -1650965 825836
42933 825836 4703003 6101680 4957459 4233499 5070262 5711815 4876109 3686712 3779298
42924 3779298 4974250 5533593 4333740 2464978 2279493 4423847 6548130 6169546 4081704
42915 4081704 3051134 3759981 4591656 5051162 6024100 6359061 3239215 -2620290 -6211238
42906 -6211238 -5033307 -2826343 -3436889 -4755330 -3006158 130254 92030 -2753354 -3748755
42897 -3748755 -1966620 -1824828 -5761254 -10366175 -11636795 -9929555 -7568953 -5133514
42889 -5133514 -2641253 -1552257 -2808160 -4708638 -4983847 -3514927 -1274954 1726775
42881 1726775 5509454 8633349 9778144 9868280 10739313 12300126 12637194 10618862 7213136
42872 7213136 4434766 3643808 4459957 5025635 4019035 2417885 2134814 3086652 3485132
42863 3485132 3110423 3741719 5546329 5902601 3499671 892560 528368 617135 -1782418
42854 -1782418 -5220594 -5302508 -1288976 2542267 2902148 1688047 2592024 5779174 8080302
42845 8080302 7547905 5897284 6120509 8603014 10424711 8771218 4448698 935924
42837 935924 82870 463055 524698 1120112 3157040 4752710 3603132 1202105 1499307
42828 1499307 5308114 8969294 9266414 7201246 5892591 6781360 9028104 10970150
42820 10970150 11089982 8956884 6103709 4666138 4612044 3967892 2248100 1352791 2028640
42811 2028640 2089915 154012 -1237062 905225 4981195 6455150 3852033 26398
42803 26398 -2344668 -3412785 -3890300 -3157279 -853774 1942203 4419846 6944748 9013341
42794 9013341 8420678 4331840 -484022 -2630786 -2114993 -1263521 -740661 626855 2489821
42785 2489821 2516534 -20883 -2760863 -3538768 -3001376 -2453368 -1175591 1772071 4391176
42776 4391176 3292939 -1589677 -6288530 -7506397 -6166649 -5296858 -5975195 -6885322 -7006241
42767 -7006241 -7033143 -8027298 -9741535 -10730932 -9763114 -6957861 -3693309 -1398005 -426051
42758 -426051 -234658 -392560 -777075 -884435 -15621 1416002 1803811 446800 -1029118
42749 -1029118 -408427 2416592 5536208 7510006 8732576 10481932 13489419 17134656
42741 17134656 19103097 16518300 9179995 1527123 -825194 2669951 6452987 5173270
42733 5173270 -464646 -5483199 -6738369 -5261348 -3476597 -2555056 -2598964 -3281844 -3563938
42724 -3563938 -2327870 -132897 903408 -167288 -1647404 -1497981 -163106 248598
42716 248598 -956265 -2266819 -2193102 -946473 364009 1054765 924375 77949 -532013
42707 -532013 661548 3878688 6808696 6845560 4513631 3148369 4578357 6548433 5715334
42698 5715334 2264315 -256514 380678 2350565 2449752 226594 -1704334 -878668 2524302
42689 2524302 6199691 7922397 7247638 5544033 4376855 3764796 2513808 507387
42681 507387 -287207 1933290 6145556 9286031 9484501 7427860 4781873 2671811 1753380
42672 1753380 2151033 2725293 1775040 -715475 -2665194 -2540643 -1263354 -545477 -576733
42663 -576733 -680063 -1098834 -2318185 -3307591 -2467233 -209945 1240899 788515 -446272
42654 -446272 -1149369 -1179730 -519451 1247150 3505921 4351213 3047354 1503876 1923327
42645 1923327 3902557 5213522 4743762 3349346 2347965 2439458 3697957 5428450 6363227
42636 6363227 6077226 5762265 6447076 7029222 5611765 2494488 123090 -10822 1252164
42627 1252164 2750850 4611926 6981392 8592019 7919646 5139347 1944777 -209264
42619 -209264 -962707 -478625 1229844 4215281 7930588 10766997 10857484 7975110 4165207
42610 4165207 1590097 248067 -925279 -1349423 628238 4362253 6676739 6082903
42602 6082903 4912050 5546732 6664954 5765482 3919152 4748890 8942047 12927355 13776420
42593 13776420 12814442 12965718 14542100 15600800 15281307 14610965 14198890 13055481 10363228
42584 10363228 7183756 5350457 5184907 5401975 5245542 5537201 7001879 8574691 8610563
42575 8610563 7275193 6253000 6176652 6012898 5315601 5273288 6668639 8491798 9747715
42566 9747715 10969142 12398382 12343322 9482653 5519481 3098190 2048730 377883
42558 377883 -1818060 -2670405 -2479061 -3596745 -5742824 -5342481 -1323183 1983157 590599
42549 590599 -3079824 -3266807 1484753 7047606 9408921 8580493 6834898 5733218 5519666
42540 5519666 5584515 4886467 3085641 1366411 1064528 1819191 2413355 2858777 3822868
42531 3822868 4488465 3403489 1558323 1975150 5349391 8479089 8473837 6583625 6064687
42522 6064687 7750252 9798647 10838259 11071223 10533147 8520078 5334195 2911245
42514 2911245 2625254 3370407 2915095 820465 -965159 -539238 1676365 3536480 3545867
42505 3545867 1902063 -543524 -3148682 -4882999 -4143806 -449696 4273044 7419463
42497 7419463 8413564 8415129 7803815 5905098 3323203 2230532 3242659 3915167 2000882
42488 2000882 -1140006 -2258945 -559249 1554576 1805643 551891 -26938 1880210
42480 1880210 6103514 10009384 10160821 5882628 782870 -830614 1278547 3772590
42472 3772590 4517533 4400012 4213869 2719432 -658773 -3477813 -2826244 943974 4857860
42463 4857860 6792294 6746973 5695158 5025846 6264649 9196923 10753792 8097502 2838273
42454 2838273 -123580 1516484 4790176 5503052 3162352 730134 843151 3449287
42446 3449287 6151638 5915485 1537382 -4469281 -7447002 -5254037 -532171 2730392
42438 2730392 3758422 4588633 6194759 7259213 6621863 4864231 3124606 2050121
42430 2050121 2292547 4266359 6699032 7096086 4744176 1906664 843812 940478 353402
42421 353402 -598828 109088 2617107 4313362 3265377 808674 -432895 75526 799341
42412 799341 911819 1500715 3880102 7852324 12017185 14923817 15500130 13300644 9227102
42403 9227102 5435256 3443846 2473568 659689 -2072064 -3486937 -1848492 1753174
42395 1753174 4673684 5610457 5265156 4560774 3410817 1482008 -656226 -1688368 -728527
42386 -728527 1720896 3863369 3890998 1562884 -1545940 -3531319 -3592005 -1860073 1316797
42377 1316797 5020007 7289740 6454444 3200389 325447 -12387 1770431 3640353
42369 3640353 4113261 3201195 1883804 1100713 1007188 1123458 1414808 2782988 5706295
42360 5706295 8751479 9660242 7978616 5415355 3460113 2089713 1272449 2025003 4696346
42351 4696346 7402869 7818745 6091799 4621931 5086895 6810692 8047783 7811480 6173146
42342 6173146 3636657 902510 -954777 -760216 1639835 4394129 4589234 1094646
42334 1094646 -3863580 -6953900 -7234946 -6176948 -4689898 -2249322 751711 2184055
42326 2184055 889427 -1740692 -4186323 -6781879 -9617402 -10621618 -8252090 -4478679
42318 -4478679 -2174874 -640509 3082874 8994069 13640263 14979686 14406811 13240593
42310 13240593 10534904 5966182 2109984 1563067 3435887 4662272 3680318 1302522
42302 1302522 -930719 -1731425 -376799 2369258 4226554 3607183 1472067 61078
42294 61078 340897 1609019 2983296 4200256 5192869 5627634 4785141 1880450 -2732343
42285 -2732343 -6629327 -6950724 -3627597 174505 1560053 752218 -192413 -101258 898727
42276 898727 2351651 3568082 3749835 3127481 2926323 3246407 2472253 147859 -1260878
42267 -1260878 476766 3800713 5442943 5199439 5879415 8674993 11234526 10854368 7546594
42258 7546594 3338999 146820 -1161320 -915920 -203151 679964 2860780 6528219 8862019
42249 8862019 6952483 2579350 972763 4118780 8306232 9574895 8552572 7839090
42241 7839090 7434132 5853333 3908444 3815791 5255845 5693296 4699654 4867265 7664189
42232 7664189 11032423 12359336 11684381 10421285 8747004 6369644 4783994 6272447
42224 6272447 10512545 14063151 14000326 11000320 8106023 7193126 7451536 6982728 5110169
42215 5110169 2975629 2122209 2603326 2698761 906143 -1959160 -3559627 -3172389 -2807436
42206 -2807436 -4228086 -5981835 -5153038 -1588132 1736195 2809449 2935664 4113161
42198 4113161 6044414 7268922 7717237 8194832 8329836 7186226 5555788 5605531 8040903
42189 8040903 11117248 12657569 11843433 9063944 5368801 2194094 421634 -373344
42181 -373344 -801563 -340507 1341559 2431933 773551 -2348450 -2948880 269244 3803922
42172 3803922 4050735 1858737 499859 949019 1552422 1290824 995200 1694719 3632910
42163 3632910 6672721 10058254 12024170 11263653 8833754 7353168 8303633 11042757
42155 11042757 14031640 15783684 15038161 11639457 7405631 4868570 4873560 6164030 7081109
42146 7081109 6722686 4900103 2331527 678290 994938 2236274 2627865 2219313 2353854
42137 2353854 2784529 1632494 -1153192 -2573633 -318396 3819703 6012552 5012287
42129 5012287 3021841 2301988 2498349 1760909 -347714 -1776630 9704 5021892 10212171
42120 10212171 12477589 11807034 10608853 10379488 10497186 10259905 10240128 10884809 11381614
42111 11381614 11026351 10479306 10558592 10956250 11310015 12258131 13909038 14499309 12641764
42102 12641764 10167703 10362754 13382386 15635581 14287665 10562415 7722027 7201399
42094 7201399 7822332 7949937 7383588 7348925 8999756 11690956 12976652 11191572 7881723
42085 7881723 6367616 7661603 9268792 8744017 7073371 7280245 10445440 14389998
42077 14389998 16116319 14704005 11849705 10046357 10173735 10793906 10133937 8469600
42069 8469600 7521637 7602632 7053765 5132304 3641935 4319712 6105356 6863118 6745055
42060 6745055 7675461 10021099 11992296 12332317 11611021 10699351 9881801 9763800 11066252
42051 11066252 12916166 13191918 11304235 8842699 6718370 3852846 117269 -1609120
42043 -1609120 1273744 6955602 10946254 11603412 11651994 13985250 17945587 20604596 20491326
42034 20491326 19046054 18688370 19924426 20575885 18295658 13842325 10786373 11373372
42026 11373372 13942579 15579306 15944094 16525943 17086022 15518651 11333269 6852374
42018 6852374 4336956 4002698 5581543 9524591 15160070 19545643 20270512 18538703
42010 18538703 17700363 19227741 21624367 22814712 22013286 19480566 16174249 13962213
42002 13962213 14674103 18086640 21641997 22887896 21751550 19927758 18572236 17366861
41994 17366861 15659961 13652398 12117180 11508838 11882853 13300205 15484265 17137913
41986 17137913 16648271 13981694 11094778 9791657 9820285 9783374 9137320 8270028 7366760
41977 7366760 6603993 6946945 9104681 11901749 13411776 13682994 14470992 16097124 16712954
41968 16712954 15338145 13485182 12674945 12370157 11842934 12163872 14320498 16827824 17546544
41959 17546544 17032638 17764279 20384599 22867995 23488546 22763589 22124316 22151542 22552666
41950 22552666 22734772 21985358 19898284 16914568 14012211 12014541 11558256 13043171
41942 13043171 15845654 18337075 19640018 20566951 21820889 22470355 21802096 21492951 23648750
41933 23648750 27313940 29417683 29030394 28186572 28344320 28641054 28244847 27837658 27699628
41924 27699628 26774760 25228741 25842289 30747282 38019714 43473361 45120349 44271588
41916 44271588 42929579 41884757 41278195 41456774 42610462 44081258 44505615 42943148
41908 42943148 40126455 38137887 38051397 38405599 37422327 36392889 38701319 44975760 51393358
41899 51393358 54015533 53044253 51430155 51013323 51837718 53771352 56443651 58259277
41891 58259277 57702370 55561468 54182230 54526769 55331379 55017124 53098919 49906239 46375934
41882 46375934 44175468 44686964 47543139 50987526 53637539 55091303 55170821 53798842
41874 53798842 51574787 49344462 47148018 44543266 41864724 40070565 39305120 38616011
41866 38616011 37161538 34839981 31868829 28798773 26872198 27194156 29401608 32135359
41858 32135359 34804960 37694312 40244898 40718562 38274529 34366271 31228301 29474867
41850 29474867 27818130 24981675 21615702 20241199 22832611 28099967 31965703 31691627
41842 31691627 28847235 26962755 27076588 27544713 27709924 28963107 31573472 33275076
41834 33275076 32719936 32216890 34719479 39333548 42259079 41741318 39874110 39470236 41167174
41825 41167174 44083899 47489975 50733263 52729516 52980443 52940582 55459990 62531162
41817 62531162 73581347 85772144 95962290 102896763 107982568 114007792 123135883 136262735
41809 136262735 153858466 176188698 201831174 226515426 244691593 252726389 250213330
41802 250213330 238471084 219218973 195470515 172151520 153477975 139482262 126892998
41795 126892998 114086018 103474077 97795680 95603102 92563726 86716202 80299011 76156884
41787 76156884 74259856 72585910 69943167 66699689 63595448 61068398 59398822 58500006
41779 58500006 57620262 56008761 53961223 52655099 52743245 53415352 53117022 51203050 48722979
41770 48722979 47343740 47470447 47782548 46825851 44613984 42249132 40484581 39394904
41762 39394904 39061244 39563319 40348873 40578410 40222195 40038527 40503194 41669586 43931418
41753 43931418 47562685 51290155 52845161 51637975 49634472 48872748 49499543 51211451
41745 51211451 54992996 61695252 70127172 78761062 88602827 101690879 116515896 127552647
41737 127552647 130595944 126791319 120097022 112451276 103295771 92557028 81446853 70351943
41729 70351943 58372416 45846500 35495957 29676542 27627560 26826870 26169743 26213116
41721 26213116 26942309 27369542 27447567 28372859 30312412 31614192 31323679 30843744 31621375
41712 31621375 32622715 32098345 30883370 31547294 34520725 37491531 39019185 40479939
41704 40479939 43538408 47732702 52001093 57081194 64688497 75208716 87729555 101578807
41696 101578807 116006780 128520785 135337344 134186005 125912954 113142724 98270975
41689 98270975 83073508 69216967 58053785 49913640 44115050 39763285 36304397 33407608
41681 33407608 30825580 28632309 27165442 26224330 24683394 21750936 18495189 16976313
41673 16976313 17589326 18510019 18298974 17536264 16883147 15340547 12345002 10026406 10645637
41664 10645637 12742558 13113560 12335184 14450893 20247384 24712493 23419519 18413280
41656 18413280 14945386 14668173 15258344 15214662 15493340 16814430 18432266 19834579 21299693
41647 21299693 22446405 22237341 20844008 19871962 20301169 21411731 21900117 21001532 18665687
41638 18665687 15805928 14186665 14872607 16927191 18549087 18985067 18462933 17351178
41630 17351178 16741201 18434776 22216881 24331242 21370266 15040788 10315644 9339398
41622 9339398 10161565 11134329 12908471 15631293 17941223 20011788 24101372 30240267
41614 30240267 34519818 34043437 31058152 29660261 30446401 30963915 29794758 27674999
41606 27674999 25825964 25400545 27368431 30873413 33032409 32517664 31925386 34187884
41598 34187884 38009876 39629009 38026940 35440242 33512287 32112242 31501133 32194885
41590 32194885 32449438 29280799 22932495 17470104 15741552 16155401 15632742 13445356
41582 13445356 10729084 8286669 6563256 6214566 7085453 7828095 7789980 7968089 8893779
41573 8893779 9161703 7727152 6288134 7313040 10485322 13112287 13665998 13060690 12597409
41564 12597409 12509866 12784795 13730275 15035006 15471931 14412742 12967886 12823116 14166551
41555 14166551 15324022 14528206 11828339 9035590 7687482 7379538 6659928 5413877
41547 5413877 5331840 7555987 10800748 12698795 12444425 11170991 10082834 9183726 7722496
41538 7722496 5074794 1245974 -2854186 -5843952 -7227451 -7928554 -8631691 -8169852 -4986870
41529 -4986870 11048 3852767 5186016 5825832 7624612 9365531 8500787 5142770
41521 5142770 2287693 1941758 2736855 2185672 185919 -871208 817625 4202885 6393542
41512 6393542 5448473 1878698 -2307749 -5471525 -7070706 -7124365 -5839772 -3937415 -2575503
41503 -2575503 -2303241 -2373251 -1650678 -81832 1214956 1283434 394301 -194815 652115
41494 652115 2857904 4930741 5278935 4101366 3367725 4239760 5206695 3979667 813216
41485 813216 -1647187 -1885819 -1136212 -893504 -575438 1056983 3504745 5260970 6155187
41476 6155187 7178390 8289447 8201908 6527330 4508054 3075400 1550725 -844441
41468 -844441 -3144471 -3403122 -1060247 2138767 3656671 2532579 467464 415930 3522637
41459 3522637 7485902 8711938 6238919 2763183 1608080 3643512 7591217 12114058
41451 12114058 16393038 19358379 20027607 18977825 18393134 19887092 22699705 24678927
41443 24678927 24837630 24204911 23981348 23669092 21901287 18814784 16390014 16065175 17083689
41434 17083689 17930750 18397651 19108815 19892881 20215408 20703720 22267091 23629461 21860571
41425 21860571 16257206 10066193 7115650 7770800 9262381 9042924 6702721 3443755
41417 3443755 1047422 1027961 3632529 7560592 11109637 13402757 14440312 14809139 15676714
41408 15676714 17956678 20839936 22291751 21727128 20800243 20541059 19476257 16456593
41400 16456593 13875644 15435276 21201521 27361488 30845650 31881268 31876851 31374392 30879032
41391 30879032 31303186 32172611 31289377 27937024 25100224 26547181 32268732 38444901
41383 38444901 41663770 41667117 39922975 37129848 33085912 28216394 23946847 21272821
41375 21272821 19660655 17958153 16010154 14539573 13578076 12208572 10214691 8699565
41367 8699565 8279370 7974937 7140094 7201544 9610715 12933641 14204886 12825052 10828550
41358 10828550 9353063 7386099 4509483 2347525 2184232 3283738 4800279 7211100
41350 7211100 10203174 11164300 8182281 3455145 1364130 3484702 7290257 9519092
41342 9519092 9176358 7332756 5579183 5057908 6000516 7783897 9703598 11458497 12650177
41333 12650177 12568521 11095396 9154885 7758946 7445053 8912023 12502581 16117661
41325 16117661 15802225 10564863 5045322 4605774 8583392 11399204 10127238 7690269
41317 7690269 7843608 10145443 11701161 11581909 11110908 10909037 9983242 7690874 5021321
41308 5021321 3491943 3458236 3827202 3372771 2420100 2963163 6411830 11262954 13993718
41299 13993718 12630236 8643194 4998812 3258542 3109517 3762780 4786161 5901127
41291 5901127 6793822 7241712 7215152 6895767 6478633 5714737 4088221 2096297 1694427
41282 1694427 4064039 7211942 7670592 4959675 2404348 2591355 3925150 3264916 436106
41273 436106 -1907092 -1936260 -50145 2747794 5567558 6869892 5416563 2542616 1321057
41264 1321057 2452980 2903086 113164 -3988675 -5226928 -2624093 602636 1474465
41256 1474465 530497 -135323 -291620 -1280331 -3107802 -3877959 -2572690 -878800 -1100209
41247 -1100209 -2998167 -4047343 -2768569 -563045 252325 -705171 -1848889 -1938297 -1429889
41238 -1429889 -1505202 -2614488 -4369079 -6266551 -7836706 -8260183 -6677848 -3331679 77243
41229 77243 1923910 2489032 3406658 5060372 5635411 3652362 440473 -1505474 -2068792
41220 -2068792 -3211086 -4962951 -4454767 -515290 3153672 2222704 -2106350 -4467882
41212 -4467882 -2614479 182990 862310 1127424 3924502 8024626 9493651 7429115
41204 7429115 4975970 4806347 6445108 8282830 9363692 8361575 3631496 -3919582
41196 -3919582 -10035392 -11264728 -8683194 -5725718 -3631472 -1236350 1652315 3394812
41188 3394812 3181614 2350232 2427843 3442681 4688511 5713108 5979552 4899114 2921006
41179 2921006 1504661 1356633 1622734 1296391 405176 -629669 -1631452 -2135854 -1527663
41170 -1527663 -435699 -611808 -2385306 -3541026 -2099741 779922 2157495 901878
41162 901878 -1423936 -2671342 -1733570 1404923 5693229 9145646 10147960 8735387
41154 8735387 6018990 2957935 535637 160279 2311111 5240059 6535132 5745583
41146 5745583 4206198 2797197 1463429 515147 548431 1150019 1392619 1550250 2608727
41137 2608727 4223964 5107877 5337200 6006702 6482436 4726237 1142989 -675040 1364981
41128 1364981 4727761 5817377 4864070 4878484 6819079 8304431 7071464 3829174 1164373
41119 1164373 590495 1243239 1399715 1031098 2036545 5209891 8101393 7870386 5631356
41110 5631356 5182925 7309118 8620770 7061865 5097924 5407243 6580520 5914230 3834410
41101 3834410 2269851 793762 -1939222 -4510330 -4414697 -2478805 -1776325 -2760744 -3365837
41092 -3365837 -3556677 -5466211 -8608401 -9269476 -5950112 -1708833 450914 1171836 2068637
41083 2068637 2769153 2766271 3324978 5087422 6144096 4972343 3275357 3397185 4668230
41074 4668230 4895525 4014348 3534221 3332011 1702956 -1680331 -4974753 -6275476 -5131636
41065 -5131636 -2378365 387387 1860655 2519221 3918767 5580425 4533964 -259440
41057 -259440 -5016336 -5226804 -1165865 3421201 6692428 9369942 11020363 9831940
41049 9831940 6386694 3718841 2515126 -86682 -5070942 -8296862 -5706608 281331
41041 281331 2986368 -450918 -5986339 -8001927 -5620193 -2757542 -3123654 -6453187
41033 -6453187 -9543486 -9935138 -7760569 -4407729 -877418 1850559 2327518 328673
41025 328673 -1604759 -406175 3611618 6940891 7327022 6197572 6009144 7049002 8041760
41016 8041760 8372477 8183075 7309413 5685321 4205966 3805660 4004736 3521056 2094606
41007 2094606 716186 234097 652024 1728059 3436107 5662078 7826232 8843124
40999 8843124 7514581 3615677 -1106044 -3861688 -3510611 -1756137 -923023 -1175709 -962590
40990 -962590 237454 972474 -165374 -2563952 -4103652 -3156480 161929 4203875 6832596
40981 6832596 6580943 3434275 -1121598 -4854825 -6015587 -4339258 -1046092 2190966
40973 2190966 4251921 4703348 3609774 1723789 327749 44471 63357 -618208 -1480206
40964 -1480206 -1077557 773484 2585548 3030658 2035338 30816 -2553750 -4900021 -6339054
40955 -6339054 -7514709 -9451453 -11227510 -10545002 -7234380 -4016533 -2706364 -1920258
40947 -1920258 -132416 1287447 422075 -1612802 -2195255 -1195128 -772118 -1962903 -4069087
40938 -4069087 -6751011 -9879696 -11619991 -9653702 -4611583 283732 3280038 5249280
40930 5249280 6509297 5461682 1475510 -3377908 -6815445 -8595202 -9204409 -8350454
40922 -8350454 -6016040 -3144884 -36648 4076413 8575789 10638775 8694021 5106980
40914 5106980 3527862 4722288 6644614 7437232 6663369 4655370 2434578 1544430 2450467
40905 2450467 3734265 3947125 3253800 2281305 972650 25415 1480828 5514500 8244446
40896 8244446 5781956 -251581 -4237622 -3370389 -63125 2552046 4368742 6428232
40888 6428232 7946796 7270686 4588701 1954911 860988 694403 -395135 -3298955
40880 -3298955 -6497961 -7131361 -4061167 501352 3174027 2918924 1730283 2249605 5309254
40871 5309254 9172961 10562809 7438365 1608831 -2658752 -3584292 -3575593 -4444631 -3473662
40862 -3473662 2490395 10772302 15056545 13617455 11087253 11178233 11643872 8405528 1644821
40853 1644821 -4576535 -6905611 -5064157 -1100776 2208768 3259726 2758715 2030370
40845 2030370 483709 -3113407 -7144139 -8205328 -6230380 -4916044 -5699136 -5173869
40837 -5173869 -868109 4012723 4911437 2214615 -362730 -1549378 -2899383 -4839953
40829 -4839953 -6065781 -6211559 -6043213 -5576080 -4623381 -4283484 -5216240 -5603499 -3773924
40820 -3773924 -1659096 -2319728 -5045863 -6487266 -5807341 -4838196 -3804077 -1375688 1029068
40811 1029068 -171820 -4827460 -8209952 -7661868 -5973863 -6137653 -6686327 -4967348 -1730316
40802 -1730316 663579 2071896 3520592 4327151 3345436 1687708 1434163 2662221 4116635
40793 4116635 5720921 7989251 9819055 9320764 6466579 3001418 194007 -1658870
40785 -1658870 -2232660 -1563815 -894402 -1311885 -1934952 -1087307 1128592 2975797 3356321
40776 3356321 2451189 638315 -1590625 -3064684 -2973448 -2241421 -2348124 -3071459 -2989551
40767 -2989551 -2016319 -1753061 -3180087 -5372921 -6710630 -6343146 -4514209 -2358457 -1108482
40758 -1108482 -614542 731369 3474005 5371031 3855847 -389304 -4173806 -5658586
40750 -5658586 -5456126 -4279499 -2079454 153725 370803 -1600836 -3163876 -2396059 -743016
40741 -743016 -720544 -2277221 -3322430 -3149414 -3331640 -5036652 -6986859 -6957855 -4707097
40732 -4707097 -2513422 -2593153 -4525436 -5952526 -5684478 -4938797 -4983644 -4919146 -3202708
40723 -3202708 -363375 1837406 3513844 6440984 10300771 11711183 8568871 3537343
40715 3537343 1082906 1913435 2522037 206652 -3379920 -4429527 -1525173 3066604
40707 3066604 6202598 6917967 6455746 6098207 5921088 5568816 5091737 4407260 2893886
40698 2893886 581285 -934386 -148239 2065746 3310366 2828826 2260382 2902279 3806512
40689 3806512 3368660 1456981 -1013365 -3469256 -5520206 -6414395 -6021008 -5746069 -7112689
40680 -7112689 -9685042 -11513678 -11428263 -9887997 -7855354 -5996831 -4867397 -4613834 -4334283
40671 -4334283 -2907254 -765520 304632 -368703 -1198220 -411036 1778885 4112029 6403746
40662 6403746 9098426 11196871 10731746 7831672 5462303 5851520 7407123 6688124 2697146
40653 2697146 -2248979 -5321082 -5312207 -2670982 482958 729547 -3510205 -8625600 -8435296
40644 -8435296 -1642216 5799664 7806709 5438267 4391604 7081239 10707519 12357709
40636 12357709 12168158 10987267 8345786 4134727 -138053 -3124119 -4768500 -4704879
40628 -4704879 -1747007 3551747 7837501 8389324 6308362 4592623 4274121 4326933 4383451
40619 4383451 5275617 6999318 7977179 6775476 3584427 -129492 -2704960 -3122709 -1618896
40610 -1618896 301562 844918 -838791 -4080208 -6868334 -6963897 -3955701 -278404 1052392
40601 1052392 -15849 -635901 951140 3102913 3241095 1041375 -1956545 -4491864
40593 -4491864 -6007692 -6139000 -5140742 -3859850 -2249120 741838 4630869 6560729
40585 6560729 4870669 1900577 868372 1234413 -67513 -3597775 -6667705 -7547560
40577 -7547560 -7519385 -8214339 -9366854 -10047082 -10194258 -10095484 -9774806 -9364955 -8829654 -7364021
40567 -7364021 -4597791 -2023094 -1137977 -515863 2535900 7287128 9730032 8219265
40559 8219265 5678516 4675192 3599621 189096 -3972693 -5674921 -4867395 -3881517
40551 -3881517 -3174278 -1375732 1016343 1588255 -40881 -1363198 -845709 97554 62178
40542 62178 21290 1105217 2042858 890383 -1854013 -3833081 -3992221 -3515559 -3800243
40533 -3800243 -4850506 -5729582 -5587649 -4147556 -1910277 156664 1746742 3691028
40525 3691028 6393040 8192004 6835198 2848854 -186845 307624 2878531 4399545
40517 4399545 4356704 4798313 6495590 7631717 6955460 6028058 6859323 8899072 10212405
40508 10212405 10529624 10956541 11189714 9425129 5300280 775957 -2599311 -5289674
40500 -5289674 -7509448 -7320942 -3068403 3256938 7344291 7329738 5546068 5119764 6218146
40491 6218146 6462121 4171534 265568 -2753933 -3046217 -789257 2137778 3687058
40483 3687058 3140353 1347309 -335114 -1182535 -1309955 -1179291 -1128296 -1069755 -315343
40474 -315343 1994186 5666079 8738995 8832023 5665900 1694881 -322165 19780 1038316
40465 1038316 1270900 572425 -701479 -2336903 -3914881 -4790581 -4634602 -3289824 -359214
40456 -359214 3828600 7093024 7131290 4720169 3148673 3670249 3721048 987725 -3041581
40447 -3041581 -5570871 -6327569 -6155835 -3711391 2637541 10346247 14159584 12545021
40439 12545021 9288701 7907740 7779742 7093327 6355392 6729574 7297353 6495055 4806090
40430 4806090 3854146 3861226 3791516 3099848 1854781 174195 -1012177 167226 4163634
40421 4163634 8432826 9935811 8544828 6496881 5277067 4640226 3982929 2957450
40413 2957450 1188840 -1072164 -2477961 -2221997 -1573241 -2205791 -3600372 -3943442 -3212082
40404 -3212082 -3280517 -4857249 -6310606 -6135486 -5011041 -4591062 -5341205 -6352845 -6565429
40395 -6565429 -5480658 -3095816 200520 3502954 5337782 4317784 644984 -3188173
40387 -3188173 -4425263 -3129391 -1982999 -2500872 -3038533 -1623726 829386 1770198 368655
40378 368655 -1987103 -3639586 -3637442 -1783893 735447 1827842 1139922 932780 2671612
40369 2671612 4590989 5020137 6001453 9971717 14344234 13999167 8982579 5078058 5867905
40360 5867905 8537136 9025493 7198375 4690197 1400696 -2804134 -5745306 -5560422
40352 -5560422 -3753700 -2735069 -2055704 -18011 2489600 2997196 1455254 179477
40344 179477 135936 36760 -892170 -1776915 -2049770 -2397617 -3231252 -3867969 -3719442 -2997069
40334 -2997069 -1966184 -678922 416361 784726 905048 2004209 4459123 7185204
40326 7185204 8542858 7243817 2990741 -2567895 -6008364 -4951616 -964505 1631141
40318 1631141 216704 -3756505 -6904190 -7245301 -5150629 -2289348 -567548 -1413238
40310 -1413238 -4909510 -9260784 -11575653 -9967299 -5454345 -1479698 -646697 -1880649
40302 -1880649 -1844519 681772 3305141 3573393 2323916 1935766 2529640 2078498 -133163
40293 -133163 -2336519 -2915116 -2582863 -3260460 -5754397 -9061024 -11400466 -11744029 -10683540
40284 -10683540 -9595320 -8659133 -6526150 -2713826 776667 1732361 846816 735925 2239231
40275 2239231 3688389 3789926 3119443 2376719 1222016 -318011 -1037822 -235066 1078120
40266 1078120 1566503 1011423 -402241 -2867145 -5953583 -8044675 -8047525 -6797619 -5636937
40257 -5636937 -4516930 -2781362 -926538 86623 844161 3041285 6838346 10049568
40249 10049568 10505885 8365879 5639241 4064735 3863446 4075727 3621534 2155598 150512
40240 150512 -1793720 -3595464 -5490649 -7356950 -8607296 -8839335 -8363726 -7904695 -7748456
40231 -7748456 -7262932 -5492548 -2456410 305848 916502 -1009891 -3985235 -6081125
40223 -6081125 -6369205 -4987816 -2485714 423997 2798361 3737396 2956287 1176830 -196
40214 -196 966172 4012536 6817913 6534597 2711675 -1973840 -4429079 -4252084 -3611685
40205 -3611685 -4341977 -5911835 -6405036 -4937539 -2631797 -1238505 -1125965 -982184 377104
40196 377104 2258608 2690856 826823 -1764279 -2531583 -439931 3126481 5619706 5272697
40187 5272697 2263404 -1492364 -3846756 -4229633 -4011418 -4806024 -6607396 -8083153 -8480104
40178 -8480104 -8333750 -8106400 -7205738 -5166406 -2970975 -1960683 -1913830 -1715784 -1710785
40169 -1710785 -3331840 -5900860 -6215610 -3030936 15559 -1440677 -6473529 -9850038
40161 -9850038 -8612083 -4713395 -1080610 1565310 3020955 2136907 -917272 -3491650
40153 -3491650 -3815243 -3480060 -4473783 -5911869 -6193458 -6223167 -7413676 -8367232 -7137322
40144 -7137322 -5335932 -5926414 -7824822 -7177895 -3868385 -2018791 -3250584 -4106950 -1857280
40135 -1857280 1401761 2744823 2710081 2838295 2294227 145658 -1786261 -1773160 -1557428
40126 -1557428 -3366822 -5573801 -5115625 -2601951 -929758 -20851 2547514 6156687
40118 6156687 7268947 5560526 5163247 7977659 9964319 6974004 1100387 -2239601
40110 -2239601 -1569266 -129342 -361723 -1128996 -584752 1195474 3394393 5897377 8091045
40101 8091045 7987594 4606310 474734 -382544 2805862 6453273 6840392 4018280 627686
40092 627686 -1685459 -3062845 -3684100 -3399074 -2901081 -3170289 -3521980 -2253371 253197
40083 253197 1245772 -503253 -2480162 -1635275 1685961 4582755 5132047 3550894 983682
40074 983682 -1246795 -2109259 -2059933 -2811942 -4578534 -4877325 -1818421 2689871 5011083
40065 5011083 3952376 936423 -2554145 -5232509 -5151320 -1817492 1634056 1727089 -403682
40056 -403682 -933432 113297 -1372707 -6495536 -10514422 -9216773 -4518405 -1100286
40048 -1100286 -388613 -759536 -1363364 -2495394 -3538649 -3469800 -2697816 -2180156 -1547390
40039 -1547390 -151503 973002 391000 -1197991 -1784562 -824475 695205 2172293 3230224
40030 3230224 2388145 -1511715 -6675222 -9675057 -9727999 -9376460 -10309138 -10686987 -7775508
40021 -7775508 -1671135 4791417 8778703 9173828 6647940 3240602 1270528 1474601
40013 1474601 2245860 1383296 -1412206 -4238632 -5186882 -4426997 -3834813 -4624342 -5772375
40004 -5772375 -5242091 -2620043 167292 967868 -412603 -2412605 -3338987 -2364986 155984
39995 155984 2518533 2574832 -9924 -2750734 -2683004 407820 4001615 5894506 6167334
39986 6167334 6084476 6190136 6044586 5153337 3506250 1434132 -550026 -1671905 -1029508
39977 -1029508 1586040 4699047 5589529 2720381 -2281865 -5971692 -6464547 -4539702
39969 -4539702 -1589526 1735356 4307996 4075090 571900 -3341175 -4215430 -2064432
39961 -2064432 -175826 -1177348 -4557679 -7804786 -8836492 -7494792 -5480808 -4456299
39953 -4456299 -3784219 -1331402 2730335 4865254 2805630 -479037 -193054 3953247
39945 3953247 7885235 9064410 8783151 8391830 6924076 3807258 891395 -91260 154874
39936 154874 422857 1161216 2784458 3680299 2202787 -478454 -1665935 -662141 744318
39927 744318 930632 131665 -361914 213815 1089214 260127 -3289053 -7383519 -8224120
39918 -8224120 -4935282 -931920 289472 -979033 -2215860 -2120910 -742866 1877922
39910 1877922 4814212 5610755 3295482 830141 1597887 4377652 5121390 3194028 2038804
39901 2038804 3298237 4237660 2546150 317564 844141 3720444 5642030 4709855 1809180
39892 1809180 -1300076 -3336433 -3612916 -2535287 -1726911 -2483657 -4409376 -6294748 -7555063
39883 -7555063 -7964645 -7054397 -5057547 -3594440 -3974373 -5353211 -5848785 -4946501 -3542026
39874 -3542026 -2194481 -786354 500027 1358839 2253707 3689934 4818021 4283901 2346903
39865 2346903 531918 -825532 -2861463 -5662623 -7364263 -6676700 -4782974 -3585737
39857 -3585737 -3259543 -2780360 -1969706 -1635044 -2074440 -2522704 -1932656 259815 3602222
39848 3602222 6191602 5567285 1193503 -4317887 -7526459 -7458174 -5629463 -3252139 17223
39839 17223 4309653 8079524 9482941 8537273 6865179 5446763 3577006 479368 -2638177
39830 -2638177 -3166260 -172774 3824952 5257465 3589246 1816704 2606939 5318216
39822 5318216 7668079 8921758 9836010 10351802 9352675 6655200 3631579 1722721 1551734
39813 1551734 3233182 5953677 7483484 6166564 3549997 2773607 3865306 3246903
39805 3246903 -894503 -5385898 -6217682 -3696906 -956844 829081 2622793 4045728
39797 4045728 3278802 459020 -1944262 -2716842 -3189861 -4236201 -4630115 -3585335 -2520641
39788 -2520641 -2656098 -2817978 -1561772 15430 -281013 -2355769 -3906133 -3508630 -1850085
39779 -1850085 -14888 1745206 3209210 3548694 2223370 -199843 -2687687 -4744522
39771 -4744522 -6279598 -6827196 -5717068 -3352515 -1661089 -2236390 -4042223 -4281996 -2169096
39762 -2169096 -352193 -1201611 -3082527 -2630299 67393 1465075 -224179 -2838954
39754 -2838954 -4023661 -4160718 -4277976 -4054635 -3811914 -5559492 -9513702 -12261707 -11458987
39745 -11458987 -9780353 -10381886 -10853915 -6836865 -322156 1838272 -1713837 -4129200
39737 -4129200 -378467 5349337 6044152 1627603 -2195136 -2202537 -146690 1575126 2305895
39728 2305895 1651470 -449224 -2046038 -950947 1479726 1444439 -1910692 -5145890 -5264089
39719 -5264089 -2926677 -100144 2466213 4076181 3479918 1483378 1409615 4338068 6291576
39710 6291576 3457408 -1614321 -3006098 200763 2895169 1661158 -784081 -591891
39702 -591891 1546379 2595610 2288566 2457899 2828140 1404410 -1178770 -1477391 1555314
39693 1555314 4200387 2629786 -2099475 -5686787 -5872183 -4066465 -2554772 -2216930
39685 -2216930 -2872676 -3862836 -3710612 -756232 4738919 9785655 11016393 7941944 3482559
39676 3482559 1188613 2063256 4107957 4809107 3767993 2650456 2801903 3568462 3176775
39667 3176775 713600 -3137818 -6841899 -8997718 -8988370 -7316054 -5271359 -3890538 -3192260
39658 -3192260 -2466323 -1116717 657248 1575333 4584 -4009476 -7616749 -7684893 -4857780
39649 -4857780 -3236571 -4985199 -7206447 -5972494 -1737668 1759217 2815981 3037566
39641 3037566 3739369 4184873 3759895 3141331 2636225 1866309 1765687 4130588 8073426
39632 8073426 9756078 7377519 3877706 2595583 2644027 1241854 -1392486 -2735400
39624 -2735400 -2359765 -2264360 -3100417 -3108888 -1136315 1722391 3893267 4689497 3665917
39615 3665917 714837 -2714504 -4425106 -4164154 -3924864 -5044468 -6510688 -6581195 -4539996
39606 -4539996 -494812 4736735 8860774 9134560 5424979 937011 -1262689 -1374426
39598 -1374426 -1525481 -2486944 -3099801 -2312002 -498600 1119193 1663315 1356760 1381575
39589 1381575 2595139 4301003 4925434 3889004 1915876 -392846 -2939549 -4962656
39581 -4962656 -5161803 -3636280 -2210778 -2033424 -2229048 -1712519 -770376 192657 1830409
39572 1830409 4334563 6157994 5909637 4381008 3040585 1629213 -883280 -3874598
39564 -3874598 -5658018 -5955641 -5881136 -5866059 -5418920 -4575801 -3787581 -2713267 -927945
39555 -927945 602344 734299 354590 998255 1539631 -828360 -5790604 -8960836 -7108048
39546 -7108048 -2210617 1136222 672504 -2440270 -5813323 -7565791 -7064676 -5359651
39538 -5359651 -4164081 -3713148 -2794952 -1393846 -1395499 -3527264 -5553975 -5228155 -3389311
39529 -3389311 -2169608 -1566510 -118832 1993959 2975654 2133822 506315 -898357 -1613686
39520 -1613686 -973889 1033204 2527277 1634401 -427211 -445473 2422602 5647292 7027323
39511 7027323 7035866 6781848 5971205 4065999 1536531 -1245599 -4564415 -7578830 -7900414
39502 -7900414 -4645285 -340124 2065081 2755612 3655500 4748215 4348146 2507049 1434883
39493 1434883 2099019 2620789 1069604 -1616525 -2642852 -521626 3673142 7819355
39485 7819355 10763345 12712575 13921507 13557446 10645918 6105201 2506463 1005915
39477 1005915 -149515 -2533646 -4113505 -1404885 5008101 9768773 8711633 3641955
39469 3641955 -322560 -766931 447959 707230 -425822 -1894097 -2953700 -3457560 -3315966
39460 -3315966 -2551470 -1479566 -223464 1645601 4360505 6993730 7994203 7000377
39452 7000377 5583252 5579257 6881684 7581983 6387647 4167432 2687002 2423093 2300047
39443 2300047 1242737 -739934 -2879146 -4351242 -4627414 -3723302 -2313719 -1342222 -1463728
39434 -1463728 -2836623 -4948375 -6428420 -5944302 -4059071 -3272197 -4939078 -6917985
39426 -6917985 -5982101 -2027898 2255683 5620562 9270732 13004777 13641226 9487490
39418 9487490 3921363 1581931 2459424 2784287 812956 -1577016 -2699276 -2900717 -2127908
39409 -2127908 738099 4653576 5787080 2552073 -1143096 -565341 3439153 5672690
39401 5672690 3395597 -1027162 -4064377 -4704732 -3738221 -2007140 -549364 -465668 -1161541
39392 -1161541 -143305 3841885 8321542 9311183 5793893 888908 -1456177 -247019
39384 -247019 2083640 2502216 475784 -1901014 -2922614 -3474581 -4978243 -5941509 -3206357
39375 -3206357 2696041 6289802 3470194 -2902058 -6615052 -6084412 -5214569 -6517388
39367 -6517388 -7406289 -4930807 -943868 305074 -1916140 -4135557 -3401067 -456156
39359 -456156 1786768 1239064 -1980828 -5704292 -7065788 -4960883 -1484062 17177
39351 17177 -1495677 -3997836 -5225651 -5084366 -4801473 -4755839 -4160585 -2656048 -1394860
39342 -1394860 -2067361 -4811647 -7501819 -7801918 -5942204 -4451461 -4692303 -4968033 -3271357
39333 -3271357 -750179 -474473 -3255617 -6915765 -9752502 -12229569 -14397327 -14216143
39325 -14216143 -10506810 -5914918 -4368142 -6137496 -7803974 -7173911 -5862679 -6123969
39317 -6123969 -7135543 -6207772 -2671824 1387730 4098484 5604512 6370589 5485922 2207933
39308 2207933 -1791201 -3705738 -3055518 -2047986 -2169745 -2351517 -1413783 -346749 -433376
39299 -433376 -647757 803734 3285877 4599428 4620839 5331769 6993172 7139015 4482151
39290 4482151 1404013 872587 2599442 4030354 3927158 3204626 2988986 3455304 4220728
39281 4220728 4691763 4306948 3249251 2458212 2313118 2015032 886700 -632058 -1935774
39272 -1935774 -3018504 -3439655 -1996180 1111486 3022124 1083985 -3504564 -6645133
39264 -6645133 -5825072 -2376987 581432 1322697 674939 811981 2790376 5074797 5298754
39255 5298754 3689861 3183028 5310308 7763049 7460922 4380817 588549 -2893685
39247 -2893685 -6053324 -8102160 -8227229 -7253703 -6379898 -5340680 -4055483 -4494114 -7764770
39238 -7764770 -10649754 -8901683 -3484236 407898 514822 -334479 404484 1745845 2448130
39229 2448130 3414472 4900342 4782648 1782623 -2332223 -5486808 -7444077 -7767405 -5034504
39220 -5034504 -122629 3111191 2912967 2155212 3132728 3416505 452706 -3051994 -2900901
39211 -2900901 -178204 615850 -1340146 -2858955 -2597715 -2225949 -1867777 653840 5167193
39202 5167193 8127600 7703856 6344320 6801980 8700490 10450701 11617264 11829765 10133054
39193 10133054 7242722 6036765 7862324 10307422 10385016 8054427 4879386 1236398
39185 1236398 -2880603 -5891961 -6141415 -4668873 -4129907 -5189195 -6019447 -5415792 -4497213
39176 -4497213 -4768524 -5968987 -6765916 -6731241 -6614077 -6913157 -7118428 -6651355 -5850889
39167 -5850889 -5297863 -4529271 -2516982 428250 2386545 2018462 9551 -2283845 -4387762
39158 -4387762 -5968919 -5985689 -4180345 -2288356 -1844036 -1629012 561653 4232761 6685267
39149 6685267 6979549 6843194 7353437 7249056 5370470 2611746 321855 -1571817 -3778225
39140 -3778225 -6271748 -8487192 -9728074 -8985008 -5799776 -1739377 568284 352146
39132 352146 -932364 -2384303 -4591576 -7042199 -7124318 -3489836 1299743 3407599 2023966
39123 2023966 -412136 -1405334 -560432 680604 418824 -1905575 -4425071 -4396701 -1266631
39114 -1266631 2873845 5989139 7613545 7592870 5766197 3651387 3741925 5711347 5950242
39105 5950242 2696822 -1068198 -2186872 -2018233 -3365236 -5125660 -4198361 -1363103
39097 -1363103 -628080 -2773480 -3919604 -1500657 2092033 3446782 2638131 1780464 1453449
39088 1453449 871523 54123 -491180 -1465690 -4044628 -7500839 -9220973 -7626976 -4145397
39079 -4145397 -1540422 -621394 515380 3536199 6917946 7303412 3928169 128162
39071 128162 -520404 1694673 3700624 3760190 2728441 1744636 697552 -716178 -1923666
39062 -1923666 -2113009 -1175606 299292 1472448 1699072 987327 -52474 -824694 -815893
39053 -815893 788466 4126271 6986117 6173817 1741326 -2256758 -3051836 -3002810 -5469416
39044 -5469416 -8930341 -9184996 -6459155 -5669064 -8940734 -12173459 -11028020 -7007161
39036 -7007161 -4898188 -6279540 -8303213 -7935419 -5187571 -2442905 -2029070 -4309531
39028 -4309531 -7338047 -8607221 -7452630 -5259818 -3421877 -2190028 -1540223 -1679353
39020 -1679353 -2273208 -2517318 -2401878 -2628568 -3051461 -2761173 -1951854 -1782973 -1902666
39011 -1902666 -372360 2861749 4635220 2420102 -2097600 -5022324 -4536402 -1583317
39003 -1583317 2344094 6034882 8020300 7350976 4881698 2415623 752844 -342546
38995 -342546 -769769 -128093 995344 1105177 -483137 -2735699 -4052361 -4056689 -3972929
38986 -3972929 -4936914 -5909127 -4224443 858104 6177935 8017381 6733048 5725624
38978 5725624 6242575 6341756 5305992 5310541 7163218 8067609 6239311 4547768 6122027
38969 6122027 8846227 8301898 4598003 1936242 2026768 2228515 473206 -1919365 -3250873
38960 -3250873 -3821239 -3962107 -2626109 371543 2933138 3188477 1837262 685745 267192
38951 267192 20128 -475540 -1377902 -2479239 -2597778 -562539 2536695 3783032 1973780
38942 1973780 -1015741 -3331188 -5471840 -7956261 -8813232 -6033898 -1419398 795736
38934 795736 -964441 -4161203 -5893327 -5931138 -5449535 -4844784 -4192594 -4465531 -6397931
38925 -6397931 -8445488 -7577710 -2735234 3384272 6739759 5782814 2362328 -684314
38917 -684314 -1835073 -930601 1582524 4491053 5748184 3953526 -424 -3555510
38909 -3555510 -4893242 -4252867 -3044135 -2384773 -2535931 -3044476 -3110796 -2136193 -125719
38900 -125719 2387963 4525090 5191646 3867391 1721192 980028 2254839 3334155 1883316
38891 1883316 -1367488 -3696909 -4151343 -4273525 -5037791 -5153600 -3242162 -142202 2004960
38882 2004960 2007550 274854 -1773422 -2308356 -203544 3587427 6575279 7324215 6655296
38873 6655296 5806487 4751051 3365846 2934180 4760924 7833459 9463602 8228839
38865 8228839 5159174 2174319 529706 749844 2709600 5186861 6179841 4453883
38857 4453883 710339 -2946021 -4642396 -4088134 -2714643 -2358965 -3419484 -4475273
38849 -4475273 -4111222 -2751104 -1962740 -2188559 -2190966 -941567 927048 2110334 2308725
38840 2308725 2165690 2087727 2055361 2294116 3013638 3404096 2034891 -1270840 -4917679
38831 -4917679 -7500803 -9274083 -10755687 -11028749 -9103500 -6289245 -5055008 -5498688
38823 -5498688 -5178750 -3005184 -947892 -677216 -876380 5619 272840 -2772862 -7960914
38814 -7960914 -10718721 -8590162 -3744897 485938 3190323 5095988 6326690 6373151
38806 6373151 5042222 2291138 -1936684 -6873529 -10842367 -12693440 -12474572 -10381890
38798 -10381890 -6450348 -1878435 1009693 1276622 447730 -144838 -1491222 -4503658
38790 -4503658 -6875382 -5154382 158364 4268557 3731043 370953 -1765353 -1662666
38782 -1662666 -1471302 -2311665 -2668786 -1533653 -637367 -1614625 -2563396 -343824 3951714
38773 3951714 5015376 289 -7453418 -11820252 -12124343 -11151803 -10000140 -7049271
38765 -7049271 -2032960 2400804 4042759 3485760 2359280 1492791 1573614 3292788 5828574
38756 5828574 7261135 7363246 7754189 8410900 6739888 1708972 -3591427 -5500415 -3812662
38747 -3812662 -440247 3459242 6550232 6025574 827933 -5206311 -7032289 -4658038
38739 -4658038 -2513488 -3052040 -4477869 -4937888 -5231688 -6073821 -5760276 -2693305 1607770
38730 1607770 4056403 3608759 1739364 -73672 -1796779 -3698316 -4957886 -4384642
38722 -4384642 -2536099 -2162516 -5383688 -10565054 -13450430 -11877461 -8000352 -5205892
38714 -5205892 -4463972 -4766607 -5325798 -5565526 -4409066 -1682296 701890 801872 -997910
38705 -997910 -3218964 -5417516 -7153621 -6631872 -3114005 781331 2290185 2705481 4848889
38696 4848889 7548176 6985919 3128594 69198 -485570 -1267137 -3799055 -5522010 -4673619
38687 -4673619 -3571981 -4165359 -4276512 -1784569 788340 -84968 -3139271 -4311299 -2885512
38678 -2885512 -1550070 -1315627 -476340 1459544 2451828 1188922 -1044502 -2440759 -2546119
38669 -2546119 -1625437 2263 1519522 1947526 1265175 174543 -1083311 -2573638 -3686644
38660 -3686644 -3502845 -1828240 982171 4367757 6736853 5763509 1285887 -3379680
38652 -3379680 -5158183 -5075699 -5935194 -7314334 -6163727 -2042096 1690984 2398000 875041
38643 875041 -1097863 -2907781 -3795598 -2388009 789190 2756328 1813676 -235825 -1255397
38634 -1255397 -1927122 -3593674 -5014043 -4087448 -1557876 -127666 -508426 -1078180 -1173836
38625 -1173836 -1879242 -3186953 -3101848 -667917 2281906 3852328 4870860 7184523 10319802
38616 10319802 11892999 11030770 9473858 8896864 8632061 6943248 3698118 758641
38608 758641 -94188 984780 2040901 1008604 -2412791 -6141066 -7324677 -5178397
38600 -5178397 -1946693 -361382 -429349 268327 3149332 6738436 8574564 7788786 5002201
38591 5002201 801038 -4251917 -8492902 -9576462 -6597266 -1273300 3324784 5186792
38583 5186792 4748468 4145787 4900889 6291093 6485009 5189068 3985856 3643884 2689338
38574 2689338 -32216 -2739320 -2721904 -299586 1489866 1029738 -420762 -1754367 -3863559
38565 -3863559 -7110786 -9159605 -7537470 -3269543 120581 752198 -242784 -1138318 -1472482
38556 -1472482 -1286936 -299981 1312868 2397710 1917562 -28013 -2735364 -5719360 -8466257
38547 -8466257 -10104045 -10101680 -8886479 -7158557 -5067719 -2722114 -895339 -215703 -95344
38538 -95344 287092 243563 -1497987 -3962758 -4097597 -857492 2771788 3712129 3254128
38529 3254128 4904221 8498127 9857961 7080126 3974972 5113541 9637123 12773948
38521 12773948 12402063 11078757 11486918 12650281 11890476 8756798 5396140 3762758
38513 3762758 3822771 4392360 4740616 5054985 5803062 7047561 8409866 9490783 10050985
38504 10050985 9742452 8039322 4810147 870403 -2341684 -3734816 -3254577 -1829059
38496 -1829059 -694145 -474702 -731242 -550650 396456 1583929 2266225 2022954 957958
38487 957958 21288 799744 3838777 7149268 7721214 4951506 1346577 -675423 -1314495
38478 -1314495 -2034659 -3277627 -4798317 -6930791 -9851491 -12413696 -13312753 -12864116 -12265201
38469 -12265201 -11704798 -10538701 -8631886 -6120227 -2717690 1002426 2514470 -164276
38461 -164276 -5099894 -7774022 -6063354 -2215672 199754 -304992 -2638836 -4206075
38453 -4206075 -2573600 1975678 5602109 4729155 685888 -1848809 -1110704 -31214
38445 -31214 -1080287 -2582671 -1953817 117253 1154070 668498 -69879 -740389 -1896333
38436 -1896333 -2862194 -2153286 -76029 952207 -828258 -4502680 -7613945 -8692579
38428 -8692579 -8302762 -7645091 -6430885 -3079453 2300975 6433837 6333621 3507049 2105783
38419 2105783 3125171 3625248 2157958 1228802 2769112 4765487 4880867 4193526 4215867
38410 4215867 3176429 -708612 -4487441 -3673659 854417 3762198 2834190 1212089
38402 1212089 1636400 2723694 2229520 354470 -1851117 -4323688 -6507522 -6743195 -4980820
38393 -4980820 -3772402 -4679646 -5756915 -4531648 -1610838 781040 2305031 4276887
38385 4276887 6902497 8815052 8897368 7079735 3941916 872285 -100964 1862244 5118324
38376 5118324 7167764 7128987 5850846 4567455 4492603 6509701 9662488 10962493 8613166
38367 8613166 4736754 2826323 2974381 2095688 -1013683 -3556426 -2765856 184287 2069083
38358 2069083 1887686 1149009 677810 -543677 -3107719 -5653915 -6525218 -5781293 -4552839
38349 -4552839 -3170018 -1086373 1641301 3886087 4576534 3599804 1587704 -533454
38341 -533454 -1898149 -2462122 -3316797 -5158806 -6495348 -4978731 -1032581 1664903 533999
38332 533999 -2687802 -4745744 -5304725 -6110298 -6827567 -5110108 -1053090 1790491 1289139
38323 1289139 -49558 1201328 4467518 6450543 6010329 4988109 4576724 3662245 1383513
38314 1383513 -906906 -1557132 -1150591 -1687590 -3808630 -6072059 -6913033 -6299887 -5082588
38305 -5082588 -3387680 -507067 3462931 6513475 6119966 2045311 -2771699 -4799495
38297 -4799495 -3421167 -1396540 -1673137 -4231496 -6583659 -7036341 -6449667 -6411668 -6733664
38288 -6733664 -6024408 -4388395 -3910729 -5882825 -8808565 -10143125 -9179856 -7230221 -5672842
38279 -5672842 -4976549 -5154188 -5965733 -6830159 -7370325 -7676316 -7385776 -5487081 -2159985
38270 -2159985 452443 1091815 1677086 4117378 5969394 3200427 -2584182 -4275623
38262 -4275623 1322480 8188984 8622881 3261349 -621773 743790 3806576 3989277
38254 3989277 1439125 -982299 -2144559 -2764137 -2979685 -2137024 -317081 1509224 2574996
38245 2574996 2633266 1624121 -86031 -1451235 -1563242 -700060 -86799 -614467 -1940131
38236 -1940131 -2639098 -1209165 2559854 6896908 9135978 7961402 4513847 1133997
38228 1133997 -763164 -1430484 -1781944 -2113707 -1924669 -801154 844447 2182655 2932495
38219 2932495 3290691 2768111 97742 -4727997 -8966874 -9252459 -5495740 -1319740 132201
38210 132201 -342865 82269 1855131 2530366 744588 -1422900 -1377014 149001 205992
38201 205992 -1946370 -3849724 -3676281 -2690556 -2478526 -1766185 1471579 5723396 6832269
38192 6832269 3608165 -78668 -141014 2683407 4326092 2615053 -1013134 -4493389
38184 -4493389 -7656442 -11107846 -13967127 -14144772 -10992463 -6804234 -4740989 -5250777
38176 -5250777 -5657555 -3935713 -1574109 -1120376 -1961895 -1141241 1740016 3399632 1636954
38167 1636954 -1472517 -2833552 -2513265 -2548683 -3475109 -4562888 -6103749 -8674276 -10930389
38158 -10930389 -10893146 -9095312 -7908082 -7916154 -7503861 -6088521 -5145437 -5507772 -5984762
38149 -5984762 -5388436 -3943298 -2105309 -49187 1006724 -803907 -5155876 -8963928
38141 -8963928 -9810608 -8303386 -6088038 -3524525 -749269 843180 77038 -2292866
38133 -2292866 -4922519 -7615997 -10117052 -10724526 -8376873 -5055425 -3596507 -3585511 -1880145
38124 -1880145 2812817 8148714 11143902 10842740 7674398 2499429 -2728615 -5439873
38116 -5439873 -5126967 -4151475 -4481153 -5013498 -3878311 -2105399 -2463839 -5006449 -6511056
38107 -6511056 -5060671 -2769369 -2445063 -3437881 -3002633 -692917 1176549 1292057 1008067
38098 1008067 1522938 1580799 -505680 -3871691 -5733046 -4450447 -970763 2166354 2549863
38089 2549863 -328522 -3992968 -4737398 -1699232 1841497 2524652 935129 -249794
38081 -249794 -669254 -2011977 -4057061 -4305830 -1951150 805336 2347692 3803382 6182230
38072 6182230 7805291 6610874 3442139 1144763 1384267 3684263 6442115 7583100
38064 7583100 5504542 989738 -2732737 -3265567 -1560050 -7322 815042 2001644
38056 2001644 3979140 5980404 7103945 6463945 3306583 -1260858 -3661016 -1286895
38048 -1286895 3734900 6369173 4380088 408879 -1814870 -1528887 -652288 -918615 -2206927
38039 -2206927 -3099974 -2554118 -1073005 23128 545655 1597991 3186167 3185715 210095
38030 210095 -3757503 -5669163 -5485451 -5553001 -6387941 -5880091 -3099304 -310582 -49278
38021 -49278 -1951989 -3588044 -3170491 -668273 2554356 4472903 3794612 1172732 -1693322
38012 -1693322 -3982380 -5507255 -5093547 -1603797 3112500 4959617 2534732 -852668
38004 -852668 -1615225 -382488 -198327 -1857436 -3316621 -2926582 -1219074 211807 178013
37995 178013 -1312981 -2563326 -1202580 2992711 7033627 7846463 5704087 3068311
37987 3068311 913485 -1801994 -5416353 -8420009 -9247815 -7702522 -4556871 -1175379
37979 -1175379 584760 -231095 -2233560 -3136213 -2631600 -2142376 -1820228 -163212 2731061
37970 2731061 3994377 1657601 -2246469 -4025490 -2552855 531379 3680627 6407853
37962 6407853 8000960 7535388 5425720 3306608 1963646 660300 -1161011 -2772734
37954 -2772734 -3279178 -2847398 -2291848 -2146607 -2406949 -2389226 -763546 3109215 7579211
37945 7579211 9816290 9134005 7764383 7421648 6806198 4213292 1099488 395835 1787523
37936 1787523 1611315 -1955678 -6216501 -7827558 -7294759 -7693008 -10215580 -13118982 -14552850
37927 -14552850 -14462517 -13633096 -12495194 -11336216 -10505707 -9801470 -8406802 -5997895 -3464228
37918 -3464228 -2067551 -2086084 -2595572 -2558536 -1964700 -1726586 -2365672 -3114324 -2762077 -1120620
37908 -1120620 1057070 3320358 5548175 6880563 6291784 4626587 4174321 5248938
37900 5248938 5160609 2190380 -1268650 -1818644 98225 1173621 213741 -767570 -161143
37891 -161143 1430260 3124387 4629787 4726848 1812641 -3024813 -6123965 -5754533 -4189010
37882 -4189010 -3931609 -4203538 -2921236 -225812 1848021 1837411 -402718 -3894107 -6338868
37873 -6338868 -5674507 -3107813 -2331660 -4210229 -5004358 -2083089 1621923 2095152 429467
37864 429467 339164 1526424 562955 -2478555 -3632706 -1748630 -585671 -2730216 -5753314
37855 -5753314 -6480895 -5389295 -4371503 -3326592 -1664793 -584888 -971300 -1004583 1301539
37846 1301539 4622694 5978586 4744903 2678300 974302 -379069 -1149507 -1080770 -1087801
37837 -1087801 -2236680 -3958472 -5027509 -5686755 -6886778 -7959718 -7138444 -4223756
37829 -4223756 -910801 1400310 2458543 2128645 359748 -1847187 -3057911 -2861675
37821 -2861675 -1281297 2517553 8644526 14011846 14339487 9264647 3056186 -486858
37813 -486858 -1439419 -1208021 445681 3657169 5909522 4199156 -883812 -5561367 -7267602
37804 -7267602 -6925528 -6830990 -7766885 -8581098 -7765427 -5203279 -2642791 -2075088 -3315404
37795 -3315404 -3984670 -2484358 58012 1782842 2867447 4718528 7165097 8311815
37787 8311815 6996710 3849902 157809 -2730195 -3232454 -850365 2275947 3306469
37779 3306469 2622424 3567749 7504936 11504957 12310946 10337480 7858112 5366710 2418855
37770 2418855 598160 2368773 7195098 11503193 12654223 10794934 7004286 2294796
37762 2294796 -1360002 -1962599 -339484 617410 572485 2668585 8140501 12960278 12565306
37753 12565306 7820890 3389935 1838454 2376525 3905482 5650955 5623557 2450294
37745 2450294 -1275128 -1410106 1437221 2074181 -1531266 -4764442 -3001759 1801240
37737 1801240 4382544 3375314 1572909 772313 272620 -223413 28942 373835 -1122081
37728 -1122081 -4358329 -6497810 -5475569 -2420783 -36384 -216663 -3533782 -9115933
37720 -9115933 -14380042 -16603461 -15544799 -13239070 -10959620 -8127368 -4639592 -2158298
37712 -2158298 -1912177 -2785733 -2829702 -1555249 160942 1287791 1009762 -796306 -2727848
37703 -2727848 -3018148 -2336303 -3563574 -7492988 -10686723 -9567008 -5149553 -1461017
37695 -1461017 -297687 -781 1058633 2271200 2343012 1183107 -295800 -1121661 -816641
37686 -816641 134111 542744 13072 -444419 -227133 -500014 -2197545 -3746097 -2993723
37677 -2993723 -820360 -314664 -2343172 -4366611 -4102559 -2167054 -404066 437434 546103
37668 546103 284352 392337 1475731 2643009 2060057 -681409 -4153807 -7088571 -8863106
37659 -8863106 -8068893 -3441497 2980716 6588229 5660046 3506435 3408419 4125786 2851126
37650 2851126 150352 -1198478 -618053 270349 921878 1830193 1860968 -924359 -5528227
37641 -5528227 -8051572 -6327604 -2529435 -477464 -1757465 -4789128 -6606500 -5654238
37633 -5654238 -3652858 -3829866 -6340791 -7309141 -4398619 -1120534 -2236380 -6505096
37625 -6505096 -8264765 -5524222 -1834687 2912 1129824 2384038 1766468 -1549527
37617 -1549527 -4799731 -5908088 -6575018 -8238637 -8486532 -5051885 -467055 1259867
37609 1259867 509863 633213 2244914 2933839 1740183 198786 -574265 -518088 1107636
37600 1107636 4726606 7991733 7645363 3967499 536305 -405694 370464 1643463 2773662
37591 2773662 2293256 -1006704 -5096607 -6139183 -3660433 -1217532 -1199727 -2200126 -2447650
37582 -2447650 -2314055 -1916284 295502 4425993 7625860 8042811 7576334 8221443 8377828
37573 8377828 5895652 2575760 2018926 4238510 5851200 5030250 3192199 2010776
37565 2010776 1546738 1393828 1273433 350289 -1973676 -4574513 -5880578 -6477080 -8264454
37556 -8264454 -11011016 -12088228 -10103296 -6708986 -4170144 -2993282 -2622453 -2652050 -2490527
37547 -2490527 -1459736 -176472 -374534 -2395083 -4256709 -4282486 -3320109 -3138081 -3883609
37538 -3883609 -4645262 -5488161 -7002136 -8255445 -7251454 -3863703 -773374 -585950 -2882383
37529 -2882383 -5016405 -5307862 -4465409 -3976145 -4170468 -4401141 -4355992 -4184661 -3538868
37520 -3538868 -1615331 1523654 4570246 6363673 6809233 5928308 3209054 -959788
37512 -959788 -4242904 -4463866 -2382674 -760324 -888579 -1812696 -2907825 -4964920 -7965080
37503 -7965080 -9796666 -8522763 -4570015 400931 5251092 8697334 8748605 5083458
37495 5083458 861582 -411035 620695 295186 -2629262 -5526956 -6407797 -6848420 -8813653
37486 -8813653 -11025788 -10903749 -8599966 -6552838 -5811178 -5301431 -4476376 -4195387 -4617276
37477 -4617276 -4457477 -3172109 -2048267 -2098331 -2453726 -2068937 -1634916 -2297605 -3525982
37468 -3525982 -3978464 -3902278 -4881504 -7219290 -9076422 -8539518 -5530971 -1487852 1920108
37459 1920108 3598142 3502630 2655216 2083286 1691284 830292 -210756 -365874 435152
37450 435152 758133 -692148 -3819314 -7788440 -11790219 -14575868 -14427407 -10814633 -5634814
37441 -5634814 -1753824 -318907 -107598 549659 1768908 2176518 725546 -1806228 -3438034
37432 -3438034 -3198693 -2138655 -1596238 -1151446 537522 3235815 4992581 4649616 3057645
37423 3057645 1435988 -51432 -1538022 -2685009 -3394745 -4003794 -4131284 -2915652 -1309849
37414 -1309849 -2301015 -7204300 -13112183 -15851647 -14491732 -11277051 -8304456 -6400659
37406 -6400659 -6318865 -8338043 -10687496 -10705723 -8035526 -5036457 -3880128 -4783239 -6918222
37397 -6918222 -9028347 -9037247 -5402681 278579 3876915 3006384 -568524 -3405412 -3802307
37388 -3802307 -2151774 368764 2322168 2560696 1466667 788588 1458382 2507174 2676669
37379 2676669 1857029 384570 -1492999 -2667425 -1564508 1266390 2902558 2135432
37371 2135432 1869944 4972010 9309174 10177740 6963725 3771174 3087123 2479614 -843076
37362 -843076 -5310879 -7439379 -6996909 -6714882 -7715051 -8203587 -6830175 -4726041 -3363958
37353 -3363958 -2502266 -1554826 -1386579 -3064669 -5777954 -7680068 -8258678 -8228627 -7435060
37344 -7435060 -4807197 -697851 2492894 2846159 896704 -1528676 -3207495 -3574215
37336 -3574215 -2272209 167291 2106131 2292966 880438 -1583989 -4860518 -7904462
37328 -7904462 -8812460 -7356035 -5902119 -5991426 -5821960 -3635120 -1774901 -3701390 -7815816
37319 -7815816 -8481918 -3648375 2406471 5012608 4164318 2070356 -713036 -4030385
37311 -4030385 -5757951 -3938132 77978 3219566 4441830 4766786 4656224 3599708
37303 3599708 1752071 147303 -348250 815906 3749448 6937695 7623915 5050184
37295 5050184 2020952 1499041 3014422 4304772 4858969 5384182 5272290 3628692 1867401
37286 1867401 2127453 3656402 3902821 2741084 2097840 1511930 -1759533 -7184689 -9631018
37277 -9631018 -5972389 45897 2434851 408783 -1748459 -998927 1326933 2550645
37269 2550645 2174178 1574240 1685379 2037686 1678481 419239 -1022507 -2079082 -3127805
37260 -3127805 -4694094 -6115695 -5941005 -3871403 -1510085 -762113 -1947218 -3718250
37252 -3718250 -4468392 -3741138 -2519690 -1972657 -1830921 -815481 926675 1264891 -753783
37243 -753783 -2740650 -2275079 -1281216 -3902918 -10096206 -14873360 -15006883 -13182761 -13435453
37234 -13435453 -15227295 -14975049 -11639872 -7436559 -3673903 684483 5702047 8552017
37226 8552017 6669001 1412248 -3185359 -4930922 -5321934 -6761766 -9251749 -10834684
37218 -10834684 -10609820 -9756571 -9387549 -9002114 -8011403 -7356356 -7996036 -8744829 -7535375
37209 -7535375 -4355881 -1057240 1310739 2800538 2575352 -526857 -4941555 -6774425
37201 -6774425 -4579284 -1375813 -354815 -786615 -179862 1414938 1809496 315991 -1501977
37192 -1501977 -2357352 -2462142 -2273587 -1752596 -1119764 -1082709 -1951647 -3250689 -4337839
37183 -4337839 -4946095 -5145438 -5020819 -4256940 -2223336 902057 3412874 3685932 2414500
37174 2414500 1702978 1874612 1131375 -1136651 -2916977 -2536885 -1063298 -367375 -543912
37165 -543912 -687342 -574510 -145116 956980 1831062 291617 -3691806 -6433578 -4716005
37156 -4716005 -8766 3693984 4630839 3517764 925749 -2436323 -4134085 -2188041
37148 -2188041 1634134 3721700 3409416 2986821 3401884 3127623 1335709 -748155 -1964989
37139 -1964989 -2252979 -1566546 -192506 101902 -2116948 -5245912 -6524133 -6248346 -7035005
$$ [...]
##END NTUPLES=NMR SPECTRUM
##END=
