##TITLE=31Pdec_DE-106_ch_9_TFA
CDCl3, 64 sc
 20.8.2025
##JCAMPDX= 6.0         $$ Bruker NMR JCAMP-DX V2.0
##DATA TYPE= NMR SPECTRUM
##DATA CLASS= NTUPLES
##ORIGIN= UXNMR, Bruker Analytische Messtechnik GmbH
##OWNER= root
$$ XWIN-NMR		Version 3.5
$$ Wed Aug 20 13:57:55 2025 Russian Standard Time (UT+4h)  she@DPX200
##.OBSERVE FREQUENCY= 81.013821
##.OBSERVE NUCLEUS= ^31P
##.ACQUISITION MODE= SIMULTANEOUS
##.ACQUISITION SCHEME= undefined
##.AVERAGES= 64
##.DIGITISER RES= 17
##SPECTROMETER/DATA SYSTEM= spect
##.PULSE SEQUENCE= zgpg30
##.SOLVENT NAME= CDCl3
##.SHIFT REFERENCE= (INTERNAL, CDCl3, 0, 198.062)
##AUDIT TRAIL= $$ (NUMBER, WHEN, WHO, WHERE, WHAT)
$$ ##TITLE= Audit trail, XWIN-NMR		Version 3.5
$$ ##JCAMPDX= 5.01
$$ ##ORIGIN= Bruker BioSpin GmbH
$$ ##OWNER= she
$$ F:/spectra/data/she/nmr/P31/2/pdata/1/auditp.txt
$$ ##AUDIT TRAIL=  $$ (NUMBER, WHEN, WHO, WHERE, WHAT)
(   1,<2025-08-20 13:56:54.40 +0400>,<she>,<DPX200>,
      <created by zg, POWCHK disabled, PULCHK disabled
       configuration hash MD5:
       00 E9 B6 7A A2 85 ED C7 34 08 36 98 17 FE 4E 26
       data hash MD5: 32K
       D7 5A CE 9D 4C DF DA 23 2F FA D8 EF 69 DE 85 ED>)
(   2,<2025-08-20 13:56:57.04 +0400>,<she>,<DPX200>,
      <Start of raw data processing
       efp BC_mod = 2 LB = 1.5 FT_mod = 6 PKNL = 1 PHC0 = 1589.47 PHC1 = -437.5005 SI = 64K 
       data hash MD5: 64K
       81 0D 9B 5A C4 3A AB D2 E1 C4 35 9E C6 2C 64 CF>)
(   3,<2025-08-20 13:57:14.01 +0400>,<she>,<DPX200>,
      <pk PHC0 = 1.276117 PHC1 = 0 
       data hash MD5: 64K
       4A F3 A3 E0 38 EF 92 95 DB 91 52 AF 24 57 53 AF>)
(   4,<2025-08-20 13:57:20.95 +0400>,<she>,<DPX200>,
      <abs ABSG = 5 
       data hash MD5: 64K
       0B EE 10 85 E5 C6 A3 E2 74 9E 90 B9 6E 6C EC 65>)
$$ ##END=
$$ 
$$ hash MD5
$$ AF 1A 0A 50 87 CB 0A DB 81 1C D1 05 5D 35 67 D1
##$RELAX= 
##$RELAX= 
##$RELAX= 
##$RELAX= 
##$RELAX= 
##$RELAX= 
##$RELAX= 
##$RELAX= 
$$ Bruker specific parameters
$$ --------------------------
##$DU= <F:/spectra>
##$EXPNO= 2
##$NAME= <P31>
##$PROCNO= 1
##$TYPE= <nmr>
##$USER= <she>
##$AMP= (0..31)
100 100 100 100 100 100 100 100 100 100 100 100 100 100 100 100 100 100 
100 100 100 100 100 100 100 100 100 100 100 100 100 100 
##$AQSEQ= 0
##$AQ_mod= 1
##$AUNM= <au_zg>
##$AUTOPOS= <>
##$BF1= 81.014009
##$BF2= 200.13
##$BF3= 200.13
##$BF4= 200.13
##$BF5= 200.13
##$BF6= 200.13
##$BF7= 200.13
##$BF8= 200.13
##$BYTORDA= 1
##$CFDGTYP= 0
##$CFRGTYP= 5
##$CHEMSTR= <none>
##$CNST= (0..31)
1 1 145 1 1 1 1 1 1 1 1 1 1 1 1 1 1 1 1 1 1 1 1 1 1 1 1 1 1 1 1 1 
##$CPDPRG= <waltz16>
##$CPDPRG1= <>
##$CPDPRG2= <waltz16>
##$CPDPRG3= <>
##$CPDPRG4= <mlev>
##$CPDPRG5= <mlev>
##$CPDPRG6= <mlev>
##$CPDPRG7= <mlev>
##$CPDPRG8= <mlev>
##$CPDPRGB= <>
##$CPDPRGT= <>
##$D= (0..31)
0 1 0 0 0 0 0 0 0 0.06 0 0.03 2e-05 3e-06 0 0 0.0002 0 0 0 0 0 0 0 0 0 
0 0 0 0 0 0 
##$DATE= 1755683813
##$DBL= (0..7)
120 120 120 11 120 120 24 19 
##$DBP= (0..7)
150 150 150 150 150 150 150 150 
##$DBP07= 0
##$DBPNAM0= <>
##$DBPNAM1= <>
$$ [...]
##$SUBNAM4= <"">
##$SUBNAM5= <"">
##$SUBNAM6= <"">
##$SUBNAM7= <"">
##$SUBNAM8= <"">
##$SUBNAM9= <"">
##$SW= 400.765351723535
##$SWIBOX= (0..15)
0 1 3 0 0 0 0 0 0 0 0 0 0 0 0 0 
##$SW_h= 32467.5324675325
##$TD= 32768
##$TD0= 1
##$TE= 0
##$TE2= 300
##$TE3= 300
##$TEG= 300
##$TL= (0..7)
0 120 53 12 22 120 120 120 
##$TP= (0..7)
150 150 150 150 150 150 150 150 
##$TP07= 0
##$TPNAME0= <>
##$TPNAME1= <>
##$TPNAME2= <>
##$TPNAME3= <>
##$TPNAME4= <>
##$TPNAME5= <>
##$TPNAME6= <>
##$TPNAME7= <>
##$TPOAL= (0..7)
0.5 0.5 0.5 0.5 0.5 0.5 0.5 0.5 
##$TPOFFS= (0..7)
0 0 0 0 0 0 0 0 
##$TUNHIN= 0
##$TUNHOUT= 0
##$TUNXOUT= 0
##$USERA1= <user>
##$USERA2= <user>
##$USERA3= <user>
##$USERA4= <user>
##$USERA5= <user>
##$V9= 5
##$VALIST= <valist>
##$VCLIST= <CCCCCCCCCCCCCCC>
##$VD= 0
##$VDLIST= <DDDDDDDDDDDDDDD>
##$VPLIST= <PPPPPPPPPPPPPPP>
##$VTLIST= <TTTTTTTTTTTTTTT>
##$WBST= 1024
##$WBSW= 4
##$XGAIN= (0..3)
0 0 0 0 
##$XL= 0
##$YL= 0
##$YMAX_a= 11809
##$YMIN_a= -19563
##$ZGOPTNS= <>
##$ZL1= 120
##$ZL2= 120
##$ZL3= 120
##$ZL4= 120
##$ABSF1= 198.0616
##$ABSF2= -202.7028
##$ABSG= 5
##$ABSL= 3
##$ALPHA= 0
##$AQORDER= 0
##$ASSFAC= 0
##$ASSFACI= 0
##$ASSFACX= 0
##$ASSWID= 0
##$AUNMP= <proc_1d>
##$AZFE= 0.1
##$AZFW= 0.5
##$BCFW= 0
##$BC_mod= 2
##$BYTORDP= 0
##$COROFFS= 0
##$CY= -3
##$DATMOD= 1
##$DC= 0
##$DFILT= <>
##$DTYPP= 0
##$F1P= 0
##$F2P= 0
##$FCOR= 1
##$FTSIZE= 65536
##$FT_mod= 6
##$GAMMA= 0
##$GB= 0
##$INTBC= 1
##$INTSCL= 9.790993e-09
##$ISEN= 30
##$LB= 1.5
##$LEV0= 0
##$LPBIN= 0
##$MAXI= 10000
##$MC2= 0
##$MEAN= 0
##$ME_mod= 0
##$MI= 50
##$NCOEF= 0
##$NC_proc= -8
##$NLEV= 6
##$NOISF1= 182.463
##$NOISF2= 159.3651
##$NSP= 0
##$NTH_PI= 0
##$NZP= 0
##$OFFSET= 198.0616
##$PC= 4
##$PHC0= 1590.746
##$PHC1= -437.5005
##$PH_mod= 1
##$PKNL= yes
##$PPARMOD= 0
##$PSCAL= 0
##$PSIGN= 0
##$REVERSE= no
##$SF= 81.0140089999434
##$SI= 65536
##$SIGF1= 159.3651
##$SIGF2= -187.1042
##$SINO= 113.3802
##$SIOLD= 16384
##$SREGLST= <1H.CDCl3>
##$SSB= 0
##$STSI= 65536
##$STSR= 0
##$SW_p= 32467.5324675325
##$SYMM= 0
##$S_DEV= 0
##$TDeff= 32768
##$TDoff= 0
##$TI= <>
##$TILT= no
##$TM1= 0
##$TM2= 0
##$TOPLEV= 0
##$USERP1= <user>
##$USERP2= <user>
##$USERP3= <user>
##$USERP4= <user>
##$USERP5= <user>
##$WDW= 1
##$XDIM= 65536
##$YMAX_p= 113478646
##$YMIN_p= -301388330
$$ End of Bruker specific parameters
$$ ---------------------------------
##NTUPLES= NMR SPECTRUM
##VAR_NAME=  FREQUENCY,     SPECTRUM/REAL,   SPECTRUM/IMAG
##SYMBOL=    X,             R,               I
##VAR_TYPE=  INDEPENDENT,   DEPENDENT,       DEPENDENT
##VAR_FORM=  AFFN,          ASDF,            ASDF
##VAR_DIM=   65536,         65536,           65536
##UNITS=     HZ,            ARBITRARY UNITS, ARBITRARY UNITS
##FACTOR=    0.49542278885378, 1,            1
##FIRST=     16045.7642231865, 0,            0
##LAST=      -16421.768244346, 0,            0
##MIN=       -16421.768244346, -301388330,   0
##MAX=       16045.7642231865, 113478646,    0
$$ Real data points
##PAGE= N=1
##DATA TABLE= (X++(R..R)), XYDATA
$$ [...]
6756f077023l117825l52419K336584L043643J196837j543052k945113k560856
6748a0019224j369822K90895K643393M669953M680800K939682J567304J427562
6740F830543J304999N94555K57860L71991m47098k021202k072333m03579l13088
6731D102648l251536n295742k603647K219653L665561J494461L29282J728441
6723B389121K061305q49122l909445l620179q57801J553875K794028L046036J484931
6714D092749j703283l508120j560898J985044L083465J280710m53615o76472r21337
6705A618243k032475k258446k45124K360996K934089J190459q96373j667297j050827
6696d6755K07893J376633J785452R86523o45613j819910j392720L23247J692138
$$ y = [-6077023, -9194848, -9547267, -7210683, -4167040, -2970203, -4513255, -7458368, -10019224, -11389046, -11098151, -8454758, -3784805, 895995, 3835677, 5402981, 6830543, 8135542, 8730097, 8987957, 9359948, 8912850, 6891648, 4819315, 4415736, 4102648, 851112, -4444630, -7048277, -4828624, -1163063, 331398, 660680, 2389121, 4450426, 3601304, -308141, -3928320, -4786121, -3232246, -438218, 2607818, 4092749, 2389466, -1118654, -2679552, -694508, 2388957, 3669667, 3216052, 2539580, 1618243, -414232, -2672678, -2917802, -556806, 2377283, 3567742, 2671369, 1004072, -46755, 161138, 1537771, 3323223, 4309746, 3664133, 1844223, 451503, 774750, 2466888]
6687B466888J560215N93996J89928L54059k27177j883076l053908k386895n98145
6678b984115P51810J346421J699642J500031J00649j602437j608637M66253K560514
6669B230131K745647J511113O21426N69831L32918o29325j328065o93934N47582
6660E907324L40430k108050m817256m914915j966782J414126K555007J515889
6652b074227M01977O63511J855224K543672J663019n65632k314625j401111K043309
6643B815117M719501L490482n75721l192590k261256n04874j503250m477055n112575
6634f602221j482424K952774L501873J93330k411822j293101J375690J856883
6626a909018J70415p02504O3829R8196j731924l140240k205968n24680l41622
$$ y = [2466888, 4027103, 4621099, 4811027, 5165086, 4937909, 3054833, 925, -2385970, -2984115, -2232305, -885884, 813758, 2313789, 2414438, 812001, -796636, -330383, 2230131, 4975778, 6486891, 7108317, 7678148, 8011066, 7381741, 6053676, 5359742, 5907324, 6247754, 4139704, -677552, -5592467, -7559249, -6145123, -3590116, -2074227, -1672250, -1008739, 846485, 3390157, 5053176, 4487544, 2172919, 771808, 2815117, 7534618, 11025100, 10449379, 7256789, 4995533, 4490659, 2987409, -1489646, -6602221, -8084645, -5131871, -1629998, -1436668, -3848490, -5141591, -3765901, -1909018, -1738603, -2441107, -2377278, -2279082, -4011006, -7151246, -9357214, -9881894, -10223516]
6617a0223516q18148J51379K146421L163348L019153K795264K035119j59040k072546
6608C7434j119992J683339K763555J463344M91919P07029l034j711317j309947
6599C002330J558341K290240j738401o227476n884859j856085J056361J644597
6591f154952J995067K250058R50798o39323K24448K632173L005021J151739M76905
6582E891934J748609J659510j157535l433692k632515q72586r33309j829737j269391
6573b828712K30235O90825J46058j6342K89394K89429K48082P83515J335320J157578
6563B325382P68023P56494L98377q23019j651084r61098j810n73446j940769j872949
6553c575899j88321J005030M59027p86440j199553m14210R50281J848425J320302
$$ y = [-10223516, -11041664, -10890285, -8743864, -5580516, -2561363, 233901, 2269020, 2109980, 37434, -1082558, 600781, 3364336, 4827680, 5319599, 6026628, 6023594, 4312277, 3002330, 4560671, 6850911, 5112510, -1114966, -6999825, -8855910, -7799549, -6154952, -4159885, -1909827, -959029, -1598352, -1373904, 1258269, 4263290, 5415029, 5891934, 7640543, 9300053, 8142518, 4708826, 2076311, 1203725, 270416, -1559321, -2828712, -2598477, -1907652, -1761594, -1777936, -1488542, -1199113, -951031, -167516, 1167804, 2325382, 3093405, 3849899, 4248276, 3425257, 1774173, 813075, 811265, 237819, -1702950, -3575899, -3764220, -2759190, -2300163, -3086603, -4286156, -4700366, -3750085, -1901660, -581358]
6544e81358l95294j595508j146348k21047n34972j416019n93253K111067L900451
6535d72281K546481n75809j966510O4162L539152M785773K284178j439278k471122
6526F294746l88988Q43373j935235o341938p149269l228439R05676J155540r83736
6517a0828270j052059K027975M546405L009894j217825l400844j008269L417749
6509d505244N408971L690784R91840L0786L49801j34252j811920l056544k612609
6500a648387q94388R98799K364421K753378J655419r98151m038866n159005k640772
6491g607552K258130N334630L487886j280549l780510j896137J257185K207078
6483a9839J444550J084837Q73405n39773k146450j766072K31960J547153J649402
$$ y = [-581358, -976652, -2572160, -3718508, -3939555, -4474527, -5890546, -6483799, -4372732, -472281, 2074200, 1498391, -468119, -403957, 3135195, 7920968, 10205146, 8765868, 6294746, 5905758, 6749131, 4813896, -1528042, -8677311, -11905750, -11000074, -9844534, -10828270, -11880329, -9852354, -5305949, -2296055, -3513880, -6914724, -7922993, -4505244, 903727, 4594511, 5586351, 5617137, 5966938, 5832686, 4020766, 964222, -1648387, -2542775, -1543976, 820445, 3573823, 5229242, 4231091, 192225, -4966780, -7607552, -5349422, -14792, 3473094, 2192545, -1587965, -3484102, -2226917, -19839, 1424711, 2509548, 3382953, 2843180, 696730, -1069342, -837382, 709771, 2359173]
6474B359173J715722J413385p12382l631900m248694k004366L46733J292168K271354
6465a198807L645526K832615j278114n284254n423580k387254O04692K320230
6457f168946L343296L382798J940289M35918O67653J877678J916203O00755n26048
6448G469596j028462j624323k006683j211253J95489P36770M88061N28103M70135
6439D017433o57131j459636N23594M249612N358182K030898k414189m199349l413198
6430D036216j889424J88921K790371L565916N42144l756810m492626r31600K379842
6421B432950J632820j609188l150157j596285Q30383J911184J820194J764323
6413D036224J801280J025366n97965j717799j341552m20964p76269k497135l447763
$$ y = [2359173, 4074895, 5488280, 4775898, 1143998, -3104696, -5109062, -4762329, -3470161, -1198807, 2446719, 5279334, 4001220, -1283034, -6706614, -9093868, -8489176, -6168946, -2825650, 557148, 2497437, 2933355, 3601008, 5478686, 7394889, 7995644, 7469596, 6441134, 4816811, 2810128, 1598875, 1794364, 2531134, 3019195, 3547298, 4017433, 3360302, 1900666, 2424260, 6673872, 12032054, 14062952, 11648763, 7449414, 4036216, 2146792, 2335713, 5126084, 8692000, 9234144, 5477334, 984708, 53108, 2432950, 4065770, 2456582, -693575, -2289860, -1459477, 451707, 2271901, 4036224, 5837504, 6862870, 6264905, 4547106, 3205554, 2784590, 2008321, -488814, -3936577]
6404c936577j881293J264433L507610L651799K394276N43775j762957l739955
6396D1111l528259m39160L242948M303322K322762m8114o99905m25607r51659
6387C817439k072091k263254j377889q92923j464945j918638j186633J62685J144040
6378f052209J859200K652416K778053J442356l38003o33747N47511R44240p66144
6369B433673k827586k666801m70555J067950N27601l48772N70323K347661K074676
6360B708170p03627k700685j179195J981760K577554j04385k193837n33228L133601
6351B986128M693205K790884m26538k691074l594047l455680k349017q26264j03510
6342b975913o32619j298255p21218J077283K693190K746879J224298l33253k96439
$$ y = [-3936577, -5817870, -4553437, -1045827, 2605972, 5000248, 5544023, 3781066, 41111, -3487148, -3926308, -683360, 3619962, 5942724, 5894610, 5194705, 4769098, 3817439, 1745348, -517906, -1895795, -2788718, -4253663, -6172301, -7358934, -7196249, -6052209, -4193009, -1540593, 1237460, 2679816, 2341813, 1708066, 2255577, 3199817, 2433673, -393913, -3060714, -3531269, -2463319, -1935718, -2284490, -1714167, 633494, 2708170, 2004543, -696142, -1875337, 106423, 2683977, 2579592, 385755, -147473, 2986128, 7679333, 10470217, 10043679, 7352605, 3758558, 302878, -2046139, -2872403, -2975913, -3608532, -4906787, -5628005, -4550722, -1857532, 889347, 2113645, 1780392, 1483953]
6333A483953R78600J251810n30506k191211j085046J635247K002980j035566l467505
6324i57244j424001L351938N530528K790823j873290m283342l462880j433026
6316a760494k81274m76408j285566j802431j559113o29888N75061J532990J792663
6307c894460J343891Q29847Q35559Q62023j45587j862843k270590k49276K391111
6298b160325K869844R93950p28937m64191R64185J764959J465168P86617K18231
6289E709501m00747j256153k066394k138910j006441O32973J047026n80879k716041
6280b776065l211532k147999j287088r15809M04621K518454K959455J033099j94721
6271c617585J497725L312082J363241k837944m135499j503676N97144n30121j902308
$$ y = [1483953, 2462553, 3714363, 3183857, 992646, -92400, 1542847, 3545827, 2510261, -957244, -2381245, 970693, 6501221, 9292044, 7418754, 3135412, -327468, -1760494, -2041768, -2518176, -3803742, -5606173, -7165286, -7795174, -7220113, -5687123, -3894460, -2550569, -1720722, -885163, -23140, -168727, -2031570, -4302160, -4551436, -2160325, 709519, 1703469, 974532, 510341, 1474526, 3239485, 4704653, 5491270, 5709501, 5308754, 4052601, 1986207, -152703, -1159144, -526171, 520855, -60024, -2776065, -5987597, -8135596, -9422684, -10338493, -9933872, -7415418, -4455963, -3422864, -3617585, -2119860, 1192222, 2555463, -282481, -4417980, -5921656, -5324512, -5854633, -7756941]
6262g756941m49511J653990Q87466j391816j086562J809870L145380J197942r84740
6253b974922p44556M67759L26395m44254J59206J730865K208539J305774P35948
6244B770754J285785J752656J064267j37126o05921j46864M56126N56095J69866
6235G165638l12282n87350o99469r56056j495201j940783j673089n54458O74883
6226c78167Q85038l54420k100033k675461j253260J267779L155211L515305K892887
6217D954879K338575K113947J363449p91918l621661m734299k667452O42629J583141
6208A181290m90661k238519j098924J072747J261282J85620O23747K053242J207468
6199C757292j870516k858751J20711K917803J356703k412915l246111n58533J519461
$$ y = [-7756941, -8206452, -6552462, -5664996, -7056812, -8143374, -6333504, -3188124, -1990182, -2974922, -3719478, -3251719, -2925324, -3369578, -3210372, -1479507, 729032, 2034806, 2770754, 4056539, 5809195, 6873462, 6736336, 6130415, 5983551, 6439677, 6995772, 7165638, 6853356, 6266006, 5566537, 4610481, 3115280, 1174497, -498592, -1053050, -378167, 506871, 152451, -1947582, -4623043, -5876303, -4608524, -1453313, 2061992, 4954879, 7293454, 9407401, 10770850, 9978932, 6357271, 1622972, -1044480, -401851, 1181290, 690629, -1547890, -2646814, -1574067, -312785, -127165, 496582, 2549824, 3757292, 1886776, -971975, -851264, 2066539, 3423242, 1010327, -2235784, -2794317, -1274856]
6190a274856O54012r88192q26385O42765J483839J142045M31834J07836K66549
6181A639447K93169p88008k955537m329391k932711O99234L887315M760512L700137
6172C974167K031804O31859j46958l85429n53117p68038n02824J19622k98768
6163D102318k317670l952647l070439o61717N97490L72241N14475J261696Q05389
6154b348864j012336j811476m56401J171814J370570Q58849N44888j55240j183642
6145c021838q24358J197905K258037P61322j023669p27848K0049j405674l567267
6136f333341k868824N73640K976886K510408J122043N67235K41817k65824J64674
6127a311286J585168J814679l90278l022715l318885j086929J720806L348262
$$ y = [-1274856, -620844, -1609036, -2435421, -1792656, -308817, 833228, 1265062, 1372898, 1639447, 1932616, 1144608, -1810929, -6140320, -9073031, -8373797, -4486482, 274030, 3974167, 6005971, 6637830, 6490872, 6105443, 5552326, 4784288, 4281464, 4401086, 4102318, 1784648, -2167999, -5238438, -5900155, -5302665, -4930424, -4415949, -3154253, -2348864, -3361200, -5172676, -5629077, -4457263, -3086693, -2227844, -1682956, -1838196, -3021838, -3846196, -2648291, -390254, 371068, -652601, -1380449, -1360400, -2766074, -6333341, -9202165, -8628525, -5651639, -3141231, -2019188, -1451953, -1210136, -1475960, -1311286, 273882, 2088561, 1698283, -1324432, -4643317, -5730246, -4009440, -661178]
6119f61178K985338O02826k567306m345610l573530j157779J358893L182919L761790
6110d13637K498386K6565j646867j557947j112447j639892j910866L1372L359812
6101b365521M887915K987084n76642k974202l225774k449337k095328k285961
6093h097766j621218J053852M379863N037309J697773k593583l783454j928880
6085e856104o96334j861045k996247j495871J652182L814738M417355M472019
6077A450693L823775J548154j398813k553652j327081L2562n01539k264229l096973
6068d287103j747152J350854M394657M973063K011494k484917n064497m680908
6060e534509l277097k165647l10276K567364L979452K257637p7986K42905J983466
$$ y = [-661178, 2324160, 2926986, 359680, -3985930, -7559460, -8717239, -7358346, -4175427, -413637, 2084749, 2111314, 464447, -1093500, -2205947, -3845839, -5756705, -5725333, -2365521, 2522394, 5509478, 4932836, 1958634, -1267140, -3716477, -5811805, -8097766, -9718984, -8665132, -4285269, 752040, 2449813, -143770, -3927224, -5856104, -6552438, -8413483, -11409730, -12905601, -11253419, -7438681, -3021326, 1450693, 5274468, 6822622, 5423809, 2870157, 1543076, 1575638, 1074099, -1190130, -4287103, -6034255, -4683401, -288744, 4684319, 6695813, 4210896, -853601, -5534509, -8811606, -10977253, -11287529, -8720165, -4740713, -2483076, -2561062, -2318157, -334691]
6051c34691J332905j735825l323351k025441r68682j955845j948577J680415N832797
6042c446295N578040J353218j865364j716411o77188r84350j349398k31009Q56722
6033b482035j63698k037394j598648J485978L902856L023347J42007j621226j348216
6024f97029p67442j211193j843388j339946K3966R37750Q63314K10900o71230
6015d494298j481597j393320J19726K059817K859562K423514J783090R66327q25130
6006B017691k805902k761849m84813J201689K63411j635162j752134j32029J117263
5997d971835J082187M83192j61362p44255o73198L10462J108846Q92706Q53130
5988a820127K229207L545195K447569k85656j526503n28833J54865j083835k773966
$$ y = [-334691, 998214, -737611, -4060962, -6086403, -7055085, -9010930, -10959507, -9279092, -3446295, 2131745, 3484963, 1619599, -96812, -774000, -1758350, -3107748, -3338757, -2482035, -2645733, -4683127, -6281775, -4795797, -892941, 2130406, 2272413, 651187, -697029, -1464471, -2675664, -4519052, -5858998, -5835032, -4897282, -4033968, -3823068, -4494298, -5975895, -7369215, -7249489, -5189672, -2330110, 93404, 1876494, 2842821, 2017691, -788211, -3550060, -4034873, -2833184, -2569773, -4204935, -5957069, -6089098, -4971835, -3889648, -3406456, -3567818, -4312073, -4985271, -4674809, -3565963, -2673257, -1820127, 409080, 3954275, 6401844, 6116188, 4589685, 4060852, 4215717, 3131882, 357916]
5979C57916l397654l638905m130496l553859r20895K260254M016918M354115L834858
5970h17748J719928j975460m267336k330857J825615L183904M47395k251961j393761
5961e860281J177936J562961m24645j653680p32919M61870M24891K45749J064178
5952c733940J780534J251111Q35570K082911L167537J132973k501558k501818
5944A513320K221683N476682J811284n139216o849054j361121M297444L780883
5936E751905r76514l898298k873779n18273R03886J580588J825804J014108n74873
5927B234554j251241k79871Q39478M90482q26693j492566j180561r68273j300474
5918c735165j134776N08660L020547M799326M797730K929635l36162l748016n155968
$$ y = [357916, -3039738, -6678643, -10809139, -14362998, -15283893, -13023639, -9006721, -4652606, -817748, 902180, -1073280, -5340616, -7671473, -5845858, -2661954, -2214559, -4466520, -5860281, -4682345, -3119384, -3544029, -5197709, -5930628, -5468758, -5043867, -4798118, -3733940, -1953406, -702295, 133275, 2216186, 5383723, 6516696, 4015138, 1513320, 3735003, 9211685, 11022969, 5883753, -965301, -2326422, 1971022, 5751905, 4775391, 877093, -1996686, -2514959, -1611073, -30485, 1795319, 2809427, 2234554, 983313, 703442, 1542920, 2033402, 1206709, -285857, -1466418, -2434691, -3735165, -4869941, -4361281, -1340734, 3458592, 8256322, 11185957, 10849795, 7101779, 1945811]
5909A945811l240481L75365K248170J067364q19144p47670P47696J172897k73986
5900B476022k122448l123644l358051k878165j130862J655630L788356L600397
5892a092765J141894j822340l152957j978349M04665J682910J152279M23895P76272
5883b464496J088495j20732j820957j738481K61306K279440L280692L469085K291862
5874F526214r65239m488444m940573j957293J060735J579259P61855O43855J188842
5865e90789J623456K180833K747112K007199j90258j697627j276895r11059k607198
5856A284774m685048l972127n88234K122531J955527p4768j787140k126324j401048
5847i271857m88827J92080J334246L584993N537509M630966Q55259k494644l026959
$$ y = [1945811, -1294670, -919305, 1328865, 2396229, 1577085, 829415, 1577111, 2750008, 2476022, 353574, -2770070, -6128121, -9006286, -10137148, -8481518, -4693162, -1092765, 49129, -1773211, -4926168, -6904517, -6499852, -4816942, -3664663, -3240768, -2464496, -1376001, -1496733, -3317690, -5056171, -4794865, -2515425, 765267, 4234352, 6526214, 5560975, 1072531, -3868042, -5825335, -4764600, -3185341, -2423486, -1779631, -590789, 1032667, 3213500, 5960612, 7967811, 7777553, 6079926, 4803031, 3891972, 1284774, -3400274, -7372401, -7960635, -5838104, -3882577, -3957345, -5744485, -7870809, -9271857, -9760684, -9568604, -8234358, -4649365, 888144, 5519110, 6374369, 3879725, 852766]
5838H52766k017469j360638l21015K149864M133373L095930J35915j401483o87358
5829D579885K62379K79818K2699j85195n35594k86292R51403J237229j041161
5820E285171l303372j658149K552450L751752M23615k463058j231388R99740j41464
5811D215297l011171k587365J685395N060712L996461l5040l491944m772171m525225
5802c465051l779755k709681o84789K540327N466841N652344K825418J02430M52652
5793F400736K615972K526385j217441n270498n613696k221661J405975K454329
5785A080101J288035M0230n6884N26894Q11832N36028J61998J01880J66398k86539
5775D369973j604832l115010l442682k060549k85400Q7149q45357j072828O64088
$$ y = [852766, -1164703, -2525341, -2846356, -696492, 3436881, 6532811, 6668726, 5267243, 4579885, 4842264, 5122082, 5144781, 4959586, 4423992, 4137700, 5089103, 6326332, 5285171, 1981799, 323650, 2876100, 6627852, 7051467, 4588409, 3357021, 4356761, 4215297, 1204126, -1383239, 302156, 5362868, 9359329, 9324289, 5832345, 1060174, -3465051, -7244806, -9954487, -10639276, -8098949, -2632108, 3020236, 5845654, 5948084, 6400736, 9016708, 11543093, 10325652, 5055154, -558542, -2780203, -1374228, 1080101, 2368136, 2408366, 2351482, 2878376, 3690208, 4226236, 4388234, 4490114, 4656512, 4369973, 2765141, -349869, -3792551, -5853100, -6138500, -6051351, -6896708, -7969536, -7305448]
5766g305448L175898M321284L326730J056382j116906k077939j560975o69157
5758h50131q28642j634127j085751J196283K695571J374448j257752k288455j244913
5749c923469K54824J378610K158964J760299m74175k721428k268238O00605K802910
5740d31098K540965Q06137r83909k159090j724661Q06031L192330K294856j099613
5731C241948k483830J07411L141586K660560m32934k371274j709292j76373L57993
5722B335795j90675n59263N16913K601089L099756K48548l465854l586395Q2815
5713A082729K775603J504429j046835j391483l89553n16056j143769l54675Q77270
5704A397660L99359q53687m42519Q45448J09789k325331k986488q83588R96124
$$ y = [-7305448, -4129550, 191734, 3518464, 4574846, 3457940, 1380001, -180974, -850131, -1678773, -3312900, -4398651, -3202368, -506797, 867651, -390101, -2678556, -3923469, -3668645, -2290035, -131071, 1629228, 1155053, -1566375, -3834613, -3234008, -431098, 2109867, 2916004, 1932095, -226995, -1951656, -1145625, 2046705, 4341561, 3241948, 758118, 865529, 4007115, 6667675, 6234741, 3863467, 2154175, 1977802, 2335795, 2145120, 1585857, 2102770, 4703859, 7803615, 8052163, 4586309, 999914, 1082729, 3858332, 5362761, 4315926, 2924443, 2534890, 2018834, 875065, 520390, 1397660, 1797019, 943332, 500813, 1346261, 1456050, -869281, -3855769, -4739357, -3743233]
5695c743233O64576p1404Q61562K594177L261161K681111J542773J3786j418780
5686F385729j628780p13441l76543j215068j581815o06821k25380k070093m123315
5677f155527l226751K8784J869824O94911r83177o49499P51755J040874N00213
5668f128593J012680K455665K573762O27081j210697j102284k03405l94918q79357
5659c250066N51096L386490M153692R38964l756466n731360l501825P64632L702186
5650b742657L403973N40302k364184l201809k111914o48975L91097J140963J232611
5641d360593J94141p98235R0613K220202K839976J321798K14737P76790N33215
5632C032644k404206n281910m107862O09062M642885N422861L706190R09956k073363
$$ y = [-3743233, -3078657, -3150061, -2288499, 305678, 3566839, 6247950, 7790723, 7804509, 6385729, 4756949, 4043508, 3666965, 2451897, 870082, 263261, 37881, -2032212, -6155527, -9382278, -9353494, -7483670, -6788759, -7771936, -8421435, -7669680, -6628806, -6128593, -5115913, -2660248, -86486, 540595, -670102, -1772386, -1975791, -2370709, -3250066, -2698970, 687520, 4841212, 5780176, 2023710, -3707650, -7209475, -6444843, -2742657, 661316, 1201618, -1162566, -4364375, -6476289, -7125264, -6734167, -5593204, -4360593, -4166452, -4964687, -4874074, -2653872, 186104, 1507902, 1722639, 2499429, 3032644, 628438, -4653472, -8761334, -8152272, -3509387, 1913474, 5619664, 6529620, 4456257]
5623D456257l862897l388763j704394o10139J60805J844413L317793K110860j137738
5614A186197k589399n09194K208230K129184m69860k882830l505300k505487n39069
5605g477528J502908K376256J560507R2940n16962M9284P23119K43454j446911
5596b892933k691211j530939J695860L994852L124026N19210p32308j4459P16427
5587B188525L70408q0650K39986J009222J882368K695015K474675N02712j597021
5578I685240j357439O89048J393821k60199j747348j314259o58412j675710l286932
5569A467810l565061k731265j881402q18903N16498M33421j896488l652970j327282
5560a3455642M049767P456755N792284J060105k605678l256581j985862q18519
$$ y = [4456257, 593360, -2795403, -4499797, -5109936, -4949131, -3104718, 213075, 2323935, 1186197, -1403202, -1912396, 295834, 2425018, 1955158, -927672, -4432972, -6938459, -7477528, -5974620, -3598364, -2037857, -1944917, -2461879, -2412595, -1689476, -1446022, -2892933, -5584144, -7115083, -5419223, -1424371, 1699655, 2218865, 1486557, 1472098, 2188525, 2558933, 2478283, 2718269, 3727491, 5609859, 8304874, 10779549, 11282261, 9685240, 8327801, 9016849, 10410670, 10150471, 8403123, 7088864, 6430452, 4754742, 1467810, -2097251, -4828516, -6709918, -7528821, -7012323, -6578902, -8475390, -12128360, -13455642, -9405875, -1949120, 3843164, 4903269, 2297591, -958990, -2944852, -3763371]
5552c763371m32252L33021K535035M698314L742931o48742m223981k838570J931911
5543A334296M331161J490656l408693n543439l841671q52071J066235J723485
5535c700041K011215K457280K994138L186075K352180P1705k932588m694463l516779
5526a771278N2621L220338L619859J850287N26417P51686P15879j471537m608565
5517B885707n542497l262256k95185N49150l79689n07232J261696L263208L565507
5508A538409K226413L36795j758834l795708m201456j666473J990399K982948
5500b347507L94527k323334k003979Q5520O33132q30218j879514j140016K31723
5491i179666Q37666O87821M07585L94030Q11544J211714N69867j022618j559833
$$ y = [-3763371, -4195623, -3862602, -1327567, 3370747, 7113678, 6464936, 2240955, -597615, 1334296, 5665457, 7156113, 3747420, -1796019, -5637690, -6489761, -5423526, -3700041, -1688826, 768454, 3762592, 6948667, 9300847, 9372552, 6439964, 1745501, -1771278, -1718657, 1501681, 5121540, 6971827, 7498244, 8249930, 8965809, 7494272, 2885707, -2656790, -5919046, -6214231, -5665081, -6044770, -6552002, -5290306, -2027098, 1538409, 3764822, 4101617, 2342783, -1452925, -5654381, -7320854, -5330455, -2347507, -1952980, -4276314, -6280293, -6194773, -5561641, -6391859, -8271373, -9411389, -9179666, -8342000, -7654179, -7246594, -6852564, -6041020, -4829306, -4259439, -5282057, -6841890]
5482f841890K52731K522541K516591O53098m18373m2148J51639j58795M77819
5473h86787J878138J868734K23538m13750J120266K404483J391823m37379r20829
5464F228237o55339j317623k629675l271740l186064k990596k577055j914468
5456a2314323j582051j075248J272530M973042O486791L994941O77897L22872
5448B756451J771753J213227j562904l122527j922435l4965P45879R70764J070228
5439A885471Q1476j882551k551652o15232J911838K203176L34871j178020r29916
5430g40539r5862k91820j303270j740921j255603q32292p86970O7488K290098
5421d689691M126306L615774J511459N8120n04635j698549l319758l194743r05454
$$ y = [-6841890, -6589159, -4066618, -1550027, -896929, -1315302, -1357450, -1205811, -1364606, -886787, 991351, 2860085, 3083623, 2669873, 3790139, 6194622, 7586445, 7149066, 6228237, 5572898, 4255275, 1625600, -1646140, -4832204, -7822800, -10399855, -12314323, -13896374, -14971622, -13699092, -8726050, -2239259, 1755682, 2433579, 2756451, 4528204, 5741431, 4178527, 1056000, -866435, -901400, -155521, 815243, 1885471, 1966947, 84396, -2467256, -3082488, -1170650, 1032526, 1367397, 189377, -740539, -836401, -1128221, -2431491, -4172412, -5428015, -6260307, -7047277, -6979789, -4689691, -563385, 3052389, 4563848, 4621968, 4117333, 2418784, -900974, -4095717, -5001171]
5412e001171J206026J676340J673362J958993J159640j225995k966218k333108
5404c852131p19777j5823J37441M39859j7904j475467k009035q57038l76342j850467
5394a0596684k512984l00540J623512l71872l745859l178642J107934L927138
5386a4047997L131988J536035J075727O05803P0220J471649M273362M707819J656006
5377D480612j037254m33391J075257k1501k708363l146002k47822L216881M318540
5368E496957K796782M80724q94097j153637j202919j340620j077555r05692k210051
5359a0108m155034l282164J283129M884289L264257q37380j623726R86608K068495
5350B578366K94037m84721J228018J858025m91438k381709r72713J340179J430926
$$ y = [-5001171, -3795145, -2118805, -445443, 1513550, 2673190, 1447195, -1519023, -3852131, -4571908, -4587731, -4450290, -4010431, -4028335, -5503802, -7512837, -8369875, -8746217, -10596684, -13109668, -13410208, -11786696, -12158568, -15904427, -19083069, -17975135, -14047997, -10916009, -9379974, -8304247, -7698444, -7628224, -6156575, -1883213, 2824606, 4480612, 3443358, 3009967, 4085224, 4063723, 1355360, -1790642, -2038464, 1178417, 5496957, 8293739, 8774463, 7880366, 6726729, 5523810, 4183190, 3105635, 2199943, -10108, -4165142, -7447306, -6164177, -1279888, 1984369, 1146989, -476737, 509871, 2578366, 2872403, 2387682, 3615700, 5473725, 4982287, 2600578, 1627865, 2968044, 4398970]
5341D398970K68883j35395o91153k450905l274349j200007J575017J946588Q36983
5332A274632J026454J983525R29572k045060l777509k669086m43305P57811O61874
5323b301092J91961K83786J352878K748740L081192J885716K08711j039846k088171
5314D323875l050823l218917k351244j119136K59843J963615K840984J326590
5306I74787j299954j645325O57738J858217j58806k461071j816110L82306R62208
5297b546010K3552k30522L99234N79057M60897J045538J768301J617721J494370
5288D612138K652150L833289K715500n20672l459813m576641m064220k468226
5280a276495m83899P54426Q76932Q15037R41164K80458j197232j681910m83603
$$ y = [4398970, 4667853, 4532458, 3841305, 1390400, -1883949, -3083956, -1508939, 437649, 1274632, 2301086, 4284611, 5214183, 3169123, -608386, -3277472, -3720777, -2962966, -2301092, -2109131, -1825345, -472467, 2276273, 5357465, 7243181, 7451892, 6412046, 4323875, 1273052, -1945865, -4297109, -5416245, -5156402, -3192787, -351803, 974787, -325167, -1970492, -1312754, 545463, 386657, -2074414, -3890524, -3508218, -2546010, -2522458, -2752980, -2353746, -1774689, -1313792, -268254, 1500047, 3117768, 4612138, 7264288, 11097577, 13813077, 13292405, 9832592, 5255951, 1191731, -1276495, -1760394, -1005968, -129036, 686001, 1627165, 1907623, 710391, -971519, -1455122]
5271a455122N50529L28606L83811J351985R12671j834500l329535o87384L105387
5262f73552L467077J153130J50688P41232l8259k223402k620973m86605J308343
5253G77679J047612k2804q26843j533371j393344P25107L417464L850513J929857
5244G971870J17549p19538j881914l509442m175813l642860k762869j225197J169203
5235h659011K122051k4000j874908J108443O743360P885434K576429l220091m264287
5226B393420k033592l50228j33806p30397j918525k314974Q0420L750004M277286
5217C019608R86837j563494p87627K13880j154240k265251m52924J826819J410978
5208A234586n6305K72338Q88799r66685l562348l299326q65772M08016N06732
$$ y = [-1455122, -904593, -575987, -192176, 1159809, 2072480, 237980, -3091555, -3778939, -673552, 2793525, 3946655, 4097343, 4838575, 4800316, 2576914, -44059, -530664, 777679, 1825291, 1802487, 975644, -557727, -1951071, -1225964, 2191500, 6042013, 7971870, 8089419, 7369881, 5487967, 1978525, -2197288, -5840148, -8603017, -9828214, -8659011, -6536960, -6560960, -8435868, -7327425, -584065, 7301369, 9877798, 6657707, 2393420, 359828, 9600, -124206, -854603, -2773128, -5088102, -5007682, -1257678, 3019608, 4006445, 2442951, 1655324, 1869204, 714964, -1550287, -2003211, -176392, 1234586, 1178281, 1450619, 2339418, 1372733, -2189615, -5488941, -6354713, -5946697, -5439965]
5199e439965J713560L030566J324238k376729l377243o84333J324788n2986j844882
5190f382986o02927K289858L305529J999983O06817J02320m70695j391998j423734
5181a967833P7772J780224J949946P81027K01357J159448J976910M66470k657499
5172C767822m099309k164746R76686K236748J404425N17423N00356L03097r15791
5163B526711k419561k978937k294482j027832O4894R06042K086797L742163M529423
5154E135218K784249q91142l434082k716010k08846R58909m6370j228459j026710
5145f73243m99108j430251l257574l407220r02169J841084K101350O81132M32837
5136e113162J386503O05724k206845k792609J260655N566720M556952k93763k836128
$$ y = [-5439965, -3726405, -695839, 628399, -1748330, -5125573, -5809906, -4485118, -4538104, -6382986, -6985913, -4696055, -1390526, 609457, 1216274, 1318594, 847899, -544099, -1967833, -1890061, -109837, 1840109, 2621136, 2822493, 3981941, 5958851, 6425321, 3767822, -331487, -2496233, -1519547, 717201, 2121626, 2639049, 3139405, 3442502, 2526711, 107150, -2871787, -5166269, -6194101, -6129207, -5223165, -3136368, 605795, 5135218, 7919467, 7028325, 3594243, 878233, 669387, 1628296, 1581926, 353467, -673243, -1172351, -2602602, -5860176, -9267396, -10169565, -8328481, -6227131, -5545999, -5113162, -3726659, -3120935, -5327780, -8120389, -6859734, -1293014, 3263938, 2970175, 134047]
5127A34047j441520j14554o24162J63927L464846M972180J357444m000390n450402
5118a538584k201741K114831M386442L704107O27152k497480k750589n34129K43695
5109A553704j984259l624340j693166J149294J118441l32938O77800L600497M416786
5100D881819K196167p8158o05217l42822P2663P84798L79999k621705n830255
5091a162711m857569J60130L927924L018529j17709j571263r40715N9526J005154
5082d78704K303135L260988K951637J891587J079328K89473j088894k270808j810405
5073F127337N8795J265542M71276j196024j771652j272888j572572l181865l772229
5064d844280j355460K272073L530793J963643M99950Q39536J540167J263256P83794
$$ y = [134047, -1307473, -1422027, -2046189, -1882262, 1582584, 6554764, 7912208, 3911818, -1538584, -3740325, -1625494, 2760948, 6465055, 7092207, 4594727, 1844138, 1310009, 1553704, -430555, -4054895, -5748061, -4598767, -3480326, -3813264, -3135464, 465033, 4881819, 7077986, 6999828, 6394611, 6051789, 6124452, 6909250, 7289249, 4667544, -1162711, -6020280, -5860150, -1932226, 1086303, 968594, -602669, -1543384, -1483858, -478704, 1824431, 5085419, 8037056, 9928643, 11007971, 11297444, 10208550, 7937742, 6127337, 6186132, 7451674, 7922950, 6726926, 4955274, 3682386, 2109814, -1072051, -4844280, -6199740, -3927667, -396874, 1566769, 2066719, 2906255, 4446422, 5709678, 6493472]
5055F493472O36397j22713j303758r00773J139607J760745l14463j971974q62919
5046D553621L35146j434371l870503k852266N96196J897269J47831j164381j41288
5037a932746J334718J385915K74800j257209k493029k003753L49446J558696p18995
5028c502157l504360j960393L108806N937949L984294O78626n46989k98280j68569
5019C728927j3887J41699p48761k094638j529662J075485K682820J638897M5645
5010D926525N7755Q27641Q86107Q63767J875023L178957L123298J135578j941315
5001A4933336m207398l647118o80673R06363j658361n550891n641603j838224
4993g384569J087435R91263Q08517K571065L960277K871873J027839M57260J10419
$$ y = [6493472, 7129869, 7007156, 5703398, 4802625, 5942232, 7702977, 7388514, 5416540, 4553621, 4888767, 3454396, -416107, -3268373, -2672177, -774908, -627077, -1791458, -1932746, -598028, 787887, 1062687, -194522, -2687551, -4691304, -4341858, -2783162, -3502157, -7006517, -8966910, -5858104, 79845, 4064139, 4742765, 4195776, 3897496, 3728927, 3715040, 3856739, 3107978, 1013340, -516322, 559163, 3241983, 4880880, 4926525, 4984280, 5811921, 6698028, 7561795, 9436818, 12615775, 15739073, 16874651, 14933336, 10725938, 7078820, 6398147, 7304510, 5646149, 95258, -5546345, -7384569, -6297134, -5305871, -4497354, -1926289, 2033988, 4905861, 5933700, 6390960, 6501379]
4984F501379j270240k141529q92936J052466J577244J120097J192450J598040
4976H736971J277441K45235j005917k378929l250596k616087j101052n77670j007423
4967a678027l95343J278293J364791q61043k325367p91417J760660K553438J940672
4958B846657J606369J433755O19573j90855j19762K73498J72847l68037j524292
4949D749753l679982n386635m104147j72648K850605L109060K615343L091768
4941C073117L062710J117955j062822j311043j05063Q86474J105327M15476j410748
4932E771383l161966k704200j83019J854321K173738J740059P61137j319920k714198
4923B217335q21129K552767K633530p38072k488182n11242J482368R78135J54845
$$ y = [6501379, 5231139, 3089610, 2196674, 3249140, 4826384, 5946481, 7138931, 8736971, 10014412, 10259647, 9253730, 6874801, 3624205, 1008118, -92934, -670604, -1678027, -2073370, -795077, 569714, -291329, -2616696, -3408113, -1647453, 905985, 2846657, 4453026, 5886781, 6506354, 6315499, 6195737, 6469235, 6642082, 6274045, 4749753, 1069771, -4316864, -8421011, -8593659, -5743054, -2633994, -18651, 3073117, 6135827, 7253782, 6190960, 4879917, 4774854, 5661328, 6766655, 7182131, 5771383, 2609417, -94783, -277802, 1576519, 3750257, 5490316, 6251453, 4931533, 2217335, 1396206, 3948973, 6582503, 5844431, 3356249, 2845007, 4327375, 5305510, 5460355]
4914E460355K48715q43605k660088r63702M171387O282616K597466j041877J5157
4905A3266424J836941j58990k961846k023248O61144J002665j29515k80919n07393
4896A0705263j754016j775505l20093q31093k856896r81104M382648N295663N57943
4887A2422810m60634N138199P073778R92727j840084M373300P136773p06055m258508
4878B9872306O156595J2415544P20567o196339J2008254K0854467k8357152j08384282
4870f0910040j27690846n1161526M4946584P1291398L3898022K542999O824137
4863h0259272J7089469J0754538J948232L532628M928147j101055l129667M917608
4855d1319372J0542904N480394J19696L597220Q064945M495893j515260j390535
$$ y = [5460355, 5709070, 4865465, 2205377, 1241675, 5413062, 11695678, 14293144, 13251267, 13266424, 15103365, 14944375, 11982529, 9959281, 10620425, 11623090, 11493575, 11212656, 10705263, 8951247, 7175742, 6855649, 6024556, 3167660, 2186556, 6569204, 11864867, 12422810, 11962176, 17100375, 24174153, 25166880, 23326796, 27700096, 34836869, 34130814, 29872306, 36028901, 48444445, 49165012, 42968673, 54976927, 75831394, 47474242, -60910040, -188600886, -239762412, -194815828, -123524430, -89626408, -87083409, -80259272, -63169803, -52415265, -50467033, -46934405, -42006258, -43107313, -46236980, -41319372, -30776468, -25296074, -25176378, -21579158, -13514213, -9018320, -10533580, -11924115]
4847a1924115J814241J382250r24911o08698L58515j208910k649311j072346P52860
4838a4080425M03865Q37512L599621M055825m86415m530632k615612K086459L616605
4829g113197K354086K056041K393292P70844j789338k280656q32782K70949N08377
4820c662384N82677L11741k09087P7682O57014o12925l286755l901417j578915
4811a1622369K65003j34313j5748K215929L333216P37928k757821l251700j186838
4802a2416713Q30475K111579K714033J779618L7174L13960K646302K859618p74428
4793A01618l670037j597905K622395L450151M70211k460315l277340k671001j150393
4784h182616Q09848J353682m85872k485816k035740K92323K209840K718579J705380
$$ y = [-11924115, -10109874, -8727624, -9652535, -10261233, -9902718, -11111628, -13760939, -14833285, -14080425, -13676560, -12839048, -9239427, -5183602, -5670017, -10200649, -12816261, -10729802, -7113197, -4759111, -2703070, -309778, 461066, -1328272, -3608928, -4441710, -4170761, -3662384, -3079707, -2767966, -2977053, -2899371, -2242357, -2855282, -6142037, -10043454, -11622369, -11357366, -11491679, -11507427, -9291498, -5958282, -5220354, -7978175, -11229875, -12416713, -11586238, -9474659, -6760626, -4981008, -4943834, -4629874, -1983572, 876046, 101618, -3568419, -5166324, -2543929, 906222, 1376433, -1083882, -4361222, -7032223, -8182616, -7372768, -6019086, -6504958, -8990774, -11026514, -10734191, -8524351, -5805772, -4100392]
4775d100392p98981k911653j646511K266916L866346R84032k128978j519952L38632
4766e650541n20213k415445j202262K216528L261484R75663j200136r81779Q53758
4757d662943L141127M836996L932324j78281m205306m493025j932345K1487N85886
4748b954080J166087J435427J62477j428232j311075l72403m33663k67803J895886
4739b107379L691042J704686k105072k809725n11787J62137j597604j480002J913763
4730c139941M097077J963983j438885k173362q83347q4935J34621O11814L64424
4721e48551j594930l800796m114133k404943Q2155K329449L366966K379538Q0668
4712d224577j631638j937077j383244j41521J699880K549649J093731n89083P38491
$$ y = [-4100392, -4899373, -7811026, -9457537, -7190621, -3324275, -2340243, -4469221, -5989173, -5650541, -6170754, -8586199, -9788461, -7571933, -4310449, -3334786, -4534922, -5516701, -4662943, -1521816, 3315180, 7247504, 7069223, 2863917, -1629108, -3561453, -3539966, -2954080, -1787993, -352566, -190089, -1618321, -2929396, -3301799, -3735462, -4003265, -2107379, 1583663, 3288349, 1183277, -1626448, -2138235, -1976098, -3573702, -5053704, -3139941, 957136, 2921119, 1482234, -691128, -1574475, -1659410, -1524789, -912975, -548551, -2143481, -5944277, -10058410, -12463353, -12381198, -10051749, -6684783, -4305245, -4224577, -5856215, -7793292, -9176536, -9318057, -7618177, -5068528, -3974797, -4563880, -3825389]
4703c825389M102271N151925K705890J18574o13605j309312k754035k496566N3977
4694A133730J167295j217388l248766r00927L377365M021387J03244m146360m992987
4685d703407k249396J765190L683357J321527l162736m545118j283843J847445
4677g326981O72723k194740j938614Q50251K078123J320003J535989K870885K401200
4668B68839j07813j482700o66801j32521r28394r05876Q15155J873284Q61625
4659d05202l03715j03242n876j197969j914020n66440J047192L44537k080128
4650e184863l444537k280878Q90256M743707P164010N877552J330924k483892
4642F612279k412411k28032k8826k537582m594670l850451j307022R44965K085642
$$ y = [-3825389, 276882, 5428807, 8134697, 8253271, 7639666, 6330354, 3576319, 1079753, 1133730, 2301025, 1083637, -2165129, -3066056, 311309, 4332696, 4435940, 289580, -4703407, -6952803, -5187613, -1504256, -182729, -3345465, -7890583, -9174426, -7326981, -6654258, -8848998, -10787612, -9937361, -7859238, -6539235, -5003246, -2132361, 268839, 161026, -1321674, -1988475, -2120996, -3049390, -3955266, -3140111, -1266827, -405202, -708917, -812159, -818035, -2016004, -3930024, -4496464, -3449272, -3104735, -5184863, -8629400, -10910278, -10020022, -5276315, 1887695, 7765247, 9096171, 6612279, 4199868, 3971836, 3943010, 1405428, -3189242, -7039693, -8346715, -7401750, -5316108]
4633e316108K037447O97537j160711j700404o1610K190551K737745J177155q20464
4624b18862j619053r78708M79216K071590K965000K208643k16360k661653l097314
4615a067501j352379O45942J178338N49824R9141J52179j11005j098957k084862
4606c089280k115448j102016J508p9481j580654k812766j569731J918243M608333
4597e821292M373762K821218K599862L156123J879198j129339k766931j812695
4589C299906p02122j162828j381241L23421J944340R24006j332729j591888j08019
4580B12846q6810k288052l817807k678005k97439J287809J956665K177764J716731
4571a816298Q89609Q41250J354442O24655j476672k348367o30683J155319K57036
$$ y = [-5316108, -3278661, -2581124, -3741835, -5442239, -5503849, -3313298, -575553, 601602, -218862, -1837915, -2816623, -2337407, -265817, 2699183, 4907826, 4691466, 2029813, -1067501, -2419880, -1773938, -595600, -45776, 53365, 205544, 94539, -1004418, -3089280, -5204728, -6306744, -6305236, -6384717, -7965371, -10778137, -12347868, -10429625, -5821292, -1447530, 1373688, 3973550, 7129673, 9008871, 7879532, 5112601, 3299906, 2597784, 1434956, 53715, 377136, 2321476, 3245482, 1912753, 320865, 212846, 126036, -2162016, -5979823, -8657828, -8955267, -7667458, -5710793, -3533029, -1816298, -926689, -85439, 1269003, 1893658, 416986, -1931381, -2562064, -1406745, -1149709]
4562a149709k085660k794437j626407n59584K55905K335180N006691N304651K238699
4553F925329j765958m280865m975812l849560o51200K711011K530892j674390
4545e030553n116633l371649J819585N044932M005245J015203j128376j703071
4537d465317q96067R61325K646814K769800J601915M43795o86877k596759m223534
4528d444905l074920Q96035M278123M335854K241214Q14023P56568Q10621L40996
4519F953609j76245n94905j238729j725295j116685M93350J568270P97718j280527
4510C680561k749954k381359r75209l06101p75855r05791L34005J676127J285055
4501a118521l47381r99348q9378M80795o72098k305213k325043l87827K098097
$$ y = [-1149709, -3235369, -6029806, -7656213, -8215797, -7959892, -5624712, -618021, 4686630, 6925329, 5159371, 878506, -4097306, -7946866, -8598066, -5887055, -3356163, -5030553, -10147186, -13518835, -11699250, -6654318, -2649073, -1633870, -2762246, -4465317, -5361384, -4400059, -1753245, 1016555, 2618470, 3062265, 2375388, -221371, -4444905, -7519825, -6623790, -2345667, 1990187, 4231401, 5045424, 5801992, 6612613, 6953609, 6777364, 6182459, 4943730, 3218435, 2101750, 2595100, 4163370, 4961088, 3680561, 930607, -1450752, -2425961, -2732062, -3507917, -4413708, -4079703, -2403576, -1118521, -1465902, -2465250, -2554628, -2073833, -2745931, -5051144, -7376187, -7764014, -5665917]
4492e665917L502221K864406L94904k233352l131139k275458j286034q76913r8584
4483h805866J416488K379086J982679J263048J070190M76309j254072k749939
4475d222077k381920p22481N22007P85161K80692j101598k664964k271093Q11901
4466a0964372L720197L226422K21606j591885o96017J164089K212291K195893
4458e11776J162168n26292j211244K74836K069297J380188j081626j923514l28506
4449f96469J010174O89599N95751J876809K490765P39080j677292k324046j417704
4440A286667m83033K73634J193439J618422J122980P02242R80069Q83406k23963
4431G353863r22819j19392P99668K62433q25373r95826j076282k485975m066045
$$ y = [-5665917, -2163696, 700710, 1095614, -1137738, -4268877, -6544335, -7830369, -8707282, -8805866, -7389378, -5010292, -3027613, -1764565, -694375, -218066, -1472138, -4222077, -6603997, -7326478, -6804471, -6019310, -5738618, -6840216, -9505180, -11776273, -10964372, -7244175, -4017753, -3796147, -5388032, -6084049, -4919960, -2707669, -511776, 650392, 124100, -1087144, -812308, 1256989, 2637177, 1555551, -367963, -696469, 313705, 1003304, 1599055, 3475864, 5966629, 6705709, 5028417, 2704371, 1286667, 803634, 1077268, 2270707, 3889129, 5012109, 5714351, 6694420, 7577826, 7353863, 6431044, 6311652, 7111320, 7373753, 6548380, 5552554, 4476272, 1990297, -2075748]
4422b075748l508460j106228O95518R68230R08115J128361R12968J43712l30196
4413b263728l39887m15214k44405Q21392J830969J076149r52680j756348m70901
4404b714653Q92969O72756q0764K49702J042495N32624j164835j889557l41042
4395b800305K029997K588363N69911j997264k580941r20497J017177J538757P60434
4386B05632k68902p35980r3006J661863L071752J994192j668171n099278n458933
4377f390831k751965Q55457L291308L388352J140049j576490k094965j99116J249806
4368c088395L24698j175746p65383Q42755J283587L46151m51781q22629j465779
4359d972522j837102r00953O30286J324960J461442J985044K149146R02913n39061
$$ y = [-2075748, -5584208, -6690436, -5994918, -5026688, -4118573, -2990212, -2077244, -1933532, -2263728, -2603615, -3018829, -3263234, -2441842, -610873, 465276, -487404, -2243752, -2714653, -1821684, -1148928, -1229692, -979990, 62505, 595129, -569706, -2459263, -2800305, -770308, 1818055, 2387966, 390702, -2190239, -3110736, -2093559, -554802, 205632, -63270, -799250, -892256, 769607, 3841359, 5835551, 4167380, -931898, -6390831, -9142796, -8287339, -4996031, -1607679, -467630, -2044120, -4139085, -4338201, -3088395, -2763697, -3939443, -4704826, -3862071, -2578484, -2232333, -2684114, -3506743, -4972522, -6809624, -7710577, -7080291, -5755331, -4293889, -2308845, -159699, 743214, 204153]
4350B04153m51610K86141n6492o28250J23260P51992o81180j915385M17000L943640
4340A993269K969915k107818m415095j047552K643406J810487j002892j372330
4332e28610N9640N34472N26612J392374J408743r41262k782507r24959K291011
4323A035514K210339q73993k586672j406269L8436Q6337K9394Q30509J538890
4314I02485J397962P04934n53986k513388m063082l865071k307150n33878J454068
4305i377106L593808M091633J757367j143966j398199O37815K003780J808312
4297A973444J669886J931671Q87124j841853m019305l648753j203804J339580
4289b912010K280171J246936j89469L34713K879037M439575K818537l38119k205341
$$ y = [204153, -247457, 38684, -17808, -646058, -522798, 229194, -451986, -2367371, -1950371, 1993269, 4963184, 2855366, -1559729, -2607281, 36125, 1846612, 843720, -528610, -468970, 65502, 592114, 1984488, 3393231, 2451969, -330538, -1255497, 1035514, 3245853, 2371860, -214812, -1621081, -1582645, -1496308, -1466914, -636405, 902485, 2300447, 3005381, 2451395, -61993, -4125075, -7990146, -10297296, -10831174, -9377106, -5783298, -1691665, 65702, -1078264, -2476463, -1838648, 165132, 1973444, 3643330, 5575001, 6462125, 4620272, 600967, -3047786, -4251590, -2912010, -631839, 615097, 425628, 760341, 3639378, 8078953, 10897490, 10559371, 8354030]
4280H354030k521539k341575j237133J172817K747761J360355j433880k545813
4272C555023j788078r01373J15181J883978K500546j25898l878464m714079k450195
4263e803359j01094J324013K684413K683031m92976m162518l646005K30323K008187
4254e275985L03454n45768J525291L054156J658936j16803j9013L37355k70344
4245F51279p447J671833J979127q7853j441463n20733j16438j504357j213121
4236e89173K449398N018731K833426m73960O2746K474007J660972j769114k995293
4227H671740j282999l34523j212679r90174J306151K716022J391205n88498q90797
4218H785448k62209o01342j813330k160147r16221L43991n55509l246604m273476
$$ y = [8354030, 5832491, 3490916, 2253783, 3426600, 6174361, 7534716, 6100836, 3555023, 1766945, 865572, 980753, 2864731, 5365277, 5239379, 1360915, -3353164, -5803359, -5904453, -4580440, -1896027, 787004, 294028, -3868490, -7514495, -7284172, -5275985, -4972531, -5518299, -3993008, -938852, 720084, 603281, 584268, 921623, 651279, 643832, 2315665, 4294792, 4206939, 2765476, 2244743, 2128305, 623948, -589173, 1860225, 6878956, 9712382, 9238422, 9301168, 11775175, 13436147, 11667033, 8671740, 7388741, 7054218, 5841539, 4851365, 6157516, 8873538, 10264743, 9676245, 8785448, 8523239, 7921897, 6108567, 3948420, 3032199, 3376190, 2820681, -425923, -4699399]
4209d699399j258572L105072L853302L98535k796950k542922l82071J079039J542254
4200a701712J408073M23370n69963P7529J659265J825729J041183J851392L229035
4191I243901J361222k815381l512455L90143K854626P37032j203865N41505J833407
4182I430135q78118l285087q44194K789612K088032j193727k242175j352945j007085
4173C504448o992K659290L486109P07472r87945J282425K492076q32926l021842
4164I282115L24139L046529l96166l714434m82545K577108k242378p808608m304440
4155c718680K221240J275432j650309L431686Q669069J715094p383258j092095
4147C468179J1117568O569923p866320p990212o647546m3572910j06015778j16094384
$$ y = [-4699399, -5957971, -2852899, 1000403, 1398938, -1398012, -3940934, -4323005, -3243966, -1701712, -293639, 129731, -440232, -362703, 1296562, 3122291, 4163474, 6014866, 9243901, 10605123, 7789742, 4277287, 4667430, 7522056, 8259088, 7055223, 7596728, 9430135, 8552017, 5266930, 4422736, 7212348, 9300380, 8106653, 5864478, 4511533, 3504448, 3497456, 6156746, 9642855, 10350327, 9362382, 10644807, 13136883, 12303957, 9282115, 9606254, 12652783, 12256617, 8542183, 8059638, 10636746, 8394368, 585760, -3718680, -1497440, -222008, -1872317, 1559369, 10228438, 11943532, 4560274, 3468179, 14585747, 21155670, 13289350, 5299138, -1348408, -44921318, -150937096, -267031480]
4139b67031480l4356850O9436208R8481927N0777143M806055M277518J8304415
4132e5305064J2912246Q61669L534031J1146845O877264j905717j324509L471151
4124a9732084J920057j462667Q74388K961034j930461o051965r31689O247784
4116a8105603N476158J544333L584648P480421M283366k521306l486148J8878
4108a725253k4851l142783l111357q30145j279937k038829K170735P167281M621269
4099A806130k800538m401621J553253N878725L512541o17630j761275j420606
4091A748979j528012r90903P0965m57594j985763j669947J60502P33421L86553
4082c531799J308045J792125j359556n447616m358522J465940M949882L042684
$$ y = [-267031480, -301388330, -231952122, -133470195, -82693052, -77886997, -73609479, -55305064, -42392818, -41531149, -37997118, -26850273, -19973009, -21878726, -23203235, -19732084, -17812027, -19274694, -18400306, -15439272, -17369733, -23421698, -24353387, -18105603, -12629445, -11085112, -7500464, -20043, 4263323, 1742017, -1744131, -1725253, -1750104, -4892887, -8004244, -8834389, -10114326, -12153155, -9982420, -2815139, 1806130, -994408, -5396029, -3842776, 2035949, 5548490, 4930860, 3169585, 1748979, 220967, -769936, -698971, -1156565, -3142328, -4812275, -4651773, -3918352, -3531799, -2223754, -431629, -1791185, -7238801, -11597323, -10131383, -5181501, -2138817]
4074b138817L00912M86406J496793Q16282j39070J95031M11313o64685j696081
4065i31916j723663j809152k459723k672285k181929j397397O91710M606327O980677
4056h97351M019827j808902l994556j241510J234953M53921n67302L89799N52857
4047a858264j993930l748374j245193K957044L923204J197565j579002j885190
4039d232140l20518R87424O7670l058098n149582k823968K287072M690995K453844
4030e097301l74461m05908L77251o87965j780229j02615K644668K817295Q83704
4021a725561N36536K699331M327791L032662j75567k871954l675241k737761j477743
4012b067507j499580k486934k108673N08050K579339J094467k564600l943795
$$ y = [-2138817, -1837905, -1351499, 145294, 961576, 822506, 1017537, 1428850, 764165, -931916, -2655579, -4464731, -6924454, -9596739, -11778668, -13176065, -12484355, -7878028, -897351, 3122476, 1313574, -2680982, -3922492, -2687539, -2233618, -2800920, -2411121, -1858264, -3852194, -7600568, -8845761, -5888717, -1965513, -767948, -2346950, -4232140, -4552658, -3565234, -3497564, -6555662, -11705244, -14529212, -12242140, -7551145, -5097301, -5471762, -5877670, -5500419, -6188384, -7968613, -8071228, -5426560, -2609265, -1725561, -1189025, 1510306, 5838097, 8870759, 8695192, 5823238, 2147997, -589764, -2067507, -3567087, -6054021, -8162694, -7654644, -5075305, -3980838, -6545438, -10489233]
4004a0489233j163140K997878M739189L047285l88835l277556m031818k323276
3996a0889506N26326K149640J124181j344817k263367m3815L310035M219771J895331
3987a316221p44612j167877l76603m72232j084822p51031k17729j046082j925811
3978i103020k52619K857186L297449L57515j702475J27310L474778M523548K894163
3969F473835O06766r95193j298066J7579J609802J158795j007122j765255k00939
3960D600202O40532r66389k191564o38121J095543k87142k911862k569251O57502
3951b570550L007393K933774K251512K246018K321276J919061P28781k009448
3943A0827817n508612o343936k758641J663333K540053J187944J963686M496816
$$ y = [-10489233, -11652373, -8654495, -3915306, -868021, -1256856, -4534412, -8566230, -10889506, -10363180, -8213540, -7089359, -8434176, -10697543, -10741358, -7431323, -3211552, -1316221, -2060833, -3228710, -3605313, -4077545, -5162367, -5913398, -6131127, -7177209, -9103020, -9355639, -6498453, -3201004, -2843489, -4545964, -4418654, -943876, 3579672, 6473835, 7080601, 6085408, 4787342, 4804921, 6414723, 7573518, 6566396, 4801141, 4600202, 5240734, 4274345, 2082781, 1444660, 2540203, 2253061, -658801, -3228052, -2570550, 436843, 3370617, 5622129, 7868147, 10189423, 12108484, 12837265, 10827817, 5319205, -1024731, -3783372, -2120039, 420014, 1607958, 3571644, 8068460]
3935H068460M051802n64592m900247n435096l471741j461831O2915P55889j9530
3926b913971o97617J214379M186183L588555q85566l688201j631074J371915R96151
3917A540754q74171n24286P23928o14628l172587k304968K404451O287292O107921
3908I573706L247521L00389j697935k256254j119326K44623k89003k211373k734225
3899C058123j092688J60523p93283k181395j442514R48050K285454J222483j063141
3890A101612k761481l133383k398360r54553Q48843K420583K839847J573420m94450
3881i57922j342632Q9684K273780K438423k37585l430588m091326j722817J236580
3872e744403K247436J282981J46024k42111n27295p87714L01095K776649L725648
$$ y = [8068460, 12120262, 11555670, 6655423, 1220327, -2251414, -3713245, -3650330, -2894441, -2913971, -3611588, -2397209, 1788974, 5377529, 4491963, 803762, -827312, 544603, 1540754, 666583, 142297, 866225, 251597, -2920990, -5225958, -2821507, 3465785, 9573706, 12821227, 13121616, 11423681, 9167427, 8048101, 8292724, 8003721, 5792348, 3058123, 1965435, 2125958, 1332675, -848720, -2291234, -1343184, 942270, 2164753, 1101612, -1659869, -4793252, -7191612, -8146165, -7297322, -4876739, -2036892, -463472, -957922, -2300554, -2210870, 62910, 2501333, 2263748, -1166840, -5258166, -6980983, -5744403, -3496967, -2213986, -2067962, -2310073, -2837368, -3625082, -3323987, -547338, 3178310]
3863C178310R35937k864961k822234J058595L500137J534958j340949q05593J895270
3854D269470K457080L2622k408612k816233j629752N04039L125503M469126K896824
3845A0900067j31751j493705q67780p83177k072671k580519j144995L42947J81344
3836B349760o22237o25814l16540n22731o42967k49632m63582j764869k261241
3827e119853m40336J794216J462364q72350j501834J294056M760884N109013J994211
3818H480371j455083k421999j216884j76225m44400q48744k12721M93174l68580
3809A828909k307270l278145k740237k001190j470810o8944K012574K639767J168807
3800d216539M7640J094054K405588J393125r14526j463078M9366R55312k24734
$$ y = [3178310, 4114247, 1249286, -1572948, -514353, 2985784, 4520742, 3179793, 2374200, 4269470, 6726550, 6759172, 4350560, 1534327, -95425, 408614, 3534117, 8003243, 10900067, 10768316, 9274611, 8406831, 7623654, 5550983, 2970464, 1825469, 2168416, 2349760, 1727523, 1101709, 785169, 262438, -380529, -630161, -1093743, -2858612, -5119853, -5560189, -3765973, -2303609, -3175959, -4677793, -3383737, 1377147, 6486160, 8480371, 7025288, 4603289, 3386405, 3210180, 2765780, 1917036, 1704315, 2197489, 1828909, -478361, -3756506, -6496743, -8497933, -9968743, -10037687, -8025113, -5385346, -4216539, -4168899, -3074845, -669257, 723868, -190658, -1653736, -1604370, -649058, -873792]
3791h73792k087005k781882j794557P41101M108074O011481L912745j546301o095867
3782d06003o021979j953955K191022L265521J379617r94178j802219j285703r90803
3773f618680j211751o67910Q95448J649408N77034m74558J91151Q52821p70308
3764e577345k741380j109932L328058N067693J859211j761387j243436J574884
3756f03634K237277P59063N42631J865742J290468k261362n054646l672829L17756
3747d579534K742597J990456p4382j212875r47115P557Q37718R24604J20344q06553
3737i97183p10632L94643R34904k09929j663365r40709J831400L311432J346611
3728C297172j538632j333820J557102K563256n28815m325441m658860k166710
$$ y = [-873792, -2960797, -5742679, -7537236, -6796135, -2688061, 3323420, 7236165, 5689864, -406003, -6427982, -8381937, -6190915, -2925394, -1545777, -2539955, -4342174, -5627877, -6618680, -7830431, -8498341, -7602893, -5953485, -5376451, -5851009, -5659858, -4807037, -5577345, -8318725, -9428657, -6100599, -1032906, 826305, -935082, -2178518, -603634, 1633643, 2392706, 2935337, 4801079, 6091547, 3830185, -1224461, -4897290, -4579534, -1836937, 153519, 79137, -1133738, -2080853, -2073296, -1235578, -310974, -190630, -997183, -1707815, -1313172, -378268, -588197, -2251562, -3192271, -1360871, 1950561, 3297172, 1758540, 424720, 1981822, 4545078, 4016263, -309178, -4968038, -7134748]
3720g134748n93277j109671j295226N25488K666204K661484P63574m01544Q65743
3711c051973L283731M073149K298176J22245N7111J464539J336718j272249l550435
3702D761012k739553Q9851J753381J144610k64757j201572j614708j254116M95350
3693A169498K964158M089095K573853q21836m241842n984822n056873j892799
3685g201568J457380L183252L726363M598540N469855M412713J297498j280452
3677A5663581j538481j132478k619332n459378o438396l848700K65227K441680
3669b666277J571984k19472k74172J533580K886917K071601K9852j205591j254647
3660B473775j392906k299026l222418l341457k580802r46433J524333L719820
$$ y = [-7134748, -7728025, -8837696, -10132922, -9607434, -6941230, -4279746, -3516172, -3917716, -3051973, 231758, 4304907, 6603083, 6725328, 6782439, 8246978, 9583696, 8311447, 4761012, 2021459, 2111310, 3864691, 5009301, 4744544, 3542972, 1928264, 674148, 1169498, 4133656, 8222751, 10796604, 9974768, 5732926, -251896, -5308769, -7201568, -5744188, -2560936, 1165427, 5763967, 11233822, 15646535, 16944033, 15663581, 14125100, 12992622, 10373290, 4913912, -1524484, -5373184, -5107957, -2666277, -1094293, -1313765, -1587937, -54357, 2832560, 4904161, 4934013, 3728422, 2473775, 1080869, -1218157, -4440575, -7782032, -10362834, -11309267, -9784934, -6065114]
3652f065114L750708J184390j843092k554582j98920L460608N720411M882138
3644H336547J504704j924036l220431k563244j669666j212876m27150O94361P01998
3635B20207r03328k171076j104561J383453K500501J187238p00209q73197P93042
3626C32070K458482K464318Q97240p64059j274260p20347L65L39568K35370m87792
3616C480955j852539k844513j945727Q71789L491688L778841J993185L93164N06256
3607G873099J379436R08578j243965k760347j412364J710366L128158J411121
3599A0994082r75867j211792K31570J089943Q30025L86018l53379j951943l057552
3590E981105j819105M70983N04162j864189l017745j186786P97785J35409j656569
$$ y = [-6065114, -2314406, -1130016, -2973108, -5527690, -5726610, -2266002, 3454409, 8336547, 9841251, 7917215, 4696784, 2133540, 463874, -749002, -1176152, -481791, 220207, -683121, -2854197, -3958758, -2575305, -74804, 1112434, 412225, -460972, 332070, 2790552, 5254870, 6152110, 5388051, 4113791, 3393444, 3393809, 3733377, 3968747, 3480955, 1628416, -1216097, -3161824, -2290035, 1201653, 4980494, 6973679, 7366843, 7873099, 9252535, 10161113, 8917148, 6156801, 4744437, 6454803, 9582961, 10994082, 10018215, 8806423, 9037993, 10127936, 10957961, 11343979, 10990600, 9038657, 5981105, 4162000, 4632983, 5137145, 3272956, 255211, -931575, -133790, 1619, -1654950]
3581a654950j509046N21167J958771J659409M92719m96048o44858M52782J991724
3572B771670K133980N41203q50077r14307j102554k425862l115940j684372J6299
3563d629960k61602j163207j3420K489952L392809K115802M57879r68845k579823
3554a160415k977631m23392L128307L646685Q84693j418728j540644j626811k659467
3545d147403k223445P02594K906611J744607m86891j13177K421014L745048K528588
3536G077546L38921j275713j942988j490661n1888J331439J839162J918033J865418
3527I609269N69388k520698n208362m608799j122565J688917J490230j48766j71196
3518d22582J843319L120722J466393j333451j413741J666554L563741J040781
$$ y = [-1654950, -3163996, -2642829, -684058, 975351, 1468070, 972022, 327164, 779946, 2771670, 4905650, 5446853, 4596776, 3682469, 2579915, 154053, -2961887, -4646259, -4629960, -4891562, -6054769, -6068189, -3578237, -185428, 1930374, 2388253, 1419408, -1160415, -4138046, -4561438, -1433131, 2213554, 3098247, 1679519, 138875, -1487936, -4147403, -6370848, -5668254, -2761643, -1017036, -1503927, -1617104, 803910, 4548958, 7077546, 7416467, 6140754, 4197766, 2707105, 2655217, 3986656, 5825818, 7743851, 9609269, 10178657, 7657959, 2449597, -2159202, -3281767, -1592850, -102620, -251386, -422582, 1420737, 4541459, 6007852, 4674401, 3260660, 4927214, 8490955, 9531736]
3510I531736k933295l191859j5542J647436K78263j79885K343432M177147K366315
3501A4023748K3140Q38055K323740M6619m243351m963682j812622o7306j711785
3492D456556k657473l90236J492835n02519l615290k942742J181057M009971L158725
3483D190884R54248L44476J235300J373785o01100l397659m041265j125945K837327
3474A770051L726269R03744j844625j396778Q28440J730671J162736J184247K116538
3465A0181293K290369J155984j59399j275772k836198m158565l365404n79631
3457A252677J589767J818974J784825K583822K024096j961761o988222q378605
3449f274427n015741l30830K291889K518482J522093K47731j70938J115551K732825
$$ y = [9531736, 6598441, 3406582, 3391040, 5038476, 5316739, 5136854, 7480286, 11657433, 14023748, 14046888, 14884943, 17208683, 17255302, 13011951, 8048269, 6235647, 6168341, 4456556, 1799083, 1408847, 2901682, 2399163, -1216127, -4158869, -2977812, 1032159, 4190884, 5145132, 5489608, 6724908, 8098693, 7497593, 4099934, 58669, -1067276, 1770051, 5496320, 6400064, 4555439, 3158661, 3987101, 5717772, 6880508, 8064755, 10181293, 12471662, 13627646, 13468247, 12192475, 9356277, 5197712, 1832308, 1252677, 2842444, 4661418, 6446243, 9030065, 11054161, 9092400, 2104178, -6274427, -11290168, -11620998, -9329109, -6810627, -5288534, -5040803, -5211741, -4096190, -1363365]
3440a363365J994913r97730k612588p23649J988405K132203O35623M14732Q87387
3431B355931q36517l837260l310237K108694P103801O301032J204460k398884
3423H691020j985231j18578K70107o77079j236781p84968j75337m60577j634792
3414A887784k290267r31202J879791L551831K532123L83647m48643q239k39518
3405F317307j595752k294138j147504O43542J200432K42834j034133j492640q59176
3396a9228L66417J301035J405027J114355J310597J955003J816814J6095k511850
3387F754265l710247k685144q58530l28830j204502j464281O3569J687842J189424
3378e56434n75102n54913J892867L690495K383197l91548j554871r56206p33270
$$ y = [-1363365, 631548, -366182, -2978770, -3702419, -1714014, 418189, 1053812, 1468544, 2355931, 1519414, -2317846, -5628083, -3519389, 3584412, 9885444, 11089904, 8691020, 6705789, 6587211, 6857318, 6180239, 4943458, 4158490, 3983153, 3522576, 1887784, -402483, -1333685, 546106, 4097937, 6630060, 7013707, 6565064, 6556825, 6317307, 4721555, 2427417, 1279913, 1923455, 3123887, 3366721, 2332588, 839948, -19228, 347189, 1648224, 3053251, 4167606, 5478203, 7433206, 9250020, 9266115, 6754265, 3044018, 358874, -499656, -828486, -2032988, -3497269, -3433700, -1745858, -556434, -1131536, -1686449, 206418, 3896913, 6280110, 5888562, 4333691, 3377485, 2644215]
3369B644215j365015j093211P13938K015278P80311k175448l937820k554297R79645
3360c992404L566232L048940N83133p57285L1892P23263n12728k203746k099197
3351a611900r29645j025808k186940j937360L30077K425809K847349K373444J605682
3342A890708k01088k708082l567334j652991Q50973J416945N40004K72412Q41999
3333b316454Q35712j42819j025261j084251n33364L96667J516684K026591J245954
3324I19459K2138O0290J484449K162945K27388l232001m878195k841383Q04648
3315e270262K192294L88708j333308L4343K816116K882937j91577k082585K71372
3306b91962M155791M564094O37776l645656m596452k519718j81311P52619R34847
$$ y = [2644215, 1279200, 185989, 899927, 2915205, 3695516, 1520068, -2417752, -4972049, -3992404, -426172, 2622768, 3205901, 2448616, 2480508, 3203771, 2691043, 487297, -1611900, -2541545, -3567353, -5754293, -7691653, -7361576, -4935767, -2088418, 285026, 1890708, 1689620, -1018462, -4585796, -6238787, -5387814, -3970869, -3430865, -3158453, -2316454, -1480742, -1623561, -2648822, -3733073, -4266437, -3869770, -2353086, -326495, 919459, 941597, 1001887, 2486336, 4649281, 4876669, 1644668, -3233527, -6074910, -5270262, -3077968, -2689260, -4022568, -3988225, -1172109, 1710828, 1519251, -563334, -291962, 3863829, 8427923, 9065699, 5420043, 823591, -1696127, -1877438, -1124819, -189972]
3297a89972J658664K733275K437021k14996l653038n155634l955025j736307j3138
3288h089150J325905K373365K135704M53146p47296j3495J088579J96649j912217
3279c188810k125994L80561K818161K650325O15119j179158k309966l493871m135023
3270i968656k585144J009403L788882L097536l50197l181913l063966p49690J663475
3261a0340270L267763M184361L888231J565202j785910l438423k058463M66917
3253d250592J410539N32210k14073K51218Q19930J56805j119120j055254R32936
3244b535401K716709J676035j682842l640198j829964J375604K041166L35915
3236a542976N3038K410431L937455K042709p24850p21501J144808J338798m50932
$$ y = [-189972, 1468692, 4201967, 6638988, 6423992, 2770954, -2384680, -6339705, -8076012, -8089150, -6763245, -4389880, -2254176, -1801030, -2548326, -2561821, -1473242, -1276593, -3188810, -5314804, -4934243, -2116082, 534243, 1149362, -29796, -2339762, -5833633, -9968656, -12553800, -11544397, -7755515, -4657979, -5008176, -8190089, -11254055, -12003745, -10340270, -7072507, -2888146, 1000085, 2565287, 779377, -2659046, -4717509, -4250592, -2840053, -2307843, -2521916, -2270698, -1450768, -1293963, -2413083, -3468337, -2535401, 181308, 1857343, 174501, -3465697, -5295661, -3920057, -1878891, -1542976, -1489938, 920493, 4857948, 6900657, 6175807, 5454306, 6599114, 7937912, 7486980]
3227G486980j316335k81104M76514k79366j142560j180813j392563j885972p93665
3218c08884K228917M201246K780037j45549j301848p87112j216365l112694m049404
3209a711656k367576O06023K518061K483144J185141j36462l55476P22470J736963
3200D680632R44071j495046l220683k243747P38769L079325K867925N65972j703076
3191D214142k186299j014985J42830o637j025635j589071j265663o63874j9030
3182c414222J138855K528897K585681M42218k315275l203054j919653n84680q10854
3173e552087j838606k098290j478784j111830j595227k384905k576951j539465
3165b0176145P87480L381309M391875K993867P55090L6591J137801K222169K040992
$$ y = [7486980, 6170645, 5889541, 6366055, 6086689, 4944129, 3763316, 2370753, 484781, -308884, 1920033, 6121279, 8901316, 8755767, 7453919, 6666807, 5450442, 2337748, -1711656, -4079232, -3473209, -955148, 1527996, 2713137, 2576675, 2221199, 2943669, 4680632, 5624703, 4129657, 908974, -1334773, -596004, 2483321, 5351246, 5917218, 4214142, 2027843, 1012858, 1155688, 1149051, 123416, -1465655, -2731318, -3395192, -3414222, -2275367, 253530, 2839211, 3281429, 966154, -2236900, -4156553, -4741233, -5552087, -7390693, -9488983, -10967767, -12079597, -13674824, -16059729, -18636680, -20176145, -19388665, -16007356, -11615481, -8621614, -7866524, -7829933, -6692132, -4469963, -2428971]
3156b428971J280579Q86708N97391m2559n12132k56427K02361K81787O18463J923338
3146B550538L114128K238163o68983l081917k893177q81069M29733j13959j070140
3137c76683m22411J607168K439094K54603l288528m572144k347376P41019J607580
3128d357678M22241l93413J20810N86345n2770q16311k67279J398273K660198
3119f99584K402907P09154j469559k691651j549697K026614N719803O149451K409414
3110A3006852k014468k394220J555062M615754K158994l839846p119948m984496
3102I83684r78784P48620N58959R63768J939655J661406L31807j32518K60719
3093F337316m35254k191373k248940M99003K987906J819394j987732m215267k741339
$$ y = [-2428971, -1148392, -261684, 335707, 293148, -218984, -475411, -273050, 8737, 627200, 2550538, 5664666, 7902829, 7233846, 4151929, 1258752, 377683, 807416, 693457, -376683, -799094, 808074, 3247168, 3501771, 213243, -4358901, -6706277, -5965258, -4357678, -3935437, -4328850, -4208040, -3621695, -3674465, -4490776, -4758055, -3359782, -699584, 1703323, 2412477, 942918, -1748733, -3298430, -1271816, 4447987, 10597438, 13006852, 10992384, 8598164, 10153226, 14768980, 16927974, 13088128, 5968180, 983684, 4900, 753520, 1312479, 2276247, 4215902, 5877308, 6209115, 6076597, 6337316, 5902062, 3710689, 1461749, 1960752, 4948658, 6768052, 4780320, 565053, -2176286]
3084b176286K80070J560887M52408j102822j459026r29143n37270k99335K58395
3075c952122N73548l00456j532090j028793J137270K017465J24158j608476J98140
3066d371356L928900M873591K011661q03368r20408l91325j730392l487967k846637
3057c737301l81015J107815J365962K688979N010642M540551q41767p165855q161316
3048e573305k881722L058724M326653J589549r48521j502649j472902j484277
3040d888450l73939J453517J340937j223963k683239m40834K779904K798601K03075
3031a034391r63457N41828K143438K107684J276656J63878j779307l515505k814679
3022c873855j85527J116173J9503r57138l62509k6173r48228r63579J015548K132153
$$ y = [-2176286, -1896216, -335329, 117079, -985743, -2444769, -3373912, -3911182, -4210517, -3952122, -3378574, -3679030, -5211120, -6239913, -5102643, -3085178, -2961020, -4569496, -4371356, -442456, 4431135, 6442796, 5639428, 4719020, 4327695, 2597303, -890664, -3737301, -4118316, -3010501, -1644539, 1044440, 6055082, 10595633, 9753866, 2588011, -5573305, -8455027, -5396303, -1069650, 519899, -428622, -1931271, -3404173, -4888450, -5262389, -3808872, -2467935, -3691898, -6375137, -6815971, -4036067, -1237466, -1034391, -1997848, -1456020, 687418, 2795102, 4071758, 4235636, 2456329, -1059176, -3873855, -4059382, -2943209, -2923706, -3880844, -4243353, -4269526, -5217754, -6181333, -5165785, -3033632]
3012c033632J24646k399524j793969J029781K517359J916957J001152L7950j871248
3003b470528l453980k387518M94175J800794N08923r83269r15792j32309M41553
2994g097951J288983K491150K983303K458183J854367J346462K7959j801903k312309
2985A238244r92491K46186j13557j077993r74941J45103J120818J453638J340350
2976B385357Q58284Q8135n72018q30058p06293j13377J009971K039540K033246
2967F192787Q62149q51922k723293m400087m712740k711464L26549J704347O76572
2958e637102n27872K67037K567031M427359M927486M348337K978946J088043m42540
2949A3996725p12506j09296k62701k282973n091857n885580k987191J567091L404797
$$ y = [-3033632, -2908986, -5308510, -7102479, -6072698, -3555339, -1638382, -637230, -599280, -2470528, -5924508, -8312026, -7817851, -6017057, -5508134, -6491403, -7407195, -7539504, -7097951, -5808968, -3317818, -334515, 2123668, 3978035, 5324497, 5352456, 3550553, 1238244, 245753, 491939, 378382, -699611, -1674552, -1529449, -408631, 1045007, 2385357, 3243641, 3331776, 2759758, 1929700, 1223407, 1110030, 2120001, 4159541, 6192787, 7054936, 6203014, 3479721, -920366, -5633106, -8344570, -8018021, -6313674, -5637102, -6164974, -5897937, -3330906, 1096453, 6023939, 10372276, 13351222, 14439265, 13996725, 13284219, 13174923, 12912222, 10629249, 5537392, -348188, -3335379, -1768288, 1636509]
2940A636509P73852k852423k730131J179733M217386L020290o71479k963086k607875
2931i97224j396144r93829j239334j404255j601558k191620k432430q70308K414635
2922a0712067M814403L877406Q59265l18851J682783L586541K289272m43459p69032
2913D866261J170327J431521j683255n108087n292819k320387J236230L294520
2905b405689L038731P77366j702608k215806p13258N23294j07027j715666k607893
2896g128556k155027n25829J644036K822831J805351j19480m29281P15487N61974
2887b808494j412255k138933j39453J500374J96244j310175Q19907M729451N040857
2878D477523R82239k384853j499434J315371K122651N70541j102458j671799j355737
$$ y = [1636509, 2410361, -442062, -3172193, -1992460, 2224926, 5245216, 4573737, 1610651, -997224, -2393368, -3387197, -4626531, -6030786, -7632344, -9823964, -12256394, -13126702, -10712067, -5897664, -2020258, -1160993, -1479844, 202939, 3789480, 6078752, 5635293, 4866261, 6036588, 7468109, 5784854, 676767, -4616052, -6936439, -5700209, -2405689, 633042, 1410408, -292200, -2508006, -3221264, -2697970, -2804997, -4520663, -7128556, -9283583, -9809412, -8165376, -5342545, -3537194, -3656674, -4085955, -3370468, -2808494, -4220749, -6359682, -6499135, -4998761, -4802517, -6112692, -5292785, -563334, 4477523, 5459762, 3074909, 1575475, 2890846, 5013497, 5584038, 4481580, 2809781, 1454044]
2869A454044l71651Q29836R54806o23685k334279k008774K39134K107080K037727
2860B284238Q19187K645j56586m47004j079362j368590r88278n27718l38199L14098
2850a485569K019201L659652L303231P07480k112312l080316k027129l28742N45385
2841A200881l2828j456410k244029j635820p31078q76919j198438L63738L324193
2832c286710M307172J570638k195665l300533j670071p1735N9448k27733J29737
2823d685452P49323R64632Q92190R35042J061436P94620l23311j906613k369934
2814c888067n19933K199064K667068J28976k471356k457329r13670m82883j393959
2805g132089j923216j429706m27013J283080L795031N141117L122810r99335l384516
$$ y = [1454044, 1082393, 1912229, 2867035, 2243350, -90929, -2099703, -1860569, 246511, 2284238, 3103425, 3106070, 2949484, 2502480, 1423118, 54528, -933750, -1461468, -1799667, -1485569, 533632, 4193284, 7496515, 8203995, 6091683, 3011367, 984238, 655496, 1200881, 1168053, -288357, -2532386, -4168206, -4899284, -5776203, -6974641, -6610903, -3286710, 1020462, 2591100, 395435, -2905098, -4575169, -4646904, -4587456, -4815189, -4685452, -3936129, -2971497, -2079307, -1144265, -82829, 711791, 388480, -1518133, -3888067, -4408000, -2208936, 458132, 587108, -1884248, -4341577, -5255247, -5738130, -7132089, -9055305, -10485011, -10912024, -9628944, -5833913, -692796, 2430014, 1430679, -1953837]
2796a953837k397556r7220J231766J532721J529717J245113P39695M02588m4867
2787B188120j038360j517229j4169K363929K688249O12638p48714N36765K503418
2778G574647K801583K121895J824511O96218k744672o316166o164005k358779
2770b564768P50516L06119j662759j755110R0687J244708N21318m98747k63796
2761c831832N36465N57130K99622J209454K640087K035779r78676k893690p34814
2752a160475L303296M328852J216042k295277k999427j721973o52415r4632N40954
2743D64945Q28515L65831Q5497P01648J145025J90778j529113k623092k818389
2734c188355k334875q58075J196372J942118N48216r70527p50362l12047j909598
$$ y = [-1953837, -4351393, -4448613, -3216847, -1684126, -154409, 1090704, 1830399, 2232987, 2188120, 1149760, -367469, -381638, 1982291, 4670540, 5283178, 4534464, 5071229, 7574647, 10376230, 12498125, 14322636, 15018854, 12274182, 5958016, -205989, -2564768, -1814252, -1508133, -3170892, -4926002, -4835315, -3590607, -3069289, -3568036, -3831832, -3295367, -2738237, -2438615, -1229161, 1410926, 3446705, 2468029, -425661, -1160475, 2142821, 6471673, 7687715, 5392438, 2393011, 671038, 18623, -76009, 464945, 1293460, 1659291, 1744788, 2446436, 3591461, 3782239, 2253126, -369966, -3188355, -5523230, -6381305, -5184933, -3242815, -2694599, -3665126, -4415488, -4727535, -6637133]
2725f637133l960760k853816J043472L220948J644336k61643R94062L791878M159496
2716A140840J513426j111829j368243K83807K053723K393273O38235k087218l080350
2707C75664r44989K138466K801192P58544j238010j404030n59529L07812J435491
2698C670611K391032J424457j604625l797537k834231l47095O54100K21933M47418
2689B26063J113126L6726k297490k385397Q18239L598403K708242j00758j404673
2680B312481j370196k321621l886554l520670j147863O56199J197185K521727
2672e559312M905554N281321K100701j374901j372521R35918J330003j211624
2664E035139l258418j985277J082933K384690Q57591j182779j324694p8472J02854
$$ y = [-6637133, -10597893, -13451709, -12408237, -9187289, -7542953, -7804596, -6810534, -3018656, 1140840, 2654266, 1542437, 174194, 458001, 2511724, 4904997, 5543232, 3456014, 375664, -569325, 1569141, 4370333, 5128877, 3890867, 2486837, 1927308, 2235120, 3670611, 6061643, 7486100, 5881475, 2083938, -750293, -1097388, -443288, -221355, 226063, 1339189, 1375915, -921575, -3306972, -2488733, 1109670, 3817912, 3717154, 2312481, 942285, -1379336, -5265890, -8786560, -9934423, -9278224, -8081039, -5559312, -653758, 4627563, 6728264, 5353363, 3980842, 4916760, 6246763, 5035139, 1776721, -208556, 874377, 3259067, 4116658, 2933879, 1609185, 1530713, 1633567]
2655A633567j479715k393717l71301L098168M409887K723395Q01243N69368N05751
2646I496646j155889l076781k998744j589822j322937k319107k161128O3812K062865
2637c001085J502835q84368k415685j695515J17370Q83843q0949j119401j12413
2628f805368K585146M108908K805755P38657Q32473K502382K487728j99190k781203
2619F275288k775226j128642p3281Q8991L17551N08319o5247q66779p56244j35738
2609A388992l44035r12924K97307L438720N263049L097059j092561k857379j147122
2600G131106L47058j557853n019421n618535k139248K230518M212221L810278
2592C396124K830083J942234O12529j131631k439110k834973k520439j635722
$$ y = [1633567, 153852, -2239865, -2611166, 487002, 4896889, 7620284, 8421527, 8990895, 9496646, 8340757, 5263976, 2265232, 675410, -647527, -2966634, -5127762, -5063950, -3001085, -1498250, -2382618, -4798303, -6493818, -6376448, -5492605, -5573554, -6692955, -6805368, -4220222, -111314, 2694441, 3433098, 4265571, 6767953, 9255681, 9056491, 6275288, 3500062, 2371420, 2298139, 2387130, 2704681, 3213000, 3147753, 2280974, 1524730, 1388992, 1044957, 132033, 429340, 3868060, 9131109, 12228168, 11135607, 8278228, 7131106, 7478164, 5920311, 900890, -4717645, -6856893, -4626375, -414154, 3396124, 6226207, 8168441, 8780970, 7649339, 5210229, 2375256, -145183, -1780905]
2584a780905k59471Q90874P69093p46669k623551l865422m234012l618129j631497
2575a7099689J447300L957548M159852K304794N11456K31528O47357K87377n41609
2566d094086k68733J239742K186084J550319O75245J094305K201710K523695K038059
2557I146340J416900J22978k382687m353608l549430j098575m34150j980660k251397
2548e364289N81600L532133L240492P19901q96821j013507j035287r86298Q1734
2539a140342J356445J110552j91945m94319L58483M06072j079945k468854k287777
2530d431630q52165Q22209J976773J981148Q96724o9505k25977o95439k070844
2521b668706k104526J114138M615225L377144k066220n312450k804257J402820
$$ y = [-1780905, -2040376, -1149502, -380409, -1127078, -3750629, -7616051, -11850063, -15468192, -17099689, -15652389, -11694841, -7534989, -5230195, -4718739, -4487211, -3839854, -3552477, -4094086, -4362819, -3123077, -936993, 613326, 1288571, 2382876, 4584586, 7108281, 9146340, 10563240, 10686218, 8303531, 3949923, 400493, -698082, -1132232, -3112892, -5364289, -4782689, -1250556, 1989936, 2709837, 1813016, 799509, -235778, -1222076, -1140342, 216103, 1326655, 1134710, 640391, 998874, 1404946, 325001, -2143853, -4431630, -5283795, -4461586, -2484813, -503665, 393059, 323554, 97577, -597862, -2668706, -4773232, -3659094, 956131, 4333275, 2267055, -3045395, -5849652, -4446832]
2513d446832K031944j00489p24795P93443J405903J16538o29315N39211J698216
2504F83824J053582j60004J42355J571330J924018L68938j605299k290660j577230
2495A10854m07731N65586J072422P13266m75116j217029j98111J760140K351627
2486D275908J157146M15853J270239J445893j193643m701878n556376l732131
2478f618989j944088q15898J252763L653762L392871K22489k098388j205451P85254
2469c375675J284035Q19942O06411p5019j610803k278921j336011r08631k104733
2460h979405k389941j2695K177623J240919m86138Q17680L683457L623387O05690
2451B80577j326175j183786k001362m395638m814080j545218K473412M572984
$$ y = [-4446832, -2414888, -2515377, -3240172, -2446729, -1040826, -924288, -1553603, -1014392, 683824, 1737406, 1577402, 1719757, 3291087, 5215105, 5584043, 3978744, 1688084, 110854, -296877, 268709, 1341131, 2054397, 1579281, 362252, 164141, 1924281, 4275908, 5433054, 5848907, 7119146, 8565039, 7371396, 2669518, -2886858, -6618989, -8563077, -9378975, -8126212, -4472450, -1079579, -857090, -2955478, -4160929, -3375675, -2091640, -1271698, -665287, -740306, -2351109, -4630030, -5966041, -6874672, -8979405, -11369346, -11382041, -9204418, -7963499, -8449637, -7631957, -3948500, -325113, 280577, -1045598, -2229384, -4230746, -8626384, -13440464, -14985682, -12512270, -7939286]
2443g939286N598176O341192N137501J534932j523165j965545j591929k022278
2435C569598j287897J944750M084590J252139l877207m958270j019021K262612
2427A971294Q09108k755929l838795k071535k56495M54860J293936K716502L326772
2418A649718K310575R25512N66545O27415l50398k039205k487728j057002M23022
2409E68454K27274r10964j276090r01489j166141k275336k876153k013618n6754
2400a0680817K083949L395077K998472J441319R11101K286825L066179Q23011
2392F325116k369847k548449k96269o8783k627159l238313O32258M768333M592818
2383E169705J812418N11818K69390j645478l746126j955347L016607N533322K845852
$$ y = [-7939286, -2341110, 4000082, 9137583, 10672515, 9149350, 7183805, 5591876, 3569598, 2281701, 4226451, 8311041, 9563180, 5685973, 727703, -291318, 1971294, 2780402, 24473, -3814322, -5885857, -6142352, -5687492, -4393556, -1677054, 1649718, 3960293, 4885805, 5452350, 6079765, 5729367, 3690162, 1202434, 145432, 568454, 795728, -115236, -1391326, -2292815, -3458956, -5734292, -8610445, -10624063, -10680817, -8596868, -5201791, -2203319, -762000, 149101, 2435926, 5502105, 6325116, 3955269, 1406820, 1110551, 1041768, -1585391, -4823704, -4191446, 576887, 5169705, 6982123, 7493941, 7763331, 6117853, 2371727, 416380, 3432987, 8966309, 11812161]
2374A1812161j576343l515532k808721j444659m12015k3578n85825j359668j149443
2365a063623o87443j816079l685711k991536Q00060L773489K944513L01747p43422
2356c168005j80478k5891m63226l58631M5910p6458R3245J565049K859371J809969
2346B100855n19658q44697J332675K660559O38641l011278m820436l675775j209360
2337g348474O99244J483707J493261J217041J131657J740380L077083L944440
2329G438339K443792j606011n214143m968047j403519J470291J612823J306647
2321A080172K629772L543573J398079j967716k540915m08730M58586j446984l205156
2312d59319k602597j311876j346675j710328p39549Q42371J510845J523726J725933
$$ y = [11812161, 10235818, 6720286, 3911565, 2466906, 2054891, 2031313, 1445488, 85820, -1063623, -1751066, -3567145, -7252856, -10244392, -9444332, -5670843, -2726330, -2424583, -3168005, -3348483, -3374374, -3837600, -4196231, -4150321, -4226779, -4133534, -2568485, 290886, 2100855, 1581197, 736500, 2069175, 4729734, 5368375, 2357097, -2463339, -6139114, -7348474, -6649230, -5165523, -3672262, -2455221, -1323564, 416816, 3493899, 7438339, 9882131, 8276120, 3061977, -1906070, -3309589, -1839298, -226475, 1080172, 3709944, 7253517, 8651596, 6683880, 4142965, 3734235, 4192821, 2745837, -459319, -3061916, -4373792, -5720467, -7430795, -8170344, -7327973, -5817128, -4293402, -2567469]
2303b567469J536680L13921p91124n23647K40463R1642l39175K53519R44590l15741
2293a156341l083395m405439k628361O73313K837940K738577J185922j8249N53527
2284c302506K476287L586135K465283J81093j451589k264156k901938k810650
2276d022041j208311P30774J066270R5367j68500P14125J228039P09826N4299
2267h00152m31785j286064j782184l41807K373386L539064K168283L44040m72382
2258C310399j465422l433115m592314l278550m31035K393944N049802P002726
2250D556435O251313K514858r49963j473766o92346j265680k254043j351053K74168
2241E609923l88931k853140l716698k114635n06230j76039K4589L78225j02995
$$ y = [-2567469, -1030789, -716868, -1507992, -2031639, -1791176, -1699534, -2038709, -1785190, -840600, -1156341, -4239736, -8645175, -11273536, -10600223, -7762283, -5023706, -3837784, -3856033, -3302506, -826219, 2759916, 5225199, 5406292, 3954703, 1690547, -1211391, -4022041, -5230352, -4499578, -3433308, -3337941, -3506441, -2792316, -1564277, -854451, -800152, -1231937, -2518001, -4300185, -4641992, -2268606, 1270458, 3438741, 3782781, 3310399, 1844977, -1588138, -6180452, -9459002, -9890037, -7496093, -2446291, 4556435, 10807748, 13322606, 12372643, 10898877, 10206531, 8940851, 6686808, 5335755, 5609923, 5220992, 2367852, -1348846, -3463481, -3969711, -4145750, -4121161, -3742936, -3845931]
2232c845931m07728J740416M917527M350891q78756n249659m079199K36674K343536
2223h72229J187693l71252q32717j084203j434519j103540j85749N29903J203539
2214b963074K210207K518292J024970j172153j943834r09947P97495K507787L692571
2205E762314K995366K05211j920506q08945J787554K082768N8804q46073J91166
2196I507659j7277k825438m710436k474097J760953L667438K509823Q47587J23802
2187H390014l59417r83080j281303j634277k944517m443700l987953j057162K212548
2178f088847L592129L063131J984385J071794K4888j388300k582002k529459q34973
2169c687254J549606K995460K836349J956694J431511J109335O5143j977654m181721
$$ y = [-3845931, -4253659, -2513243, 2404284, 6755175, 5876419, 626760, -3452439, -3215765, -872229, 315464, -55788, -888505, -1972708, -3407227, -4510767, -4696516, -4166613, -2963074, -752867, 1765425, 2790395, 1618242, -325592, -1235539, -438044, 2069743, 5762314, 8757680, 8962891, 7042385, 6233440, 8020994, 10103762, 10162566, 9316493, 9507659, 9490382, 6664944, 1954508, -519589, 1241364, 4908802, 7418625, 8266212, 8390014, 8030597, 7047517, 5766214, 4131937, 1187420, -3256280, -7244233, -8301395, -6088847, -2496718, 566413, 2550798, 3622592, 3647480, 2259180, -322822, -2852281, -3687254, -2137648, 857812, 3694161, 5650855, 7082366, 8191701, 8256844, 6279190, 2097469]
2160B097469n164771l819186m23058K664417K681357k26698k640286k082896k06195
2151g119847R1635p05092J41708K548294L202841P98583j728616j702966m64514
2142d937974m54604j104167m73290Q60328Q24681k51984j31810J231985J405752
2133c031083k97220j437602l93671J061130P60760m85096n37632O15763J200930
2124b543721N70711k21500m20926m57859p85714j061460p18581K97706J410558
2115c930786J778896J178042O61800J481496K996955K869302J15453l218225m479231
2106e46298l411656j602080j28766P63292P27711j84638q46928m96104k1900k21090
2096e968457r658J451581K183466k0194l226538l189324M38117L408003L041683
$$ y = [2097469, -3067302, -6886488, -7309546, -4645129, -1963772, -2190470, -4830756, -6913652, -7119847, -7028212, -7733304, -7591596, -5043302, -1840461, -1041878, -2770494, -4473460, -4937974, -5392578, -6496745, -6970035, -6109707, -5285026, -5537010, -5668820, -4436835, -3031083, -3328303, -4765905, -5159576, -4098446, -3337686, -3822782, -4360414, -3744651, -2543721, -1973010, -2194510, -2615436, -3073295, -3859009, -4920469, -5639050, -5341344, -3930786, -2151890, -973848, -312048, 1169448, 4166403, 7035705, 7151158, 3932933, -546298, -3957954, -5560034, -5688800, -4925508, -4197797, -4382435, -5229363, -5725467, -5747367, -5968457, -5978115, -4526534, -2343068, -2363262, -5589800, -8779124, -8341007, -4933004, -1891321]
2087a891321J350016P31718L50176j033255j989570j049933K24025j74397j161846
2078d644387o80592N10324M22708l38946J26144J024812l1644k418237k796747
2069h826565k55307K315350K609525J559074P84316L12393p1739J78410P62003
2060f32540J99526j651314k823919k117384o56864N03759J965686L692678L628885
2051B108513Q62784j789110j062494K067603L654744K129422k32111j153798j151108
2042E434445j676751k431398k044370n90035J77921o43233j521375n33321J516190
2033b311927J783136l56659j861851m71577J466271N21749j951504j585021J685785
2024c081598K966249L77191j310307J894424O367050N959404J118370k178413
$$ y = [-1891321, -541305, 190413, 540589, -492666, -2482236, -3532169, -3308144, -3482541, -4644387, -5324979, -4814655, -4391947, -4730893, -4604749, -3579937, -3611581, -6029818, -8826565, -9081872, -6766522, -4156997, -2597923, -1813607, -1501214, -1572953, -1394543, -632540, -433014, -2084328, -4908247, -7025631, -7682495, -7178736, -5213050, -1520372, 2108513, 2971297, 1182187, 119693, 2187296, 5842040, 7971462, 7739351, 6585553, 5434445, 3757694, 1326296, -718074, -1308109, -1130188, -1773421, -3294796, -3828117, -2311927, -528791, -885450, -2747301, -3218878, -1752607, -1230858, -3182362, -4767383, -3081598, -115349, 261842, -1048465, 845959, 7213009, 13172413, 14290783, 12112370]
2016A2112370j265976M95779k12844k469848l826517l454164j411225K025798
2008A993373M965238M621818R58064k578576l221853j816735o02886k51779l21541
1999C745123n92440n74407N13664K036456K043434K74909r49446k63582M71227
1990F704938p00061k417629k096890N1294J591572J479297P17178P7485n26463
1981D880721p78393k01628N24959L87781m5084N69480J769075J525285o99320
1972G932876k906503l036731j143295J204635K477357J949790Q6012j607284k002094
1963B954763j557207j293912j129371m84586J02858k98823j084766q06027M15393
1954c181678J130811J052671J125830J226556L36594q34042l31910J307696J059510
$$ y = [12112370, 10846394, 11342173, 11129329, 8659481, 4832964, 1378800, -32425, 1993373, 6958611, 11580429, 12538493, 9959917, 6738064, 4921329, 4318443, 4066664, 3745123, 3152683, 2578276, 3091940, 5128396, 7171830, 7446739, 6497293, 6233711, 6704938, 6004877, 3587248, 1490358, 1541652, 3133224, 4612521, 5329699, 5407184, 4880721, 4102328, 3900700, 4425659, 4813440, 4768356, 5337836, 7106911, 8632196, 7932876, 5026373, 1989642, 846347, 2050982, 4528339, 6478129, 6564141, 4956857, 2954763, 1397556, 103644, -1025727, -1510313, -1407455, -1706278, -2791044, -3597071, -3181678, -2050867, -998196, 127634, 1354190, 1690784, 856742, 524832, 1832528, 2892038]
1945B892038j538467k714994j05156L040950K426968r45223k732349j907830j291635
1936b875698k056900k020853k0286J808729J594621O01766P00416J209617L11947
1927g46641j816466l204814k694606r53248O67843J354424J289375J393574K113173
1918b597386K398484R05097j676954k936572j855427q6388N95319M96965O02291
1909d154571N90295j66470q65470l41539Q82185J280057N10126o14981j749378
1900d629746k908716l201036j615975Q88245J913625O42289j119081j300122L01842
1891a1028675K493666L866637L181074K43251k825861k817635P68313M349848
1883a769382M207815J010289j269160n36726J214986J179544n98731k005231k150745
$$ y = [2892038, 1353571, -1361423, -1466579, 1574371, 4001339, 3056116, 323767, -1584063, -2875698, -4932598, -6953451, -6973737, -5165008, -3570387, -2968621, -2268205, -1058588, -746641, -2563107, -5767921, -8462527, -9415775, -8747932, -7393508, -6104133, -4710559, -2597386, -198902, 706195, -970759, -3907331, -5762758, -5849146, -5253827, -4756862, -4154571, -3564276, -3730746, -4596216, -4937755, -4055570, -2775513, -2265387, -2880368, -4629746, -7538462, -10739498, -12355473, -11467228, -9553603, -8911314, -10030395, -11330517, -11028675, -8535009, -4668372, -1487298, -1244047, -4069908, -6887543, -6119230, -1769382, 2438433, 3448722, 2179562, 1642836, 2857822, 4037366, 3438635, 1433404, -717341]
1874g17341k152195k711349k589799m63913K590685L814223J947736j309677l239342
1865d830972k637938j94320K552302L924682K773198l83614l297121m064599k971386
1856i129768j444500K03879K626065N304699O211762M095595J04118l234818l940484
1847G96548j645303K030054M109493K728982o14798k600602k190441j548468k292915
1838a227450k965649j720163L85689J077045O34535J312734L391131M512124L331114
1829H731110J388238M11499j47304j474200k909008k861747j293056L85796J359877
1820C591205J794113J503598m0955k176727l060233j861853J42688J300239J391245
1811B583320J020712L38825m62737l28702J291174K650965J269208k358562m471568
$$ y = [-717341, -2869536, -5580885, -8170684, -8634597, -6043912, -2229689, -281953, -1591630, -4830972, -7468910, -7663230, -5110928, -1186246, 1586952, 1203338, -2093783, -6158382, -9129768, -10574268, -10370389, -7744324, -2439625, 3772137, 7867732, 7971850, 4737032, 796548, -848755, 1181299, 5290792, 8019774, 7404976, 4804374, 2613933, 1065465, -1227450, -4193099, -5913262, -5527573, -4450528, -3815993, -2503259, 887872, 5399996, 8731110, 10119348, 10530847, 10383543, 8909343, 6000335, 3138588, 1845532, 2231328, 3591205, 5385318, 6888916, 6847961, 4671234, 1611001, -250852, -108164, 1192075, 2583320, 3604032, 3942857, 3480120, 3151418, 4442592, 7093557, 8362765, 6004203, 1532635]
1802A532635k491984J647702L925955K916668N56589r81378j354953j143834o22696
1793C984704N4835N13936M37619l60896j951623l589286l575498j259882J171235
1784d574856P95225k014562l641430j857238J557918L664869L831640L109689
1776H71255K090111J134649J178006K297255K645511Q08697j780920k843636k676601
1767C724327l178831m186422l611020j204044O33613M61890j52175Q32044L212589
1758c468029N258063N540923L414226n71716l990360m183309j604479K97777l55888
1749C37208j432029m21197J550124J645779k07432j465808r43975o9296k00112
1740a206738r41048j474233j716888j655804j006273J4287P71430J259080J817921
$$ y = [1532635, -959349, 688353, 4614308, 7530976, 8087565, 7106187, 5751234, 4607400, 3984704, 4039539, 4553475, 4991094, 4630198, 2678575, -910711, -4486209, -5746091, -4574856, -3779631, -5794193, -9435623, -11292861, -9734943, -6070074, -2238434, 871255, 2961366, 4096015, 5274021, 7571276, 10216787, 11025484, 9244564, 6400928, 3724327, 545496, -3640926, -7251946, -8455990, -7822377, -7360487, -7512662, -6680618, -3468029, 1790034, 7330957, 10745183, 10173467, 6183107, 1999798, 395319, 693096, 337208, -1094821, -1516018, 34106, 1679885, 1472453, 6645, -937330, -1006626, -1206738, -2147786, -3622019, -5338907, -6994711, -8000984, -7986697, -7215267, -5956187, -4138266]
1731d138266J848292M41908j555257k056926q57197j48876r32143j151505Q25070
1722g724900K933679K273714j02469n03808J634339K756797P52544j701705j202950
1713h84759J473723K992713K279904R90804J70484o43046j279401q07811R3841
1704D386452o09693k790483l452740j022680J859223J808839o50599k088967q31125
1695c391773J456141K323101R82448j380726k415487m91232K853805L549120k6450
1686C458947l985882l431942R89908M182460L669091J820389Q06068m28367k606741
1677D473931l501461j566013Q10289P67523n62517k81959J367654J824394P69231
1668D101072J95894L53833o84284k983285l653978j037425K581697L927947K577769
$$ y = [-4138266, -2289974, -1848066, -3403323, -5460249, -6317446, -6466322, -7398465, -8549970, -7724900, -4791221, -2517507, -2619976, -3123784, -1489445, 1267352, 2019896, 318191, -884759, 588964, 3581677, 5861581, 6852385, 7022869, 6379823, 5100422, 4292611, 4386452, 3776759, 986276, -2466464, -3489144, -1629921, 178918, -471681, -2560648, -3391773, -1935632, 387469, 1369917, -10809, -2426296, -2917528, -63723, 3485397, 3458947, -526935, -3958877, -2968969, 1213491, 4882582, 6702971, 7509039, 7080672, 4473931, 972470, -593543, 216746, 984269, 421752, 139793, 1507447, 3331841, 4101072, 4296966, 4650799, 3966515, 983230, -2670748, -3708173, -1126476, 2801471, 5379240]
1659E379240N04397p62170j148700j144738j059641p65850L00198K320181M119089
1650G742006L913234J369361j848666l809458l891933k681808j224586m16255
1642h48105k95980p0374M35016J11583j343519j782553N47005L271720K194948
1633B219741k246098m440298j069363M110311N390355K403477p32453j620187
1625D015485j378782j161696n02620O82898J430066J660199K335821L045856J822822
1616A1950049j599933m479916m473300k747564k054793k811411k890738r07927
1608a0015533J897310L304639K636131J178406N08897P97587Q41000k77763j841259
1599i70585k190208p27318J220691J745389L36420j637002k358209j431335k07187
$$ y = [5379240, 5883637, 5121467, 3972767, 2828029, 1768388, 1002538, 1302736, 3622917, 7742006, 11655240, 13024601, 11175935, 7366477, 3474544, 792736, -431850, -848105, -1144085, -1214459, -779443, -667860, -2011379, -3793932, -3246927, 24793, 2219741, -26357, -4466655, -5536018, -1425707, 3964648, 6368125, 5635672, 4015485, 2636703, 1475007, 972387, 1655285, 3085351, 4745550, 7081371, 10127227, 11950049, 10350116, 5870200, 1396900, -1350664, -3405457, -6216868, -9107606, -10015533, -8118223, -4813584, -2177453, -999047, -490150, 307437, 1148437, 870674, -970585, -3160793, -3888111, -2667420, -922031, -585611, -2222613, -4580822, -6012157, -6219344]
1590f219344n3178o08369n32498J32038k19828j895738k424101L83652M765943
1581f671423O487500L935913j02227k075429j409268j2465M69818q6947q96498
1572c61026j245747j170990j308140j635462q68626J658193L960053L224653j88545
1563B064363k773092k521730j182392p46297l10439J420899K791961J484103j101708
1554h74332j230749J514878L262312J371885j792489k179605O79456L472558L245619
1545G469533K40537l041032m419891l531711j402379R06652K892448L995712L341146
1536F451015Q45123k026000l544802l382677k218888m56265J491657K448727J715212
1527A323102N81553P42327J521780Q19415j256551k198882j018634K19229j62067
$$ y = [-6219344, -6272522, -6880891, -7413389, -7281351, -7501179, -9396917, -11821018, -11437366, -6671423, -183923, 3751990, 3649763, 1574334, 165066, 152601, 622419, 535472, -361026, -1606773, -2777763, -4085903, -5721365, -6589991, -4931798, -971745, 2252908, 2064363, -708729, -3230459, -4412851, -5159148, -5469587, -4048688, -1256727, 227376, -874332, -2105081, -590203, 2672109, 4043994, 2251505, 71900, 751356, 4223914, 7469533, 7710070, 4669038, 249147, -3282564, -4684943, -3778291, -885843, 3109869, 6451015, 7296138, 5270138, 1725336, -1657341, -3876229, -4332494, -2840837, -392110, 1323102, 1904655, 2646982, 4168762, 4988177, 3731626, 1532744, 514110, 733339, 571272]
1518E71272r02382l15032P12489K94911j263001j935361q45044J033220K424084
1509b24844K612324J392785n88836k043436k522686k826919l173054k417891k80047
$$ y = [571272, -331110, -646142, 66347, 361258, -901743, -2837104, -3682148, -2648928, -224844, 2387480, 3780265, 3191429, 1147993, -1374693, -4201612, -7374666, -9792557, -10072604]
$$ [...]
##END NTUPLES=NMR SPECTRUM
##END=
