##TITLE=31Pdec_DE-106_ch_8
CDCl3, 64 sc
 19.8.2025
##JCAMPDX= 6.0         $$ Bruker NMR JCAMP-DX V2.0
##DATA TYPE= NMR SPECTRUM
##DATA CLASS= NTUPLES
##ORIGIN= UXNMR, Bruker Analytische Messtechnik GmbH
##OWNER= root
$$ XWIN-NMR		Version 3.5
$$ Tue Aug 19 15:33:07 2025 Russian Standard Time (UT+4h)  she@DPX200
##.OBSERVE FREQUENCY= 81.013821
##.OBSERVE NUCLEUS= ^31P
##.ACQUISITION MODE= SIMULTANEOUS
##.ACQUISITION SCHEME= undefined
##.AVERAGES= 64
##.DIGITISER RES= 17
##SPECTROMETER/DATA SYSTEM= spect
##.PULSE SEQUENCE= zgpg30
##.SOLVENT NAME= DMSO
##.SHIFT REFERENCE= (INTERNAL, DMSO, 0, 198.062)
##AUDIT TRAIL= $$ (NUMBER, WHEN, WHO, WHERE, WHAT)
$$ ##TITLE= Audit trail, XWIN-NMR		Version 3.5
$$ ##JCAMPDX= 5.01
$$ ##ORIGIN= Bruker BioSpin GmbH
$$ ##OWNER= she
$$ F:/spectra/data/she/nmr/P31/2/pdata/1/auditp.txt
$$ ##AUDIT TRAIL=  $$ (NUMBER, WHEN, WHO, WHERE, WHAT)
(   1,<2025-08-19 15:31:59.62 +0400>,<she>,<DPX200>,
      <created by zg, POWCHK disabled, PULCHK disabled
       configuration hash MD5:
       00 E9 B6 7A A2 85 ED C7 34 08 36 98 17 FE 4E 26
       data hash MD5: 32K
       62 FC B4 0C E2 0A 83 86 A8 43 B0 8D F6 2B 3C 88>)
(   2,<2025-08-19 15:32:01.76 +0400>,<she>,<DPX200>,
      <Start of raw data processing
       efp BC_mod = 2 LB = 1.5 FT_mod = 6 PKNL = 1 PHC0 = 1417.252 PHC1 = 24.09949 SI = 64K 
       data hash MD5: 64K
       72 D4 71 19 F9 23 B1 9D CB EC D8 0E 13 53 D3 48>)
(   3,<2025-08-19 15:32:20.37 +0400>,<she>,<DPX200>,
      <pk PHC0 = 3.492932 PHC1 = 0 
       data hash MD5: 64K
       AD 0E 66 32 8F BB D3 1C 26 11 B7 B6 C0 FD DA 24>)
(   4,<2025-08-19 15:32:29.75 +0400>,<she>,<DPX200>,
      <abs ABSG = 5 
       data hash MD5: 64K
       89 A6 55 D3 E1 B1 50 FF 58 B0 81 D2 E1 36 5E 1D>)
$$ ##END=
$$ 
$$ hash MD5
$$ 6A 52 E2 78 08 C2 C9 C0 2A 33 9D 81 0A 85 02 A3
##$RELAX= 
##$RELAX= 
##$RELAX= 
##$RELAX= 
##$RELAX= 
##$RELAX= 
##$RELAX= 
##$RELAX= 
$$ Bruker specific parameters
$$ --------------------------
##$DU= <F:/spectra>
##$EXPNO= 2
##$NAME= <P31>
##$PROCNO= 1
##$TYPE= <nmr>
##$USER= <she>
##$AMP= (0..31)
100 100 100 100 100 100 100 100 100 100 100 100 100 100 100 100 100 100 
100 100 100 100 100 100 100 100 100 100 100 100 100 100 
##$AQSEQ= 0
##$AQ_mod= 1
##$AUNM= <au_zg>
##$AUTOPOS= <>
##$BF1= 81.014009
##$BF2= 200.13
##$BF3= 200.13
##$BF4= 200.13
##$BF5= 200.13
##$BF6= 200.13
##$BF7= 200.13
##$BF8= 200.13
##$BYTORDA= 1
##$CFDGTYP= 0
##$CFRGTYP= 5
##$CHEMSTR= <none>
##$CNST= (0..31)
1 1 145 1 1 1 1 1 1 1 1 1 1 1 1 1 1 1 1 1 1 1 1 1 1 1 1 1 1 1 1 1 
##$CPDPRG= <waltz16>
##$CPDPRG1= <>
##$CPDPRG2= <waltz16>
##$CPDPRG3= <>
##$CPDPRG4= <mlev>
##$CPDPRG5= <mlev>
##$CPDPRG6= <mlev>
##$CPDPRG7= <mlev>
##$CPDPRG8= <mlev>
##$CPDPRGB= <>
##$CPDPRGT= <>
##$D= (0..31)
0 1 0 0 0 0 0 0 0 0.06 0 0.03 2e-05 3e-06 0 0 0.0002 0 0 0 0 0 0 0 0 0 
0 0 0 0 0 0 
##$DATE= 1755603118
##$DBL= (0..7)
120 120 120 11 120 120 24 19 
##$DBP= (0..7)
150 150 150 150 150 150 150 150 
##$DBP07= 0
##$DBPNAM0= <>
##$DBPNAM1= <>
$$ [...]
##$SUBNAM3= <"">
##$SUBNAM4= <"">
##$SUBNAM5= <"">
##$SUBNAM6= <"">
##$SUBNAM7= <"">
##$SUBNAM8= <"">
##$SUBNAM9= <"">
##$SW= 400.765351723535
##$SWIBOX= (0..15)
0 1 3 0 0 0 0 0 0 0 0 0 0 0 0 0 
##$SW_h= 32467.5324675325
##$TD= 32768
##$TD0= 1
##$TE= 0
##$TE2= 300
##$TE3= 300
##$TEG= 300
##$TL= (0..7)
0 120 53 12 22 120 120 120 
##$TP= (0..7)
150 150 150 150 150 150 150 150 
##$TP07= 0
##$TPNAME0= <>
##$TPNAME1= <>
##$TPNAME2= <>
##$TPNAME3= <>
##$TPNAME4= <>
##$TPNAME5= <>
##$TPNAME6= <>
##$TPNAME7= <>
##$TPOAL= (0..7)
0.5 0.5 0.5 0.5 0.5 0.5 0.5 0.5 
##$TPOFFS= (0..7)
0 0 0 0 0 0 0 0 
##$TUNHIN= 0
##$TUNHOUT= 0
##$TUNXOUT= 0
##$USERA1= <user>
##$USERA2= <user>
##$USERA3= <user>
##$USERA4= <user>
##$USERA5= <user>
##$V9= 5
##$VALIST= <valist>
##$VCLIST= <CCCCCCCCCCCCCCC>
##$VD= 0
##$VDLIST= <DDDDDDDDDDDDDDD>
##$VPLIST= <PPPPPPPPPPPPPPP>
##$VTLIST= <TTTTTTTTTTTTTTT>
##$WBST= 1024
##$WBSW= 4
##$XGAIN= (0..3)
0 0 0 0 
##$XL= 0
##$YL= 0
##$YMAX_a= 6336
##$YMIN_a= -11526
##$ZGOPTNS= <>
##$ZL1= 120
##$ZL2= 120
##$ZL3= 120
##$ZL4= 120
##$ABSF1= 198.0616
##$ABSF2= -202.7028
##$ABSG= 5
##$ABSL= 3
##$ALPHA= 0
##$AQORDER= 0
##$ASSFAC= 0
##$ASSFACI= 0
##$ASSFACX= 0
##$ASSWID= 0
##$AUNMP= <proc_1d>
##$AZFE= 0.1
##$AZFW= 0.5
##$BCFW= 0
##$BC_mod= 2
##$BYTORDP= 0
##$COROFFS= 0
##$CY= -3
##$DATMOD= 1
##$DC= 0
##$DFILT= <>
##$DTYPP= 0
##$F1P= 0
##$F2P= 0
##$FCOR= 1
##$FTSIZE= 65536
##$FT_mod= 6
##$GAMMA= 0
##$GB= 0
##$INTBC= 1
##$INTSCL= 9.790993e-09
##$ISEN= 30
##$LB= 1.5
##$LEV0= 0
##$LPBIN= 0
##$MAXI= 10000
##$MC2= 0
##$MEAN= 0
##$ME_mod= 0
##$MI= 50
##$NCOEF= 0
##$NC_proc= -9
##$NLEV= 6
##$NOISF1= 182.463
##$NOISF2= 159.3651
##$NSP= 0
##$NTH_PI= 0
##$NZP= 0
##$OFFSET= 198.0616
##$PC= 4
##$PHC0= 1420.745
##$PHC1= 24.09949
##$PH_mod= 1
##$PKNL= yes
##$PPARMOD= 0
##$PSCAL= 0
##$PSIGN= 0
##$REVERSE= no
##$SF= 81.0140089999434
##$SI= 65536
##$SIGF1= 159.3651
##$SIGF2= -187.1042
##$SINO= 113.3802
##$SIOLD= 16384
##$SREGLST= <1H.CDCl3>
##$SSB= 0
##$STSI= 65536
##$STSR= 0
##$SW_p= 32467.5324675325
##$SYMM= 0
##$S_DEV= 0
##$TDeff= 32768
##$TDoff= 0
##$TI= <>
##$TILT= no
##$TM1= 0
##$TM2= 0
##$TOPLEV= 0
##$USERP1= <user>
##$USERP2= <user>
##$USERP3= <user>
##$USERP4= <user>
##$USERP5= <user>
##$WDW= 1
##$XDIM= 65536
##$YMAX_p= 426973796
##$YMIN_p= -140347372
$$ End of Bruker specific parameters
$$ ---------------------------------
##NTUPLES= NMR SPECTRUM
##VAR_NAME=  FREQUENCY,     SPECTRUM/REAL,   SPECTRUM/IMAG
##SYMBOL=    X,             R,               I
##VAR_TYPE=  INDEPENDENT,   DEPENDENT,       DEPENDENT
##VAR_FORM=  AFFN,          ASDF,            ASDF
##VAR_DIM=   65536,         65536,           65536
##UNITS=     HZ,            ARBITRARY UNITS, ARBITRARY UNITS
##FACTOR=    0.49542278885378, 1,            1
##FIRST=     16045.7642231865, 0,            0
##LAST=      -16421.768244346, 0,            0
##MIN=       -16421.768244346, -140347372,   0
##MAX=       16045.7642231865, 426973796,    0
$$ Real data points
##PAGE= N=1
##DATA TABLE= (X++(R..R)), XYDATA
$$ [...]
##PAGE= N=2
##DATA TABLE= (X++(I..I)), XYDATA
7364c747050j4667067q500901J037592P065805O874569M287910K592051J94942
7356d862149l780187n244315j231851M309481O020775M585748L462694K167377
7348E427573r63853k843072J31874M128328K100368m748900p591417k720576L720520
7339c359155N503425L995560L249984L261501J889826o32708k669810l801130
7331G437493l871522k043681J039809K572176Q77631k677746n961364p652924
7323a0280128o159385o93215N491491O990657L141600p74165j006797J29177n51796
7314c712561j849143j340979K30435J416277L149524N360799M349309j444921
7306F158740o347834m125770K407132M842378J156206k413501j628030L43783
$$ plain form
7364 -3747050 -18414117 -26915018 -25877426 -18811621 -11937052 -7649142 -5057091 -4862149
7356 -4862149 -8642336 -13886651 -15118502 -10809021 -4788246 -202498 3260196 5427573
7348 5427573 4463720 1620648 1752522 5880850 7981218 3232318 -4359099 -7079675 -3359155
7339 -3359155 2144270 6139830 9389814 12651315 14541141 13908433 11238623 7437493
7331 7437493 3565971 1522290 2562099 5134275 6011906 3334160 -2627204 -10280128
7323 -10280128 -16439513 -17132728 -11641237 -4650580 -1508980 -2283145 -3289942 -3160765 -3712561
7314 -3712561 -5561704 -6902683 -6672248 -5255971 -2106447 3254352 7603661 6158740
7306 6158740 -189094 -4314864 -1907732 2934646 4090852 1677351 49321 393104
7298C93104l78025k205172j854614J506N22362n88251j415440j173154n55380
7289g253064J89838J538941L603448N718080O391619L701982k465973q497898
7281B926973r847501o386131k462608r74656l58554J408256L180261L071001J566706
7272g876253j52493k305502m374098l670639O84561M659769L901199j69915k527776
7263a1831147j565000j30920k70586p59324K740J667175K730840J677712j825117
7254a0303627m982852l328690K897212O730484L402691j661944j99379N715422
7246a730683O274331l84070m649180l31452O047372O011404J441488o03581N98563
7237A2674192O24825j494704l272622m606555o802630p846621m928874K04182
$$ plain form
7298 393104 15079 -2190093 -4044707 -4043201 -3520839 -4109090 -5524530 -6697684 -7253064
7289 -7253064 -7063226 -5524285 -1920837 3797243 10188862 13890844 11424871 2926973
7281 2926973 -6920528 -13306659 -15769267 -16743923 -17102477 -15694221 -12513960 -9442959 -7876253
7272 -7876253 -8028746 -10334248 -14708346 -18378985 -17694424 -13034655 -9133456 -9303371 -11831147
7263 -11831147 -13396147 -13527067 -13797653 -14556977 -14554237 -12887062 -10156222 -8478510 -10303627
7254 -10303627 -15286479 -18615169 -15717957 -8987473 -5584782 -7246726 -7446105 -1730683
7246 -1730683 4543648 4159578 -489602 -821054 5226318 11237722 12679210 12075629 12674192
7237 12674192 13299017 11804313 8531691 3925136 -2877494 -10724115 -15652989 -15448807
7229a5448807M208319P856275J2303688J2650932L697726r249377j4449171r081651
7221g512066j953180L05367Q47704L821125O710882N982147L212058O40157l180137
7212H874057q096032q621380j788454N780842N409572j814851o865717m488373
7204a1610336K411012Q448080J0321086O624121j370705q322340q699714l190552
7196e389348J831678K048184j70897J82967M025697O956183M488820k241074p082923
7187D649287n900018j373576J390933K078551L724491N338446K368972m403684
7179G873402p290974k358942M212589M812579M00843l072863l686617l348346
7171b458329k280513K92453K528742K481856J867243K435495J672380k409612
$$ plain form
7229 -15448807 -11240488 -3384213 8919475 21570407 25268133 16018756 1569585 -7512066
7221 -7512066 -9465246 -9159879 -8312175 -4491050 2219832 8201979 11414037 12054194 8874057
7212 8874057 778025 -7843355 -9631809 -3850967 1558605 -256246 -7121963 -11610336
7204 -11610336 -9199324 -751244 9569842 16193963 14823258 6500918 -2198796 -5389348
7196 -5389348 -3557670 -1509486 -1680383 -1497416 2528281 9484464 13973284 11732210 4649287
7187 4649287 -1250731 -2624307 -1233374 845177 4569668 9908114 12277086 7873402
7179 7873402 582428 -1776514 2436075 7248654 7649497 4576634 890017 -2458329
7171 -2458329 -4738842 -4446389 -1917647 564209 2431452 4866947 6539327 4129715
7163D129715n573535k961782K547323M686968L763807M228434M665547r1684p476311
7154G918482q384937j628028K973067l92813m800529k341130L558630M761914
7146A664656J355423j58474J807069K391876p30086l584383k299748J321186K612874
7137D380393l6628l903534n666669m888679l094224l48403M623251R959742R935625
7128A0960874K373218n910977o325879J88137M962586M144454K475912L499258
7120A6367583L530733j059017o803533q240593n721394l485971l252702l919963
7112a2584857m776869n100076l225686K60906J193244k301630n266244j949668
7104c3750880N426180Q938666N506689O36271R23567O121949J0000654P458654
$$ plain form
7163 4129715 -1443820 -4405602 -1858279 2828689 6592496 10820930 15486477 15394793 7918482
7154 7918482 -466455 -2094483 878584 485771 -4314758 -6655888 -3097258 1664656
7146 1664656 3020079 2861605 4668674 7060550 6330464 2746081 446333 1767519 4380393
7137 4380393 4343765 440231 -5226438 -10115117 -13209341 -13557744 -8934493 1025249 10960874
7128 10960874 13334092 7423115 1097236 1285373 6247959 10392413 12868325 16367583
7120 16367583 19898316 18839299 12035766 3795173 -1926221 -5412192 -8664894 -12584857
7112 -12584857 -17361726 -22461802 -25687488 -25426582 -24233338 -26534968 -31801212 -33750880
7104 -33750880 -28324700 -19386034 -13879345 -13243074 -12319507 -6197558 3803096 11261750
7096A1261750j41222o406053o776658l524661k388457m688951n857530k533807
7088b1055589K421156M121541K094387l4594N00705L066449M796384L134139j386944
7079b342366m686909l637270n60222J87827o08613J507930O019357P097602L568538
7070F545874J526832L505442L155826l451329q900289n074681L183097M827738
7062E318510o72150l762560n08371K503010J2637m218402m343597k24008M507439
7053a387492O854958M854145j513379p884005q456332l105713K277794L419998
7045d940026J485067j065464l319851l663848p8966N489468P876804N628717K618991
7036A0030892J324028k40381k944146l737272j506557k01149k171801l488803
$$ plain form
7096 11261750 11120528 4714475 -2062183 -5586844 -7975301 -12664252 -18521782 -21055589
7088 -21055589 -18634433 -14512892 -12418505 -12453099 -11952394 -8885945 -4089561 -955422 -2342366
7079 -2342366 -7029275 -10666545 -11226767 -11038940 -11647553 -10139623 -4120266 2977336 6545874
7070 6545874 8072706 11578148 14733974 11282645 2382356 -2692325 490772 5318510
7062 5318510 4646360 883800 375429 2878439 2891076 -1327326 -5670923 -5894931 -1387492
7053 -1387492 5467466 10321611 8808232 924227 -7532105 -10637818 -8360024 -4940026
7045 -4940026 -3454959 -4520423 -7840274 -11504122 -11583088 -6093620 1783184 7411901 10030892
7036 10030892 11354920 11114539 8170393 4433121 2926564 2725415 553614 -2935189
7028b935189o03468K904409J827973k019961k846579j95346J183202k98843j117389
7019d101191O98918K656451K781834K574345L103983K508256o7126j740541m10975
7010H003954Q59026j929605o692295p105677j591660M030406M556176K076865
7002B207190J505665K657562J598560j701953k983154j544310k355839p429288
6994h045567j0508517n369919M221174Q732169N140138r13148m323992n506426
6986a6574088n544987k809105K824469P258445P236565M802290L463671K764455
6978C421715K28506l429238m977463l657229j883988r46587P18103L846727N527886
6969a151568K525559l211253n065633N61345Q506822R783311K584571n113553
$$ plain form
7028 -2935189 -3538657 -634248 1193725 -826236 -3672815 -3868161 -2684959 -2983802 -4101191
7019 -4101191 -3402273 -745822 2036012 4610357 7714340 10222596 10155470 8414929 8003954
7010 8003954 8862980 6933375 241080 -6864597 -8456257 -4425851 130325 2207190
7002 2207190 3712855 6370417 7968977 6267024 3283870 1739560 -616279 -8045567
6994 -8045567 -18554084 -23924003 -19702829 -10970660 -5830522 -6743670 -11067662 -16574088
6986 -16574088 -22119075 -24928180 -22103711 -14845266 -7608701 -2806411 657260 3421715
6978 3421715 3650221 220983 -4756480 -8413709 -10297697 -11244284 -10526181 -6679454 -1151568
6969 -1151568 1373991 -1837262 -6902895 -6341550 2165272 11948583 14533154 9419601
6961I419601o020339l028420l879812q701956r368906k001847O372084P277654
6953i931941K245583l92470K231771M330364Q57301n018417o518711k286426K791492
6944a1691454M716906M511324M452877L814759J092152j994568k628171j784758
6936D89067k457286l417702m22542N278585O269965K49401m514009q05458N927550
6927F597571N400208j879968o152445m015833k250999m770777n813167m66280
6919a3351690O232067O850598K474141m57424l55249q82630l074559l337878M37018
6910e465606N374296P443530N999249L271622R56604j299494m145776o293843
6902E840582n543542k378337l30942j071921j535111J216313M729320M872594
$$ plain form
6961 9419601 3399262 370842 -3508970 -12210926 -21579832 -23581679 -17209595 -9931941
6953 -9931941 -7686358 -8078828 -5847057 -1516693 -659392 -5677809 -12196520 -14482946 -11691454
6944 -11691454 -6974548 -2463224 1989653 5804412 6896564 4901996 2273825 489067
6936 489067 -1968219 -5385921 -5808463 -529878 5740087 5989488 1475479 670021 6597571
6927 6597571 11997779 10117811 3965366 -50467 -2301466 -7072243 -12885410 -13351690
6919 -13351690 -7119623 -269025 2205116 1747692 1392443 509813 -2564746 -5902624 -5465606
6910 -5465606 -91310 7352220 13351469 16623091 17579695 16280201 12134425 5840582
6902 5840582 297040 -2081297 -2412239 -3484160 -5019271 -3802958 926362 5798956
6894E798956K656543K102533K893289J465625j297147p21602K778742L145694
6886A8822633j260888m812633m532658m707100p374859o486357J943217J0727979
6878B319334J0570888L545693o30283J211168L237704J061508k634336l339540
6870A5342136l64348L435404M425841J193107l016520k877413J750588M502461
6862B4391256J480065k675664k021427J542125J772755k723263q404282j2603975
6854G57590j3583536q317021K804553J1785903J0974290L420880j697097j910113
6846D235449j921741l106099j786735J892276K485764j530982m840596l766943
6838h339607q03148J313834L302093M952971L685735K6874j647745l38876l06313
$$ plain form
6894 5798956 8455499 10558032 13451321 14916946 13619799 12898197 15676939 18822633
6886 18822633 17561745 12749112 8216454 3509354 -3865505 -10351862 -8408645 2319334
6878 2319334 12890222 16435915 15805632 17016800 20254504 21316012 18681676 15342136
6870 15342136 14977788 18413192 22839033 24032140 21015620 18138207 19888795 24391256
6862 24391256 25871321 23195657 21174230 22716355 24489110 21765847 13361565 757590
6854 757590 -12825946 -21142967 -18338414 -6552511 4421779 7842659 6145562 4235449
6846 4235449 2313708 -792391 -2579126 -686850 1798914 267932 -4572664 -8339607
6838 -8339607 -9142755 -7828921 -4526828 426143 4111878 4138752 2491007 2152131 1845818
6829A845818l300353n312517l925329k322191k526183j329153K761578N086592
6821i021738K596725n8712J644468L803999J021573k896287l4978P948415J0353581
6812A5357046K337467q343478j1732610o919056j27331L581807L145119m12796
6804c113832m364688m286398K104136J0678121J3553172P502672k056930o910153
6796A3106100m382950J744148O671355P808523M010602l581423r488311p870769
6788H017275n21369M105362K400753L25152K639856M212264r10473p656944o863713
6779E748163m03956J647710k440998m148487j85596K286679o10610k239874K052219
6770A705250N524112J127664o177125p094368j886383K289535L192806L656395
$$ plain form
6829 1845818 -1454535 -6767052 -10692381 -13014572 -15540755 -16869908 -14108330 -9021738
6821 -9021738 -6425013 -6483725 -4839257 -1035258 -13685 -2909972 -2944950 5003465 15357046
6812 15357046 17694513 9351035 -2381575 -9300631 -9427962 -5846155 -2701036 -3113832
6804 -3113832 -7478520 -11764918 -9660782 1017339 14570511 22073183 20016253 13106100
6796 13106100 8723150 10467298 17138653 24947176 28957778 25376355 15888044 8017275
6788 8017275 7495906 11601268 14002021 14327173 16967029 21179293 20268820 12611876 5748163
6779 5748163 5344207 6991917 4550919 402432 216836 2503515 1892905 -346969 1705250
6770 1705250 7229362 8357026 2179901 -4914467 -6800850 -4511315 -1318509 2337886
6762B337886L369028l78737n408128o431263l564130j827880k452446j606213
6754a5961883J864414M022411K535897L12366N76833K479896L385229K492798
6746A707961Q10798m39045p60310r12548j826161k106203R27734N899402O754160
6737A0055788J074524m647067l216042K666596M231094p09148n756446o120586
6729b421287l848468j929783J91431K791255K992479r34439n918572p556499m931476
6720b1565359l69154L317462M349407L164316K620297M469416N820685K697221
6712D504291k977013m706912p98199K731222J078174k286919j349441L276449
6704e28348N653530L165956o96318j847628k32458J504895J281133j198294m493495
$$ plain form
6762 2337886 5706914 5328177 -79951 -6511214 -10075344 -11903224 -14355670 -15961883
6754 -15961883 -14097469 -10075058 -7539161 -7226795 -6649962 -4170066 -784837 1707961
6746 1707961 2518759 2079714 1319404 406856 -1419305 -3525508 -2597774 3301628 10055788
6737 10055788 11130312 6483245 3267203 5933799 10164893 9455745 3699299 -2421287
6729 -2421287 -6269755 -8199538 -8008107 -5216852 -2224373 -3158812 -9077384 -16633883 -21565359
6720 -21565359 -21934513 -18617051 -14267644 -11103328 -8483031 -4013615 1807070 4504291
6712 4504291 1527278 -3179634 -3977833 -1246611 -168437 -2455356 -3804797 -528348
6704 -528348 5125182 8291138 7594820 5747192 5514734 7019629 8300762 7102468 2608973
6695B608973n929164l554170J380011M776349L603138p41804l789068k866382
6687d512117J18973J292537n03347k812690l083656j497347J15602O67734K99333
6678i914978l07274k44773R23884K132121J691738k21624j431807o91117R47334
6669g116496K208290K949177K868305J484638K10563J259168L300871K090518
6661I255034k587474n000146j688975K723447K285757j601719l462318k349774
6653b426168j122699L34676M340682R045702R531596N156719m9632l953006p258203
6644A3599667q489599n148558l15479n25395n381376o812415j441068L823125
6636a0691098K794912l21633J698623P211476Q192328K119259m867900o129160
$$ plain form
6695 2608973 -3320191 -6874361 -5494350 -718001 2885137 2143333 -1645735 -4512117
6687 -4512117 -4393144 -3100607 -3603954 -6416644 -9500300 -10997647 -10882045 -10214311 -9914978
6678 -9914978 -10222252 -10467025 -9543141 -7411020 -5719282 -5940906 -7372713 -8063830 -7116496
6669 -7116496 -4908206 -1959029 909276 2393914 2604477 3863645 7164516 9255034
6661 9255034 6667560 1667414 -21561 2701886 4987643 3385924 -76394 -2426168
6653 -2426168 -3548867 -3214191 1126491 10172193 19703789 24860508 24810876 20857870 13599667
6644 13599667 5110068 -38490 -353969 -879364 -6260740 -13073155 -14514223 -10691098
6636 -10691098 -7896186 -8217819 -6519196 692280 8884608 11003867 6135967 6807
6628F807j480174L828909M210677j600236q872012j0794868n530577K124522O914472
6619a1192480Q163025P376640M676182N10458k310334j938516o53221j384224
6611C247530l086045k944880j355604r87052k070019k322053j157000o37717j894495
6602a3207335l103365j868663J587626M231346L314361J5009j038357K271374
6594g798004N399378K754400l056638l138550N009674J2614468J0955460K366063
6586B5106251m820847p679024q865582q782701n035749J102268M507074L394497
6578a073813J458357J709362K661978K020864L21164q15259j293664k001758l395544
6569d08313m989725m837289o20054O365586J0122508O722909O88346m67241K689027
$$ plain form
6628 6807 -1473367 2355542 6566219 4965983 -3906029 -14700897 -20231474 -18106952 -11192480
6619 -11192480 -3029455 4347185 9023367 9533825 7223491 5284975 4631754 3247530
6611 3247530 161485 -2783395 -4138999 -5126051 -7196070 -9518123 -10675123 -11312840 -13207335
6602 -13207335 -16310700 -18179363 -16591737 -12360391 -9046030 -9031021 -10069378 -7798004
6594 -7798004 -2398626 355774 -2700864 -5839414 -829740 11784728 22740188 25106251
6586 25106251 20285404 12606380 3740798 -5041903 -10077652 -8975384 -4468310 -1073813
6578 -1073813 384544 2093906 4755884 6776748 7097912 6282653 4988989 2987231 -408313
6569 -408313 -5398038 -10235327 -10855381 -4489795 5632713 12355622 13043968 12576727 15265754
6560A5265754K270905m176620q828409n108828K043823L236169j945647n254179
6552b497032k095149K994109L991445J126217j417125j798494j412203j458358
6544b566590j618995j597732j760132k163218k368432k239160j773255k88465
6536a6375979K817035O292321P447499N018442O87207k707102l529146j781211
6528b130934J198398K853019J134217k654096m538385k883588p44228j311469
6520i077066l248750l271634j278633M69749J401687J872223J64695m693260q276927
6511b5937916m967575L068155P350790M655490P95766R26814K665447K112709
6503i330320M47276J07122r9068j084244L16120N620364R583897P112276J802243
$$ plain form
6560 15265754 17536659 13360039 4531630 -577198 1466625 4702794 2757147 -2497032
6552 -2497032 -4592181 -1598072 2393373 3519590 2102465 303971 -1108232 -2566590
6544 -2566590 -4185585 -5783317 -7543449 -9706667 -12075099 -14314259 -16087514 -16375979
6536 -16375979 -13558944 -7266623 180876 5199318 5886525 3179423 -349723 -2130934
6528 -2130934 -932536 1920483 3054700 400604 -4137781 -7021369 -7765597 -9077066
6520 -9077066 -12325816 -15597450 -16876083 -16406334 -15004647 -13132424 -12967729 -17660989 -25937916
6511 -25937916 -30905491 -27837336 -20486546 -15831056 -15035290 -14108476 -11443029 -9330320
6503 -9330320 -8883044 -8775922 -8874990 -9959234 -9643114 -4022750 5561147 12673423 14475666
6494A4475666Q84223M149196M826599J84281n361149p493753o630102m972865
6486F2096l554010k555330j209105J950519N845529O025130Q24291m384293l822733
6477h17906M74455K346153O63575j138066j980859k927971k519583M76988K117909
6468c305305j028990l996080n97617M095767J73690r161835r702543J639766J0829071
6459a1054076P843196M63534n71873K042180N92664k957599k263027P57118K52409
6450d895474j896842r9514L297827J668057l338469m099073m84786k3796m511754
6441a4383824o880413l020949K484330M838490N166376N328251L703032m74078
6433c238785m239338n423798n346540m725279j713497L545874O945479N795949
$$ plain form
6494 14475666 15359889 19509085 24335684 24519965 19158816 11665063 5034961 62096
6486 62096 -3491914 -6047244 -7256349 -5305830 539699 6564829 7389120 3004827 -817906
6477 -817906 -343451 2002702 2666277 1528211 -452648 -3380619 -5900202 -5423214 -3305305
6468 -3305305 -4334295 -8330375 -8927992 -4832225 -4658535 -13820370 -23522913 -21883147 -11054076
6459 -11054076 -3210880 -2747346 -3319219 -1277039 -684375 -3641974 -5905001 -5147883 -4895474
6450 -4895474 -6792316 -6891830 -3594003 -1925946 -5264415 -9363488 -9848274 -9872070 -14383824
6441 -14383824 -21264237 -24285186 -21800856 -16962366 -11795990 -6467739 -2764707 -3238785
6433 -3238785 -7478123 -12901921 -18248461 -22973740 -24687237 -21141363 -14195884 -8399935
6425h399935K566982Q29392O49455K00646q21283j391272p31059J413971M239770
6416a443333N524852M026192J664759O33546l46097l170908n464292l724353k06967
6407b506601l66391l609561l618060J116227M425801K381510j140415k046602
6399e364092k109166l179064k196532K385167N297322K307409j674649J38032
6391d395573N013075M931230k72164k954734l45661J654088j134294m908663n174112
6382g586808l725067m056274m770051k570657J283141K582511R09818L61779L472964
6373a4098644P754840R100232O394436J773737k102223l805016l085846n53257
6365A378259K411789M234973M102852K183254q78910l861260m499044r95905M724662
$$ plain form
6425 -8399935 -5832953 -5003561 -4354106 -4153460 -4974743 -6366015 -7097074 -5683103 -1443333
6416 -1443333 4081519 8107711 9772470 10406016 10059919 6889011 1424719 -2299634 -2506601
6407 -2506601 -2872992 -6482553 -10100613 -8984386 -4558585 -2177075 -3317490 -5364092
6399 -5364092 -7473258 -10652322 -12848854 -10463687 -5166365 -2858956 -4533605 -4395573
6391 -4395573 617502 5548732 5276568 2321834 1976173 3630261 2495967 -2412696 -7586808
6382 -7586808 -11311875 -15368149 -20138200 -22708857 -21425716 -18843205 -17933387 -17571608 -14098644
6373 -14098644 -6343804 2756428 9150864 10924601 8822378 5017362 1931516 1378259
6365 1378259 3790048 8025021 12127873 14311127 13432217 9570957 5071913 4076008 8800670
6356H800670O933925J754560p525025j3096660j0594639k566314N295217Q597507
6348b400759N574906j900373p811310o524737M71405N773182N338865K393492
6340I14671M12613k173790o512092q186214l594147K656792L776075J342454K007406
6331i356232N336537L895794l852750r530784o647320Q71679N710000O479154
6323g093922N794217M553060K931310K609866L352131J523046l303963m779074
6315E586671J318716Q525736P110297k346775j0019652j0182806o211563k729207
6307h948583m76322M345k831216o507018n057143K002448P196867N485117J414582
6298g716923J101228K595730P55656k570783j331746L634142M694177p53253o020676
$$ plain form
6356 8800670 15734595 17489155 9964130 -3132530 -13727169 -16293483 -10998266 -2400759
6348 -2400759 3174147 1273774 -6537536 -13062273 -12590868 -6817686 -1478821 914671
6340 914671 1327284 -846506 -7358598 -15544812 -19138959 -16482167 -12706092 -11363638 -9356232
6331 -9356232 -4019695 -123901 -3976651 -13507435 -20154755 -19283076 -13573076 -7093922
6323 -7093922 -1299705 3253355 6184665 8794531 12146662 13669708 10365745 5586671
6315 5586671 6905387 15431123 22541420 20194645 10174993 -7813 -6219376 -8948583
6307 -8948583 -9424905 -9420560 -12251776 -18758794 -23815937 -21813489 -14616622 -9131505 -7716923
6298 -7716923 -6615695 -4019965 -3264309 -5835092 -7166838 -3532696 1161481 408228 -5612448
6289e612448m959608K09709L999168N100784M666796J802420l842143p838839
6281f474161n188238K002958O042907L130318k772829o064602n613790l620401
6273a8557838j891306j073250r90636j25723K862605N762963L981289k721521
6265a2753417p760053n419753J274174M559444K462834N23906K937678O841148
6257g334039P144502L163966k050802o060984p877949o651329k711165J128472
6249b1249328K081457P63167o2179N62282J371722J860114K873768L896820K491966
6240e410211k042340o179691n366778N14124O322282O919893K708878r92952k54670
6231c781465L007447M051712J627110j239691k489446l561830n367762n270495
$$ plain form
6289 -5612448 -10572056 -10362347 -6363179 -1262395 3404401 5206821 1364678 -6474161
6281 -6474161 -11662399 -9659441 -3616534 -486216 -3259045 -9323647 -14937437 -18557838
6273 -18557838 -20449144 -21522394 -22513030 -22638753 -19776148 -14013185 -10031896 -12753417
6265 -12753417 -20513470 -25933223 -24659049 -20099605 -17636771 -17112865 -14175187 -7334039
6257 -7334039 -189537 2974429 923627 -5137357 -13015306 -19666635 -22377800 -21249328
6249 -21249328 -19167871 -18404704 -18466883 -17904601 -16532879 -14672765 -11798997 -7902177 -5410211
6240 -5410211 -7452551 -13632242 -18999020 -18484896 -12162614 -5242721 -2533843 -3526795 -3781465
6231 -3781465 -774018 3277694 4904804 3665113 1175667 -2386163 -7753925 -13024420
6223a3024420j021175M785445P600586O500381L516356n82995n429295p555018
6215e210135l483619L609630O107377K099664k153798j778222N14224Q72272J036216
6206A613609L643234N673815K940047k058038l449146j216181k92436j538733
6198E316171j005704J541389J154369l071862m718672o9596M861870K887021l467215
6189C427771o104026l478160j623548l949545o649919n333904q75125L251025
6181b1335431N290590M864650J985515j251540j243724K168098M180714J489151
6173c851977k424676k295763Q43303J558474r30266j385560K646775O303047M802548
6164E265905Q37572m3962J641639P69017l034722l672521K083210Q417757P190515
$$ plain form
6223 -13024420 -14045595 -9260150 -1659564 4840817 8357173 7774178 2344883 -5210135
6215 -5210135 -8693754 -5084124 1023253 3122917 969119 -809103 -294879 577393 1613609
6206 1613609 5256843 10930658 13870705 11812667 8363521 7147340 6854904 5316171
6198 5316171 4310467 5851856 7006225 3934363 -784309 -853905 4007965 6894986 3427771
6189 3427771 -2676255 -6154415 -7777963 -11727508 -18377427 -23711331 -24586456 -21335431
6181 -21335431 -16044841 -11180191 -9194676 -10446216 -11689940 -9521842 -5341128 -3851977
6173 -3851977 -6276653 -8572416 -7729113 -6170639 -7100905 -8486465 -5839690 463357 5265905
6164 5265905 6103477 6059515 7701154 8470171 5435449 1762928 3846138 12263895 19454410
6155A9454410j586308r470606r227883k265287L829471L604630j262242m921844
6147a845659m234850j299223R14279K779363N607059P310994M691377n10281k569956
6138A0843103J85007K671526L12388m910211q079860p387503l779084J796249
6130h348385P303885R050376O168441K951712K822507L043616L5543l402103k402735
6121A7222857Q56266k11233n604042q156794m835223r88753r81855j792599J48160
6112d343216J983425l68610m432479m396185K30494M299729M303316J751349m67193
6103a439370j728366l005271m344278l962430k99409M612537N565466N61731m812938
6094h852328l769646J762155L377818j288482n270809l664234p93882j587979
$$ plain form
6155 19454410 17868102 8397496 -830387 -3095674 733797 4338427 3076185 -1845659
6147 -1845659 -6080509 -7379732 -6465453 -3686090 1920969 9231963 13923340 13413059 10843103
6138 10843103 11028110 13699636 14012024 9101813 1021953 -6365550 -10144634 -8348385
6130 -8348385 -1044500 8005876 14174317 17126029 19948536 22992152 23027695 19625592 17222857
6121 17222857 18079123 17867890 12263848 4107054 -728169 -1716922 -2698777 -4491376 -4343216
6112 -4343216 -2359791 -2728401 -7160880 -11557065 -11326571 -7026842 -2723526 -972177 -1439370
6103 -1439370 -3167736 -6173007 -10517285 -14479715 -14779124 -10166587 -4601121 -4039390 -8852328
6094 -8852328 -12621974 -10859819 -7482001 -8770483 -14041292 -17705526 -18499408 -20087387
6086b0087387k839960M03627N283556N628348K184963M49406R50640j30955k213569
6077a0371331o63423M202207O625439M989331M184798O352746O575495J226400
6069B3121662n437458p136632l540103J305537M594367N180527J923792m210150
6061A5801542q542440o884063m99561N207182N930026J500200m217443n706522
6053B588921r51121M844072M258047k283683n985743j845780L672814J885282
6045F182809n265409q201661l654782J695451K156328O38896K163893N186452
6037I01977M591036M95166j822980n91117n37894m939008r119157o404213J569093
6028a5857097N965217K645726k137784n27239O240392R649097M417119o229655
$$ plain form
6086 -20087387 -22927347 -22523720 -17240164 -11611816 -9426853 -8977447 -8026807 -8157762 -10371331
6077 -10371331 -11034754 -6832547 -207108 4782223 8967021 15319767 21895262 23121662
6069 23121662 17684204 10547572 7007469 8313006 12907373 18087900 20011692 15801542
6061 15801542 7259102 375039 -124522 5082660 11012686 12512886 8295443 2588921
6053 2588921 1637800 6481872 10739919 8456236 2470493 624713 4297527 6182809
6045 6182809 917400 -7284261 -10939043 -9243592 -7087264 -6448368 -4284475 901977
6037 901977 5493013 5988179 4165199 3574082 3036188 -1902820 -11021977 -17426190 -15857097
6028 -15857097 -9891880 -7246154 -9383938 -9911177 -3670785 5978312 10395431 4165776
6020D165776j4614061j5128475p979359Q05583M326574K154694P26544L839891
6012b1702833O395190K563489l318949j815558O703500J1046667M920753m475628
6004C16631p362384l900475o68010k35441m43587l81220p94701m64074K262493
5995a1670768N156715M039998j081876n472884n391298j685367K246953L911975
5987i946552L155256J578962N20375m41035j817623j806059J450005N405412N170271
5978C269012P57210k580412k638693l135354n748419n854533q49833L420186J013702
5969a2347134m097138l718877K210029O583801O313173M901831M738672M002193
5961H586550J499296j276316l140234l578246j056113M194979P403350M620762
$$ plain form
6020 4165776 -10448285 -25576760 -33556119 -32750536 -28423962 -26269268 -25542724 -21702833
6012 -21702833 -15307643 -12744154 -16063103 -17878661 -11175161 -128494 4792259 316631
6004 316631 -7045753 -10946228 -11614238 -11849679 -12293266 -12674486 -13469187 -13933261 -11670768
5995 -11670768 -6514053 -2474055 -3555931 -9028815 -14420113 -16105480 -13858527 -9946552
5987 -9946552 -6791296 -5212334 -4691959 -5132994 -6950617 -8756676 -7306671 -1901259 3269012
5978 3269012 4026222 1445810 -1192883 -4328237 -10076656 -15931189 -16781022 -13360836 -12347134
5969 -12347134 -16444272 -20163149 -17953120 -11369319 -5056146 -154315 4584357 8586550
5961 8586550 10085846 8809530 5669296 2091050 1034937 5229916 12633266 17254028
5953A7254028j228449n203875p835913j0707653r117418M94875R241125N107686
5945a995594p279365j0954830k426386K981887l125766q083335l5218J1315607
5937a9603000J0573032J804165M76798P302668Q538520r2073p582575p044286
5929e626751m718949n419635l353202N568015J3634035J1946904L290732l221594
5921A2099555m356327k809489l30085K263082K110124k090236o240249o149862
5913e503487m023766m334705n972128m511801m16410J466881P1736m22030J980247
5904b1665463L825714K327159N8218N48808K474229J893054j231924k470062N82051
5895a3658216M016426K167815m242710p503408k226219O879098J0094932M994554
$$ plain form
5953 17254028 16025579 10821704 2985791 -7721862 -16839280 -16344405 -7103280 -1995594
5945 -1995594 -9274959 -20229789 -22656175 -19674288 -22800054 -30883389 -30918607 -19603000
5937 -19603000 -9029968 -7225803 -6749005 553663 9092183 9000110 1417535 -5626751
5929 -5626751 -10345700 -15765335 -19118537 -13550522 83513 12030417 15321149 12099555
5921 12099555 7743228 4933739 4603654 6866736 8976860 6886624 646375 -5503487
5913 -5503487 -9527253 -13861958 -19834086 -24345887 -24762297 -23295416 -23223680 -23645710 -21665463
5904 -21665463 -17839749 -15512590 -15454372 -14905564 -12431335 -10538281 -11770205 -14240267 -13658216
5895 -13658216 -9641790 -7473975 -11716685 -19220093 -21446312 -14567214 -4472282 522272
5887E22272q61541q37471K040831R87320l748415n750647k659213P01121L65142
5878i240601j077338L96894L441571L535376l8816l165875k376707J594496N897886
5869a033114Q668480R111667O504466J041062m869114p970513p376181n253588
5861a176835l594290j678457J654576M523112L813114L82786j206830N92864J776297
5852E086337m70966k575637o45323J668488k013826r498016j1205725l845308
5844b3499976M485200N972998L118235K254624K853935K0159n929936r561039
5836b0285800q460647m875994j60388N859737J0025684P334056r01527o428158
5828a7893037m454224L31049J434454l05202K79961L757809N479486L001960m77196
$$ plain form
5887 522272 -339269 -1176740 864091 1851411 -1897004 -7647651 -10306864 -9605743 -9240601
5878 -9240601 -10317939 -9921045 -6479474 -2944098 -2982914 -6148789 -8525496 -6931000 -1033114
5869 -1033114 7635366 16747033 23251499 24292561 19423447 11452934 4076753 -1176835
5861 -1176835 -4771125 -6449582 -4795006 -271894 3541220 3924006 2717176 3310040 5086337
5852 5086337 4615371 2039734 1394411 3062899 1049073 -8448943 -19654668 -23499976
5844 -23499976 -19014776 -13041778 -9923543 -7668919 -4814984 -4794825 -10724761 -20285800
5836 -20285800 -28746447 -33622441 -33782829 -27923092 -17897408 -10563352 -11464879 -17893037
5828 -17893037 -22347261 -22016212 -20581758 -20886960 -20606999 -16849190 -11369704 -8367744 -8844940
5819h844940r68141J114579K319355J296477N68954K683297N954735O165769K576426
5810A2866511p31889j150310j739668n563643r013421o504251j12042K472825
5802i475888k98881j617565K359411O559988N906819L012656J960527Q58576l065635
5793F200008o407324n004873k169774l423546o057877k708502O057681J1582184
5785a932023R760998N521728L301141R92255l762239p993163p962191m477286
5777f550780m44243K809084M207163K188120j824376l028574O32445N065280N401371
5768H455490J934409j630260l034734k385651r40612r70464m106403q068921q023692
5759a8770838k980256K326764L781268K650155J893840J506942M98162J52086
$$ plain form
5819 -8844940 -9813081 -8698502 -6379147 -5082670 -4513716 -1830419 4124316 10290085 12866511
5810 12866511 12134622 10984312 9244644 3681001 -5332420 -11836671 -11948713 -9475888
5802 -9475888 -9774769 -11392334 -9032923 -2472935 3433884 6446540 8407067 9265643 6200008
5793 6200008 -207316 -5212189 -7381963 -10805509 -16863386 -19571888 -13514207 -1932023
5785 -1932023 7828975 13350703 16651844 17644099 13881860 5888697 -2073494 -6550780
5777 -6550780 -6995023 -4185939 21224 2209344 384968 -2643606 -2011161 3054119 8455490
5768 8455490 10389899 8759639 5724905 3339254 2398642 1428178 -2678225 -10747146 -18770838
5759 -18770838 -21751094 -19424330 -15643062 -12992907 -11099067 -9592125 -9093963 -8941877
5751h941877J782369L630642L208564Q37887j677235l746451m927147l547106
5743a3380354Q21684N341530O723022M550371N44317l078745l623976M7473M123074
5734B068396K960954k370912m001679J146652N616186K235506m887750o882973
5726d115620l301980j039651k739052m298048k967460n24938J625110L941357
5718a3420282N120358L164820M08991J367610M951833M969675m36705n756194
5710C70106o174410l246762o51549O19888P66578m06266j460963j9847K768845
5701g434380K924850L63344k15326K646763L808585l54576n555725n774729j784568
5692a1375762J415629K614933M432838O856244O000509m2076p393900r695885
$$ plain form
5751 -8941877 -7159508 -3528866 -320302 517585 -1159650 -4906101 -9833248 -13380354
5743 -13380354 -12558670 -7217140 -494118 4056253 4600570 1521825 -2102151 -2054678 2068396
5734 2068396 5029350 2658438 -1343241 -196589 5419597 7655103 2767353 -4115620
5726 -4115620 -7417600 -8457251 -11196303 -15494351 -18461811 -18986749 -17361639 -13420282
5718 -13420282 -8299924 -5135104 -4726113 -3358503 1593330 6563005 6126300 370106
5710 370106 -5804304 -9051066 -9702615 -9082727 -8316149 -8722415 -10183378 -10203225 -7434380
5701 -7434380 -4509530 -4146186 -4361512 -1714749 2093836 1739260 -3816465 -9591194 -11375762
5692 -11375762 -9960133 -7345200 -2912362 3943882 9944391 9902315 2508415 -7187470
5684g187470m364954M411854Q955008N617713j165978m375958l210126k700740
5676d020651m736252m924945m18250M486848M365231K59128k894393l205923j984092
5667a3073299K38488L306630N156737M246438K567017K358499J968686p06122
5659F063074l056642j450295J707198R60789k734470k491350L436654P818247
5651A0253205M631486k489176n975609m225549j284660K28747Q74090P13909j115699
5642A610744l256413k790652J29670J761113J70850j781734p57334K082239K890431
5633E8914O06327j983471k211047k38917K230982L864881L927399K416419M75740
5624I147227p90833j901729l479600l613382q3211M446564L947477k251452o868651
$$ plain form
5684 -7187470 -11552424 -7140570 1814438 7432151 6266173 1890215 -1319911 -4020651
5676 -4020651 -8756903 -13681848 -14100098 -9613250 -5248019 -4988891 -7883284 -11089207 -13073299
5667 -13073299 -12834811 -9528181 -4371444 -125006 2442011 4800510 6769196 6063074
5659 6063074 3006432 1556137 3263335 4224124 1489654 -1001696 2434958 10253205
5651 10253205 14884691 12395515 6419906 2194357 909697 1138444 2012534 2726443 1610744
5642 1610744 -1645669 -4436321 -4306651 -2545538 -2374688 -4156422 -4913756 -2831517 58914
5633 58914 665241 -1318230 -3529277 -3768194 -1537212 2327669 6255068 8671487 9147227
5624 9147227 8356394 6454665 2975065 -638317 -721528 3725036 7672513 5421061 -1447590
5615a447590m285316J569671L712310K463920K931438N098439M181332l36594
5607A3887610m076943o065773r183423j1436590o323845M931205J0990948N707482
5599a569329k477944l170123J462409L027249J238772J729619L748969J275687
5591E265309m765309o104966k76784M914849K744311l934612q560261r087200
5583a9804663p021306l264151J490739N545662P951222Q936132P642359K938454
5575D414448k699515m447913j837337K1239k116587n011430m168464M5176M294972
5566a1505411P073811Q525779P922189M422293r00873n759647q267782p163587
5558e653228k673018K018716L025451P68024k97338J590028K632364k47838l832817
$$ plain form
5615 -1447590 -5732906 -4163235 -450925 2012995 4944433 10042872 14224204 13887610
5607 13887610 9810667 3744894 -5438529 -16875119 -23198964 -18267759 -7276811 -1569329
5599 -1569329 -4047273 -7217396 -5754987 -2727738 -1488966 240653 3989622 5265309
5591 5265309 500000 -5604966 -5881750 -966901 1777410 -2157202 -10717463 -19804663
5583 -19804663 -26825969 -30090120 -28599381 -23053719 -15102497 -6166365 1475994 4414448
5575 4414448 1714933 -2732980 -4570317 -4549078 -6665665 -11677095 -15845559 -15800383 -11505411
5566 -11505411 -4431600 4094179 12016368 16438661 15537788 9778141 1510359 -5653228
5558 -5653228 -8326246 -6307530 -3282079 -2514055 -2811393 -1221365 1410999 1163161 -2669656
5549b669656l022064J544752M343351K395419j739990m044573k973540P75126
5541e391175N436427Q105860N823462j170806p905957q535856k779919K735632
5533c682332J570826m497513p329126k847339L999459O685013N434581M172547
5525C506116K809104j433435o813203p787797l000366L037051O281652N799985
5517B399107Q60437p615504j2802357p671238L398924P654028J756853k865689
5509a4885439K469149J0437478R757876K277633j875922k99583J211621L63830
5501I456643k03786r87000m543290p240891k502605P216769J1552872O753608
5493A9502320j64707l507725n521432p944876o692364j23662N503162M807363
$$ plain form
5549 -2669656 -5691720 -4146968 196383 2591802 851812 -3192761 -6166301 -5391175
5541 -5391175 45252 8151112 13974574 12803768 4897811 -3638045 -6417964 -3682332
5533 -3682332 -2111506 -6609019 -13938145 -16785484 -12786025 -6101012 -666431 3506116
5525 3506116 6315220 4881785 -1931418 -9719215 -12719581 -9682530 -3400878 2399107
5517 2399107 3259544 -4355960 -17158317 -24829555 -21430631 -13776603 -12019750 -14885439
5509 -14885439 -12416290 -1978812 7779064 10056697 8180775 7881192 9092813 9456643
5501 9456643 9252857 8265857 3722567 -3518324 -6020929 1195840 12748712 19502320
5493 19502320 19337613 15829888 10308456 2363580 -4328784 -4452446 1050716 5858079
5485E858079R77487r32175k025213m641607n484243j262043L382211J762634l933510
5476f298380n563937j089347L926858N776899N737787L874554j986379r239492
5468d861437j0170479k470945N852573O631721K115155M56786L886097O901833
5460H341304M949270k26669m255279n211376l792889j198460J455408K907899
5452B969208K297382k37117l609365o087444o057893l399781K88947L623210O679440
5443c533413R103486Q515215L524266k455986m059654j058784J231071j24111
5435A1142090j730806n45594J68157l353152p031578l496349N804484J0455272
5427A1412524M801498m574843q299114n680387k386294j015629L16017K090091
$$ plain form
5485 5858079 6835566 5903391 3878178 -763429 -6247672 -7509715 -4127504 -2364870 -6298380
5476 -6298380 -11862317 -12951664 -9024806 -3247907 2489880 6364434 4378055 -4861437
5468 -4861437 -15031916 -17502861 -11650288 -5018567 -2903412 -2446626 1439471 8341304
5460 8341304 13290574 13063905 8808626 3597250 -195639 -1394099 61309 2969208
5452 2969208 5266590 5029473 1420108 -4667336 -10725229 -14125010 -13836063 -10212853 -3533413
5443 -3533413 5570073 14085288 17609554 15153568 11093914 10035130 11266201 11142090
5435 11142090 9411284 8865690 9033847 5680695 -1350883 -4847232 957252 11412524
5427 11412524 16214022 11639179 3340065 -2340322 -4726616 -5742245 -5426228 -3336137
5419c336137J744864j804632n771985o580899l611574K80196J341777r75483k407484
5410b1121357J087387O460958O154601q08781n897320l024597K325589K030147
5402a2793373j617627j77520O555654J0058098O553687J460540j088544l830618
5394E120297p989618p931733p1025R028028R967553K359591n982768q928127o506488
5385a0934290j999176R94231K87866k453673k553975J680109O084274O436841
5377b457793M110604K556377J434062j225814l670279k600986O73284J531947
5369C51402r09983k830975j830388M65417K312023L883750M378466J511415l961703
5360C369424o896465l991181J044004J962209j525865l330351N00642O041429
$$ plain form
5419 -3336137 -1591273 -3395905 -9167890 -15748789 -19360363 -19080167 -17738390 -18713873 -21121357
5410 -21121357 -20033970 -13573012 -7418411 -8227192 -14124512 -17149109 -14823520 -12793373
5402 -12793373 -14411000 -14588520 -8032866 2025232 8578919 10039459 8950915 5120297
5394 5120297 -2869321 -10801054 -10872079 -1844051 8123502 10483093 4500325 -4427802 -10934290
5385 -10934290 -12933466 -11939235 -11651369 -14105042 -16659017 -14978908 -8894634 -2457793
5377 -2457793 1652811 4209188 5643250 4417436 747157 -1853829 -1180545 351402
5369 351402 -558581 -3389556 -5219944 -4754527 -2442504 1441246 5819712 7331127 3369424
5360 3369424 -3527041 -7518222 -6474218 -4512009 -6037874 -9368225 -8867583 -2826154
5352b826154O438089Q38547m593822m348288P45823O129166Q522442O686955Q29504
5343A8422262n565777o577177q92860M622764L403013j536931l138789k290823
5335F445682n285680j0405670q314848J829329Q174319L537174l553503k856653
5327a0429850J992558J752263k345313k577979L64435r31343o338522p707610
5319b6221361k486798K897756L965170K788230R44521k472638m573186k41671
5311b5399977P796022J0045227M401068n4586K799509P321555O411621K130702
5303A5451141o0319m22485j730067k926227k424468k583325m794325n096196q81255
5294e467526K950538J296144k242804j242952K567608K566667r31342r08194M654596
$$ plain form
5352 -2826154 3611935 4450482 -143340 -4491628 -3745805 2383361 10905803 17592758 18422262
5343 18422262 12856485 6279308 5386448 10009212 13412225 11875294 8736505 6445682
5335 6445682 1160002 -9245668 -17560516 -15731187 -7556868 -4019694 -7573197 -10429850
5327 -10429850 -8437292 -6685029 -9030342 -11608321 -11243886 -12175229 -18513751 -26221361
5319 -26221361 -28708159 -25810403 -21845233 -19057003 -18112482 -20585120 -25158306 -25399977
5311 -25399977 -17603955 -7558728 -3157660 -3212246 -412737 6908818 13320439 15451141
5303 15451141 15390822 14968337 13238270 10312043 7887575 5304250 509925 -4586271 -5467526
5294 -5467526 -2516988 -1220844 -3463648 -4706600 -2138992 427675 -503667 -1411861 3242735
5285C242735R418653Q270181L479319o83242l686520o255153o606620k882729
5277D296624K686578N046730J665747m513554p856041o086143l147107m420185
5269a2327351r200470j0868561n628872K278183O314673N516177L703257L447629
5261a6765335M234352M867039M570903K917452Q84819L69000R81997m2558k917562
5252h99893l838839j057537J628719R71288l78521Q84094K319761L03907k552705
5243b619726j164532L244421M871324K283964q76317k778282m313983m308314
5235e661445r69707K507207J228519k712331k718018R22344J067523l234380l502838
5226a3073126M226170J1297052Q757762N88592l131775j114805l79079l653050
$$ plain form
5285 3242735 12661388 20931569 24410888 23727646 20041126 13785973 7179353 4296624
5277 4296624 6983202 12029932 13695679 9182125 1326084 -4760059 -7907166 -12327351
5269 -12327351 -21527821 -32396382 -38025254 -35747071 -29432398 -23916221 -20212964 -16765335
5261 -16765335 -12530983 -7663944 -3093041 -175589 709230 1078230 2060227 2017669 -899893
5252 -899893 -4738732 -5796269 -4167550 -3196262 -3574783 -2690689 -370928 -67021 -2619726
5243 -2619726 -3784258 -539837 4331487 6615451 5739134 2960852 -1353131 -5661445
5235 -5661445 -6631152 -4123945 -2895426 -5607757 -8325775 -7403431 -6335908 -9570288 -13073126
5226 -13073126 -8846956 2450096 11207858 11796450 8664675 7549870 7170791 3517741
5218C517741n932585l753599o01389p11814k400441r55933M058043P572156N265031
5209F057210p97191m413771k860182J80206N13640p69833n70141R4463j477325
5200d042924l003777l8036M676481K902463n764856j0697071n154449L207786
5192a7914383L685225j829118l330137J214718M352038K670624J754127N488163
5184c908743Q950791O422403N38719j820516O86891L235559K506528P07167J645052
5175A8963851N397517P846349M837689l297698j1294165j3629313r738169l755356
5167d669295N95100L023083M327687L641916J27523m003061m956005k021200J428261
5158b505991K375834J640346J429263J177466j368186n318071o241117k049958
$$ plain form
5218 3517741 -2414844 -6168443 -6769832 -7481646 -9882087 -10838020 -6779977 792179 6057210
5209 6057210 5260019 846248 -2013934 -1833728 -1320088 -2089921 -2660062 -2565599 -4042924
5200 -4042924 -7046701 -7084737 -2408256 494207 -5270649 -15967720 -21122169 -17914383
5192 -17914383 -14229158 -16058276 -19388413 -18173695 -13821657 -11151033 -9396906 -3908743
5184 -3908743 5042048 11464451 12003170 10182654 10869545 14105104 16611632 17318799 18963851
5175 18963851 24361368 32207717 37045406 33747708 22453543 8824230 -913939 -4669295
5167 -4669295 -4074195 -1051112 3276575 6918491 7046014 3042953 -1913052 -3934252 -2505991
5158 -2505991 -130157 1510189 2939452 4116918 2748732 -2569339 -8810456 -10860414
5150a0860414L195964L743216r04345n763551o310212k497441K551697N589570
5142a1255516N127282K293554o2313m56726m07594j594147k734904j623540J033887
5133i680017K839028L655948M697263M494668L72324n811831q228591m796644
5125a2457852o8083J409730N81578N26086J473662K043454K357149L036742L569941
5116B472407M017583N671883P761322O628640J051516m592070n804359m062561
5108A3144361l897215o020140p085842m849394k49798M367144O195707K807023
5100D411846m613506j0147295q705471k105807L144741L354472M88463j410602
5092a5583159r9235L617685O301404M704151L3310k495373m42051K120208N68738
$$ plain form
5150 -10860414 -7664450 -3921234 -4825579 -10589130 -16899342 -19396783 -16845086 -11255516
5142 -11255516 -6128234 -3834680 -3896993 -4353719 -4761313 -6355460 -9090364 -10713904 -9680017
5133 -9680017 -6840989 -3185041 1512222 6006890 6379214 567383 -7661208 -12457852
5125 -12457852 -12525935 -11116205 -10534627 -10008541 -8534879 -6491425 -4134276 -1097534 2472407
5116 2472407 6489990 12161873 19923195 26551835 27603351 23011281 17206922 13144361
5108 13144361 9247146 3227006 -3858836 -8708230 -8958028 -4590884 1604823 4411846
5100 4411846 -201660 -10348955 -19054426 -21160233 -18015492 -14661020 -14172557 -15583159
5092 -15583159 -15682394 -12064709 -5763305 -1059154 -1025844 -3521217 -3963268 -1843060 -1274322
5083a274322l308721m203209r38314L073753N336826N687031L478986j739024
5075F113006p091938q421089n598104k104253K36736K100458K868636Q31629k483542
5066a3548461k900460L41587L082984K065189j165279l243719k721190k5253L092466
5057a5022136L408006r47822o482025o641158L47390Q748819J1725878P966804
5049C103756J113948m545417o705256n922226m898463m937815l426110K105771
5041b4111812Q095190P941241J546410l439638j921196K253161L202723J235847
5033e198074k16884j357114l695712m052881J714640R514449R226291j339546
5025D595169j0914044q027944L946454J0790467N206385n303926r363108n051364
$$ plain form
5083 -1274322 -4583043 -8786252 -9724566 -6650813 -1313987 4373044 7852030 6113006
5075 6113006 -978932 -9400021 -14998125 -17102378 -16865642 -14765184 -11896548 -11064919 -13548461
5066 -13548461 -16448921 -16107334 -13024350 -10959161 -12124440 -15368159 -18089349 -18114602 -15022136
5057 -15022136 -11614130 -12561952 -19043977 -25685135 -25337745 -16588926 -4863048 3103756
5049 3103756 4217704 -327713 -7032969 -12955195 -17853658 -22791473 -26217583 -24111812
5041 -24111812 -16016622 -8075381 -6528971 -9968609 -11889805 -9636644 -6433921 -5198074
5033 -5198074 -5414958 -6772072 -10467784 -14520665 -12806025 -3291576 5934715 4595169
5025 4595169 -6318875 -14346819 -10400365 390102 5596487 292561 -9070547 -14121911
5017a4121911J085540M256143N250461N575399M553257K270294R00704J199776
5009A0969663J045892q16707k765004l633802m576526n671056m504798p35601
5001a0687939J867222J215027P94748L697643O544043M498297o23297k911389
4993D394355r82829J570426K772501L589691L741391J934008k25508J3855J294017
4984A8101907M1495k846915l022829l78705L63629k445314m673666k962614J122421
4975C299409M732531O628954N424783J98351n611401o054247n18095M600512L924776
4966A6625573j108526n727982o898204l806944K111669O212802M331397r05944
4958A0833841k078393K836071O985952L958910l602577p861419n316999M39039
$$ plain form
5017 -14121911 -13036371 -8780228 -3529767 2045632 6598889 8869183 9769887 10969663
5009 10969663 12015555 11198848 8433844 4800042 223516 -5447540 -9952338 -10687939
5001 -10687939 -8820717 -7605690 -6810942 -3113299 3430744 7929041 7305744 4394355
4993 4394355 3411526 4981952 7754453 11344144 15085535 17019543 16794035 16807890 18101907
4984 18101907 18143402 15296487 12273658 11894953 12258582 9813268 5139602 2176988 3299409
4975 3299409 8031940 14660894 20085677 20284028 14672627 8618380 8100285 12700797 16625573
4966 16625573 15517047 9789065 2890861 -916083 1195586 7408388 11739785 10833841
4958 10833841 8755448 11591519 18577471 22536381 18933804 11072385 5755386 6194425
4950F194425L747112K582000j46914o31840L99059j425920o408809q282833l423486
4941g397206K112382J139077l122990k315157L198794N438178K456311M81383
4933A990772J969843J868363k155203n203406l691680j78888K754696N641807
4925B996304P284103M762773j01625k273430k210045m224885o222954j945990
4917a935749N844626O855045J91907l077443K149049P477495N987629J930534
4909B5423093J73083j486450l818332k452677J629089N59079n840669p220017
4901F966199j41697N680220M392543K227380K866363J154527k290861J350463
4893B2205137R786119Q341548l729749q507856o60837K599209m980058n032078
$$ plain form
4950 6194425 9941537 12523537 12376623 11744783 12143842 10717922 4309113 -3973720 -7397206
4941 -7397206 -5284824 -4145747 -7268737 -9583894 -6385100 -946922 1509389 1990772
4933 1990772 3960615 5828978 3673775 -1529631 -5221311 -5400199 -2645503 2996304
4925 2996304 10280407 15043180 14941555 12668125 10458080 6233195 10241 -1935749
4917 -1935749 3908877 10763922 10955829 7878386 10027435 17504930 23492559 25423093
4909 25423093 25596176 24109726 20291394 17838717 19467806 20026885 14186216 6966199
4901 6966199 6824502 12504722 16897265 19124645 21991008 23145535 20854674 22205137
4893 22205137 31991256 40332804 36603055 28095199 27434362 30033571 25053513 20021435
4885B0021435Q888772J3860231r08077r669048M521188J6582610O682612J492014
4877F1471737K3089911L8389596K0184860J7770122Q1901901J44682898Q1803884
4870D69294909r5759404k19996462j77188833m8479789J9889599N568699j0792706
4863e7463987N641791J4871827k138781j1701719L385022J4894425M636397o206858
4855c4081883j51588Q250598M160104l069380k767563j067354l091229k222684
4847c4040979K505370J520711m634414k521878Q997739J3438089M084155n404777
4839a6055984n576994m448272p428843n595720N110955J2446010P596029k29667
4831a4182486k86854L486317L332738J012590K18203j689396n159487l797874
$$ plain form
4885 20021435 28910207 42770438 41862361 32193313 36714501 53297111 59979723 61471737
4877 61471737 84561648 122951244 143136104 160906226 242808127 387491025 469294909
4870 469294909 373535505 153539043 -23649790 -72129579 -52239980 -46671281 -57463987
4863 -57463987 -51822196 -36950369 -39089150 -50790869 -47405847 -32511422 -27875025 -34081883
4855 -34081883 -34233471 -25982873 -21822769 -24892149 -27659712 -28727066 -31818295 -34040979
4847 -34040979 -31535609 -30014898 -34649312 -37171190 -28173451 -14735362 -10651207 -16055984
4839 -16055984 -21632978 -26081250 -33510093 -39105813 -33994858 -21548848 -13952819 -14182486
4831 -14182486 -14469340 -10983023 -7650285 -6637695 -6419492 -8108888 -13268375 -17066249
4823a7066249L301335O575404J329947m069872l009458q05806j877611k79415
4815a5901725O947534R937716J347918r529456j0431926m515430k412176l900393
4807b8457938r06301O578818J0499065Q032756M180491K474223J719141J015402
4799E135657J136571J600295J188461Q8187j552530m470952p329666o879413l237403
4790a4320793k32399J164309L581371N805954K732667m123817n180193K845055
4782g727846R730133N856782l869011q028436m624385o84531j89674n84802P47103
4773i374667L062707M408416L204388p37922m403243l646653J126047N065193
4765a295734N728133M876569K871982j888249o735821o145489j655475j339881
$$ plain form
4823 -17066249 -13764914 -7189510 -5859563 -9929435 -12938893 -13744699 -15622310 -15901725
4815 -15901725 -8954191 983525 2331443 -7198013 -17629939 -22145369 -24557545 -28457938
4807 -28457938 -29364239 -22785421 -12286356 -4253600 -73109 2401114 4120255 5135657
4799 5135657 6272228 7872523 9060984 9149171 7596641 3125689 -4203977 -11083390 -14320793
4790 -14320793 -14553192 -13388883 -9807512 -4001558 -1268891 -5392708 -10572901 -7727846
4782 -7727846 2002287 7859069 3990058 -4038378 -8662763 -9347294 -9536968 -10121770 -9374667
4773 -9374667 -6311960 -1903544 1300844 562922 -3840321 -7486974 -6360927 -1295734
4765 -1295734 4432399 9308968 12180950 10292701 3556880 -2588609 -4244084 -5583965
4757e583965o134898o747319Q69371P487877N130677l24324R433L300096J616641
4748c76411l384993l580046J828031N772692M284709k76111m857485p658323o769343
4739a5017280k742981L09734Q91965K954647P880184R855235N343787L41813N83578
4730A0400682J324410l998765j1030230j0765778l897599J546251L126653M203934
4722i090442M590322J710389j372156L30832L872938K507691k171217k837712
4714b459355L82720O18766k538420k311172K097936L390932n28160k278521K269566
4705a355708O805627M736624j512235n894555o703399m988977q62806M645017
4697e130412Q450130Q891767O802087K529726l433566p197624n106639p34897
$$ plain form
4757 -5583965 -11718863 -18466182 -17596811 -10108934 -4978257 -5302581 -5293148 -1993052 -376411
4748 -376411 -3761404 -7341450 -5513419 259273 4543982 4267871 -589614 -8247937 -15017280
4739 -15017280 -17760261 -17450527 -16558562 -13603915 -5723731 4131504 9475291 9817104 10400682
4730 10400682 11725092 7726327 -3303903 -14069681 -17967280 -16421029 -13294376 -9090442
4722 -9090442 -4500120 -2789731 -4161887 -3831055 41883 2549574 378357 -2459355
4714 -2459355 -2076635 -1457869 -3996289 -6307461 -4209525 -818593 -1346753 -3625274 -1355708
4705 -1355708 5449919 10186543 8674308 2779753 -3923646 -8912623 -9775429 -5130412
4697 -5130412 3319718 12211485 19013572 21543298 18109732 10912108 5805469 5070572
4689E070572j239771o142911p429844k202596K940975K739200M42958M03208Q81092
4680d537117q95961k639835j317993J013657P23787j357915j637794R54721M439706
4671e254744O349055M931847M36724l526067k994883J000172L489674K488894
4663F920672Q31899N94821L92920p51611j551865j709360k629446l996834m028051
4654e926855l341688l538264k291123L677975J0693044J0912239M135784j414180
4646A2906932j985401k840396o713535p687437k258771K736953Q27869l302023
4638h315809k302954J235062L24881l417246k791360K127439M634688L391000
4630e114299L472428N418599L368706l858294q920776o747703j631337O80557
$$ plain form
4689 5070572 3830801 -2312110 -9741954 -11944550 -9003575 -6264375 -5821417 -5418209 -4537117
4680 -4537117 -5433078 -8072913 -9390906 -8377249 -7653462 -9011377 -10649171 -9694450 -5254744
4671 -5254744 1094311 6026158 6462882 2936815 -58068 942104 4431778 6920672
4663 6920672 7752571 8347392 8740312 7988701 6436836 4727476 2098030 -1898804 -5926855
4654 -5926855 -9268543 -12806807 -15097930 -11419955 -726911 10185328 14321112 12906932
4646 12906932 10921531 8081135 1367600 -6319837 -8578608 -5841655 -5013786 -8315809
4638 -8315809 -10618763 -9383701 -9058820 -12476066 -15267426 -13139987 -8505299 -5114299
4630 -5114299 -1641871 3776728 7145434 3287140 -5633636 -12381339 -14012676 -13332119
4622a3332119J338165L512609M609341K75480o479514p173702Q95965J0606815
4614e746960J3651927R224560K099501m324556r447747j1973443r776894l964229
4606b0257841P44671J584894Q56096J404425K098117J047571M37764L273437O889197
4597a921669N532010m56307m035902j744376J237694l46124l354480j578060L822214
4588b845000N638505J636372k047754l22827L189819J878297l530648n825952
4580b229188k334478O45925k612953p924252o893726N18727O060551N503352L261144
4571f004898K990883J819028j862770k917106J560775M860272Q24829m537315
4563c266302k061319M345992K863329o616193j1347208n584919J370948J021114
$$ plain form
4622 -13332119 -11993954 -8481345 -3872004 -3596524 -10076038 -17249740 -16353775 -5746960
4614 -5746960 7904967 17129527 19229028 14904472 5456725 -6516718 -16293612 -20257841
4606 -20257841 -19513170 -17928276 -17072180 -15667755 -13569638 -12522067 -12084303 -8810866 -1921669
4597 -1921669 3610341 3154034 -881868 -2626244 -1388550 -1734674 -5089154 -6667214 -2845000
4588 -2845000 2793505 4429877 2382123 2059296 5249115 7127412 3596764 -2229188
4580 -2229188 -4563666 -3917741 -6530694 -14454946 -21348672 -20829945 -14769394 -9266042 -6004898
4571 -6004898 -3014015 -1194987 -3057757 -5974863 -4414088 446184 1271013 -3266302
4563 -3266302 -5327621 -981629 1881700 -4734493 -16081701 -21666620 -20295672 -19274558
4555a9274558k258936j269868J870726J529192r67212q81896J047637Q72861q90659
4546b0222713l93356L008585O325090P129017M860272N26631k585191j542570
4538b894235J054257m98601n393232n614729J752996Q505540O585017r57309n930209
4529c390505o129270m382794j830855J261957K474075J212118J410298M582468
4521d792508N342647J15061n358946m579062p92784n69845k114654L63745M807390
4512g578956M310327p22793l691716l180628l164373l457783l87616L976420L956654
4503i940464J251682K737749P090253N512260k561938o898928l118781K54343
4495e673824l222801p362729n024612j34474P56832M05765M376194R056837O880037
$$ plain form
4555 -19274558 -21533494 -22803362 -20932636 -19403444 -20370656 -21252552 -20204915 -19332054 -20222713
4546 -20222713 -20616069 -17607484 -11282394 -4153377 706895 1233526 -1351665 -2894235
4538 -2894235 -1839978 -2338579 -7731811 -13346540 -11593544 -3088004 3497013 2539704 -3390505
4529 -3390505 -9519775 -13902569 -15733424 -14471467 -11997392 -10785274 -9374976 -4792508
4521 -4792508 550139 665200 -4693746 -9272808 -10065592 -10635437 -12750091 -12386346 -7578956
4512 -7578956 -3268629 -3991422 -7683138 -10863766 -14028139 -17485922 -17873538 -13897118 -9940464
4503 -9940464 -8688782 -5951033 1139220 6651480 4089542 -2809386 -5928167 -5673824
4495 -5673824 -8896625 -16259354 -21283966 -21418440 -20661608 -20255843 -15879649 -6822812 57225
4486E7225l98239l916523j250544J601826R47000o74690j542770l388493n441067
4477a4006275l554375J905000M189811K74560l093886R89975Q308512Q834129
4469C847451J333780m938166l832274j52189m97987k775681j070647L278478L567811
4460a239424n76856j872373K772600O935175M770727k97218j934636m64391k07572
4451G886032j411209j158991L84917O55309k43655m54581n05973j488384j257868
4442B405597K094148N042780K768386l107529o678094o015284l510296r1256M201950
4433b889598N833182J689979l670284k748684L259072N731442J657376l050740
4425E811745l969202l151406k352977k04186J776305o53076n593534n428895O69660
$$ plain form
4486 57225 -341014 -4257537 -5508081 -3906255 -2959255 -3633945 -5176715 -8565208 -14006275
4477 -14006275 -17560650 -15655650 -11465839 -11191279 -14285165 -13295190 -4986678 3847451
4469 3847451 5181231 243065 -3589209 -3741398 -4239385 -7015066 -8085713 -4807235 -1239424
4460 -1239424 -1816280 -3688653 -916053 6019122 10789849 10492631 8557995 8093604 7886032
4451 7886032 6474823 5315832 5700749 6356058 6112403 5657822 5151849 3663465 2405597
4442 2405597 4499745 9542525 12310911 9203382 2525288 -3489996 -7000292 -7091548 -2889598
4433 -2889598 2943584 4633563 963279 -1785405 1473667 7205109 8862485 5811745
4425 5811745 1842543 -1308863 -3661840 -3866026 -2089721 -2742797 -8336331 -13765226 -13095566
4416a3095566M217223J481822j32319M385192P934317L252720m226965n115268
4408a298844p99048P05674j601574k526830j438501k012403l472230j705800K036111
4399a2113445K426777m79624j280200J437756L499530L007077K430870K451222
4391A379963Q36822j793196j897266L48671Q54881r89307j327606O18272R30695
4382a038071j318287j823706R34684K460646N31129k01736L327711N909313K041670
4373A0823353m479217o123858l192268k026984l729610l141270P55023J963396
4365i151435k134502m857601J64508Q547023J0542268M129837l511151o400451
4357b671504n279496k512576J837391O340555O456618P71642n142141n772639
$$ plain form
4416 -13095566 -8878343 -7396521 -7528840 -3143648 4790669 8043389 3816424 -1298844
4408 -1298844 -2097892 -1392218 -2993792 -5520622 -6959123 -8971526 -12443756 -14149556 -12113445
4399 -12113445 -9686668 -10166292 -11446492 -10008736 -6509206 -3502129 -1071259 1379963
4391 1379963 2216785 423589 -1473677 -1125006 -270125 -1259432 -2587038 -1968766 -1038071
4382 -1038071 -2356358 -4180064 -3245380 -784734 -253605 -455341 2872370 8781683 10823353
4373 10823353 6344136 220278 -2971990 -4998974 -8728584 -11869854 -11114831 -9151435
4365 -9151435 -11285937 -16143538 -15979030 -7432007 3110261 7240098 3728947 -2671504
4357 -2671504 -7951000 -10463576 -8626185 -2285630 4170988 4942630 -199511 -5972150
4349e972150l238332k673113l112119L21741O589761Q667297M151390j030231
4341C704244j806987o53595j720892l643644k644046R81322L931050M904409M721831
4332G773692L517055J198387r66943j979793k621461l265223k556915l77851Q32686
4323A553634J79469L66708K606177L142423j033064o210247o535133k195471J859317
4314f266187L437954M187757M504340K787234m18332k251389j796130q15586m68527
4305B901134q01077k690539o195798p649522l103411N071486R400170O005478
4297B937921j324544o255122n953350j991396J486227N58649m224336o803404
4289b1569355k372810N612493R465147P435141M523127L473500J489267k765010
$$ plain form
4349 -5972150 -9210482 -11883595 -14995714 -14673973 -8084212 583085 4734475 3704244
4341 3704244 1897257 1243662 -477230 -4120874 -6764920 -5783598 -1852548 3051861 7773692
4332 7773692 11290747 12489134 11522191 9542398 6920937 3655714 1098799 720948 1553634
4323 1553634 1733103 2099811 4705988 7848411 6815347 605100 -5930033 -8125504 -6266187
4314 -6266187 -2828233 1359524 5863864 8651098 8232766 5981377 4185247 3369661 2901134
4305 2901134 2100057 -590482 -6786280 -14435802 -17539213 -12467727 -3067557 2937921
4297 2937921 1613377 -4641745 -10595095 -12586491 -11100264 -10541615 -14765951 -21569355
4289 -21569355 -23942165 -18329672 -8864525 -1429384 3093743 6567243 8056510 5291500
4281E291500n575460m605642l050651l421065k333866L527391J0250469J1147508
4273A1230184O019735O45116j604690k556589m176701n582297n728448n136098
4265f889788l831932p14576L704724O495055N811439L378989J980796J844072
4257A1778779J047636j390546m382523o352297o556751m816316j337539K481645
4249i527912M149736K426368o28517j479454N47038K233864Q24641k043580k663182
4240f160998o29324O95989p50517k910027l088099j907100j544844j624372R5463
4231a7823829L245012M296559J573570j878017k391793o10047K03775q42269k178528
4222a6405567l495147n273699m833410J592035J0952965J3472177N142444m651440
$$ plain form
4281 5291500 -283960 -4889602 -7940253 -11361318 -13695184 -10167793 82676 11230184
4273 11230184 17249919 17895035 16290345 13733756 9557055 3974758 -1753690 -6889788
4265 -6889788 -10721720 -11436296 -7731572 -1236517 4574922 7953911 9934707 11778779
4257 11778779 12826415 11435869 7053346 701049 -5855702 -10672018 -12009557 -9527912
4249 -9527912 -5378176 -2951808 -3580325 -5059779 -4512741 -2278877 -1454236 -3497816 -6160998
4240 -6160998 -6790322 -6094333 -6844850 -9754877 -12842976 -14750076 -16294920 -17919292 -17823829
4231 -17823829 -14578817 -10282258 -8708688 -10586705 -12978498 -13588545 -13384770 -14227039 -16405567
4222 -16405567 -19900714 -25174413 -30007823 -28415788 -17462823 -3990646 1151798 -3499642
4214c499642m420952L635802O912665M52959o907812o272091m45645K438219P72383
4205g334114r76144o15145J24613N08130J760801L350175K815361l9397k168270
4196b573990j563084m5453l69971k090659k225905N8887J426433j198343n319739
4187a3901824n423580j225686J168032j386487l740812r39291L176894K705309
4179a9567445N93106L742287J0041120J0915360N949359L497051N752542N213528
4171B6136908j029708n408412l016291M46536n30510k894605l140308l420598
4163G143012l952181m92649M802196K686141o337129r013377j465354K453848
4155d175493l899483n674378O808420J6695370P584616o253332l291967P749349
$$ plain form
4214 -3499642 -7920594 -4284792 2627873 3080832 -3826980 -10099071 -10544716 -8106497 -7334114
4205 -7334114 -8310258 -8925403 -8800790 -8292660 -6531859 -3181684 -366323 -405720 -2573990
4196 -2573990 -4137074 -4182527 -4552498 -6643157 -8869062 -8810175 -7383742 -8582085 -13901824
4187 -13901824 -19325404 -20551090 -19383058 -20769545 -24510357 -25449648 -22272754 -19567445
4179 -19567445 -18974339 -15232052 -5190932 5724428 11673787 15170838 20923380 26136908
4171 26136908 25107200 19698788 16682497 17129033 16598523 13703918 10563610 7143012
4163 7143012 3190831 2698182 7500378 10186519 3849390 -5163987 -6629341 -4175493
4155 -4175493 -8074976 -13749354 -6940934 9754436 17339052 11085720 7793753 15543102
4147A5543102N614587k137345N552993J5036026p925706n2628219o2084282j4936704
4139i7965548L6492857L8177441O471398p124102O953391J6686089P457904l280308
4131C869122m432673n230973q965251n459149M884269O972720k396193p548646
4123a8306774n99576O371294L701374j028601J93702J769899k173378n311764
4115a5383824j217778M067428K486522k582127l415972o63743K79562p62934p41167
4106a7934033k22354j082881j588807L85422L077376M237060M634397M717516
4098c776304K867860L03121J684668O823033Q237014K164494m155666k628724
4090A1519496L395081M411177j014697n215032l600782n40881j558109n003646
$$ plain form
4147 15543102 21157689 19020344 24573337 39609363 31683657 -20944562 -83028844 -97965548
4139 -97965548 -61472691 -23295250 -16823852 -23947954 -16994563 -308474 7149430 3869122
4131 3869122 -563551 -5794524 -14759775 -20218924 -15334655 -8361935 -10758128 -18306774
4123 -18306774 -18906350 -12535056 -8833682 -9862283 -9668581 -7898682 -10072060 -15383824
4115 -15383824 -16601602 -12534174 -10047652 -12629779 -16045751 -16709494 -16429932 -17192866 -17934033
4106 -17934033 -18156387 -19239268 -20828075 -20442653 -17365277 -13128217 -8493820 -3776304
4098 -3776304 -908444 -605323 1079345 7902378 16139392 18303886 14148220 11519496
4090 11519496 14914577 19325754 18311057 13096025 9495243 8954362 7396253 2392607
4082B392607m774396R75393P167762Q259586M974434K071235N89663k936447q344387
4073A0375450r117872k471124L454647N716q245530r440412k166263L208845J253603
4064a3142940j481243Q82946M219580L015814l02364j042276l21537q87504p00705
4055i760229K493508N040449K784927j275823j614233P71212R02469j110288r41294
4046b709302J284937O83577l591573n936426k575260K961063N118686L217945
4038a546353M56645j024613j077402O40314M351395P674980O515859K19842n974023
4029A0236644o445695k575034j012296l871842n167757O8674P485745R315137
4021H033576N431510J993878P14129k819047r472522j2887886q508826m78874
$$ plain form
4082 2392607 -2381789 -1406396 5761366 14020952 18995386 21066621 21656284 18719837 10375450
4073 10375450 1257578 -1213546 2241101 2246817 -5998713 -15439125 -17605388 -14396543 -13142940
4064 -13142940 -14624183 -13741237 -9521657 -6505843 -6808207 -7850483 -8172020 -9059524 -9760229
4055 -9760229 -7266721 -2226272 558655 -717168 -2331401 -1560189 -657720 -1768008 -2709302
4046 -2709302 -1424365 -740788 -4332361 -10268787 -12844047 -9882984 -4764298 -1546353
4038 -1546353 -1089708 -2114321 -3191723 -2551409 1799986 9474966 15990825 16210667 10236644
4029 10236644 3790949 1215915 203619 -3668223 -8835980 -8767306 -1281561 8033576
4021 8033576 13465086 15458964 16173093 13354046 3881524 -9006362 -17515188 -17994062
4013a7994062M090012L492065R64867m43183L27021K577857L660378J387506k195677
4004d133216k980476j179590n85765q69782K593772R023795J0109310K219612
3996A4197660o314079o451563j117233P90420j657009k151594Q25283J896320
3988A8205j262113l961280k441988M15683R3920l052983m985026l264497N78883
3979a7861196K630984K48597m486385n763681o88049O085410P413077K866136
3971i555107p50082J260789N144637L997412k569469p235054m002563L852426
3963i857011P398214L279678k061581j256715M194710O881697L902215r24345
3955A1556862m171580o038080o241055l204637J053006J600113j374115j531754
$$ plain form
4013 -17994062 -13904050 -10411985 -9447118 -9890301 -9563280 -6985423 -3325045 -1937539 -4133216
4004 -4133216 -7113692 -8293282 -8879047 -9748829 -7155057 1868738 11978048 14197660
3996 14197660 7883581 1432018 314785 1105205 -551804 -2703398 -1878115 18205
3988 18205 -1243908 -5205188 -7647176 -7231493 -7137573 -10190556 -15175582 -18440079 -17861196
3979 -17861196 -15230212 -14981615 -19468000 -25231681 -25919730 -19834320 -12421243 -9555107
3971 -9555107 -10305189 -9044400 -3899763 97649 -2471820 -9706874 -13709437 -9857011
3963 -9857011 -2458797 820881 -1240700 -2497415 1697295 8578992 12481207 11556862
3955 11556862 7385282 1347202 -4893853 -8098490 -7045484 -5445371 -6819486 -8351240
3947h351240L378416O766399L166996l162714n210894l383638k278210j874168
3939a0949053P17184L827343L066286r16201l090257j633566P54630K200732L074645
3930b948257K957691J093801r91866j618275k187174m016546m215350J37265N810727
3921e977984P061793L774179M36391j119295k078917j821687O52750K262288m9159
3912C140359k371226R93150O591720N355433k643826o936174k450875L147825
3904D826386K124379k129704k468077N74401J703810K58936l99561L5846j199760
3895C326656m081245n061130k178858K375802M818202L147524j299492m587805
3887c540346l725818q1968K388458K274768J468380J014206j5155j008973M72922
$$ plain form
3947 -8351240 -4972824 1793575 4960571 1797857 -3413037 -6796675 -9074885 -10949053
3939 -10949053 -10231869 -6404526 -3338240 -4254441 -7344698 -8978264 -8223634 -6022902 -2948257
3930 -2948257 9434 1103235 111369 -1506906 -3694080 -7710626 -11925976 -11788711 -5977984
3921 -5977984 1083809 4857988 5294379 4175084 2096167 274480 927230 3189518 3140359
3912 3140359 769133 1762283 8354003 13709436 11065610 4129436 1678561 4826386
3904 4826386 6950765 4821061 2352984 2927385 4631195 4890131 4490570 4526416 3326656
3895 3326656 -754589 -5815719 -7994577 -5618775 -800573 2346951 1047459 -3540346
3887 -3540346 -7266164 -7348132 -4959674 -2684906 -1216526 -202320 -217475 -1226448 -753526
3878g53526L994487N382611K676723p09697j079242N30704P81754j236571l808469
3869E778774m851514l052454Q01744L024596P72090l060270k827030J435927L705197
3860A727060J349551j146694l74341L22806k474531n454206l846088O63489K947830
3851f285124K327366J985463K799641K921116J799585K8525l067355p219344q553181
3842a3263308m136414K285333M337592J940132Q23482L287364N000945K283214
3834B558340k187393l310964q0995M191964O313040N905697M501396L224767J557024
3825B2672876j491347n133039o973936n964486l648232j634285K82780K256874
3817C67205K848242J281731n96001p19337L55292Q83208N66912j00167j376819
$$ plain form
3878 -753526 3240961 8623572 11300295 10590598 9511356 10042060 10823814 9587243 5778774
3869 5778774 927260 -2125194 -1323450 1701146 2473236 -587034 -3414064 -1978137 1727060
3860 1727060 3076611 1929917 1555576 1878382 -596149 -6050355 -9896443 -9232954 -6285124
3851 -6285124 -3957758 -1972295 827346 3748462 5548047 5576572 2509217 -4710127 -13263308
3842 -13263308 -17399722 -15114389 -10776797 -8836665 -8013183 -4725819 275126 2558340
3834 2558340 370947 -2940017 -3021012 1170952 7483992 13389689 17891085 21115852 22672876
3825 22672876 21181529 16048490 9074554 3110068 -538164 -2172449 -1889669 367205
3817 367205 3215447 4497178 3901177 3181840 3537132 4420340 4987252 4887085 3510266
3808C510266l257964m629846n056208n350343n059866k440607J262738J422646
3800a9599184l137173o877039m916517K20201L694713N947390R246915J0527899
3792d892795N483446k273794m524462n06024K509920J174446M3775J676185J433044
3783A23741l683025q333069o439807j06508M326797M733071K813761l30826k848346
3774i744211n37989O944790J1490752N442610o536704j1936546o518148J353514
3766a0041932L521510J750910J557166K901177K319739K21313J71380K481844
3758D883107L495306J113827k617129m538939l170403J189853O087422O916009
3750A3359053J025164p471124j0663729o145025P8456K002363J236146K624906
$$ plain form
3808 3510266 252302 -4377544 -9433752 -14784095 -19843961 -22284568 -21021830 -19599184
3800 -19599184 -22736357 -29613396 -34529913 -34309712 -30614999 -24667609 -15420694 -4892795
3792 -4892795 590651 -1683143 -6207605 -6713629 -4203709 -3029263 -2985488 -1309303 123741
3783 123741 -3559284 -11892353 -18332160 -18438668 -14111871 -9378800 -6565039 -6895865 -9744211
3774 -9744211 -10282200 -3337410 8153342 13595952 7059248 -4877298 -11395446 -10041932
3766 -10041932 -6520422 -4769512 -3212346 -311169 2008570 2229883 2401263 4883107
3758 4883107 8378413 9492240 6875111 2336172 -834231 355622 6443044 13359053
3750 13359053 14384217 6913093 -3750636 -9895661 -9817205 -7814842 -6578696 -3953790
3742c953790N349595L828389l128541r396340r210443l876538J147592K833679
3734a6406397J939918J62495j232984j011057J278165M097985M903470K606436
3726c661969j266774l647287k327162J823000N163416M889128K034098l89994
3718B616456j454147k382303l292581k870007j201312K96182J885626M718208
3710a683878O700290L889222k513725n708038k630976J237179L25509k579370
3702b963787j775293J383769Q96671l439734n335751j983104J897178J773474
3694i546577l63540k64952J866402K392759Q0171k096828r35536K719028M508363
3685a640710J681503l059560m650169k383992m23081r17082r72118J243961K330601
$$ plain form
3742 -3953790 1395805 5224194 2095653 -7300687 -16511130 -20387668 -19240076 -16406397
3734 -16406397 -14466479 -14303984 -15536968 -16548025 -15269860 -11171875 -6268405 -3661969
3726 -3661969 -4928743 -8576030 -10903192 -9080192 -3916776 972352 3006450 2616456
3718 2616456 1162309 -1219994 -4512575 -7382582 -8583894 -8287712 -6402086 -1683878
3710 -1683878 5016412 8905634 6391909 683871 -1947105 -709926 -384417 -2963787
3702 -2963787 -4739080 -3355311 -2458640 -5898374 -11234125 -13217229 -11320051 -9546577
3694 -9546577 -9910117 -10175069 -8308667 -5915908 -5835737 -7932565 -8868101 -6149073 -1640710
3685 -1640710 40793 -3018767 -7668936 -10052928 -10476009 -11393091 -12365209 -11121248 -8790647
3676h790647k34374k545802o84269J466279j674767o505001m590323L152908O562283
3667a3843713J846529k639712K53913O107142P089116L217932o34023l198353
3659a801169n679955o455662l523251N43831J916646J539007K582626M110807
3651f767120K711642j222203m165129n174873n794816n285956j440317L993249
3643b3145523N976877L045671r03335k484629k322328j653994L74440M059150
3635a7053671P028748O997148M445710R96477k608506n197502m216876J206200
3627h402272P401574R110186N384802N10854j436033j047950j301491k431454
3619G788216j811256J099559K915304J203202j518442j698712o60587k481318
$$ plain form
3676 -8790647 -9025021 -11570823 -12255092 -10788813 -12463580 -18968581 -23558904 -20405996 -13843713
3667 -13843713 -11997184 -14636896 -14382983 -8275841 -1186725 2031207 1397184 -1801169
3659 -1801169 -7481124 -13936786 -17460037 -16916206 -14999560 -13460553 -10877927 -6767120
3651 -6767120 -4055478 -5277681 -9442810 -14617683 -20412499 -25698455 -27138772 -23145523
3643 -23145523 -17168646 -14122975 -15026310 -17510939 -19833267 -21487261 -21112821 -17053671
3635 -17053671 -10024923 -3027775 1417935 2414412 -194094 -5391596 -9608472 -8402272
3627 -8402272 -1000698 8109488 13494290 14005144 12569111 11521161 10219670 7788216
3619 7788216 5976960 7076519 9991823 11195025 9676583 7977871 7317284 4835966
3611D835966o907801r153977p107428l942408k302346o78159K238369M134829
3603a8882955L009125O63900p69069k019227l249127j662856L420839P204980
3595a2284390N958385L135853L492597M782659J976548l186088m506435j469554
3587b100425R25268J646043M315798P981329O380725j125140o590261n443479
3579E989858l439916o252757r213916m716339M889110R598380M915598l739929
3571a969911q867094p884012k780149K813980O045770P009468P824458Q061900
3563A0254410M061107m379595j0430988q070580n57435M256219M483317L872178
3555C488633L165353l22181m769462l955342K569219O966824M337559r0823M28939
$$ plain form
3611 4835966 -2071835 -11225812 -18333240 -22275648 -24577994 -25256153 -23017784 -18882955
3603 -18882955 -15873830 -15209930 -15978999 -17998226 -21247353 -22910209 -19489370 -12284390
3595 -12284390 -6326005 -3190152 302445 5085104 7061652 3875564 -630871 -2100425
3587 -2100425 -1175157 470886 4786684 12768013 19148738 18023598 11433337 5989858
3579 5989858 2549942 -3702815 -12916731 -17633070 -12743960 -3145580 1770018 -1969911
3571 -1969911 -10837005 -18721017 -21501166 -18687186 -12641416 -5631948 2192510 10254410
3563 10254410 14315517 9935922 -495066 -8565646 -9123081 -4866862 -383545 3488633
3555 3488633 6653986 6331805 1562343 -2392999 176220 7143044 11480603 11389780 11818719
3546A1818719M009377M272861M47245k964559l981377m285551l827660m95870
3538D993185M506699O288224K715209k606222n138870m129782j500122R55515
3530F083836J926740P00575j583543k565122j461612L92889K029777L581600M253318
3521A3358458K452524j133990l478986l485985l394402m406829m248876j542549
3513e880635N93759j108871m380085m131447K50007M207528M268696J539984j081513
3504e722577k042353j136601Q33604J852150M48961j932193k362681l50219J690421
3495h721488J811318L13815j527683k312393o82640K805548M824478L313542J215796
3486A040293K208901L896739P50012o261956r427377n217120R41304L436189L571191
$$ plain form
3546 11818719 15828096 20100957 20548202 17583643 13602266 9316715 5489055 4993185
3538 4993185 9499884 15788108 18503317 15897095 10758225 6628443 5128321 6083836
3530 6083836 8010576 8711151 7127608 4562486 3100874 3493763 5523540 9105140 13358458
3521 13358458 15810982 14676992 11198006 7712021 4317619 -89210 -4338086 -5880635
3513 -5880635 -5286876 -6395747 -10775832 -14907279 -14657272 -10449744 -6181048 -4641064 -5722577
3504 -5722577 -7764930 -8901531 -8067927 -6215777 -5766816 -7699009 -10061690 -10411909 -8721488
3495 -8721488 -6910170 -6596355 -8124038 -10436431 -11119071 -8313523 -3489045 -175503 1040293
3486 1040293 3249194 7145933 7895945 1633989 -7793388 -13010508 -12069204 -8633015 -5061824
3477e061824M094239L161494n90651k504373J524142O858176N977417n3748l440261
3468I964611j357376J694354K496587K549382K586637Q22777k146565l102745
3460A3507662k117199k574915m239542l039587N88915N25630m809044q144262
3452a0302342l658514M455994Q567199P439569M451416R55251k880253m727353
3444D300967l509278k822226n325429p017966l122460L341399N445850K522620
3436f186523l00201r18293j500643k051408k31590K403090J328663k920683m565871
3427a4943459j714899J089855J152059J483142L787318M456903J336190j627469
3419d980360r10575P43888k75595k090038j564635n26512j910138l226723k44957
$$ plain form
3477 -5061824 -967585 2193909 1603258 -901115 623027 7481203 13458620 13404872 9964611
3468 9964611 8607235 10301589 12798176 15347558 17934195 18756972 16610407 13507662
3460 13507662 11390463 8815548 4576006 1536419 2125334 2650964 -2158080 -10302342
3452 -10302342 -13960856 -9504862 -937663 6501906 10953322 11908573 9028320 4300967
3444 4300967 791689 -2030537 -7355966 -14373932 -17496392 -14154993 -8709143 -6186523
3436 -6186523 -6486724 -7405017 -8905660 -10957068 -11188658 -8785568 -7456905 -10377588 -14943459
3427 -14943459 -16658358 -15568503 -14416444 -12933302 -9145984 -4689081 -3352891 -4980360
3419 -4980360 -5890935 -5147047 -5422642 -7512680 -9077315 -9603827 -11513965 -14740688 -14985645
3410a4985645N118534O861992L574923o58350l057970m177459l656058J50229
3402a0829804N604948P961191N327557N05878l686577o827328q217413o439422
3394a6600970k717708l72322M02196K862757P270583Q779308M274895k783744
3386A114995p213117q069074o787500l249314K299476O406553N873498K192032
3378g432451j068437l098199m309934k711240K976270Q397226P831921K929071
3370C514227R21212L497032M171604p97343n454011k945861L633921N590210J220987
3361A3351978k801298k296272r98872k997019n561145l921431M17878J659978
3353c146203j123762k355835J392995N817163M811260j212714o469743p210845
$$ plain form
3410 -14985645 -9867111 -3005119 569804 -88546 -3146516 -7323975 -10980033 -10829804
3402 -10829804 -5224856 2736335 8063892 8569770 4883193 -1944135 -10161548 -16600970
3394 -16600970 -19318678 -19691000 -19288804 -16426047 -9155464 -376156 3898739 1114995
3386 1114995 -6098122 -14167196 -20954696 -24204010 -21904534 -15497981 -9624483 -7432451
3378 -7432451 -8500888 -11599087 -15909021 -18620261 -15643991 -7246765 585156 3514227
3370 3514227 4435439 7932471 12104075 11306732 5852721 2906860 6540781 12130991 13351978
3361 13351978 10550680 8254408 7255536 4258517 -1302628 -5224059 -4806181 -3146203
3353 -3146203 -4269965 -6625800 -5232805 584358 5395618 4182904 -2286839 -9497684
3345i497684m251215L49061M592883N145899j6701o552764o728537J11894N180794
3336a1666370K026134m288491n159022j333519l95066l640661m291699M94179
3328b8254515M433268K366581j419133k89061M522602O744774M704964J967751
3320e222769K33097k162458m822561m144150P71886N264786M606070k4879l159833
3311h660811j429669L136769N707957L799505j20562j385773J329964M240447
3303F617827L059186j784689n925631o108756k941752N64402J692345P9343j600594
3294f348319k76603K868864K691757k429218o101419j522908P786659J0650970
3286G319783K440932q776636j2498884p530659m17771L646363M020636J673525
$$ plain form
3345 -9497684 -13748899 -13399838 -8806955 -3661056 -3677757 -10230521 -16959058 -16847164 -11666370
3336 -11666370 -9640236 -13928727 -19087749 -20421268 -20816334 -24456995 -28748694 -28254515
3328 -28254515 -23821247 -21454666 -22873799 -23162860 -18640258 -11895484 -7190520 -5222769
3320 -5222769 -4989672 -7152130 -11974691 -16118841 -15346955 -10082169 -5476099 -5500978 -8660811
3311 -8660811 -10090480 -6953711 -1245754 2553751 2433189 1047416 2377380 6617827
3303 6617827 9677013 7892324 1966693 -4142063 -7083815 -6519413 -4827068 -4747725 -6348319
3294 -6348319 -6624922 -3756058 -1064301 -3493519 -9594938 -11117846 -3331187 7319783
3286 7319783 9760715 984079 -11514805 -19045464 -19463235 -15816872 -11796236 -10122711
3278a0122711j821319l349421q33272L238521M496454K917993K649448N136430
3270B312123O417301K949525l158596p062709o874805m065061l85004K709366
3262g157860L192043L99236k819602k996059p59189M57227J07895J028622L739962
3253d807725M831498L018249K254789N223003P632116M112829k754155n288421
3245A4222183j705642J823125O09981k912835m639326m408349l521174j466539
3237a998576J439246K065108j194821n211147o545001n860194m598254j123074
3229b3026713N249633R870735Q163749L153328J553703L667768L470891j454935
3221A0648159o286912o294326k479794J625761M208246M490979J889873k056074
$$ plain form
3278 -10122711 -11944030 -15293451 -16126723 -12888202 -8391748 -5473755 -2824307 2312123
3270 2312123 8729424 11678949 8520353 1457644 -5417161 -9482222 -9867226 -7157860
3262 -7157860 -3965817 -3566581 -6386183 -9382242 -10141431 -9684204 -9576309 -8547687 -4807725
3253 -4807725 23773 3042022 5296811 10519814 18151930 22264759 19510604 14222183
3245 14222183 12516541 14339666 14949647 12036812 7397486 2989137 -532037 -1998576
3237 -1998576 -559330 1505778 310957 -4900190 -11445191 -17305385 -21903639 -23026713
3229 -23026713 -17777080 -7906345 257404 3410732 4964435 8632203 12103094 10648159
3221 10648159 4361247 -1933079 -4412873 -2787112 1421134 5912113 7801986 5745912
3213E745912l934531k367840M86477J995496J397761p60175k907117k760985k37374
3204c342376J287770O6976j17917L706415O362163J247917p291155q082548r9322
3195f262077N442621K707889l96402K977473O538981K324298m856796n304401
3187C171586m26527O98534l116452m562603j131851J749755R08904p13377j075376
3178d497407j466211j170602K169560N877584M055266k301003m910020l20888
3170b563721M913944M073845j332696n990066p464102n553188r18838K697707
3162a2137115Q62739l929114l348471M456775J0317710O732558j082194l052602
3154a179714J710997N656860M404371P70423j381873j510479q89851p88641j796122
$$ plain form
3213 5745912 1811381 -556459 -69982 1925514 3323275 2563100 -344017 -3105002 -3342376
3204 -3342376 -2054606 -1987630 -2105547 1600868 7963031 9210948 1919793 -6162755 -6262077
3195 -6262077 -819456 1888433 1492031 4469504 11008485 13332783 8475987 3171586
3187 3171586 2745059 3443593 327141 -4235462 -5367313 -3617558 -2708654 -3422031 -4497407
3178 -4497407 -5963618 -7134220 -4964660 912924 4968190 2667187 -2242833 -2563721
3170 -2563721 2350223 6424068 5091372 -898694 -8362796 -13915984 -14834822 -12137115
3162 -12137115 -11274376 -15203490 -18551961 -14095186 -3777476 2955082 1872888 -1179714
3154 -1179714 531283 6188143 10592514 11362937 9981064 8470585 7580734 6792093 4995971
3145D995971k554514q70591J936408J178737l781787o528821k527531L053341
3137e098787K530075k411247l300695J944887N968695K934803l828695p246348
3129h507312m964886l16693K001580q9731l892704l604751K981036R973779R425058
3120C005376J625107n157856n627985l105659k646011l576328k240728J346973
3112a6377111L620851K722507M58766n46856M49853K416312M124666N345055O390318
3103H604361O425403L637926j449832m513296k223364K345715K693340k684448
3095A2835805q436890r393040n774725o11204L929502O003127M070635R6981q25656
3086A894535K743665N380406K168104l475320m202529M40351K975039j574693
$$ plain form
3145 4995971 2441457 1570866 3507274 4686011 904224 -5624597 -8152128 -5098787
3137 -5098787 -2568712 -4979959 -8280654 -6335767 -367072 2567731 -1260964 -8507312
3129 -8507312 -13472198 -13788891 -11787311 -11877042 -15769746 -19374497 -16393461 -6419682 3005376
3120 3005376 4630483 -527373 -6155358 -9261017 -11907028 -15483356 -17724084 -16377111
3112 -16377111 -12756260 -10033753 -9574987 -10121843 -9671990 -7255678 -3131012 2214043 8604361
3103 8604361 15029764 18667690 17217858 12704562 10481198 12826913 15520253 12835805
3095 12835805 4398915 -4994125 -10768850 -11380054 -7450552 -1447425 2623210 2720191 1894535
3086 1894535 4638200 10018606 12186710 8711390 4508861 4949212 7924251 6349558
3078F349558q710739j0063806l282673N902427J0135131P149807O46549l989890
3070D136364m365790j978215N29209J827130J736331N49326l41691J037638M030200
3061G160502M153242j743593r569910j0993681l518556N721594Q459680M862214
3053D531492J415482J290308J377708j152509m155438m471075k929673k231107
3045f324812k194200n65648K904842O490601R230942J0107448O177667l398596
3037B2428244j2208838j1763064k941540L998296L039314o11328o47489N28262
3029A821857j842538n244256m829928l045709m724306o116901l1924R508691J0237851
3020d267163Q08817n549365r05846N750721L838522k434165k662883K838468N798618
$$ plain form
3078 6349558 -2361181 -12424987 -15707660 -9805233 329898 7479705 8126254 4136364
3070 4136364 -229426 -2207641 -1678432 148698 1885029 2434355 2092664 3130302 7160502
3061 7160502 11313744 9570151 241 -10993440 -14511996 -8790402 -330722 4531492
3053 4531492 5946974 7237282 8614990 7462481 3307043 -1164032 -4093705 -6324812
3045 -6324812 -8519012 -9084660 -6179818 310783 9541725 19649173 25826840 22428244
3037 22428244 10219406 -1543658 -4485198 -486902 2552412 1941084 1293595 1821857
3029 1821857 -20681 -5264937 -10094865 -13140574 -17864880 -23981781 -24013705 -14505014 -4267163
3020 -4267163 -3458346 -9007711 -9913557 -4162836 -324314 -2758479 -5421362 -2582894 3215724
3011C215724M391378L536461L787747J129559l032545k384691K768520M154319
3003A7566472j756978p933111p106070j187859L317885L771038J588696j379500
2995F880573l034299j286049K608504M016578R26183k912646l224230o90067J257103
2986D541650J473894J288044J453458J116495j105651n647095j0203801j0101669
2978a7184675l465648M545597O836158L612572J440113K572153J690202m170657
2970d124185q954372n713289L187791R317013Q625463L925428n36755k345845
2962C381249o92350K725646L839712P65970l246038m381211l492529l340439l186864
2953g626854m91308L832558O281794N788955M182355K891184K406421L052531
$$ plain form
3011 3215724 7607102 11143563 14931310 16060869 13028324 10643633 13412153 17566472
3003 17566472 15809494 7876383 770313 -417546 2900339 6671377 8260073 6880573
2995 6880573 3846274 2560225 5168729 9185307 10111490 7198844 3974614 3284547 4541650
2986 4541650 6015544 7303588 8757046 9873541 8767890 3120795 -7083006 -17184675
2978 -17184675 -20650323 -16104726 -9268568 -5655996 -4215883 -1643730 46472 -4124185
2970 -4124185 -13078557 -18791846 -15604055 -6287042 2338421 6263849 5727094 3381249
2962 3381249 2688899 5414545 9254257 10020227 6774189 2392978 -1099551 -4439990 -7626854
2953 -7626854 -8118162 -4285604 1996190 7785145 11967500 14858684 17265105 20317636
2945B0317636L023305j384494r390231j3223923p857729R4605O92154m503222
2937a2231899m970983J929027O788459L135278l011867l425820L32453J534528
2929i920824p92603k402562j712578p33605q5523J457105L450621M085695L167027
2920c487247J533936j033618m129675m885329j661327K088552J982666l90610
2912i982652M36858N024526P522350M396486R21L14384M166770M783868p43346
2903A5920165p331020q348896l573404J504448K909849J757196O07426l85576
2895C060188j934417k887192j772449N90955K646484M507775N892316L994515
2887A4098175k173615p253574n223238J111516L017003j261179m003791o53082
$$ plain form
2945 20317636 23340941 21956447 12566216 -657707 -8515436 -8420831 -7728677 -12231899
2937 -12231899 -17202882 -15273855 -8485396 -5350118 -8361985 -11787805 -11455352 -9920824
2929 -9920824 -10713427 -13115989 -14828567 -15562172 -15647695 -14190590 -10739969 -6654274 -3487247
2920 -3487247 -1953311 -2986929 -7116604 -12001933 -13663260 -11574708 -9592042 -9982652
2912 -9982652 -9545794 -4521268 3001082 7397568 7398489 7712873 11879643 16663511 15920165
2903 15920165 8589145 240249 -3333155 -1828707 1081142 2838338 3445764 3060188
2895 3060188 1125771 -1761421 -3533870 -2942915 -296431 4211344 10103660 14098175
2887 14098175 11924560 4670986 -552252 559264 3576267 2315088 -1688703 -2341785
2879b341785L062700J279819k074964m98048L408792J911009n007942r109354
2871i369773n615805J655878P107841Q931311P090551J825395l875275n157668
2863B592455j132532L384162L649506l9555l949623m770480j422084M074494P115577
2854I501920M805999p3498k414960j850770k533209n647001o891735l130407K546730
2845e686931M826859K253462k722368o960407p970330m830041M0701K363004J169155
2836a7516896J16391J882484M156996L705003J595567R82390J710712J030022
2828b337331j244194k129049k03577K312676L043698K391674J702581O09329j838216
2819B307591m459443m552878j443023K160100L136564J248350j437832l268818
$$ plain form
2879 -2341785 720915 2000734 -74230 -572278 2836514 4747523 -260419 -9369773
2871 -9369773 -14985578 -13329700 -6221859 2709452 9800003 11625398 7750123 2592455
2863 2592455 1459923 4844085 8493591 8454036 4504413 -266067 -1688151 2386343 9501920
2854 9501920 14307919 14234421 11819461 9968691 7435482 1788481 -5103254 -8233661 -5686931
2845 -5686931 -860072 1393390 -1328978 -8289385 -16259715 -21089756 -21049055 -18686051 -17516896
2836 -17516896 -17400505 -15518021 -11361025 -7656022 -6060455 -5078065 -3367353 -2337331
2828 -2337331 -3581525 -5710574 -5914151 -3601475 -557777 1833897 3536478 4145807 2307591
2819 2307591 -2151852 -6704730 -8147753 -5987653 -2851089 -1602739 -3040571 -6309389
2811f309389l583707j604326K662246O506434O448901K904280J54817O27753K245907
2802A0052916K795674L091129L400092R65199m973567r384755p587828k212593
2794c853733J234325K694544N056326O196680J853267m707633n246084K72414
2786C500106K521651k336935o042748j571457N292283M957436j525973n149172
2778c54809k384000J888187L102184J730393l01575k282293l469138l227882k510925
2769g809858k318329j556335P70768K685621J764530p25965j406477M80719K653959
2760e461367L083560J493721j034675k278408q72054N59636k106896o949385o103354
2751a9669222K749012J0453501P952162o73127m114982K29238M414727K698336
$$ plain form
2811 -6309389 -9893096 -11497422 -8835176 -2328742 4120159 7024439 7179256 7807009 10052916
2802 10052916 12848590 15939719 19339811 20305010 15331443 5946688 -1641140 -3853733
2794 -3853733 -2619408 75136 5131462 11328142 13181409 8473776 3227692 3500106
2786 3500106 6021757 3684822 -2357926 -3929383 1362900 6320336 4794363 -354809
2778 -354809 -2738809 -850622 2251562 3981955 3680380 1398087 -2071051 -5298933 -7809858
2769 -7809858 -10128187 -11684522 -10913754 -8228133 -6463603 -7189568 -8596045 -8115326 -5461367
2760 -5461367 -2377807 -884086 -1918761 -4197169 -5069223 -4509587 -6616483 -13565868 -19669222
2751 -19669222 -16920210 -6466709 1485453 812326 -3302656 -3073418 1341309 4039645
2743D039645k099495n299192n940476m247627R7154N224691P594321O544248M151137
2734A0064406P32488m320713p758794n180928R01272K673949j828192o069513
2726a0786025n440317l048698k182823n29779L529065N625746K219088k625631
2718a3239374l285484r52133K14204J234920N400902R795888P585351j281995
2710E472279q306536o872434K48780N473876N034880J342311j041104k66120J293339
2701B379271K55322k885964l623285P31363P042316J0023111Q072270L362088
2693B5356492j814045n959707p402454n856016m099872m815180o146051l654229
2685a4391062L070932Q694755Q020905J710276m754300o600547l674522K95531
$$ plain form
2743 4039645 1940150 -3359042 -9299518 -13547145 -13449991 -8225300 -630979 5913269 10064406
2734 10064406 10796894 6476181 -1282613 -6463541 -5562269 -2888320 -4716512 -10786025
2726 -10786025 -16226342 -19275040 -21457863 -21987642 -18458577 -12832831 -10613743 -13239374
2718 -13239374 -16524858 -17476991 -17262787 -16027867 -10626965 -831077 6754274 5472279
2710 5472279 -2834257 -9706691 -9457911 -3984035 1050845 2393156 1352052 1085932 2379271
2701 2379271 2634593 -251371 -3874656 -3143293 3899023 13922134 21994404 25356492
2693 25356492 23542447 17582740 10180286 4324270 224398 -4590782 -10736833 -14391062
2685 -14391062 -11320130 -2625375 5395530 7105806 2351506 -4249041 -7923563 -7628032
2677g628032J679943K02441j635262j580448Q97454N141825R072311R070952L516590
2668A8737774l270774m664703o17390J546212k336522o718900m540701K162585
2660B97581N633743L750012J384910J236110J11794m243646q287515p474246k301636
2651i892893L012920N427794M654107J949427p20261j649203q92116L6761K62841
2642B189377q233j023605l236889n139155l833911R93467N571290N937690K178021
2633C628052k219081m193159l478131j974672j349633q38026K134069P981558
2625c09023J2418663J0296164K190163n336708p045014m463606k694945l765001
2617A290693n298322m795797k805838j439047j326897j260519n02440j61403j335685
$$ plain form
2677 -7628032 -5948089 -5745648 -7380910 -8961358 -8063904 -2922079 6150232 15221184 18737774
2668 18737774 15467000 10802297 10184907 11731119 9394597 2675697 -1865004 297581
2660 297581 5931324 9681336 11066246 12302356 12414150 8170504 -117011 -7591257 -9892893
2651 -9892893 -6879973 -1452179 3201928 5151355 4431094 2781891 1889775 1926536 2189377
2642 2189377 2181144 1157539 -2079350 -7218505 -11052416 -10058949 -4487659 1450031 3628052
2633 3628052 1408971 -2784188 -6262319 -8236991 -9586624 -10424650 -8290581 -309023
2625 -309023 12109640 22405804 24595967 19259259 12214245 7750639 5055694 1290693
2617 1290693 -4007629 -8803426 -11609264 -13048311 -14375208 -15635727 -16138167 -16299570 -17635255
2608a7635255k562366r67859L542345P186538O859176M172599K881019L538991
2600G015188L446261J337868r64424j961419k633105m010574m892346l600339
2592f262890n78249K133945L047890J996334q1735j298316n9014K786230M176676
2583E860871K368517q00741k378908j957032j259752r30577L5094J536131J367554
2574C841157j652035n026939n071530j640538J661368K243843J278935O12504
2566c753235n95126l523615n697530l230635K937961O938407N336810J211124
2558c75839r29756r65938j193388j444452O7467K636568L552936K133531K01782
2549C682911j031985j823288k107092j595110j287251k240956l214055k190691
$$ plain form
2608 -17635255 -20197621 -21165480 -17623135 -10436597 -3577421 595178 3476197 7015188
2600 7015188 10461449 11799317 10834893 8873474 6240369 2229795 -2662551 -6262890
2592 -6262890 -6841139 -4707194 -1659304 337030 255295 -1043021 -1102035 1684195 5860871
2583 5860871 8229388 7428647 5049739 3092707 1832955 902378 937472 2473603 3841157
2574 3841157 2189122 -2837817 -7909347 -9549885 -7888517 -5644674 -4365739 -3753235
2566 -3753235 -4348361 -7871976 -13569506 -16800141 -13862180 -6923773 -1586963 -375839
2558 -375839 -1305595 -2271533 -3464921 -4909373 -4841906 -2205338 1347598 3481129 3682911
2549 3682911 2650926 827638 -1279454 -2874564 -4161815 -6402771 -9616826 -11807517
2541a1807517J70645J417964J242286J533719K741337L334002K883851K498804
2533D015091K079663M14269j867456k947175l567026n991444q602977o418329
2525b2885384R73734O669275N082420j91027j209129L788733Q764319P950583
2517H943524K146561l119439l446849O62306M615331M312249L32161l116637l295251
2508H033956j253545R87551K850448L785669K300241j608270n131976n710900
2500D253174l771262j109819J163781J602026j629300p224123r954519o754393
2492b3424435j412734M50329p42374P8183M408922Q046079P459785M075252J055613
2483e380o01673j095520J3768K403944L844707K879034J436603K410351N102729
$$ plain form
2541 -11807517 -11636872 -10218908 -8976622 -7442903 -4701566 -1367564 1516287 4015091
2533 4015091 6094754 6509023 4641567 1694392 -1872634 -7864078 -16467055 -22885384
2525 -22885384 -21911650 -15242375 -10159955 -10350982 -11560111 -7771378 992941 8943524
2517 8943524 11090085 7970646 4523797 5186103 9801434 14113683 14445844 11329207 8033956
2508 8033956 6780411 7767962 10618410 14404079 16704320 15096050 9964074 4253174
2500 4253174 481912 -627907 535874 2137900 508600 -6715523 -16670042 -23424435
2492 -23424435 -24837169 -24386840 -25129214 -25051031 -20642109 -12596030 -5136245 -1060993 -5380
2483 -5380 -607053 -1702573 -1688805 715139 4559846 7438880 8875483 11285834 16388563
2474A6388563N425809J187995m631062p238632n660049l191753k437188k206381
2466b362698m20262K079063K878741J755755L41026j121931l489682n470707m313151
2457a0123846m20697K152486J029759j722863l294398l300763j933178J343491
2449a6270009N213518O284124L938332J916626K400320K385099o59877l486076
2441A722057j846099K732969N715929O120805N346790K625197k393260n312159
2433A4712229k259347K472364J783709k446030j855337L739409M173341n191788
2425A5128550j4602113j2957840k887862M321192M285475K550171M255973P710897
2417G804443Q506894N294018M68486k438591j916260k81492j265549m897306p097503
$$ plain form
2474 16388563 21814372 23002367 18371305 11132673 5472624 2280871 -156317 -2362698
2466 -2362698 -2782960 -703897 2174844 3930599 4271625 3149694 -339988 -5810695 -10123846
2457 -10123846 -10544543 -8392057 -7362298 -9085161 -12379559 -15680322 -17613500 -16270009
2449 -16270009 -11056491 -4772367 -834035 1082591 3482911 5868010 5208133 1722057
2441 1722057 -124042 2608927 8324856 14445661 19792451 22417648 20024388 14712229
2433 14712229 12452882 14925246 16708955 14262925 12407588 16146997 20320338 15128550
2425 15128550 526437 -12431403 -15319265 -10998073 -6712598 -4162427 93546 7804443
2417 7804443 16311337 21605355 22073841 19635250 17718990 17437498 16171949 11274643 4177140
2408D177140n628211l162430k253353j067180K311484M829030K558991k492481
2400g27010m934031m026913l743128n099301m092316J241771O344803N520649
2392i515476o67932n816411m544523K322103Q965355J0528050P854347N528384
2384A4653897N270473L869350q79178n497575n642379l184697l702091p825848
2376b938048j0097366o908270j135482K369361K283458M73930p34120L37980L676824
$$ plain form
2408 4177140 -1451071 -4613501 -6866854 -7934034 -5622550 -793520 1765471 -727010
2400 -727010 -5661041 -9687954 -13431082 -18530383 -22622699 -21380928 -15036125 -9515476
2392 -9515476 -10183408 -15999819 -20544342 -18222239 -9256884 1271166 9125513 14653897
2384 14653897 19924370 23793720 22914542 17416967 11774588 8589891 4887800 -2938048
2376 -2938048 -13035414 -19943684 -21079166 -18709805 -16426347 -15952417 -16686537 -16348557 -12671733
$$ [...]
##END NTUPLES=NMR SPECTRUM
##END=
