##TITLE=31Pdec_DE-106_ch_7_TFA
CDCl3, 64 sc
 20.8.2025
##JCAMPDX= 6.0         $$ Bruker NMR JCAMP-DX V2.0
##DATA TYPE= NMR SPECTRUM
##DATA CLASS= NTUPLES
##ORIGIN= UXNMR, Bruker Analytische Messtechnik GmbH
##OWNER= root
$$ XWIN-NMR		Version 3.5
$$ Wed Aug 20 13:48:50 2025 Russian Standard Time (UT+4h)  she@DPX200
##.OBSERVE FREQUENCY= 81.013821
##.OBSERVE NUCLEUS= ^31P
##.ACQUISITION MODE= SIMULTANEOUS
##.ACQUISITION SCHEME= undefined
##.AVERAGES= 64
##.DIGITISER RES= 17
##SPECTROMETER/DATA SYSTEM= spect
##.PULSE SEQUENCE= zgpg30
##.SOLVENT NAME= CDCl3
##.SHIFT REFERENCE= (INTERNAL, CDCl3, 0, 198.062)
##AUDIT TRAIL= $$ (NUMBER, WHEN, WHO, WHERE, WHAT)
$$ ##TITLE= Audit trail, XWIN-NMR		Version 3.5
$$ ##JCAMPDX= 5.01
$$ ##ORIGIN= Bruker BioSpin GmbH
$$ ##OWNER= she
$$ F:/spectra/data/she/nmr/P31/2/pdata/1/auditp.txt
$$ ##AUDIT TRAIL=  $$ (NUMBER, WHEN, WHO, WHERE, WHAT)
(   1,<2025-08-20 13:46:04.34 +0400>,<she>,<DPX200>,
      <created by zg, POWCHK disabled, PULCHK disabled
       configuration hash MD5:
       00 E9 B6 7A A2 85 ED C7 34 08 36 98 17 FE 4E 26
       data hash MD5: 32K
       76 8F 94 7F 38 1C 8B B6 E6 B5 D9 4A 91 F7 3C 59>)
(   2,<2025-08-20 13:47:25.07 +0400>,<she>,<DPX200>,
      <Start of raw data processing
       efp BC_mod = 2 LB = 1.5 FT_mod = 6 PKNL = 1 PHC0 = 1420.745 PHC1 = 24.09949 SI = 64K 
       data hash MD5: 64K
       E1 1D A7 80 32 CD 13 CD 2F A5 F8 B8 7D 1C B9 05>)
(   3,<2025-08-20 13:48:10.28 +0400>,<she>,<DPX200>,
      <pk PHC0 = 168.7251 PHC1 = -461.6 
       data hash MD5: 64K
       C5 66 B4 94 87 67 7D D8 50 AF 44 86 8B 6C D5 70>)
(   4,<2025-08-20 13:48:17.51 +0400>,<she>,<DPX200>,
      <abs ABSG = 5 
       data hash MD5: 64K
       80 E6 95 AC 54 B0 F7 0E 67 92 D4 F3 A0 07 1D 79>)
$$ ##END=
$$ 
$$ hash MD5
$$ CF 45 1E 07 6F CD 89 2F C0 60 62 72 31 90 8B 35
##$RELAX= 
##$RELAX= 
##$RELAX= 
##$RELAX= 
##$RELAX= 
##$RELAX= 
##$RELAX= 
##$RELAX= 
$$ Bruker specific parameters
$$ --------------------------
##$DU= <F:/spectra>
##$EXPNO= 2
##$NAME= <P31>
##$PROCNO= 1
##$TYPE= <nmr>
##$USER= <she>
##$AMP= (0..31)
100 100 100 100 100 100 100 100 100 100 100 100 100 100 100 100 100 100 
100 100 100 100 100 100 100 100 100 100 100 100 100 100 
##$AQSEQ= 0
##$AQ_mod= 1
##$AUNM= <au_zg>
##$AUTOPOS= <>
##$BF1= 81.014009
##$BF2= 200.13
##$BF3= 200.13
##$BF4= 200.13
##$BF5= 200.13
##$BF6= 200.13
##$BF7= 200.13
##$BF8= 200.13
##$BYTORDA= 1
##$CFDGTYP= 0
##$CFRGTYP= 5
##$CHEMSTR= <none>
##$CNST= (0..31)
1 1 145 1 1 1 1 1 1 1 1 1 1 1 1 1 1 1 1 1 1 1 1 1 1 1 1 1 1 1 1 1 
##$CPDPRG= <waltz16>
##$CPDPRG1= <>
##$CPDPRG2= <waltz16>
##$CPDPRG3= <>
##$CPDPRG4= <mlev>
##$CPDPRG5= <mlev>
##$CPDPRG6= <mlev>
##$CPDPRG7= <mlev>
##$CPDPRG8= <mlev>
##$CPDPRGB= <>
##$CPDPRGT= <>
##$D= (0..31)
0 1 0 0 0 0 0 0 0 0.06 0 0.03 2e-05 3e-06 0 0 0.0002 0 0 0 0 0 0 0 0 0 
0 0 0 0 0 0 
##$DATE= 1755683163
##$DBL= (0..7)
120 120 120 11 120 120 24 19 
##$DBP= (0..7)
150 150 150 150 150 150 150 150 
##$DBP07= 0
##$DBPNAM0= <>
##$DBPNAM1= <>
$$ [...]
##$SUBNAM3= <"">
##$SUBNAM4= <"">
##$SUBNAM5= <"">
##$SUBNAM6= <"">
##$SUBNAM7= <"">
##$SUBNAM8= <"">
##$SUBNAM9= <"">
##$SW= 400.765351723535
##$SWIBOX= (0..15)
0 1 3 0 0 0 0 0 0 0 0 0 0 0 0 0 
##$SW_h= 32467.5324675325
##$TD= 32768
##$TD0= 1
##$TE= 0
##$TE2= 300
##$TE3= 300
##$TEG= 300
##$TL= (0..7)
0 120 53 12 22 120 120 120 
##$TP= (0..7)
150 150 150 150 150 150 150 150 
##$TP07= 0
##$TPNAME0= <>
##$TPNAME1= <>
##$TPNAME2= <>
##$TPNAME3= <>
##$TPNAME4= <>
##$TPNAME5= <>
##$TPNAME6= <>
##$TPNAME7= <>
##$TPOAL= (0..7)
0.5 0.5 0.5 0.5 0.5 0.5 0.5 0.5 
##$TPOFFS= (0..7)
0 0 0 0 0 0 0 0 
##$TUNHIN= 0
##$TUNHOUT= 0
##$TUNXOUT= 0
##$USERA1= <user>
##$USERA2= <user>
##$USERA3= <user>
##$USERA4= <user>
##$USERA5= <user>
##$V9= 5
##$VALIST= <valist>
##$VCLIST= <CCCCCCCCCCCCCCC>
##$VD= 0
##$VDLIST= <DDDDDDDDDDDDDDD>
##$VPLIST= <PPPPPPPPPPPPPPP>
##$VTLIST= <TTTTTTTTTTTTTTT>
##$WBST= 1024
##$WBSW= 4
##$XGAIN= (0..3)
0 0 0 0 
##$XL= 0
##$YL= 0
##$YMAX_a= 19115
##$YMIN_a= -16297
##$ZGOPTNS= <>
##$ZL1= 120
##$ZL2= 120
##$ZL3= 120
##$ZL4= 120
##$ABSF1= 198.0616
##$ABSF2= -202.7028
##$ABSG= 5
##$ABSL= 3
##$ALPHA= 0
##$AQORDER= 0
##$ASSFAC= 0
##$ASSFACI= 0
##$ASSFACX= 0
##$ASSWID= 0
##$AUNMP= <proc_1d>
##$AZFE= 0.1
##$AZFW= 0.5
##$BCFW= 0
##$BC_mod= 2
##$BYTORDP= 0
##$COROFFS= 0
##$CY= -3
##$DATMOD= 1
##$DC= 0
##$DFILT= <>
##$DTYPP= 0
##$F1P= 0
##$F2P= 0
##$FCOR= 1
##$FTSIZE= 65536
##$FT_mod= 6
##$GAMMA= 0
##$GB= 0
##$INTBC= 1
##$INTSCL= 9.790993e-09
##$ISEN= 30
##$LB= 1.5
##$LEV0= 0
##$LPBIN= 0
##$MAXI= 10000
##$MC2= 0
##$MEAN= 0
##$ME_mod= 0
##$MI= 50
##$NCOEF= 0
##$NC_proc= -8
##$NLEV= 6
##$NOISF1= 182.463
##$NOISF2= 159.3651
##$NSP= 0
##$NTH_PI= 0
##$NZP= 0
##$OFFSET= 198.0616
##$PC= 4
##$PHC0= 1589.47
##$PHC1= -437.5005
##$PH_mod= 1
##$PKNL= yes
##$PPARMOD= 0
##$PSCAL= 0
##$PSIGN= 0
##$REVERSE= no
##$SF= 81.0140089999434
##$SI= 65536
##$SIGF1= 159.3651
##$SIGF2= -187.1042
##$SINO= 113.3802
##$SIOLD= 16384
##$SREGLST= <1H.CDCl3>
##$SSB= 0
##$STSI= 65536
##$STSR= 0
##$SW_p= 32467.5324675325
##$SYMM= 0
##$S_DEV= 0
##$TDeff= 32768
##$TDoff= 0
##$TI= <>
##$TILT= no
##$TM1= 0
##$TM2= 0
##$TOPLEV= 0
##$USERP1= <user>
##$USERP2= <user>
##$USERP3= <user>
##$USERP4= <user>
##$USERP5= <user>
##$WDW= 1
##$XDIM= 65536
##$YMAX_p= 256120354
##$YMIN_p= -40127062
$$ End of Bruker specific parameters
$$ ---------------------------------
##NTUPLES= NMR SPECTRUM
##VAR_NAME=  FREQUENCY,     SPECTRUM/REAL,   SPECTRUM/IMAG
##SYMBOL=    X,             R,               I
##VAR_TYPE=  INDEPENDENT,   DEPENDENT,       DEPENDENT
##VAR_FORM=  AFFN,          ASDF,            ASDF
##VAR_DIM=   65536,         65536,           65536
##UNITS=     HZ,            ARBITRARY UNITS, ARBITRARY UNITS
##FACTOR=    0.49542278885378, 1,            1
##FIRST=     16045.7642231865, 0,            0
##LAST=      -16421.768244346, 0,            0
##MIN=       -16421.768244346, -40127062,    0
##MAX=       16045.7642231865, 256120354,    0
$$ Real data points
##PAGE= N=1
##DATA TABLE= (X++(R..R)), XYDATA
$$ [...]
##PAGE= N=2
##DATA TABLE= (X++(I..I)), XYDATA
7506E132099M147190K838635l33471l294407m549730l739059j623634N4421J8416
7497a349540p51517j13779J895406K663210P48508j950433k944063k150880q14980
7488d768068O00893J804382J784443L18882j184747j796910k134446k057555o0815
7479g493941L076226L331097p08062m142719k157842K386726K892786r98337l168231
7470f982297o14888K569926K199268j31007o51790Q92310J993522J349368l45211
7461B79201j990401k766795k401682j643261j296418p08936J036156K703673K210043
7452d578420K96802q6919J587845K634155J683352O20099Q02132P64232n67267
7443C156011j561375r70876n26952j943126l623756l015349n65208J157546J133049
$$ y = [5132099, 9279289, 12117924, 11784453, 8490046, 3940316, 201257, -1422377, -1367956, -1349540, -2101057, -2214836, -319430, 2343780, 3092288, 1141855, -1802208, -3953088, -4768068, -4167175, -2362793, -578350, -259468, -1444215, -3241125, -5375571, -7433126, -7493941, -4417715, -1086618, -1794680, -5937399, -8095241, -5708515, -2815729, -3814066, -6982297, -7597185, -5027259, -2827991, -2958998, -3610788, -2718478, -724956, 624412, 279201, -1711200, -4477995, -6879677, -8522938, -9819356, -10528292, -9492136, -6788463, -4578420, -4281618, -4368537, -2780692, -146537, 1536815, 2156914, 2959046, 3723278, 3156011, 1594636, 623760, 96808, -1846318, -5470074, -8485423, -9050631, -7893085, -6760036]
7434f760036N74017P44103J657445K342335J655856k11670j019339Q94059L400166
7425C276936K824231m13981k054609p11796L4381j876831l137946r69671J497916
7416a531370K19075k818324k769732L59035K565499K840916L715915N361134M627354
7407A2569502O10543l413564m635695l575222j608793P08487K110195J042247
7399C807700j339560j864517M1667J676709J751823K052141L174292K603659p31480
7390A1172434l515431k551851M76449J754677P16639l93193p00755j190618j849255
7381C919096j402919Q3251P49731m98817k561961l567490k662326l59772K016631
7372d284576L241863L056835J967866K48652j884574l127640j943188P51535J822133
$$ y = [-6760036, -6186019, -5441916, -3784471, -1442136, 213720, 2050, -1017289, -123230, 3276936, 6101167, 5687186, 3632577, 2920781, 2955162, 1078331, -2059615, -3029286, -1531370, -1312295, -4130619, -6900351, -6541316, -3975817, -1134901, 2581014, 7942148, 12569502, 13180045, 9766481, 5130786, 1555564, -53229, 655258, 2765453, 3807700, 2468140, 603623, 645290, 2321999, 4073822, 6125963, 9300255, 11903914, 11172434, 7657003, 5105152, 5581601, 7336278, 8052917, 7659724, 6958969, 5768351, 3919096, 2516177, 2599428, 3349159, 2850342, 288381, -3279109, -5941435, -6301207, -4284576, -1042713, 2014122, 3981988, 4230640, 2346066, -781574, -2724762, -1973227, -151094]
7363a51094J78686j309269r0308K049096K105028J171281K664594N925952O170160
7354A8714126J740633k833117l163341q48565p8366j298940j987667j743171k221321
7345F280271k806147j011091K331053K858115o30960l410274j531420K197476
7337D277023K663671K31389n36772J455910K551845Q32088j064651j089757j327482
7328G993264l747277n893349m292622l9066K553554J838682K21029N1223R75829
7319c38733J609738J535692R68850Q100j048081j506257q65985O63586K084504
7310C111414K016259R0480j797852j112292J710755L096283J138605j396760j022321
7301E834571J267178J667442n91104k397049j667066O0388O00059L3288m10175
$$ y = [-151094, 27592, -1281677, -1371985, 677111, 2782139, 3953420, 6618014, 12543966, 18714126, 20454759, 17621642, 14458301, 13609736, 13531370, 12232430, 10244763, 8501592, 6280271, 3474124, 2463033, 4794086, 7652201, 7021241, 3610967, 2079547, 4277023, 6940694, 7172083, 6635311, 8091221, 10643066, 11475154, 10410503, 9320746, 7993264, 4245987, -1647362, -5939984, -5979050, -3425496, -1586814, -1365785, -1314562, -338733, 1271005, 2806697, 3775547, 3783647, 2735566, 1229309, 363324, 1026910, 3111414, 5127673, 5218153, 3420301, 2308009, 4018764, 7115047, 8253652, 6856892, 5834571, 7101749, 8769191, 8178087, 5781038, 4113972, 4174360, 4774419, 4807707, 4397532]
7292D397532l28972J08135Q45828J405861Q97002o84493k165384k667723k423989
7283f16203j911913j190825k21756J067315K853349M583109M663370K383393n11741
7274A1098098j853946j900959k114390k021524j61860K266341K114366q86761
7266F539365l222761k491664k70048J054882J401306J430106O14730j203094k552089
7257A300733k472444j975386j807542r31429J058986K327222J686571R34568J934353
7248B055632L300231K563357J1683k238116l533926m352846m019712j743055R62401
7239f994351J835498J277792J396683K164918J574918m98786j759037j301341
7231b303706r82723j901548k181033n7118K698931K691503l98222k965539j736926
$$ y = [4397532, 4068560, 4176695, 5022523, 6428384, 7325386, 6640893, 4475509, 1807786, -616203, -2528116, -3718941, -3940697, -2873382, -20033, 4563076, 9226446, 11609839, 11098098, 9244152, 7343193, 5228803, 3207279, 3045419, 5311760, 7426126, 6539365, 3316604, 824940, 554892, 1609774, 3011080, 4441186, 5055916, 3852822, 1300733, -1171711, -3147097, -4954639, -5886068, -4827082, -2499860, -813289, 121279, 2055632, 5355863, 7919220, 7930903, 5692787, 2158861, -2193985, -6213697, -7956752, -6994351, -5158853, -3881061, -2484378, -319460, 1255458, 756672, -1002365, -2303706, -3286429, -5187977, -7369010, -7426128, -4727197, -2035694, -2433916, -5399455, -7136381]
7222g136381K270626M960478L979027J098998p12849j142268j718614k247041
7214f48024r65286J664404K630843J017525k24680R32339K149187P90472j415911
7205E930869j360162O0177k71226j954462j691731Q35106K235739R81208m13823
7196D351695K31217J800003K544971K546761K145819P53383j356185k594736k687246
7187G735682l269515m619944m433824j452550K125831L650097L257323K345116
7179E338216R97072r58302k188194j481601J54842J033335J211486J504158J360285
7170F971297j05353j881566k079457p41422L02295J77515j33782L28007J095877
7161C933411J030452k68432j903152k293248p59054J347619J859480L53237j430206
$$ y = [-7136381, -4865755, 94723, 4073750, 5172748, 4459899, 3317631, 1599017, -648024, -1613310, 51094, 2681937, 3699462, 3474782, 4407121, 6556308, 7346780, 5930869, 4570707, 4630884, 4359658, 2405196, 713465, 1548571, 3784310, 4765518, 4351695, 4582912, 6382915, 8927886, 11474647, 13620466, 14373849, 13017664, 10422928, 7735682, 4466167, -153777, -4587601, -6040151, -3914320, -264223, 2993100, 5338216, 6335288, 5376986, 3188792, 1707191, 1862033, 2895368, 4106854, 5611012, 6971297, 6865944, 4984378, 2904921, 2163499, 2465794, 2643309, 2509527, 2837534, 3933411, 4963863, 4695431, 2792279, 499031, -260023, 1087596, 2947076, 3300313, 1870107]
7152A870107j826313o92431J359428L393734L648443R55427k607198l093676l6165
7143B971356K295316Q66509j702775j451313P60218J180265l82978m36644K138545
7134F238499M072048K619992q31683l389458m246650m152935l326844j596808
7126d613839M72977J821427J753158K99232j462488j633939N75372L222000L542583
7117C976483J514678k98935n54477n87366j523156k245874j455152J55141J188628
7108A69970J443646J115708l22769k672703l698307j406703K847057N376370M212797
7099G065066Q05198k087221k817433j337031J154108K672367J830519n50404j930946
7090D804223p55748J746974K917974J557380r27309k197915j497847k46348r4608
$$ y = [1870107, 43794, -648637, 710791, 4104525, 7752968, 8708395, 6101197, 3007521, 2971356, 5266672, 6133181, 4430406, 2979093, 3739311, 4919576, 4536598, 4099954, 6238499, 10310547, 12930539, 12098856, 8709398, 4462748, 309813, -3017031, -4613839, -4140862, -2319435, -566277, -267045, -1729533, -3363472, -2788100, 433900, 3976483, 5491161, 5192226, 4637749, 4050383, 2527227, 281353, -1173799, -1018658, 169970, 1613616, 2729324, 2406555, -266148, -3964455, -5371158, -2524101, 2852269, 7065066, 7870264, 5783043, 2965610, 1628579, 2782687, 5455054, 7285573, 6735169, 4804223, 4048475, 5795449, 8713423, 10270803, 9343494, 7145579, 5647732, 5401384, 5306776]
7081E306776p82859n60539J231361K838795K016436j131954m010051m233209j917308
7072a242552Q29545K172793J943568J058001K10173m34529n63540L38792J871056
7063F183307K262672J40323l329576n131273l571309j0423K825115L439036K183691
7054D991563L28815q21572p69850n52991j781657m146108m994651k692575O95549
7045i743477J964513J180312J004711J875365J133743j982537l801753j276281
7037i645404K835326L441844O18645m66793K563523N550730L813380j280092m645857
7028B785302m376413k937614k311337j487386N62540K290823J632885r17254k920438
7019g678892k894271j325705O35612K158608K535457J304812q85326k271470j630233
$$ y = [5306776, 4523917, 3963378, 5194739, 8033534, 10049970, 8918016, 4907965, 674756, -1242552, -413007, 1759786, 3703354, 4761355, 4971528, 4536999, 3973459, 4312251, 6183307, 8445979, 8586302, 5256726, 125453, -3445856, -3456279, -631164, 2807872, 4991563, 5320378, 4498806, 3728956, 3175965, 1394308, -2751800, -7746451, -10439026, -9743477, -7778964, -6598652, -5593941, -3718576, -2584833, -4567370, -8369123, -9645404, -6810078, -3368234, -2749589, -3216382, -652859, 4897871, 8711251, 7431159, 2785302, -1591111, -4528725, -6840062, -8327448, -7764908, -5474085, -3841200, -4758454, -7678892, -10573163, -11898868, -11263256, -9104648, -6569191, -5264379, -6149705, -8421175, -10051408]
7010a0051408J84101J054668J58692r86282o23651P95984J488302J289843J897240
7001d792511L721439M541851K665208k59566j510125j102356j041918j686324
6993E35698j596553p12940o96375j660200j459537O49963K222133J120070j231295
6984b829036j945867n44140J083894J498895Q32433j65153q13629p52570l94675
6975d029848m98894q48907m83273L96687M17354m61918m54527J088719K445804
6966b428803K515993K554047L171010K313967j210626m606342m551569j854344
6958d096667N05324K012054L634815M054587J380558k330440k990450p19776M14788
6949A864793r63149j972073j249248j217868k856396l057250K7089L088773K502155
$$ y = [-10051408, -9867307, -8812639, -8653947, -9640229, -10263880, -9467896, -7979594, -6689751, -4792511, -1071072, 3470779, 6135987, 5876421, 4366296, 3263940, 2222022, 535698, -1060855, -1773795, -2470170, -4130370, -5589907, -4939944, -2717811, -1597741, -2829036, -4774903, -5319043, -4235149, -2736254, -1903821, -2068974, -2882603, -3635173, -4029848, -4528742, -5377649, -5860922, -5464235, -5046881, -5508799, -5963326, -4874607, -2428803, 87190, 2641237, 5812247, 8126214, 6915588, 2309246, -2242323, -4096667, -3591343, -1579289, 2055526, 6110113, 7490671, 5160231, 2169781, 1450005, 1864793, 901644, -1070429, -2319677, -3537545, -6393941, -9451191, -9424102, -6335329, -3833174]
6940c833174o5823m35830J934724M008099L874109K332107P06303l78305o45754
6931G496456m48682p16947j394812j129782L80818J427101R70836L48670P31804
6922G665462R46492k92745j941823k438540k100580j761483j035726Q155k57361
6913a208149k060629k632396m16393J658979N84336j466916m62473K836117M281752
6904A114228L139606K412072K907220K238459O1337q30571K88424N46346j328472
6895A0548649k774209k260456k029071l500743m008813j262133K355545L468862
6887E37631K905747L412344M319018K658286j414629m251536l728353j470016
6879B968492K53602J188677J975123K435658J972178N60132j209920k414560k131264
$$ y = [-3833174, -3898997, -4334827, -2400103, 1607996, 5482105, 7814212, 8520515, 8142210, 7496456, 7047774, 6330827, 4936015, 3806233, 4187051, 5614152, 6584988, 6933658, 7665462, 8611954, 8319209, 6377386, 3938846, 1838266, 76783, -958943, -950788, -1208149, -3268778, -5901174, -6317567, -4658588, -4074252, -5541168, -6003641, -3167524, 1114228, 4253834, 6665906, 9573126, 11811585, 11872922, 11042351, 11330775, 11877121, 10548649, 7774440, 5513984, 3484913, -15830, -4024643, -5286776, -2931231, 537631, 3443378, 6855722, 11174740, 13833026, 12418397, 8166861, 4438508, 2968492, 3222094, 4410771, 6385894, 8821552, 10793730, 11353862, 10143942, 7729382, 5598118]
6870E598118l21750J638176K093034Q40387p47699j231234m04707O49662O04330
6861H718317o48249j598991q72719P66018J265252J02856j223724j684782j846528
6852B977450j959389j062815P65849J306297p79757l340834l284076p25655J508070
6843d594860J830997J228455R85390J159241J417157J650508J455584L94137r40048
6834D586561j312870n95623n9254n75232j403680j230625J18971J403391J285858
6825B217497j25225j178049n10121J149555J812589Q64100k97846m87629j22219
6816C322652K11442R01095J934609K031891O68420n19444j73385L18103r59528
6807G735855k830720k347184O43076K962109K431676L70414q62136p71440k98752
$$ y = [5598118, 5276368, 6914544, 9007578, 9847965, 9100266, 7869032, 7464325, 8113987, 8718317, 8070068, 6471077, 5598358, 6364376, 7629628, 7732484, 6508760, 4823978, 2977450, 1018061, -44754, 721095, 2027392, 1247635, -2093199, -5377275, -6102930, -4594860, -2763863, -1535408, -550018, 609223, 2026380, 3676888, 5132472, 5526609, 4586561, 3273691, 2678068, 2618814, 2043582, 639902, -590723, -471752, 931639, 2217497, 2092272, 914223, 404102, 1553657, 3366246, 4230346, 3932500, 3444871, 3322652, 3534094, 4435189, 6369798, 8401689, 9070109, 8550665, 8377280, 8695383, 7735855, 4905135, 2557951, 3201027, 6163136, 8594812, 8965226, 8103090, 7331650, 7032898]
6798G032898j38058m92702j351470k142571j926720n27516J144326K112095K023180
6789E733462R21681p24755j847558j662189o88668P5679P08137J846731K950785
6780G313305K668604R31540q92779k027096k862407l369880k711428r19692O29373
6771a240460J032395Q01966N42747N8611p69286j525137k012008k184864j353092
6762f649128Q69416K934674K919552J801480K363805M236610L410499j600260
6754A0286648o347884n943650j519537J894793K094606R40957K09725r7274K55053
6745A773437J819266L192332J832506j977702m568919l332220L05533L175056
6737B219289L651567J878694j084202l085515j886059J902907M352240K551403
$$ y = [7032898, 6894840, 6402138, 5050668, 2908097, 981377, 453861, 1598187, 3710282, 5733462, 6655143, 5930388, 4082830, 2420641, 1731973, 1807652, 2515789, 4362520, 7313305, 9981909, 10913449, 10020670, 7993574, 5131167, 1761287, -950141, -1869833, -1240460, -208065, 593901, 1136648, 1195259, 425973, -1099164, -3111172, -5296036, -6649128, -5779712, -2845038, 74514, 1875994, 4239799, 8476409, 11886908, 10286648, 3938764, -2004886, -3524423, -1629630, 464976, 1405933, 1615658, 1518384, 1773437, 3592703, 6785035, 8617541, 6639839, 2070920, -1261300, -955767, 2219289, 5870856, 7749550, 6665348, 3579833, 1693774, 3596681, 7948921, 10500324]
6729A0500324j588007l695611k374979k66891O9392q40896j155163o83910n90033
6720f25774r31631k77800J897783L790104L297448Q55685j062651j229580j047314
6711D666270k132846l823454m201532k757848p28167P73667J663747K127214K192431
6702b220518K098094K060707J699047O74141k58400n4253Q00915O76646p53486
6693D722893j836956j235772L01482J075966L67469j260005k605239k420812n23451
6684c414425J277673P32410j796653l372528k362954m96098J76072L67310J577429
6675g311764K769425J925659N5820L92305L404239N644562M504521J526379m10438
6666A2500708r82890j651159k660477k998993k493830j942748j475409m63051
$$ y = [10500324, 8912317, 5216706, 2841727, 2574836, 2644228, 1803332, 648169, -35741, -625774, -1557405, -1835205, 62578, 3852682, 7150130, 8005815, 6943164, 5713584, 4666270, 2533424, -1290030, -5491562, -8249410, -8977577, -8203910, -6540163, -4412949, -2220518, -122424, 1938283, 3637330, 4311471, 4053071, 3998818, 4799733, 5476379, 4722893, 2885937, 1650165, 1951647, 3027613, 3395082, 2135077, -470162, -2890974, -3414425, -2136752, -1404342, -3200995, -6573523, -8936477, -9432575, -9256503, -8889193, -7311764, -4542339, -2616680, -2560860, -2168555, 1235684, 6880246, 11384767, 12911146, 12500708, 11517818, 9866659, 7206182, 4207189, 1713359, -229389, -1704798, -2167849]
6658b167849R70313J717001J140645j44496r80693n49482J084606K600617K212950
6649E883612j57748k172030j816196j94337R4312j142232j553147L304J931309
6640H76847K653704K496282J780343m89175m177268o349058m576434o53091J545879
6631f891971J086995K75886N40595R72488J002293J467473K269845J846154K45526
6622B815284M7749K400252M539607L607278R40458k65298k9916q93710k857232
6613A0304472k898603j79171J834972K24657l093730m203634k428142k37281Q51950
6604A75490J541434K278395K153687P96612o31645j166947j273846j510100j273935
6595A089145N7301J708144K354818J778790O96171n02202j795606k718684k606435
$$ y = [-2167849, -1197536, 519465, 1660110, 1515614, 534921, -14561, 1070045, 3670662, 5883612, 5725864, 3553834, 1737638, 1543301, 1637613, 495381, -1057766, -1054462, 876847, 3530551, 6026833, 7807176, 7318001, 3140733, -3208325, -7784759, -8437850, -6891971, -5804976, -5529090, -4988495, -4016007, -3013714, -1546241, 723604, 2569758, 2815284, 2863033, 5263285, 9802892, 13410170, 14350628, 14085330, 14055414, 13161704, 10304472, 7405869, 7226698, 9061670, 9286327, 6192597, 1988963, -439179, -676460, 175490, 1716924, 3995319, 6149006, 6945618, 6313973, 5147026, 3873180, 2363080, 1089145, 1146446, 2854590, 5209408, 6988198, 7684369, 7182167, 5386561, 2667877, 61442]
6586F1442j559064l21097O25478J053208M72054j190473k538513j754399R49828
6577d201536L126217K904365J063345k83877k10113N04483P08808O5464p22972
6568B954184n49924P80778J868325J175934q08250k024520j579035n96014r8684
6559A122794R8398k22507k113722m916152n537608k359718J964252L932695L692208
6550d339360L449185L161058J362403q26369o26322J589659K416690Q09654n35852
6541F460746o7501L09197p17625j338821k83895M60483p99567k200954j505002
6532C17061n32j92251j696158k425849k002328j096563O78533L111203L608844
6523C01960O86922k395050j464427K248023L789558J775105l82896l87210L40410
$$ y = [61442, -1497622, -1818719, -1193241, -140033, 332021, -858452, -3396965, -5151364, -4201536, -1075319, 1829046, 2892391, 2608514, 2398401, 2902884, 3611692, 3677156, 2954184, 2404260, 3185038, 5053363, 6229297, 5421047, 3396527, 1817492, 1221478, 1122794, 1221192, 998685, -1115037, -6031189, -11568797, -13928515, -11964263, -8031568, -4339360, -890175, 2270883, 3633286, 2806917, 2180595, 3770254, 6186944, 6996598, 6460746, 6393245, 6702442, 5984817, 4645996, 4362101, 4822584, 4023017, 1822063, 317061, 316529, 124278, -1571880, -3997729, -6000057, -7096620, -6418087, -3306884, 301960, 988882, -1406168, -2870595, -622572, 3166986, 4942091, 4559195, 4171985, 4512395]
6514D512395N95028J490821L103938K863071n24693m377177n394707l648970j534697
6505b914991n36439m62773m02031N33660K052735K084244o47024l513933k423724
6496f230276K147430M953139K972267q89903k813774l120186l677910l622218
6488a0281431j292075J857307L052794K427035J906748J149404j514305m614006
6480g308529m119307P54287N601944O073009K758835n33476j592048j246363r86986
6471e98634q55462J2168J530821K200719R05533j344619k490721k091003j530877
6462d262075j444969p33184J160221K879252L283922L219331L632619L512894
6454A1248011J609600r87196k009496j079288N6266j91218j988593m303140n309758
$$ y = [4512395, 5107423, 6598244, 9702182, 12565253, 12040560, 7663383, 2268676, -1380294, -2914991, -3451430, -3914203, -4316234, -3782574, -1729839, 354405, -292619, -3806552, -6230276, -4082846, 870293, 3842560, 2952657, 138883, -2981303, -6659213, -10281431, -11573506, -9716199, -6663405, -4236370, -2329622, -1180218, -2694523, -7308529, -11427836, -10673549, -5071605, 1001404, 3760239, 3226763, 1634715, 388352, -598634, -1454096, -1441928, 88893, 2289612, 3195145, 1850526, -640195, -2731198, -4262075, -5707044, -6440228, -5280007, -2400755, 883167, 4102498, 7735117, 11248011, 12857611, 11870415, 9860919, 8781631, 8837897, 8646679, 6658086, 2354946, -2954812]
6445b954812l738749r02094K08928q94166j062643J557261L946409K535201r70517
6436b275182j876664N69494K544899J572015p88893k354294k789432k062358J81995
6427g278420K656558K731955o1199l031632l651545j898165J001212L797666M924051
6418h09519L540626J256007L29378K01899j153200k672434j193559K399327K916375
6409D814900j249802m699457k716631J660467K385402q40000l190718k198956
6401f034795L9355J287099J520098R59369n01117j527790k28997K544223L522942
6392A580387J484689r05007p04887J632820L238489K318042q8305j229062N73067
6383G900233L697192M342381R02990l496778m366452j225424K156770K592779
$$ y = [-2954812, -6693561, -7595655, -7386727, -8280893, -9343536, -7786275, -3839866, -1304665, -2275182, -4151846, -3582352, -1037453, 534562, -254331, -2608625, -5398057, -7460415, -7278420, -4621862, -1889907, -1951106, -4982738, -8634283, -10532448, -9531236, -5733570, -809519, 2731107, 3987114, 4316492, 4518391, 3365191, 692757, -500802, 1898525, 4814900, 3565098, -1134359, -3850990, -2190523, 194879, -645121, -3835839, -6034795, -5995440, -4708341, -3188243, -2228874, -2729991, -4257781, -4486778, -1942555, 1580387, 3065076, 2160069, 1455182, 3088002, 6326491, 8644533, 8556228, 7327166, 7900233, 11597425, 15939806, 16842796, 13346018, 8979566, 7754142, 9910912, 12503691]
6375A2503691N05708k006104l873917m783248l954780j038401K247988L042219
6367B643156N66334k358219k148147J146034L612749K502994j6082j67827J510821
6358G291813R19538k751265m871569j982710K860299M376327K157789o4478m80463
6349G455281n16902q45417j43425J703824K461613O23083k585602m889073m882411
6340a619029k311427J473536L499374K003922p39513r62541J264455K192756K12638
6331E014171j842329j379910J26153k1873j489594j804346o9965K145788K816184
6322C494279J171400j721982l442068k447955k10545M63931n50966n96819J340008
6313b500717K867189K110245N76268J53861j42795j845016l513702k555827O68360
$$ y = [12503691, 13009399, 11003295, 7129378, 2346130, -1608650, -2647051, -399063, 2643156, 3209490, 851271, -1296876, -150842, 3461907, 5964901, 5948819, 5780992, 7291813, 8211351, 5460086, 588517, -1394193, 1466106, 5842433, 8000222, 7935744, 7455281, 6938379, 6092962, 5949537, 7653361, 10114974, 10738057, 8152455, 3263382, -1619029, -3930456, -2456920, 1042454, 3046376, 2306863, 1344322, 2608777, 4801533, 5014171, 3171842, 1791932, 1918085, 1896212, 406618, -1397728, -1467693, 678095, 3494279, 4665679, 2943697, -498371, -2946326, -3156871, -2692940, -3243906, -3840725, -2500717, 366472, 2476717, 3052985, 3206846, 3064051, 1219035, -2294667, -4850494, -4182134]
6304d182134L330876L925575L106357J515606o43833k274331k106069p75977j77537
6295A718533p47337j149874n19805O55935J653842J899003P07342j516031k357371
6286C44237O4485L818701M832734K073186j284148k372395j947572k147746l034266
6277C47216k971185j223012J233530K805868K338046j30844k878087l556820j556491
6268e591779J258474K686497K334016J143169j99835j409003j872407j048878
6260b699746M82838J378459J197760R93386J714618K513428J611608r63388k637646
6251C591317j376745J209821J607769p93087k729799j660285Q01244J567385L45337
6242B562957r09680j421315j912909k240115j350348M64992J532423J114032p8595
$$ y = [-4182134, -851258, 3074317, 6180674, 7696280, 7052447, 4778116, 2672047, 1896070, 1718533, 971196, -178678, -698483, -42548, 1611294, 3510297, 4217639, 2701608, 344237, 408722, 4227423, 9060157, 11133343, 9849195, 7476800, 5529228, 3381482, 347216, -2623969, -3846981, -2613451, 192417, 2530463, 2399619, -478468, -4035288, -5591779, -4333305, -1646808, 687208, 1830377, 1630542, 221539, -1650868, -2699746, -2216908, -838449, 359311, 1352697, 3067315, 5580743, 7192351, 6228963, 3591317, 2214572, 3424393, 5032162, 4239075, 1509276, -151009, 650235, 2217620, 2562957, 1653277, 231962, -1680947, -3921062, -5271410, -4806418, -3273995, -2159963, -2238558]
6233b238558j433532k495882j961162Q33194L601132L158667J9628j949313r16795
6224c382621R05453J325837R31003N95834l51697j687503j263459J314776K957736
6215A345359J576101n29769n64101L25702j25931o98660R76851L469775L485047
6206I260374J577609J302746L103998L601074J220471j683455k985520l197039
6198A2200258k917377j666411l52767j207664l754982m280104j143673K433209
6190f89511K861307P42814j046391j336717o88745L27183Q97564K9749j439141
6181c41888j067885J312358K470332N08744j937521j728512Q7279N81544k30573
6172c46122k21187Q17185J384068J413617J956238K488980J559383m50341j869155
$$ y = [-2238558, -3672090, -6167972, -8129134, -7295940, -3694808, -536141, -516513, -2465826, -3382621, -2477168, -1151331, -220328, 375506, 23809, -1663694, -2927153, -1612377, 1345359, 2921460, 2391691, 1827590, 2153292, 2027361, 1328701, 2305552, 5775327, 9260374, 10837983, 12140729, 15244727, 18845801, 20066272, 18382817, 15397297, 12200258, 9282881, 7616470, 7263703, 6056039, 2301057, -1979047, -3122720, -689511, 2171796, 2914610, 1868219, 531502, -157243, 169940, 1067504, 1097253, -341888, -1409773, -97415, 2372917, 2881661, 944140, -784372, -697093, -115549, -346122, -567309, 249876, 1633944, 3047561, 5003799, 7492779, 9052162, 8601821, 6732666]
6163F732666k342745k379447j348750J210162L302482K642776L17410q47463o95608
6154F591483j099973j802328q66356J117467J442591n4261q60638m84925r23925
6145C059135k019600j153863J321604J314404k420899n599760m765147j948902
6137a2213028j98822J188909L476271M529020K304146p85660j327210l27395r83907
6128d337676l050821l606984j930679K55347K055897L371707L135381J157759
6120b950069M0891J480819K563431L3424l639175l503467l5713J773808N29623
6111c706428k57353J009403J928709J663748K570863M664537M261868M43890k589595
6102I989642k328059j750753l055707l016502R48335M836180L656778n57622k107155
$$ y = [6732666, 4389921, 2010474, 661724, 1871886, 5174368, 7817144, 8134554, 7287091, 6591483, 5491510, 3689182, 2822826, 3940293, 5382884, 5328623, 4467985, 3983060, 3059135, 1039535, -114328, 1207276, 2521680, 100781, -5498979, -10264126, -12213028, -12411850, -11222941, -7746670, -3217650, -913504, -1699164, -3026374, -3353769, -4337676, -7388497, -10995481, -12926160, -12670813, -10614916, -7243209, -4107828, -2950069, -2909178, -1428359, 1135072, 1168496, -2470679, -5974146, -6009859, -4236051, -3706428, -3963781, -2954378, -1025669, 638079, 3208942, 7873479, 12135347, 12579237, 9989642, 7661583, 5910830, 2855123, -161379, 786956, 5623136, 9279914, 8722292, 6615137]
6093F615137m76095J28874j400765j800947J71974J660098R45219Q2686P79967
6084F706148J447435K28185j861258k640746j666115p3010R57129P02831p56186
6075C044413k200973k564452k546043l273643l606305j194929L396933O214124
6067b730875M708678R96969j024646k39378J372331J726251N55927r30706j308874
6058C125677l49923M07999o29391k591097k767749m30983J623577P13609j889252
6049b787533k659967o75856J377512J199297j79515m79392L33041M59484l70728
6040c783657j61684J975712L583205J871396j943444l694857j724291J143898
6032b733722J936220J416572J833274K781188K035251m18141k073411j663760
$$ y = [6615137, 6139042, 6267916, 4867151, 3066204, 3238178, 4898276, 5843495, 5926181, 6706148, 8153583, 8381768, 6520510, 3879764, 2213649, 2140639, 3097768, 3800599, 3044413, 843440, -1721012, -4267055, -7540698, -11147003, -12341932, -8944999, -2730875, 1977803, 2974772, 1950126, 1710748, 3083079, 4809330, 5365257, 4434551, 3125677, 2775754, 3183753, 2554362, -36735, -2804484, -3235467, -1611890, -898281, -2787533, -5447500, -6123356, -4745844, -3546547, -3726062, -4205454, -3872413, -3412929, -3783657, -3945341, -1969629, 1613576, 3484972, 1541528, -2153329, -3877620, -2733722, -797502, 619070, 2452344, 5233532, 7268783, 6850642, 4777231, 3113471]
6024C113471o83479n94569p54540j58831N86102M65651M3967P12777K427234L440826
6014H598609K342547l35432k654888l083412j713002J24719J196319J124103J39811
6005E739374j122070j561602m77681J045599Q97401j061637k178238n90991J696661
5996B386816J340895j608813l775346k890448N6976K974474M697295M721269L139932
5987A1043050J278270M62997k6757j684189l507862k897131l27734K67890k616777
5978A991757n016563k884759J994015M557891L195226O53513o93542j037755q32372
5969A927411L37733J838768J651208p43456l002905k801584p70656P48808R63973
5960A49300J158866K204310K943526J733112j049695l068277k775588j165511
$$ y = [3113471, 2429992, 1835423, 1080883, 922052, 1508154, 1973805, 2017772, 2730549, 5157783, 8598609, 10941156, 10605724, 7950836, 4867424, 3154422, 3279141, 4475460, 5599563, 5739374, 4617304, 3055702, 2578021, 3623620, 4521021, 3459384, 1281146, 690155, 2386816, 3727711, 2118898, -1656448, -4546896, -4489920, -1515446, 3181849, 7903118, 11043050, 12321320, 12784317, 12757560, 11073371, 7565509, 4668378, 4340644, 4608534, 1991757, -3024806, -5909565, -3915550, 642341, 3837567, 4491080, 3797538, 2759783, 1927411, 2265144, 4103912, 5755120, 5011664, 2008759, -792825, -1563481, -814673, 149300, 1308166, 3512476, 6456002, 8189114, 7139419, 4071142, 1295554, 130043]
5952A30043o9544L60541J037525J474425K22149j968604k017342J080139L942293
5943D191625L018074n25680k662634k156461j442784k207810l154943k797289
5935g737902j756334r43117M01695L013879N347118N062162K282828l73158j034546
5926D262625m56088l48966j020098j438766r83593j86840J52873j53338q10342
5917i82533j386190j312003k45673J150072J563756Q06243L49416J122157J762730
5908B827975O41212j193149j262563M93559J703193J560047J867006L148041K886083
5899A2671404l57083l795176m091733k072696p59078m08040R91835L298331M014058
5890I491822K334234J681j977469m076197n320064l311767J516169M960057M232013
$$ y = [130043, 60499, 421040, 1458565, 2932990, 3155139, 1186535, -830807, 249332, 4191625, 7209699, 6684019, 4021385, 1864924, 422140, -1785670, -4940613, -7737902, -9494236, -10437353, -10035658, -7021779, -1674661, 3387501, 5670329, 5297171, 4262625, 3806537, 3457571, 2437473, 998707, 15114, -171726, -18853, -172191, -982533, -2368723, -3680726, -3926399, -2776327, -1212571, -406328, -56912, 1065245, 2827975, 3469187, 2276038, 1013475, 1507034, 3210227, 4770274, 6637280, 9785321, 12671404, 12314321, 8519145, 4427412, 2354716, 1595638, 1187598, 2179433, 5477764, 9491822, 11826056, 11827737, 9850268, 5774071, 454007, -2857760, -1341591, 3618466, 7850479]
5881G850479J411766k21641p03161j757688k897878k315674n08519J31266q90155
5872I8795j492591m31967R13674R26553J29967N6966Q39966J201052N47145J7651
5862B807211R97296K993463L771314J959401j100826k912374k788354k078690
5854C648441j665846r22370M22739J172710N37428l14892l5206O82248L47725
5845C872977o30314m64426J017802J872549Q93916p44116j470570j538619k084436
5836G24763k841471k250198J71434K680131L054296J039625j422684k276513j264961
5827b385578K72992J094347J125130R24617O01788k68424j645385k419779j408241
5818d108533R58609K603421K038532J54904j061457j126163j036690r45735J18402
$$ y = [7850479, 9262245, 9040604, 8337443, 6579755, 3681877, 1366203, 857684, 988950, 98795, -1393796, -1825763, -912089, 14464, 144431, 201397, 1041363, 2242415, 2789560, 2807211, 3804507, 6797970, 10569284, 12528685, 11427859, 8515485, 5727131, 3648441, 1982595, 1060225, 1482964, 2655674, 3193102, 2878210, 2843004, 3525252, 3872977, 3242663, 2778237, 3796039, 5668588, 6562504, 5818388, 4347818, 2809199, 724763, -2116708, -4366906, -4195472, -1515341, 1538955, 2578580, 1155896, -1120617, -2385578, -2112586, -1018239, 106891, 1031508, 1633296, 1364872, -280513, -2700292, -4108533, -3149924, -546503, 1492029, 1646933, 585476, -540687, -1577377, -2523112, -2404710]
5809b404710J777810J931348J74577p83949P25168K036996J70492k662674j821753
5800h56695K180930L759582O88347k434039j323041J767099K320936O21903L16397
5791G041419K022185K759159R72956j688702l444283l989745l098863o73364J605747
5782A506509J513595m44240j563363j037144p78580j633047j753266L2354J920957
5773b236225J950167R90709R79053J765429J771279P38441j68494n14965j119584
5764D155810k397122l383132k757247m37725J944152K335323N13278j246895p53665
5755b027223J071725J236565j136922l501418l438674j684755m15255j48751J2830
5746a0031878K95594L02649M66792J603564L191699L623389K261872K08013r45729
$$ y = [-2404710, -626900, 1304448, 1479025, 695076, 1420244, 3457240, 3627732, 965058, -856695, 1324235, 5083817, 5772164, 3338125, 2015084, 3782183, 6103119, 6725022, 7041419, 9063604, 11822763, 12795719, 11107017, 7662734, 3672989, 574126, -99238, 1506509, 3020104, 2575864, 1012501, -24643, -803223, -2436270, -4189536, -4157182, -2236225, -286058, 704651, 1683704, 3449133, 5220412, 5958853, 5790359, 5275394, 4155810, 1758688, -1624444, -4381691, -4819416, -2875264, -539941, -26663, -1273558, -2027223, -955498, 281067, -855855, -4357273, -7795947, -9480702, -9895957, -10044708, -10031878, -9736284, -9433635, -8966843, -7363279, -4171580, -548191, 1713681, 1921694, 975965]
5737I75965l83476J487920L014963K393058p4427j561938q3767K418618K390526
5728A0577442k44397j860322n09406J199933K38124k105251k270188j7186J167099
5719F175848o00648k785400k226112M98759K478019K736928K589460K330085M58843
5710A1655782l066409n249680l500196O56719L129201J958713j009577k806958
5702A767595k310241o03533N00190K05805m03042L76014K270957K826393Q69590
5693E499728j258940q67468J001628J329075n364n64837k63814j736350m939978
5684a806320n837279k671858N26619j4854j788921k86152L361379M139626J286926
5675c090834o44041J027092L717759M382554L393669K026499r2310k811291l836496
$$ y = [975965, 592489, 2080409, 5095372, 7488430, 7414003, 5852065, 5768298, 8186916, 10577442, 10333045, 8472723, 7963317, 9163250, 9401374, 7296123, 5025935, 5008749, 6175848, 5575200, 2789800, 563688, 1062447, 3540466, 6277394, 8866854, 11196939, 11655782, 8589373, 3339693, -160503, 496216, 3625417, 5584130, 4574553, 1767595, -542646, -1146179, -645989, -440184, -843226, -467212, 1803745, 4630138, 5499728, 4240788, 3373320, 4374948, 5704023, 5698659, 5133822, 4870008, 3133658, -1806320, -7643599, -10315457, -9788838, -9803692, -11592613, -11878765, -8517386, -4377760, -3090834, -3734875, -2707783, 1009976, 5392530, 8786199, 10812698, 10720388, 7909097, 4072601]
5666D072601j835428J013462J802325M87523j075015j819522j431294L84793K575558
5657D175003K600445j09328k342811j306039R93852N08007k904835n526565n194731
5648i107002l392386j905875n54634J073881K306200K794076L155240L386720
5640b243780K606367J133859P27058J663405J601208j127181m656908n724110
5632f020082l627722n11633J562806K333393K501646K490891K161474J195641
5624B086414j99322r81817l33796R68343J356219Q25881R80508K170665K443578
5615I316673N93879j513250j581468m49662n88599j866029j675157O26534K254606
5606E117527J038342j320987j663122M06730K423662K379704N64414j492323k492801
$$ y = [4072601, 2237173, 3250635, 5052960, 5540483, 4465468, 2645946, 1214652, 1599445, 4175003, 6775448, 6666120, 4323309, 3017270, 4011122, 4519129, 1614294, -3912271, -9107002, -12499388, -14405263, -14959897, -13886016, -11579816, -8785740, -5630500, -2243780, 362587, 1496446, 2223504, 3886909, 5488117, 4360936, -295972, -6020082, -9647804, -10159437, -8596631, -6263238, -3761592, -1270701, 890773, 2086414, 1887092, 905275, 571479, 1539822, 2896041, 3721922, 4702430, 6873095, 9316673, 9910552, 8397302, 6815834, 6366172, 5777573, 3911544, 2236387, 2862921, 5117527, 6155869, 4834882, 3171760, 3578490, 6002152, 8381856, 8946270, 7453947, 4961146]
5597D961146j896365k40846R08220L87029r31132r40029Q17657K140998J003057
5588F209735j396474j926606J76096J999189Q34439j949503k538146L18198L703093
5579E430021M193377J588194j651904l363533l115052j700974l55978P1240j7297
5570A078094M74502J367803R84246j104842k576858j400580Q39261J081571m94316
5561B48881q37760R04721J936502L76051j775636j951398o74760L09879J262576
5552b00944K987207L884027J844861j665097k830036q91951P80101k53653k151411
5543A503104j818642P95197K973380K530022k97385l242924l612202o41318L216741
5534A405973M638548L327458J816835J198174j93770k705443l222127K10340M133024
$$ y = [4961146, 3064781, 2823935, 3732155, 4119184, 3188052, 2248023, 3065680, 5206678, 6209735, 4813261, 2886655, 3062751, 5061940, 5896379, 3946876, 1408730, 1726928, 5430021, 9623398, 11211592, 9559688, 6196155, 3081103, 1380129, 1024151, 1095391, 1078094, 1552596, 2920399, 3904645, 2799803, 222945, -1177635, -338374, 743197, 248881, -588879, 315842, 2252344, 2628395, 852759, -1098639, -1773399, -1463520, -200944, 2786263, 6670290, 8515151, 6850054, 4020018, 3128067, 3908168, 3654515, 1503104, -315538, 479659, 3453039, 5983061, 5685676, 2442752, -1169450, -1810768, 1405973, 6044521, 9371979, 11188814, 12386988, 12193218, 9487775, 6265648, 6475988, 10609012]
5525A0609012L663140o50606l765747l327062j926079j946163k214067j184472
5517g42044J6507j18509p34552m52571J7139o41003j796133j968711j213945m00512
5507h034334O32881K103972K689959J248174q10817j247116k60932L95653O39963
5498b642597J453600J766935m42225l814570m186829n97312K747663K209623o14400
5489d120112k004175j155537L16040J515767K124827J059498j679547l252859
5481g196098j217944K459321L723071K006429K72157N967k02976r35894n93336
5472a679303J147069J898198K69766j782994k169732j711766j873337j784641
5464g686740j74001J533997J103091n66845n13261J552591K631270J047965j025027
$$ y = [10609012, 14272152, 13621546, 9855799, 6528737, 4602658, 2656495, 442428, -742044, -725537, -844046, -1578598, -2031169, -2014030, -2655033, -4451166, -6419877, -7633822, -8034334, -7401453, -5297481, -2607522, -1359348, -2170165, -3417281, -3678213, -3282560, -2642597, -1188997, 577938, 135713, -3678857, -7865686, -8462998, -5715335, -3505712, -4120112, -6124287, -7279824, -6963784, -5448017, -3323190, -2263692, -3943239, -7196098, -8414042, -5954721, -2231650, -225221, 46936, 52903, -150073, -1085967, -1679303, -532234, 1365964, 1635730, -147264, -2316996, -4028762, -5902099, -7686740, -7860741, -6326744, -5223653, -5790498, -6303759, -4751168, -2119898, -1071933, -2096960]
5455b096960q59806J057240K151957J374562j6982p05682p43176o40593l06948
5446g86388M57318J075383O53740p16956j807763j678811p28864J38771Q70684
5437b522886J958584L064235L039377J488289o33218k263851l186404l441379
5429b497253k856315j711089q41609l61349P13030K686213M068418L416614J460176
5420D076836N7999l11937n78782j100503j281929j005473q77736r85079q14931
5411b821535m67447m55727j94278J562138M265499N329157L334427O0094j842182
5402H770146j974612j699080j641686j381569r84307j011799j089799j70892J433598
5393B50000J802060k5298k296827k395969P3899K922135L841520K494344K29670
$$ y = [-2096960, -2956766, -1899526, 252431, 1626993, 1610011, 904329, 161153, -479440, -786388, -329070, 746313, 1400053, 683097, -1124666, -2803477, -3532341, -3393570, -2522886, -564302, 2499933, 5539310, 7027599, 6394381, 4130530, 944126, -2497253, -5353568, -7064657, -7906266, -8267615, -7554585, -4868372, -799954, 2616660, 4076836, 4134835, 3822898, 3244116, 2143613, 861684, -143789, -1021525, -2006604, -2821535, -3288982, -3744709, -3938987, -2376849, 1888650, 7217807, 10552234, 10612328, 8770146, 6795534, 5096454, 3454768, 2073199, 1088892, 77093, -1012706, -1183598, 250000, 2052060, 2026762, -270065, -2666034, -2592135, 330000, 4171520, 6665864, 6895534]
5384F895534j486888k052673j642977p23042K54703R02274R56428N41425L30847
5375C975631R95714K129753K102573k28498l600827n040060l066843L74735J945536
5366d12286N04845k083915l354327k400983J53314K986226M535523L873593J815619
5357E617609K78576l602j49239r88198j596593r97347P914K14179Q8374N77203
5347C048876P59965q80808l208268l240260o55422J258503L17314j432105j087529
5338e119734Q14742J834961J825104K557019L884660L551392J176557n85004r1567
5329I848130N84149j084466l900825m422745j822039J083414J690677N21979k88071
5320B210203J27801R26238J041476K21150r17682j291370l18666J084347J183206
$$ y = [6895534, 5408646, 3355973, 1712996, 989954, 1244657, 2146931, 3103359, 3644784, 3975631, 4971345, 7101098, 9203671, 8975173, 5374346, 334286, -2732557, -2357822, -412286, 92559, -1991356, -5345683, -7746666, -7593352, -4607126, -71603, 3801990, 5617609, 5896185, 5892583, 5743344, 4755146, 3158553, 2161206, 2169120, 2383299, 2471673, 3048876, 3808841, 2928033, -280235, -3520495, -4175917, -2917414, -2600100, -4032205, -5119734, -4304992, -2470031, -644927, 1912092, 5796752, 9348144, 10524701, 9939697, 9848130, 10432279, 9347813, 5446988, 1024243, -797796, 285618, 1976295, 2498274, 2210203, 2338004, 3264242, 4305718, 4526868, 3609186, 2317816, 1999150, 3083497, 4266703]
5311D266703l33598j616605j035542M72607O76362q16399k168419j949703o31331
5302c135925P87946K080908L051771K899527J383298l39446j093143j144600j291701
5293C198635j297685n01810N57197N62295o41031j754707j763451r49282p9784
5284b669623M74601O47695N30669N19075R56432J569757J860225J869949J729649
5275G488429P67230j553060l734230l055333P47803L985650K795736k115332o050162
5266g23269n627525k099312J015312K168186K449868K866286K767185J362255
5258D178986n92095j596525j138757K54063J923823K980310K186359l99084k287057
5249E510023j239937J085969Q11384k361469m008006j160558L196109M258628
$$ y = [4266703, 3933105, 2316500, 1280958, 1753565, 2429927, 1613528, -554891, -2504594, -3135925, -2347979, -267071, 2784700, 5684227, 7067525, 6728079, 5634936, 4490336, 3198635, 1900950, 1399140, 1956337, 2518632, 1877601, 122894, -1640557, -2589839, -2669623, -2195022, -1547327, -1016658, -497583, 458849, 2028606, 3888831, 5758780, 7488429, 8255659, 6702599, 2968369, -86964, 660839, 4646489, 7442225, 5326893, -723269, -6350794, -8450106, -7434794, -5266608, -2816740, 49546, 2816731, 4178986, 3586891, 1990366, 851609, 1105672, 3029495, 6009805, 8196164, 7797080, 5510023, 4270086, 5356055, 6167439, 3805970, -202036, -1362594, 1833515, 6092143]
5241F092143J803101n32474p19127K64229J448351K627139K437817n08782m104234
5232H808163l993967L97733M219236L222615j153424m487267m789027l133747
5224i09685q75558J254215K304973J604857j32729j471681j661317p56373P28102
5215H4804J656183J013541m93917j022657m12725m95086j643503j490387J099428
5206a704319L195530J661977j938699l437200j881144R1433J061171K296506M102013
5197C447268M338638J985221o97432j402435r67164j294576j875648q85065J196801
5188C845608J693294m48836l087307l764382k543051j125501m90900n26826r11239
5179g359140r66731M47884L101948M165137J331485k856493k922647K172235O729788
$$ y = [6092143, 7895244, 7362770, 6643643, 6907872, 8356223, 10983362, 13421179, 12912397, 8808163, 4814196, 5211929, 9431165, 12653780, 11500356, 7013089, 2224062, -909685, -1785243, -531028, 1773945, 3378802, 3246073, 1774392, 113075, -643298, 84804, 1740987, 2754528, 2260611, 1237954, 825229, 330143, -1313360, -2803747, -1704319, 1491211, 3153188, 1214489, -2222711, -4103855, -4012422, -2951251, -654745, 3447268, 7785906, 9771127, 9073695, 7671260, 6704096, 5409520, 3533872, 2648807, 3845608, 5538902, 5090066, 2002759, -1761623, -4304674, -5430175, -5921075, -6447901, -7359140, -8325871, -7877987, -4776039, -610902, 720583, -2135910, -5058557, -2886322, 3843466]
5170C843466N619619R92837j560040j075673r77550k211721j995009L33670J463226
5161D432825l06857k180888j747499o84809r82178j202890L55742K023616J727449
5152A434511Q19254J324897J848360J42316k284106k310085m78874P9856r88583
5143d12454j156078K45671J191730P92818K91485J56351m16514r93971j58610
5134d59572J592176K296709J883910J962312K425084J691706K55635K30844J147018
5125A3025822J98252k676426m056790k479274n74929k98920m7055J463680K275602
5116F829962P41859j284014j601528j178140j669293k004396n41146J460879J646925
5107B401108K51160q88424j469060j960516j164808K106432N715808N972875K704921
$$ y = [3843466, 9463085, 10455922, 8895882, 7820209, 6842659, 4630938, 2635929, 2969599, 4432825, 4125968, 1945080, 197581, -487228, -1469406, -2672296, -2316554, -292938, 1434511, 2253765, 3578662, 5427022, 5569338, 3285232, 975147, 496273, 576129, -412454, -1568532, -1322861, -131131, 661687, 953172, 1109523, 693009, -300962, -459572, 1132604, 3429313, 5313223, 7275535, 9700619, 11392325, 11647960, 11878804, 13025822, 13224074, 10547648, 6490858, 4011584, 3436655, 3137735, 3090680, 4554360, 6829962, 7571821, 6287807, 4686279, 3508139, 1838846, -165550, -706696, 754183, 2401108, 2652268, 1763844, 294784, -1665732, -2830540, -724108, 4991700, 10964575, 13669496]
5098A3669496m53778j221678j301327k833402m627564l868140m95516K120330
5090I88421J187186k015902l617260j791954J296459K575642J716434N14164j54220
5081F98970p58697j123931l60927J127347J732706J075604M04012L25187K40428
5072C360699K70955J271400K349657J070281k708371n648455n025782j913674
5064f973290J056859K916983L747359L006600N88185j865657k582236j674635
5056a779832l63620O66063J223065J298036J537537K466240K818239Q25616k331799
5047F359545l210666j249984l6867j778251l795445k863686K9103K047385K777175
5038a721691K961603J660713j547201l675822j842315J684801K133769q13142
$$ y = [13669496, 13215718, 11994040, 10692713, 7859311, 3231747, -636393, -1131909, 988421, 2175607, 159705, -3457555, -5249509, -3953050, -1377408, 339026, 853190, 698970, -59727, -1183658, -1544585, -417238, 1315468, 2391072, 2795084, 3120271, 3360699, 3631654, 4903054, 7252711, 8322992, 5614621, -33834, -5059616, -6973290, -5916431, -2999448, 747911, 3754511, 4342696, 2477039, -105197, -1779832, -2143452, -1477389, -254324, 1043712, 2581249, 5047489, 7865728, 8691344, 6359545, 3148879, 1898895, 1862028, 83777, -3711668, -6575354, -6546251, -4498866, -1721691, 1239912, 2900625, 1353424, -2322398, -4164713, -2479912, -346143, -1159285]
5030a159285k786831j282130J443401K453306J678264N03139l75498o10601J49892
5021A3657J337285J726596J139583N47564L61444O1308m47966o13625m56135o16373
5011C053338j051314r13336J06844J298937J912169J914474J746390J687054J371751
5002A1126307J11333j745047k415020j056687K16250r69420l048168k262210J279639
4993A236977L199731J482880o91618n38170K38702m43412j082607j86853P4870
4984C290500k082137l764185j697976J986147K958724J315618L17310O57979P73957
4975C755937R19255K028783K280804j99389k867586k166857K24137Q4619j903916
4966B155787j516400J199943K011311J74087o20226N63929M64586j393209r16617
$$ y = [-1159285, -3946116, -5228246, -3784845, -1331539, 346725, 849864, 474366, -136235, 13657, 1350942, 3077538, 4217121, 4764685, 5126129, 5187437, 4739471, 4125846, 3669711, 3053338, 2002024, 1088688, 1195532, 2494469, 4406638, 6321112, 8067502, 9754556, 11126307, 11237640, 9492593, 7077573, 6020886, 6237136, 5267716, 2219548, -42662, 1236977, 4436708, 5919588, 5227970, 4689800, 4928502, 4485090, 3402483, 3215630, 3290500, 1208363, -2555822, -4253798, -2267651, 691073, 2006691, 2324001, 2981980, 3755937, 4675192, 6703975, 8984779, 8785390, 5917804, 3750947, 3975084, 4059703, 2155787, 639387, 1839330, 3850641, 4024728, 3404502, 3968431, 4433017, 3039808, 2123191]
4957B123191L044116N416747K344150k892471m744715k525172L41738J296168
4949D403752K85417j403570k098484j120755J50752L18583M98359K158329L537290
4940F729673K029013p39849p85229J685919K549342O37304q04917m9463Q54540
4931A2106333O22470N69036Q39997m27196l042812m321590l561226k618267j683374
4922a516629P08527L241997K677593m47913k290446k034891k112244k229299K97405
4913c705900M017179M160779O73138j594034j301550j742134l011238j399022
4905c902782K352573L002904M83987M09385L235795K903347j348492k380219K369523
4896G126021O372104N593951L875678L171996j2607m530148l468474K406087L514300
$$ y = [2123191, 5167307, 10584054, 12928204, 10035733, 5291018, 2765846, 3107584, 4403752, 4689169, 3285599, 1187115, 66360, 217112, 535695, 1034054, 3192383, 6729673, 8758686, 8018837, 7233608, 8919527, 11468869, 12106173, 11301256, 11251793, 12106333, 12728803, 13297839, 14137836, 13710640, 10667828, 6346238, 2785012, 166745, -1516629, -808102, 2433895, 5111488, 4663575, 2373129, 338238, -1774006, -4003305, -3705900, 311279, 4472058, 5145196, 3551162, 2249612, 507478, -2503760, -3902782, -1550209, 1452695, 1936682, 2346067, 5581862, 8485209, 7136717, 4756498, 7126021, 13498125, 19092076, 22967754, 26139750, 26127143, 21596995, 18128521, 20534608, 24048908]
4887B4048908j459459k364489L116880M253074j549523j886502O806376J0290879
4879D1256144L786901L659638J5373705J8214882O071511J1379174N0071272P0977133
4871B20790360J5174406q5914385j32798260q5032247r220489J8394664L517899
4864e5088052l823836P917470J3000006M560009J066332O916181P010662j497582
4856a9938810m515135J399603L941306p57859k497993K040239L848293J58918
4848a6321438n82508M046794N445273K80119l694579k219732p73173k231621j646183
4839a7697048K458201M102031J489950P60303L744990L678452j892067n281117
4831h636305j743241K113299j13565l940074k521899J887932L017817J101932
$$ y = [24048908, 22589449, 20224960, 23341840, 27594914, 26045391, 24158889, 30965265, 41256144, 45043045, 48702683, 64076388, 82291270, 88362781, 99741955, 149813227, 220790360, 235964766, 150050381, 17252121, -67780126, -77000615, -58605951, -55088052, -58911888, -50994418, -37994412, -33434403, -32368071, -25451890, -18441228, -19938810, -24453945, -23054342, -19113036, -19870895, -22368888, -20328649, -16480356, -16321438, -16903946, -12857152, -7411879, -7131760, -10826339, -13046071, -13819244, -16050865, -17697048, -15238847, -11136816, -9646866, -8886563, -5141573, -1463121, -3355188, -8636305, -10379546, -8266247, -8379812, -12319886, -14841785, -12953853, -9936036, -8834104]
4823h834104M78591J090881k26790k869289l357426j433242k3564j54302m7208
4814a5376453J276860K577152K427956R62892k18511M45560K304447K584288K98896
4805b716913j477828m7354K128697J178100j432184j252105J159469R38038k356885
4796c878965l426829P1943L899809M306070K749720J176777j497198n094652n896432
4787g589757k432812J110973J088366k01464Q56300L086338L249924J606116M77426
4778A251410j53840j510458k525962j404119P27470J142417m59824j949357j847859
4769f730122k96021J890969L300778K424561k28133j962044j296282J49865M94033
4760b252396K47618N45939Q40379K54327n41810o10101l47372l47348k88887j78968
$$ y = [-8834104, -8355513, -7264632, -7491422, -10360711, -13718137, -15151379, -15174943, -15329245, -15376453, -14099593, -11522441, -9094485, -8131593, -8350104, -7904544, -5600097, -3015809, -2716913, -4194741, -4242095, -2113398, -935298, -2367482, -3619587, -2460118, -1522080, -3878965, -7305794, -7233851, -3334042, 972028, 3721748, 4898525, 3401327, -1693325, -7589757, -10022569, -8911596, -7823230, -8024694, -7168394, -4082056, -832132, 773984, 1251410, 1097570, -412888, -2938850, -4342969, -3615499, -2473082, -2932906, -4882263, -6730122, -7026143, -5135174, -1834396, 590165, 362032, -1600012, -2896294, -2746429, -2252396, -2004778, -1458839, -618460, -364133, -905943, -1516044, -1863416, -2210764, -2499651, -2678619]
4750b678619q50859k062564k144725p11860M71414M76555O09315J547455J781933
4741c561955N58558k75091P11247K041979J757198J35112j587247k808781k507846
4732e536826L77615L771705L157641k001640n941610l908887J251220L490367
4724e340415J839446O5981P6279L14083j29996j52444N67318Q47525L34320j01569
4714a679472k40711m44121j13877J335372K420501J101478j851189l483005k628205
4705e583229r59870j4325N91843J587764K564458K698875J841852N96530l5795
4696C288103O08607J848953K074412Q06243o63942j327907j673094j989631j385167
4687A586577J47253P26581m95894j396102j11360J640271J155267q67391j520732
$$ y = [-2678619, -3529478, -5592042, -7736767, -8448627, -7977213, -7500658, -6891343, -5343888, -3561955, -3003397, -3278488, -2567241, -525262, 1231936, 1367048, -220199, -3028980, -5536826, -5159211, -1387506, 1770135, -231505, -6173115, -10082002, -8830782, -5340415, -3500969, -3434988, -3358709, -3044626, -3174622, -3327066, -2759748, -1912223, -1577903, -1679472, -1920183, -2364304, -2478181, -1142809, 1277692, 2379170, 527981, -2955024, -5583229, -6543099, -6557424, -5965581, -4377817, -1813359, 885516, 2727368, 3323898, 3288103, 3896710, 5745663, 7820075, 8626318, 7962376, 6634469, 4961375, 2971744, 1586577, 1733830, 2460411, 1964517, 568415, 457055, 2097326, 3252593, 2385202, 864470]
4678H64470k54667P48528J96193j080448k150170k691768j989932K98288K503936
4669c555570K340119p8811k461323l245338k494027n71091J954037L596714L253947
4660a261343J812043P35069m1896r52398r90473M22306J292463o9326j428317
4651d81872K92184L352093L178476k30642j900367K69999K278827O57141k243937
4642E171902k631304j235172j204894k613230k907298j344026N63525K144362
4634d056135L776707M367415J950672k653903n585859m552446j641174r8798N138
4625h488383Q40054K494435K368606m80777k912609j699997J574897K502526K58018
4616c543230j291325M38345L094716L538014K497794K267931K334896R13814r27223
$$ y = [864470, 609803, 1358331, 1554524, 474076, -1676094, -4367862, -6357794, -6059506, -3555570, -1215451, -1294262, -3755585, -7000923, -9494950, -10066041, -8112004, -4515290, -1261343, 550700, 1285769, 1243873, 291475, -698998, -276692, 1015771, 946445, -481872, -189688, 3162405, 6340881, 6110239, 4209872, 4479871, 6758698, 7415839, 5171902, 2540598, 1305426, 100532, -2512698, -5419996, -6764022, -6200497, -4056135, -279428, 4087987, 6038659, 3384756, -2201103, -6753549, -8394723, -8493521, -8488383, -7648329, -5153894, -2785288, -3266065, -6178674, -7878671, -6303774, -3801248, -3543230, -4834555, -4396210, -1301494, 2236520, 4734314, 7002245, 9337141, 10250955, 9323732]
4607I323732p17360P76189M84871j668995k583629j388154q31325k220507k983757
4598a808935j070206J646371K508552J808757J232684R97328O36472M72192L27997
4589F751212j109172l702212m844900l147775r28816o55835j128209k4347J790019
4580g000035J889302P49617Q76408K214785K168258J80289j222247n40922O49095
4571c5450O86180J09185j87605n99976j203445p15065J203182K435396J212676
4562B905078r21860j129020N51723J314194l03312k590309l382003k689513j636889
4553g881911l45928J533714L060666K663862N81039j013574q29583k4410j48435
4544b404560p95907n29882P96148K112525K893353L232151K596649M19057k062738
$$ y = [9323732, 8606372, 9382561, 9867432, 8198437, 5614808, 4226654, 3395329, 1174822, -1808935, -2879141, -1232770, 1275782, 3084539, 4317223, 5314551, 5951023, 6423215, 6751212, 5642040, 1939828, -2905072, -6052847, -6981663, -7637498, -8765707, -8790054, -7000035, -5110733, -4361116, -3484708, -1269923, 898335, 1078624, -143623, -684545, -35450, 650730, 759915, 572310, -27666, -1231111, -1946176, -742994, 1692402, 2905078, 1983218, 854198, 1405921, 2720115, 2416803, -173506, -3555509, -6245022, -7881911, -8227839, -6694125, -3633459, -969597, -388558, -1402132, -2231715, -2256125, -2404560, -3200467, -3730349, -2934201, -821676, 2071677, 5303828, 7900477, 8319534, 6256796]
4535F256796k584938j004423K24851m33065j433804p74588Q45759J224570p4550
4526B246608j491521j886918j425912l73336J251042K746106K982637J929019
4518E977725P65734J68739m52337j601707k567768k303246q73669N49712R18038
4509E81221K35522n96203p77994n11788o54675j308712j351507Q009J790506K384379
4499b01242J753470J192807R56973k19775k658069m368851l417406o40675J441093
4490f161675J841101J736865K162531K684368K573988J833166N62464j366909
4482E865899l312940l759463k167025M6898J323879J758692K016984J660126J59787
4473C592837j382438j534740r48615j260764j958570r58074J544592K671679J168405
$$ y = [6256796, 3671858, 2667435, 2892286, 2459221, 1025417, 250829, 1096588, 2321158, 2246608, 755087, -1131831, -2557743, -2931079, -1680037, 1066069, 4048706, 5977725, 6743459, 6912198, 6459861, 4858154, 2290386, -12860, -886529, -336817, 581221, 816743, 220540, -557454, -1069242, -1723917, -3032629, -4384136, -4376127, -2585621, -201242, 1552228, 2745035, 3702008, 3482233, 824164, -3544687, -6962093, -7602768, -6161675, -4320574, -2583709, -421178, 2263190, 4837178, 6670344, 7232808, 5865899, 2552959, -1206504, -3373529, -3326631, -2002752, -244060, 1772924, 3433050, 3592837, 2210399, 675659, -272956, -1533720, -3492290, -4450364, -2905772, -234093, 934312]
4464I34312o38214n26629N86332J046526J333969K206484K260879K28634k041471
4455E390822k003745n05637k64672j354504j679407j150502j532671k397382j350885
4446f848583J302644K296703P97002j13093J045884J364186j182682l554154k209439
4437g101532J207200K704233K193831K575415L954846L389831K87098k176580
4429G034342j941330r93445j974515m310608n285139l483988n1762K554350K654576
4420e797519J097072O71306K481831L709041J306722k673643k925918J364545
4412g66563M492247K033682k749437l635002q7545L007551K989622K065025K039356
4403I388936J183115j611267l467019j658037J426587J337887j637808k780319
$$ y = [934312, 296098, -230531, 355801, 1402327, 2736296, 4942780, 7203659, 7432293, 5390822, 3387077, 2881440, 2616768, 1262264, -417143, -1567645, -3100316, -5497698, -6848583, -5545939, -3249236, -2452234, -2565327, -1519443, -155257, -1337939, -4892093, -7101532, -5894332, -3190099, -996268, 1579147, 5533993, 8923824, 9210922, 7034342, 5093012, 4099567, 2125052, -2185556, -7470695, -10954683, -11006445, -8452095, -5797519, -4700447, -4029141, -1547310, 2161731, 3468453, 794810, -2131108, -766563, 3725684, 5759366, 3009929, -625073, -712618, 2294933, 5284555, 7349580, 9388936, 10572051, 8960784, 5493765, 3835728, 5262315, 6600202, 4962394, 2182075]
4395B182075n3018K939934K307824j034588l550537l800452k582024l57570K473053
4386a475303L808752J593917k592926m459340k234991J157916K055530L05718
4378a840727j564017j827261o93788R76525K387728K545363P64774k184681m197292
4369e633376l522669k17184L999284O982249P294337M747783N79050k842867l404958
4360G981649j288360P74315M11392j453889k045905r40408n41749j756788k011533
4351h71276M97037L071480K001138j853037m279195l554450j603287J41797K208102
4342d241691M144659L925666J413008p68960j076056r00769j420046j579339o78100
4333a181628j9878k64232J3265J233514J230915r44994k497644r22906J924074
$$ y = [2182075, 2129057, 5068991, 7376815, 6342227, 2791690, -1008762, -3590786, -3948356, -1475303, 2333449, 3927366, 1334440, -3124900, -5359891, -4201975, -2146445, -1840727, -3404744, -5232005, -5925793, -4949268, -2561540, -16177, 748597, -1436084, -5633376, -9156045, -9373229, -5373945, 1608304, 8902641, 13650424, 14229474, 11386607, 7981649, 6693289, 7467604, 7878996, 6425107, 4379202, 3438794, 2897045, 1140257, -871276, -374239, 2697241, 4698379, 2845342, -1433853, -4988303, -6591590, -6449793, -4241691, -97032, 3828634, 5241642, 4472682, 3396626, 2495857, 1075811, -503528, -1181628, -1201506, -1465738, -1452473, -218959, 1011956, 66962, -2430682, -3353588, -1429514]
4324a429514K785646J744588Q12756m1957j758586k815609j111920J768637K200640
4315B154681q0789k068307k584826l188487l933116k664690M71237K037438N80367
4306i276492q23286M39562K293929J628062n19465q99149N29736Q49320p48511
4297f526294j769289p71301K81368n34673j782237r97929J202313K078288J346507
4288g473247J762379M281217N573156K701376j774942k718230L73006K786937
4280E511652J559201q43856j297084p81542j615163k825980j936469L69473J205214
4271f54554L26273K75158J723056K247590M65461j780271k567483k484655k467402
4262d916827j449440J536631M447498M101684O93224j924152j177675P96849K58596
$$ y = [-1429514, 1356132, 3100720, 3913476, 3871519, 2112933, -702676, -1814596, -45959, 2154681, 2073892, 5585, -2579241, -5767728, -9700844, -12365534, -11894297, -9856859, -9276492, -10099778, -9660216, -7366287, -5738225, -6257690, -7156839, -6627103, -5777783, -6526294, -8295583, -9066884, -8785516, -9320189, -11102426, -12100355, -10898042, -8819754, -7473247, -5710868, -1429651, 4143505, 6844881, 5069939, 2351709, 2724715, 5511652, 7070853, 6226997, 4929913, 4148371, 2533208, -292772, -2229241, -1859768, -654554, -328281, -53123, 1669933, 3917523, 4382984, 2602713, 35230, -2449425, -4916827, -6366267, -4829636, -382138, 3719546, 4412770, 2488618, 1310943, 2107792, 2366388]
4253B366388k567655l472809l92110K995948K104975j779619l018368L35733L797943
4244C70426K848635j346499m470995m355718j546895K614005N784915N009097
4236D906971M50264l216672k245935J174517K462286J122093j1986j41662p37079
4227C762797j555341r39692M23002L51309n39032L16732K454894K684389N03161
4218G462219j236640j399082j709802k288136r22224K065464L062379Q76175j353758
4209D556595j591903j540673k002384p75150K193156K812411l98486k515695L77856
4200A115727M400825L766961j59877j702275k34415j99329k774044l954438j613171
4191a354036J017050O17699j642857k819578k345659j450006o89929Q291K98576
$$ y = [2366388, -201267, -3674076, -4066186, -1070238, 1034737, -744882, -3763250, -3427517, 370426, 3219061, 1872562, -2598433, -6954151, -8501046, -5887041, -102126, 4906971, 5357235, 2140563, -105372, 1069145, 3531431, 4653524, 4641538, 4499876, 3762797, 2207456, 1267764, 1690766, 2042075, 1503043, 1819775, 4274669, 6959058, 7462219, 6225579, 4826497, 3116695, 828559, -93665, 1971799, 5034178, 5910353, 4556595, 2964692, 1424019, -578365, -1353515, 839641, 3652052, 3253566, 737871, 1115727, 5516552, 9283513, 9123636, 7421361, 7186946, 6987617, 4213573, 259135, -1354036, -336986, 280713, -1362144, -4181722, -6527381, -7977387, -8667316, -8659025, -8360449]
4182h360449l3706l43496Q227P21626J174112J344096J516350J529139R34448
4173a509653j72874r48868p33592m0558l1370q30672j167995k12754J160320J671086
4163b816930J085444m55279k881517m687059l226244J303933M564614L625542
4155c487496J211794Q43555R49274j135435k711989k52491K507192r0001m275397
4146f440994k127085K312521l423614j7061545j8129931K694791K4994428K3828137
4138F646708L495958j0619784p657106k80598R5728j952998K32918L089547K001714
4129d947913O71312L022118M853958J629058k628781k001011J513955K297986
4121D410682N91150M28464J593581O32742k237366l389868j734841N40328K050902
$$ y = [-8360449, -8394155, -8737651, -8729424, -8007798, -6833686, -5489590, -3973240, -2444101, -1509653, -1682527, -2631395, -3364987, -3405545, -3436915, -4267587, -5435582, -5648336, -4488016, -2816930, -1731486, -2186765, -5068282, -9755341, -12981585, -11677652, -7113038, -3487496, -2275702, -1432147, -482873, -1618308, -4330297, -4582788, -2075596, -2165597, -6440994, -8568079, -6255558, -9679172, -26740717, -44870648, -42175857, -17181429, 6646708, 10142666, -477118, -8134224, -8414822, -8319094, -10272092, -10039174, -6949627, -4947913, -4276601, -1254483, 3599475, 5228533, 2599752, 598741, 2112696, 4410682, 5001832, 5430296, 7023877, 7656619, 5419253, 2029385, 294544, 834872, 2885774]
4112B885774K831801K134244m42595k693135k254738l67385l5580j452020k230709
4103a624343j301460J58906R89724J046978O79353P35839J871066K745330J000147
4094F301540k704164m403610k387952O4842j33645j319325p91050K45007n39761
4085e668118j655642k83804K261239K407712M41918j10173J334837J635363m78097
4076a14765k431902k232321j058986l92905J42175Q66658Q06183l27047j147448
4067e890358o82737L70754J160991J669846J742418R77501l0402k12854p9998
4058i74839j204251l258894l797013j766569Q33510J871864J815143K220372K999974
4049a260703K808270J374550j0405k16231M18037O32698k50458j554134k099882
$$ y = [2885774, 5717575, 7851819, 7409224, 4716089, 2461351, 2093966, 2058386, 606366, -1624343, -2925803, -2766897, -1777173, -730195, -50842, 684997, 2556063, 5301393, 6301540, 3597376, -806234, -3194186, -3129344, -3262989, -4582314, -5373364, -5128357, -5668118, -7323760, -7607564, -5346325, -2938613, -2496695, -2606868, -1272031, 363332, -114765, -2546667, -4778988, -5837974, -6230879, -6088704, -5222046, -4415863, -4742910, -5890358, -6573095, -6202341, -5041350, -3371504, -1629086, -651585, -681987, -894841, -974839, -2179090, -5437984, -9234997, -11001566, -10168056, -8296192, -6481049, -4260677, -1260703, 1547567, 2922117, 2911712, 2695481, 3113518, 3746216, 3495758, 1941624, -158258]
4040a58258j749822j518976j928927k059975q34971J485100L726325M904034M265042
4031F129572J427326k386313m362194k853698N57080L024325L611228L149013
4023H296339K065211L38807j081561j008934k7452J12587r22561j765727j579519
4014D427190q91889k45207K69477P4313j500068l523217l803817j577818J274364
4005e496672K238198O66932j840094k865809j199503J740697K905892R68642j920731
3996d802448k833991j652682l62509L81523J687742L549034L927711J538417j984765
3987e51968l589358j808970J897025M264857L142909L0748j213580P61825K725724
3978E659212J470160j267499j523242M82659P13126j920703l585559j761010N65079
$$ y = [-158258, -1908080, -3427056, -5355983, -7415958, -8250929, -6765829, -3039504, 1864530, 6129572, 7556898, 5170585, 808391, -2045307, -1488227, 1536098, 5147326, 8296339, 10361550, 10700357, 9618796, 8609862, 8582410, 8694997, 7772436, 6006709, 4427190, 3535301, 3290094, 3559571, 3633884, 2133816, -1389401, -5193218, -6771036, -5496672, -3258474, -2591542, -4431636, -7297445, -8496948, -6756251, -3850359, -2881717, -4802448, -7636439, -9289121, -9651630, -9270107, -7582365, -4033331, -105620, 1432797, -551968, -4141326, -5950296, -4053271, 211586, 3354495, 3385243, 2171663, 2933488, 5659212, 7129372, 5861873, 4338631, 4821290, 5534416, 3613713, 28154, -1732856, -1167777]
3969a167777l60631l075275l097693L92066L437549K723725m68310k376412j281917
3960e274675J049720K032646J525457J620889L078366L503937P07034l269876
3952D973498m192485j564712N42714o26490k874018k942574j260395k89988k24231
3943h458681O15143K162915K479209J132053Q8078O70170J603919J034310p27822
3934E99294j511718m736K463897L150680J024226j761757k302648n60348P96076
3925A892966K07494r39682r55778l57958l85241p25812n44635m42387j320860
3916c571893k240654j591479J53682R64165K19533q37424j347914j478270r99837
3907a0730091M99636J891267J417725j95403o5216K421893L996069J979759j690193
$$ y = [-1167777, -1528408, -4603683, -7701376, -7309310, -3871761, -1148036, -1616346, -3992758, -5274675, -4224955, -2192309, -666852, 954037, 4032403, 7536340, 8243374, 4973498, 781013, -783699, -240985, -867475, -3741493, -6684067, -7944462, -8234450, -8458681, -7843538, -5680623, -3201414, -2069361, -1981283, -1311113, 292806, 1327116, 599294, -912424, -917160, 1546737, 4697417, 5721643, 3959886, 1657238, 1096890, 1892966, 2100460, 1160778, 205000, -152958, -538199, -1264011, -1808646, -2251033, -3571893, -5812547, -7404026, -7250344, -6286179, -6066646, -6904070, -8251984, -9730254, -10730091, -10230455, -8339188, -6921463, -7116866, -7182082, -4760189, -764120, 1215639, -474554]
3898d74554l060303j339937Q06097J226993K18293j070692j857358j330019Q06472
3889f075008K975042K864119O13837q91993J52552J975640J793303m64391k487035
3880D56066k688735j446764O5425P47409j62892k061078k636885l67972K863912
3871e231514L679137J828841O33575K118572M090135L562042J082421n54023o41800
3862A0567386j056705k710236l922694l000105q04597K96519o43223k063165j658563
3853d995383J002420L741191L961313J574882r50692j651524j106065q08177p87565
3844a9600j89048O74262N80404n47323j438881j423881j192307j298853j124345
3835e979572J7848J452493J578006k01722k217719j761278J741410N183093M873558
$$ y = [-474554, -3534857, -4874794, -4068697, -2841704, -2623411, -3694103, -5551461, -6881480, -6075008, -3099966, -235847, 377990, -514003, -361451, 1614189, 3407492, 2943101, 456066, -2232669, -3679433, -3614008, -2866599, -3029491, -5090569, -7727454, -8095426, -5231514, -1552377, 276464, 910039, 3028611, 7118746, 10680788, 11763209, 11209186, 10567386, 9510681, 6800445, 2877751, -122354, -926951, -630432, -1273655, -3336820, -4995383, -3992963, -251772, 3709541, 5284423, 4333731, 2682207, 1576142, 767965, -19600, -208648, 465614, 1046018, 498695, -940186, -2364067, -3556374, -4855227, -5979572, -5961724, -4509231, -2931225, -3132947, -5350666, -7111944, -5370534, -187441, 4686117]
3826D686117J318610j030849M09915K995995K857465Q7680k421708l465164l799453
3817A638608l222704r07397J779830K255957O54358l90993q5298k69553j447491
3808E317j638778k23682O81373K17735N64317K623126L434586Q09660k444619
3799D029035k412566R3671J325077N40469J28177P06455K95097j547817k643467
3790E14131k074840j760771k802978l220898j278570J184759J101522j454831
3782i792476l496343l089812j080575R57396K528657L536777L462315K242125
3774d731936R39086M42755K54407k46369j01767J838866M138048L771103N51070
3765F855263j894579j078682O69138k08136l055540m184286k428963k02693O60687
$$ y = [4686117, 6004727, 4973878, 5383793, 8379788, 11237253, 11324933, 8903225, 5438061, 1638608, -1584096, -2491493, -711663, 1544294, 2198652, 1807659, 1722361, 1452808, 5317, -1633461, -1857143, -1175770, -958035, -393718, 2229408, 5663994, 6473654, 4029035, 1616469, 1710140, 3035217, 3575686, 3703863, 4410318, 4705415, 3157598, 514131, -1560709, -3321480, -6124458, -9345356, -10623926, -9439167, -8337645, -9792476, -13288819, -16378631, -17459206, -16501810, -13973153, -10436376, -6974061, -4731936, -3792850, -3350095, -3095688, -3342057, -3443824, -1604958, 2533090, 6304193, 6855263, 4960684, 3882002, 4551140, 4343004, 1287464, -2896822, -5325785, -5528478, -4867791]
3756d867791P54835N82633m31598j615611r32866J538785K870558J485035n55677
3747a171697j028112o70878r46419j163124q5571J584899K530958K872199K930783
3738D853038J850622m37625j815457r01062M37504l8802j379660j508968j032452
3729B7138j709391k554957j207571J495542K111350j43626k198957j840209n47459
3720f568140n42356j515333j721219o22615R01054J957550K258947J887434J065211
3711b899467R6235m43992K88915K256252L421931J581142k071205l391354o42617
3702a804160K872453L442208J872705J168791J438180N28293j637862l030815
3694D849793l195650l515092m006263l078580o09852J570834K446043K589196
$$ y = [-4867791, -4112956, -3530323, -3961921, -5577532, -6510398, -4971613, -2101055, -616020, -1171697, -2199809, -2870687, -3817106, -4980230, -5065801, -3480902, -949944, 1922255, 4853038, 6703660, 6266035, 4450578, 3549516, 3987020, 3948218, 2568558, 1059590, 27138, -1682253, -4237210, -5444781, -3949239, -1837889, -1981515, -4180472, -6020681, -6568140, -7110496, -8625829, -10347048, -10969663, -10068609, -8111059, -5852112, -3964678, -2899467, -2803232, -3247224, -2958309, -702057, 2719874, 4301016, 2229811, -1161543, -1804160, 1068293, 4510501, 6383206, 7551997, 8990177, 9518470, 7880608, 4849793, 1654143, -1860949, -5867212, -8945792, -9555644, -7984810, -5538767, -2949571]
3686b949571K264778J200625Q6172j07530k4949q41815j901524j876087j324254
3677e474155j280607n33927K208028M597037L247502o09552k499480j396634l97340
3668b139128q19441p10893L74839M67506r6881J362071L850273K684733k252774
3659B720305m469397n19762M121634L281786j003020k984574k144862j765314
3651b763204k029076q59284O22567l06298k233832j392277J474035J743600j475857
3642g219626l745399k130763J130664L093300L996281M883898M801765K583436
3634G393556p84083l302216l966169k745035k02738K122161K533060J094056m52774
3625A689818r26451o04940L6048Q81697J373552P35767o83155j531778j087515
$$ y = [-2949571, -684793, 515832, 602004, 494474, 469525, -372290, -2273814, -4149901, -5474155, -6754762, -7288689, -5080661, -483624, 2763878, 2154326, -345154, -1741788, -2139128, -2958569, -3669462, -3294623, -2827117, -2923998, -1561927, 2288346, 4973079, 2720305, -1749092, -2268854, 1852780, 5134566, 4131546, 1146972, -997890, -2763204, -4792280, -5651564, -5028997, -5335295, -7569127, -8961404, -7487369, -5743769, -7219626, -10965025, -13095788, -11965124, -8871824, -4875543, 8355, 4810120, 7393556, 6609473, 3307257, -658912, -3403947, -3606685, -1484524, 1048536, 2142592, 1689818, 763367, 158427, 194475, 1076172, 2449724, 3185491, 2502336, 970558, -116957]
3616a16957J64848J300504J295179p19629m109372o249227n031466j514203J364431
3607a3615892K183775J684715Q10122N049m0908J066269K351606K613103K245701
3598f96460K251527K063716M27931j938723k795375j495896K90147J040462Q16503
3589c6168K54739j86926J5245R26887J537929J045182K64892K91588N73212J47885
3579D834465j93447O95541J641881O68451j331276j500694M22627J554192L05907
3570G097647j537678j951170j246612o12047l95952p01971j570717j946636o89250
3561c554386R28884L74634j814440j903588J444712M447616L259836o33048k673661
3552a23441j251780J206084K258581J975391J457490Q24332o13911k931175m824215
$$ y = [-116957, 47891, 1348395, 2643574, 1923945, -2185427, -8434654, -13466120, -14980323, -13615892, -11432117, -9747402, -8937280, -8932231, -8973139, -7906870, -5555264, -2942161, -696460, 1555067, 3618783, 4046714, 2107991, -687384, -2183280, -1893133, -852671, -36168, 218571, 31645, 46890, 973777, 2511706, 3556888, 3821780, 4113368, 4686580, 4834465, 4641018, 5336559, 6978440, 7646891, 6315615, 4814921, 5237548, 6791740, 7097647, 5559969, 3608799, 2362187, 1750140, 1354188, 652217, -918500, -2865136, -3554386, -2625502, -2250868, -4065308, -5968896, -4524184, -76568, 3183268, 2550220, -123441, -1375221, -169137, 2089444, 4064835, 5522325, 6346657, 5732746, 2801571, -2022644]
3543b022644m497477j736606J164269J546806n13154k316759j779579O35779L183741
3534f335624M511671L905859J578791p23538r21009Q73874K235048J355948j049698
3525E431322l097248l650957k543987k94514J877981K906355L027086L002118
3517F658156K415468L81264k186736l057829j722405k5449N68327M38242K55300
3508C724338Q810m3423M98643P87280l69478k005032j896066k61538L20009p33066
3498C0477r66985O61333J630319l0849k410952k661488q44263J234018K779075
3489e79315L550091K767885N60943j313158j871232k062822k211852r67614J506529
3480f20545K344822K81364j817486j338096J44796K81982J82955J554724K450222
$$ y = [-2022644, -6520121, -8256727, -7092458, -5545652, -6058806, -8375565, -10155144, -9519365, -6335624, -1823953, 2081906, 3660697, 2937159, 2016150, 2890024, 5125072, 6481020, 5431322, 2334074, -1316883, -3860870, -4155384, -2277403, 628952, 3656038, 6658156, 9073624, 9454888, 7268152, 4210323, 2487918, 2462469, 3030796, 3469038, 3724338, 3733148, 3689725, 4188368, 4975648, 4606170, 2601138, 705072, 443534, 763543, 30477, -936508, -275175, 1355144, 1324295, -1086657, -3748145, -4592408, -3358390, -579315, 2970776, 5738661, 6299604, 4986446, 3115214, 1052392, -1159460, -2127074, -620545, 1724277, 2005641, 188155, -1149941, -1005145, -723163, -540208, 1014516, 3464738]
3471C464738K51393l200551l983890k080495n54798o7837J172488K909825L040296
3462I51169J890103J671691J872048r3490l486794m378552j865619N98122J130373
3453a710949J806397L426177K832915j647914o154863o225116k917659n66203
3445a1157215n57281p34759L75717J928314K783328K704180J782492M84784l8945
3436b429385P85320J682126Q51431j552725l305844k546385J97554K422851K048952
3427a846105l49604j992730j125875P69882J015471o44064j963405j381822M12848
3418g105404J981548K490418J606634k33854j434038q07178N41375O96920K5707
3409b237872N33881K211631K658611Q62721j176488j473851m88602M03742Q28264
$$ y = [3464738, 3716131, 515580, -3468310, -5548805, -6103603, -6171440, -4998952, -2089127, 951169, 2841272, 4512963, 6385011, 6291521, 2804727, -1573825, -3439444, -2841322, -1710949, 95448, 3521625, 6354540, 4706626, -1448237, -7673353, -10591012, -11157215, -11714496, -12449255, -12073538, -10145224, -7361896, -4657716, -2875224, -2390440, -2429385, -1644065, 38061, 889492, -663233, -3969077, -6515462, -6317908, -3895057, -1846105, -2195709, -4188439, -5314314, -4544432, -3528961, -4173025, -6136430, -7518252, -7105404, -5123856, -2633438, -1026804, -1260658, -2694696, -3501874, -2960499, -2263579, -2237872, -1703991, 507640, 3166251, 4028972, 2852484, 1378633, 890031, 1293773, 2122037]
3400B122037Q23913J70816p71040j102302q09430n76793j23532J179771K106689
3391C020129P59956j751925k014998M89586K224912R83052r18959p16922P07714
3382B782545J220606J117327J605029J809013K33020k256346l428491k590172
3374D92531o52213J372318K417346J623879M5584J15232J967222K711310R41845
3365A1035054j027777j480645k310617m738316n674711k544919J347680J290574
3357d103677j302213j354218J374990K320213L21769m12874K306249M929525M071574
3348H151338J530467N93611Q98811P8173j884314k847349j742937M51347K044831
3339G273978J719476n74046k907785k877431n95032J190119O35834j007991j481701
$$ y = [2122037, 2945950, 3116766, 2345726, 1243424, 433994, -142799, -266331, 913440, 3020129, 3780085, 2028160, 13162, 502748, 2727660, 3710712, 2791753, 2074831, 2782545, 4003151, 5120478, 6725507, 8534520, 8767540, 6511194, 3082703, 492531, -159682, 1212636, 3629982, 5253861, 5299445, 5414677, 7381899, 10093209, 11035054, 10007277, 8526632, 6216015, 1477699, -4197012, -6741931, -5394251, -4103677, -5405890, -6760108, -5385118, -3064905, -2743136, -3156010, -849761, 4079764, 8151338, 9681805, 10275416, 11174227, 11252400, 9368086, 6520737, 4777800, 5229147, 7273978, 8993454, 8419408, 5511623, 2634192, 2039160, 3229279, 3865113, 2857122, 1375421]
3330A375421l31230J162275J645019O14679j270092k394267j694799r1190O19809
3321c64375J05497m87882m35914J34583J166413K297328K246337N86288o83246
3312D565029K64245J814146J190493q30972j124856L01721K82727j744939k515559
3303B202035o39587R72066K80800o04698J24018L25340j957013m114805k617377
3294f029221J352968L681431L074553J629733R42487P30618L76670o82719k986753
3285B089767n333855m750484o27257L070273K689666J33396k19076J770394K375371
3276A198195K85075j644978j084828Q99102K257305K320063J134883j046607k965532
3267A352678l019129j173861J169425K861979L123402J163771k119271l439057
$$ y = [1375421, 1044191, 2206466, 3851485, 4466164, 3196072, 801805, -892994, -984184, -364375, -258878, -746760, -1182674, -1048091, 118322, 2415650, 4661987, 5248275, 4565029, 4829274, 6643420, 7833913, 7002941, 5878085, 6179806, 6462533, 4717594, 2202035, 1562448, 2534514, 2815314, 2210616, 2334634, 2659974, 702961, -3411844, -6029221, -4676253, -994822, 2079731, 3709464, 4651951, 5382569, 5759239, 5076520, 2089767, -3244088, -7994572, -8621829, -5551556, -2861890, -2728494, -2947570, -1177176, 1198195, 1483270, -161708, -1246536, -347434, 1909871, 4229934, 5364817, 4318210, 1352678, -1666451, -2840312, -1670887, 1191092, 4314494, 5478265, 3358994, -80063]
3259h0063j030045J949803J372884j565033k187636J14437J196876m27964q78528
3250a535269K260300N189700L414053j470733m331848l572369j898376j340122
3242c284664j089407o5661J210226J788714J629125J312332J237558J176325M17536
3233D332084j095851j841048k64371K476764L065200J68996l491812m240146j395824
3224b286008K565861M468340K588855j844292m703699k631271K482241N018876
3216E658903K683323p52600j351464m18628j183836k922106k383186M35199K084035
3207A849640R00161j075669j542864l52147J639055L360156L091943N6598l319601
3198D607272l587160j108936K73297r65207j899951j77990K164815K226601Q10965
$$ y = [-80063, -1110108, 839695, 2212579, 647546, -1540090, -1425653, -228777, -656741, -1535269, 725031, 5914731, 9328784, 7858051, 3526203, -46166, -1944542, -3284664, -4374071, -4439732, -3229506, -1440792, 188333, 1500665, 2738223, 3914548, 4332084, 3236233, 1395185, 1130814, 3607578, 6672778, 6841774, 3349962, -890184, -2286008, 279853, 4748193, 7337048, 5492756, 789057, -1842214, 640027, 5658903, 8342226, 7589626, 6238162, 5819534, 4635698, 1713592, -669594, -234395, 1849640, 2749801, 1674132, 131268, -220879, 1418176, 4778332, 7870275, 7926873, 4607272, 1020112, -88824, 184473, -780734, -2680685, -2858675, -693860, 1532741, 2343706]
3189B343706M69604R60600J59366j484842j141405J494300K908520P90453k263277
3180D237025k223893P65395K762364J526856p98958j106338N04083J331431j54563
3171F843402k656146l905888k993569p96907J009815J269329L32296k76826K96020
3162h78474J122864J002559L88305M13836N57152p23397l060018m145783l141987
3153h464943j826425j424248o75832J426990L217081K795730J215608Q90992K000021
3144h45026K719113K156452R27455m35157j604735j691316l25575J135441J297660
3135C334312P88304Q55709J147124R77901J280500K590007K678995l42386l855875
3126I454591l781420j018020j47353j778243j467816K541205N761224M136665
$$ y = [2343706, 2813310, 3773910, 3933276, 2448434, 1307029, 2801329, 5709849, 6500302, 4237025, 2013132, 2778527, 5540891, 7067747, 6268789, 5162451, 5666534, 6997965, 6843402, 4187256, 281368, -2712201, -3509108, -2499293, -1229964, -897668, -1174494, -878474, 244390, 1246949, 1635254, 2049090, 2606242, 1882845, -1177173, -5322956, -8464943, -10291368, -11715616, -12391448, -10964458, -7747377, -4951647, -3736039, -2845047, -845026, 1874087, 4030539, 4957994, 4522837, 2918102, 1226786, 901211, 2036652, 3334312, 4122616, 4978325, 6125449, 7103350, 8383850, 10973857, 13652852, 13310466, 9454591, 5673171, 4655151, 4507798, 2729555, 1261739, 3802944, 9564168, 13700833]
3118A3700833j36302k583587k630763k400956k261643j193987L81492J336549
3110D211636J857210K230138J454120n31576j416344p350J134020m08195k639445
3101E884214k279924q0283Q69659L32575J52964j71530k294588m257417k190893
3092d035223L035666N919066L943737L91303j595179k834303m066102l067066
3084b308101Q62973L512474J038071l892187n370717k209173J221787J460939
3076e683934k78638j025458J63123K176276L642655L725477K236341j30573j993675
3067B831594k176580o29906J284246J660817n3351k051349j939894M38653K936569
3058B300799L780029L028832J407417n95936k098351k066818q71907l6652R0588
$$ y = [13700833, 13564531, 10980944, 8350181, 5949225, 3687582, 2493595, 2875087, 4211636, 6068846, 8298984, 9753104, 9221528, 7805184, 7797834, 8931854, 8523659, 5884214, 3604290, 3524007, 4393666, 4726241, 4879205, 4707675, 2413087, -1844330, -4035223, -999557, 4919509, 8863246, 9254549, 7659370, 4825067, 758965, -2308101, -1445128, 2067346, 3105417, -786770, -6157487, -8366660, -7144873, -5683934, -5962572, -6988030, -6824907, -4648631, -1005976, 2719501, 4955842, 4825269, 2831594, 655014, 25108, 1309354, 2970171, 2916820, 865471, -1074423, -635770, 2300799, 6080828, 9109660, 10517077, 9921141, 7822790, 5755972, 4884065, 4847413, 4938001]
3049D938001O25230J567479J174361j023067k828349k492524j138654m32361L3528
3040D23644J042441J567964P29086L3287Q80983J541803j13710k206952j017070
3031B881476K910464M741396J908373k736292n177993m581606k299140N22159
3023a831163K723599K884013J090386o60277j143583j361750k207537k622987
3015c129299j585085j10845M91219P82549J648766J999983L45655k194422k880398
3006d631877j140020P54040Q94912k49549j363572k066088k418456j994839n08106
2997a2723555J287593K228511K104284J810779K090587K471249J797591r7218
2989I69821j693145j379599M33572J723701J466366O85154M47344J55849j108012
$$ y = [4938001, 5563231, 7130710, 8305071, 7282004, 4453655, 1961131, 822477, 390116, 423644, 1466085, 3034049, 3763135, 3796422, 4677405, 6219208, 6105498, 3898546, 2881476, 5791940, 10533336, 12441709, 9705417, 4527424, -54182, -2353322, -1831163, 892436, 3776449, 4866835, 4206558, 3062975, 1701225, -506312, -3129299, -4714384, -4825229, -4334010, -3551461, -1902695, 97288, 442943, -1751479, -4631877, -5771897, -5017857, -4122945, -4372494, -5736066, -7802154, -10220610, -12215449, -12723555, -11435962, -9207451, -7103167, -5292388, -3201801, -730552, 1067039, 969821, -723324, -2102923, -1669351, 54350, 1520716, 2205870, 2653214, 2809063, 1701051]
2980A701051k641122k953412j857808k72371J481204L474929M588629L147388
2972F668488m84081l684194m626729m092751l508562k707798q73989J435292K737608
2963i136716K616008J989163J607655J327646P92071o0893j187730k414310l146536
2954g613642k654549p79383J833641M032925M600727L011536K16048j895957k374573
2945a623227j988120j629492r19904N98637J894834J695394P04021O72588J448505
2936H53236J057398r56456k431778j718547p02P43984M72282K85516K81943j16767
2926a529891p07247j026195j447838k088749j544066J246082M503408N261493
2918B666997L302910J164811J87315r02180k831227l778770k066286R25079K276144
$$ y = [1701051, -940071, -3893483, -5751291, -6023662, -4542458, -1067529, 3521100, 6668488, 6184407, 2500213, -2126516, -6219267, -9727829, -12435627, -13309616, -11874324, -9136716, -6520708, -4531545, -2923890, -1596244, -804173, -865066, -2052796, -4467106, -7613642, -10268191, -11047574, -9213933, -5181008, -580281, 2431255, 2647303, 751346, -1623227, -3611347, -5240839, -6160743, -5562106, -3667272, -1971878, -1267857, -595269, 853236, 1910634, 954178, -1477600, -3196147, -3196849, -2452865, -1980583, -1695067, -1413124, -1529891, -2237138, -3263333, -4711171, -6799920, -8343986, -7097904, -2594496, 2666997, 5969907, 7134718, 7322033, 6419853, 3588626, -190144, -2256430, -1331351, 944793]
2909I44793R91719j372235k713947j970014L68793K249604J532357j345338l137251
2900d451519j573730J553350K763449J607331Q67056K089737L232715J781258
2892G869647j436978l210508k132810k03872J35554o30053N0782K733429M314069
2883G489260J627152m025618p686037o305375j924425J388883K209897K014995
2875e211268J983707J607313M16075o79504n18916P03921J665207J450661M54330
2866A871526k66771l54129n20880j269517j722528p12158J103182J620681K20504
2857c0090j140927o42480R63743J872427J946859K235816K594368J731109n19678
2848I011147k610172l138329k165298o77552L06291K75015k28720N035J020395
$$ y = [944793, 1936512, 564277, -2149670, -4119684, -3750891, -1501287, 31070, -1314268, -4451519, -6025249, -4471899, -1708450, -101119, 765937, 2855674, 6088389, 7869647, 6432669, 3222161, 1089351, 885479, 1021033, 390980, 441762, 3175191, 7489260, 9116412, 5090794, -2595243, -8900618, -10825043, -9436160, -7226263, -5211268, -3227561, -1620248, -1204173, -1883677, -2402593, -1698672, -33465, 1417196, 1871526, 1604755, 1250626, 729746, -539771, -2262299, -2974457, -1871275, -250594, -30090, -1171017, -1813497, -849754, 1022673, 2969532, 5205348, 7799716, 9530825, 9011147, 6400975, 3262646, 1097348, 419796, 726087, 1001102, 772382, 777417, 1797812]
2839A797812J034854j053368l357742l104629n54471J333319J084362K99173O55037
2830a865653J501678J420100N21583L7184N95297J662343K000124N38265k223942
2821D186979l841553k402331P07351K271214J454541L91192L68756J32293j064221
2812B204221j527892n5653J585172J393839M25731P05598J358645m8211k977274
2803C064176m001705j738234J164255J927971J092088N17404l8116j942774m173570
2794d128505l612230L86649L956767L184052n47838k180388J63381K780401J903170
2785A905459j204883k955219k881153k994102l134969j113031K631008M618549
2777e128341L488350J897367J952465K242194J199853P2068K15455M10261n14568
$$ y = [1797812, 2832666, 1779298, -1578444, -4683073, -5237544, -3904225, -2819863, -2520690, -1865653, -363975, 1056125, 1577708, 1614892, 2210189, 3872532, 5872656, 6410921, 4186979, 345426, -2056905, -1349554, 921660, 2376201, 2767393, 3136149, 3268442, 2204221, 676329, 620676, 2205848, 3599687, 4025418, 4731016, 6089661, 6041450, 3064176, -937529, -2675763, -1511508, 416463, 1508551, 2025955, 1987839, 45065, -4128505, -7740735, -7354086, -3397319, -213267, -761105, -2941493, -2778112, 2289, 1905459, 700576, -2254643, -5135796, -8129898, -11264867, -12377898, -9746890, -5128341, -1639991, 257376, 2209841, 4452035, 5651888, 5723956, 5939411, 6349672, 5835104]
2768E835104j056604J15746J159007M0257j640844j246351K67406k0908j986779
2759A466034k766112j396442K01588N06656j83463j096284j291353L00178K628136
2750a631062K129654k153482n230601k355139L282703M520162P91248j576254
2742b222771L31514K282701J054890m46828O39108J787253J26929j949635r25455
2733F77706J702967K102081K01490j227844j342999j010231J16323K278526L225032
2724F723051J138260j692044k057577j007199j580637k909515j459745K541745
2716c03661M874003L655236J363836K735j401724l425035m339164l094674j027793
2707c696241O49552K092003K622789O85968k599465l240695K08853L905854L705850
$$ y = [5835104, 4778500, 4894246, 6053253, 6093510, 4452666, 3206315, 3473721, 3452813, 1466034, -1300078, -2696520, -2494932, -1988276, -2171739, -3268023, -4559376, -4259198, -1631062, 498592, -1654890, -6885491, -9240630, -5957927, -1437765, -646517, -2222771, -1891257, 391444, 1446334, 999506, 1638614, 3425867, 3552796, 1603161, 677706, 2380673, 4482754, 4684244, 3456400, 2113401, 1103170, 1219493, 3498019, 6723051, 7861311, 6169267, 4111690, 3104491, 1523854, -1385661, -2845406, -303661, 4570342, 8225578, 9589414, 9592149, 8190425, 4765390, 426226, -2668448, -3696241, -3046689, -954686, 1668103, 2354071, -245394, -3486089, -3277236, 628618, 4334468]
2698D334468N09570j761022j496077j69685O78398O61426l10222j799524k291030
2689a643698q10653J222331J407588n07584k236331j702337P36590K840435K748711
2680B055052P59692j039069j169038l91824j57415j71237P53845J854706R35072
2671C429784j869297l433190j797688J352985L542325M314290L692453P51534
2663I983196l711769n668508k552931K123674K657044j100786l710673j822528
2655c803281J991135L907979L672945K867450J344530j806777n279052o319636
2647c424707m282210j478338k42362m40745l53597Q08519K025929K004554R07348
2638d475609l3243l31990o31699j073900o64759Q26686J663000L96302j573244
$$ y = [4334468, 4844038, 3083016, 1586939, 1417254, 2095652, 2757078, 2446856, 647332, -1643698, -2454351, -1232020, 175568, -332016, -2568347, -4270684, -3534094, -693659, 2055052, 2814744, 1775675, 606637, 214813, 57398, -113839, 640006, 2494712, 3429784, 1560487, -1872703, -3670391, -2317406, 1224919, 5539209, 9231662, 9983196, 6271427, 602919, -1950012, 173662, 2830706, 1729920, -1980753, -3803281, -1812146, 2095833, 5768778, 8636228, 9980758, 8173981, 2894929, -3424707, -7706917, -9185255, -9427617, -9868362, -10221959, -9413440, -7387511, -5382957, -4475609, -4508852, -4840842, -5472541, -6546441, -7211200, -6384514, -4721514, -4325212, -5898456]
2629e898456j547153Q74009L619713N146212N444505M288667J124715k795301
2621A0256911m771578m228454l608681m358903m353114j319693L046466M897964
2613d439082L131897J70876j521745j570358p17904J90291K68987o21379j142734
2604f251151o3655J605061J759712L24932p68875q21364j260507k592520k808266
2595a0876633m21443K664123L409093J820094P33821J642719K775634J916582
2587C663990l98981j669660p62080P10414M78373j635126l522939l091740l09169
2578f536918K925800M400949L063321k77937l182058l239136m63924K281391K210110
2569A181598j79622j769207o32462J885654L071191J785569q44207k773401k655907
$$ y = [-5898456, -7445609, -6571600, -2951887, 2194325, 7638830, 11927497, 13052212, 10256911, 5485333, 1256879, -2351802, -6710705, -11063819, -12383512, -9337046, -4439082, -1307185, -1136309, -2658054, -4228412, -4946316, -4756025, -4487038, -5108417, -6251151, -6314806, -4709745, -2950033, -2625101, -3393976, -4215340, -5475847, -8068367, -10876633, -11298076, -8633953, -5224860, -3404766, -2670945, -1028226, 1747408, 3663990, 3265009, 1595349, 833269, 1543683, 2022056, 386930, -3136009, -6227749, -6536918, -3611118, 789831, 3853152, 3575215, 393157, -2845979, -3309903, -1028512, 1181598, 1001976, -767231, -1399693, 485961, 3557152, 5342721, 4498514, 1725113, -930794]
2560i30794q59413P99903R69621L82657N96671J339275Q51063q61657j378317
2551I09009L59636J847191O38472j629012j590045N54000J307620o95486k779403
2542a078018k487594q32946J51169O36288J747688K854053K428843P13315n74983
2533C557815q07338r66492j736796k528815k464179j304853M81874J777365J429496
2524b561923j75157q32690Q38687L147436L443872J956189J273693K031500J750197
2515A0871804j119794m409613n113375l235698q92025R43428K542374L263801
2507B850902J915817p47054k173953j224119M88156J061884N95311J85253p3235
2498B878962r41120k492624l616358k965595k57780L009427M350916K678093j86313
$$ y = [-930794, -1790207, -990304, -20683, 361974, 958645, 2297920, 3148983, 2287326, 909009, 1268645, 3115836, 3754308, 2125296, 535251, 1089251, 2396871, 1701385, -1078018, -3565612, -4398558, -4247389, -3611101, -1863413, 990640, 3419483, 4132798, 3557815, 2750477, 1783985, 47189, -2481626, -4945805, -6250658, -5768784, -3991419, -2561923, -2737080, -3569770, -2731083, 416353, 3860225, 5816414, 7090107, 9121607, 10871804, 9752010, 5342397, 229022, -3006676, -3898701, -2955273, -412899, 2850902, 4766719, 4019665, 1845712, 621593, 1109749, 2171633, 2766944, 2952197, 2878962, 1937842, -554782, -4171140, -7136735, -7394515, -4385088, -34172, 2643921, 2457608]
2489B457608j438372o69464M3859n74094j472477j516327j177885r18233N7594
2480e207791J808305K336969M31174j752768j504895K66085O06407n90252p05059
2471d311825P04102Q71287j334482k973299j324437K008697L452937K031683m59338
2462a334675k271101k696950j558941L12791J054838o9314j429713j402677o77542
2453a0073284n09828k14866J300763K767874K043646l17203j699202j272428m97565
2444h472093K7119J262172K937678L100335J500270P26383K332155L981428K507908
2435I903355j520650m382435l845195j506623l35389j007976j392755M34273L322744
2426c30651M127457J709451j545805k987661k844220k597185j967517n0357J789889
$$ y = [2457608, 1019236, 349772, 393631, -180463, -1652940, -3169267, -4347152, -5265385, -5207791, -3399486, -1062517, -631343, -2384111, -3889006, -3622921, -3016514, -3606766, -4311825, -3607723, -2736436, -4070918, -7044217, -8368654, -6359957, -2907020, -875337, -1334675, -3605776, -6302726, -7861667, -7548876, -6494038, -6563352, -7993065, -9395742, -10073284, -10583112, -10797978, -9497215, -6729341, -4685695, -5002898, -6702100, -7974528, -8472093, -8444974, -7182802, -4245124, -1144789, 355481, 1081864, 3414019, 7395447, 9903355, 8382705, 4000270, 155075, -1351548, -1686937, -2694913, -4087668, -3653395, -330651, 3796806, 5506257, 3960452, 972791, -1871429, -4468614, -6436131, -6486488, -4696599]
2417d696599J338872o66253j463559q38220j135716k420536j744451J520505L741311
2408f364646K555547N98216R45359K213647J560504l14835j048219j218307k767199
2399c839933m301185k598767J588027L702416J960249j37386P73893L130270L046960
2390C324544k38688l541801l677292r60756J345374Q59891j035482j133370Q39374
2381d218206J539833q50837l337997k312969J052355K727019J679388L44414J41682
2372c235318J95008J49762N68655N13174j500836l765951k552547J955307M716180
2363b956566K558350j423828k283677N99979L826928M337194J671466k246730
2355D083116m134245k093101J462203J874520j532586l990718j764801K695952
$$ y = [-4696599, -3357727, -4023980, -5487539, -6325759, -7461475, -9882011, -11626462, -10105957, -6364646, -3809099, -3210883, -2265524, -51877, 1508627, 1193792, 145573, -1072734, -3839933, -8141118, -10739885, -9151858, -5449442, -3489193, -3626579, -2852686, 277584, 3324544, 3085856, -455945, -4133237, -5093993, -3748619, -2888728, -3924210, -5057580, -4218206, -2678373, -3529210, -6867207, -9180176, -8127821, -5400802, -3721414, -3377000, -3235318, -3040310, -2890548, -2321893, -1808719, -3309555, -7075506, -9628053, -7672746, -2956566, -398216, -1822044, -4105721, -3505742, 321186, 4658380, 6329846, 4083116, -51129, -2144230, -682027, 1192493, -340093, -4330811, -6095612, -3399660]
2347c399660M466873K595274O1053q48712k31065J089924K186779J772579m49085
2338G243960k811982l666566l254843k228483j19872K735968L750892J268689
2330B917763k298494l363653j968161p85048m95689M79982K240770K871365J807134
2321A405969P64870R18779J574121J826375J315656m34891k909873l279250N51403
2312A733159N476851N462332o57983p004504p889901m256013q68978J91772M96761
2303g316504J532829K982667M061953M197069K649936n42883l323942l156877
2295A084248k24337K307888J881024n48097j979780j152725K44197K01051r76707
2286H36762j610921j378177j372037j564143l84295K322070M025471K823557L05290
$$ y = [-3399660, 1067213, 3662487, 3723540, 2874828, 2643763, 3733687, 5920466, 7693045, 7243960, 4431978, 765412, -2489431, -4717914, -4837786, -2101818, 1649074, 2917763, 619269, -2744384, -4712545, -5497593, -5993282, -5513300, -3272530, -401165, 1405969, 2170839, 3089618, 4663739, 6490114, 7805770, 7370879, 4461006, 1181756, 1733159, 7210010, 12672342, 12014359, 5009855, -2880046, -7136059, -8005037, -7813265, -7316504, -5783675, -2801008, 1260945, 5458014, 8107950, 7565067, 4241125, 1084248, 859911, 3167799, 5048823, 4500726, 2520946, 1368221, 1612418, 1813469, 836762, -774159, -2152336, -3524373, -5088516, -5472811, -3150741, 874730, 3698287, 4003577]
2277D003577r09769j039639k108714m086141m774448l149354m08149J942589K843572
2268g686476J358067j704828k796276L09398M193685L737914R5838m69928L455693
2259D93087N593860J761116l244577l108451L10824P29098k153766k807950N19241
2250a907518L087743J602640q79443l92299J940995K433696M85395j392664j570011
2241C408534o62221K75704Q46443R19882N65292K13757N5789l82315j462776k712246
2231A065843l384166l236781k347611p73897J111952K470788K685279J948425
$$ y = [4003577, 3093808, 2054169, -54545, -4140686, -8915134, -12064488, -12472637, -10530048, -7686476, -6328409, -8033237, -10829513, -10520115, -6326430, -2588516, -2492678, -2962606, 493087, 6086947, 7848063, 4603486, 1495035, 1805859, 2534957, 381191, -2426759, -1907518, 1180225, 2782865, 1903422, 1511123, 3452118, 5885814, 6371209, 4978545, 3408534, 2746313, 3022017, 3868460, 4788342, 5353634, 5567391, 5623180, 5240865, 3778089, 1065843, -2318323, -5555104, -7902715, -8676612, -7564660, -5093872, -2408593, -460168]
$$ [...]
##END NTUPLES=NMR SPECTRUM
##END=
