##TITLE=31Pdec_DE-106_ch_6
CDCl3, 64 sc
 19.8.2025
##JCAMPDX= 6.0         $$ Bruker NMR JCAMP-DX V2.0
##DATA TYPE= NMR SPECTRUM
##DATA CLASS= NTUPLES
##ORIGIN= UXNMR, Bruker Analytische Messtechnik GmbH
##OWNER= root
$$ XWIN-NMR		Version 3.5
$$ Tue Aug 19 14:56:41 2025 Russian Standard Time (UT+4h)  she@DPX200
##.OBSERVE FREQUENCY= 81.013821
##.OBSERVE NUCLEUS= ^31P
##.ACQUISITION MODE= SIMULTANEOUS
##.ACQUISITION SCHEME= undefined
##.AVERAGES= 64
##.DIGITISER RES= 17
##SPECTROMETER/DATA SYSTEM= spect
##.PULSE SEQUENCE= zgpg30
##.SOLVENT NAME= DMSO
##.SHIFT REFERENCE= (INTERNAL, DMSO, 0, 198.062)
##AUDIT TRAIL= $$ (NUMBER, WHEN, WHO, WHERE, WHAT)
$$ ##TITLE= Audit trail, XWIN-NMR		Version 3.5
$$ ##JCAMPDX= 5.01
$$ ##ORIGIN= Bruker BioSpin GmbH
$$ ##OWNER= she
$$ F:/spectra/data/she/nmr/P31/2/pdata/1/auditp.txt
$$ ##AUDIT TRAIL=  $$ (NUMBER, WHEN, WHO, WHERE, WHAT)
(   1,<2025-08-19 14:54:26.73 +0400>,<she>,<DPX200>,
      <created by zg, POWCHK disabled, PULCHK disabled
       configuration hash MD5:
       00 E9 B6 7A A2 85 ED C7 34 08 36 98 17 FE 4E 26
       data hash MD5: 32K
       94 25 D4 B9 8B 61 C3 93 F0 9D 9C CF 6A 3D B5 18>)
(   2,<2025-08-19 14:54:29.54 +0400>,<she>,<DPX200>,
      <Start of raw data processing
       efp BC_mod = 2 LB = 1.5 FT_mod = 6 PKNL = 1 PHC0 = 1409.619 PHC1 = 24.09949 SI = 64K 
       data hash MD5: 64K
       12 73 BA FB BF 16 82 39 E2 32 CF 32 1C 6B 6F F9>)
(   3,<2025-08-19 14:54:49.43 +0400>,<she>,<DPX200>,
      <pk PHC0 = 7.63315 PHC1 = 0 
       data hash MD5: 64K
       91 93 25 89 97 E3 99 2E C5 24 3E 5C 7A D8 8F 0B>)
(   4,<2025-08-19 14:54:53.59 +0400>,<she>,<DPX200>,
      <abs ABSG = 5 
       data hash MD5: 64K
       AF AB FF 9F 5A 68 C2 E1 B7 88 12 03 CC E3 16 FC>)
$$ ##END=
$$ 
$$ hash MD5
$$ 77 85 66 29 65 43 86 87 57 4F 36 CD 5E 8A 21 F0
##$RELAX= 
##$RELAX= 
##$RELAX= 
##$RELAX= 
##$RELAX= 
##$RELAX= 
##$RELAX= 
##$RELAX= 
$$ Bruker specific parameters
$$ --------------------------
##$DU= <F:/spectra>
##$EXPNO= 2
##$NAME= <P31>
##$PROCNO= 1
##$TYPE= <nmr>
##$USER= <she>
##$AMP= (0..31)
100 100 100 100 100 100 100 100 100 100 100 100 100 100 100 100 100 100 
100 100 100 100 100 100 100 100 100 100 100 100 100 100 
##$AQSEQ= 0
##$AQ_mod= 1
##$AUNM= <au_zg>
##$AUTOPOS= <>
##$BF1= 81.014009
##$BF2= 200.13
##$BF3= 200.13
##$BF4= 200.13
##$BF5= 200.13
##$BF6= 200.13
##$BF7= 200.13
##$BF8= 200.13
##$BYTORDA= 1
##$CFDGTYP= 0
##$CFRGTYP= 5
##$CHEMSTR= <none>
##$CNST= (0..31)
1 1 145 1 1 1 1 1 1 1 1 1 1 1 1 1 1 1 1 1 1 1 1 1 1 1 1 1 1 1 1 1 
##$CPDPRG= <waltz16>
##$CPDPRG1= <>
##$CPDPRG2= <waltz16>
##$CPDPRG3= <>
##$CPDPRG4= <mlev>
##$CPDPRG5= <mlev>
##$CPDPRG6= <mlev>
##$CPDPRG7= <mlev>
##$CPDPRG8= <mlev>
##$CPDPRGB= <>
##$CPDPRGT= <>
##$D= (0..31)
0 1 0 0 0 0 0 0 0 0.06 0 0.03 2e-05 3e-06 0 0 0.0002 0 0 0 0 0 0 0 0 0 
0 0 0 0 0 0 
##$DATE= 1755600866
##$DBL= (0..7)
120 120 120 11 120 120 24 19 
##$DBP= (0..7)
150 150 150 150 150 150 150 150 
##$DBP07= 0
##$DBPNAM0= <>
##$DBPNAM1= <>
##$DBPNAM2= <>
$$ [...]
##$SUBNAM3= <"">
##$SUBNAM4= <"">
##$SUBNAM5= <"">
##$SUBNAM6= <"">
##$SUBNAM7= <"">
##$SUBNAM8= <"">
##$SUBNAM9= <"">
##$SW= 400.765351723535
##$SWIBOX= (0..15)
0 1 3 0 0 0 0 0 0 0 0 0 0 0 0 0 
##$SW_h= 32467.5324675325
##$TD= 32768
##$TD0= 1
##$TE= 0
##$TE2= 300
##$TE3= 300
##$TEG= 300
##$TL= (0..7)
0 120 53 12 22 120 120 120 
##$TP= (0..7)
150 150 150 150 150 150 150 150 
##$TP07= 0
##$TPNAME0= <>
##$TPNAME1= <>
##$TPNAME2= <>
##$TPNAME3= <>
##$TPNAME4= <>
##$TPNAME5= <>
##$TPNAME6= <>
##$TPNAME7= <>
##$TPOAL= (0..7)
0.5 0.5 0.5 0.5 0.5 0.5 0.5 0.5 
##$TPOFFS= (0..7)
0 0 0 0 0 0 0 0 
##$TUNHIN= 0
##$TUNHOUT= 0
##$TUNXOUT= 0
##$USERA1= <user>
##$USERA2= <user>
##$USERA3= <user>
##$USERA4= <user>
##$USERA5= <user>
##$V9= 5
##$VALIST= <valist>
##$VCLIST= <CCCCCCCCCCCCCCC>
##$VD= 0
##$VDLIST= <DDDDDDDDDDDDDDD>
##$VPLIST= <PPPPPPPPPPPPPPP>
##$VTLIST= <TTTTTTTTTTTTTTT>
##$WBST= 1024
##$WBSW= 4
##$XGAIN= (0..3)
0 0 0 0 
##$XL= 0
##$YL= 0
##$YMAX_a= 26687
##$YMIN_a= -26268
##$ZGOPTNS= <>
##$ZL1= 120
##$ZL2= 120
##$ZL3= 120
##$ZL4= 120
##$ABSF1= 198.0616
##$ABSF2= -202.7028
##$ABSG= 5
##$ABSL= 3
##$ALPHA= 0
##$AQORDER= 0
##$ASSFAC= 0
##$ASSFACI= 0
##$ASSFACX= 0
##$ASSWID= 0
##$AUNMP= <proc_1d>
##$AZFE= 0.1
##$AZFW= 0.5
##$BCFW= 0
##$BC_mod= 2
##$BYTORDP= 0
##$COROFFS= 0
##$CY= -3
##$DATMOD= 1
##$DC= 0
##$DFILT= <>
##$DTYPP= 0
##$F1P= 0
##$F2P= 0
##$FCOR= 1
##$FTSIZE= 65536
##$FT_mod= 6
##$GAMMA= 0
##$GB= 0
##$INTBC= 1
##$INTSCL= 9.790993e-09
##$ISEN= 30
##$LB= 1.5
##$LEV0= 0
##$LPBIN= 0
##$MAXI= 10000
##$MC2= 0
##$MEAN= 0
##$ME_mod= 0
##$MI= 50
##$NCOEF= 0
##$NC_proc= -7
##$NLEV= 6
##$NOISF1= 182.463
##$NOISF2= 159.3651
##$NSP= 0
##$NTH_PI= 0
##$NZP= 0
##$OFFSET= 198.0616
##$PC= 4
##$PHC0= 1417.252
##$PHC1= 24.09949
##$PH_mod= 1
##$PKNL= yes
##$PPARMOD= 0
##$PSCAL= 0
##$PSIGN= 0
##$REVERSE= no
##$SF= 81.0140089999434
##$SI= 65536
##$SIGF1= 159.3651
##$SIGF2= -187.1042
##$SINO= 113.3802
##$SIOLD= 16384
##$SREGLST= <1H.CDCl3>
##$SSB= 0
##$STSI= 65536
##$STSR= 0
##$SW_p= 32467.5324675325
##$SYMM= 0
##$S_DEV= 0
##$TDeff= 32768
##$TDoff= 0
##$TI= <>
##$TILT= no
##$TM1= 0
##$TM2= 0
##$TOPLEV= 0
##$USERP1= <user>
##$USERP2= <user>
##$USERP3= <user>
##$USERP4= <user>
##$USERP5= <user>
##$WDW= 1
##$XDIM= 65536
##$YMAX_p= 298012329
##$YMIN_p= -115086104
$$ End of Bruker specific parameters
$$ ---------------------------------
##NTUPLES= NMR SPECTRUM
##VAR_NAME=  FREQUENCY,     SPECTRUM/REAL,   SPECTRUM/IMAG
##SYMBOL=    X,             R,               I
##VAR_TYPE=  INDEPENDENT,   DEPENDENT,       DEPENDENT
##VAR_FORM=  AFFN,          ASDF,            ASDF
##VAR_DIM=   65536,         65536,           65536
##UNITS=     HZ,            ARBITRARY UNITS, ARBITRARY UNITS
##FACTOR=    0.49542278885378, 1,            1
##FIRST=     16045.7642231865, 0,            0
##LAST=      -16421.768244346, 0,            0
##MIN=       -16421.768244346, -115086104,   0
##MAX=       16045.7642231865, 298012329,    0
$$ Real data points
##PAGE= N=1
##DATA TABLE= (X++(R..R)), XYDATA
$$ [...]
43984C551679N29676J63249Q8475j04050j48920M37557R73224K64654j145901
$$ 3551679 4081355 4244604 4333079 4229029 4080109 4517666 5490890 5755544 4609643
43975D609643j247957K36657R72958l44877j552824l48093J697891J350776j125270
$$ 4609643 3361686 3598343 4571301 4226424 2673600 2325507 4023398 5374174 4248904
43966D248904k365614j218652j37032o80863j125608J5849J247424R59719L84206
$$ 4248904 1883290 664638 527606 -153257 -1278865 -1263016 -15592 944127 1328333
43957A328333J143642K000545R26589j149417j693244o55223j93141q84678j202962
$$ 1328333 2471975 4472520 5399109 4249692 2556448 1901225 1708084 823406 -379556
43948c79556o03610k42405m42449k00516L94649j5637j177031r27237J157488
$$ -379556 -983166 -1225571 -1668020 -1868536 -1473887 -1489524 -2666555 -3593792 -2436304
43939b436304K494609J392063k28425K9443J241082R01378r62981j970715j000431
$$ -2436304 58305 1450368 1221943 1251386 2492468 3393846 2430865 460150 -540281
43930e40281O40574J429107J103687j3142j480324k366887j802248j89960J083855
$$ -540281 100293 1529400 2633087 2619945 1139621 -1227266 -3029514 -3219474 -2135619
43921b135619J238363O11025k16823q63490q93694j44454P18715Q51277L84472
$$ -2135619 -897256 -286231 -503054 -1366544 -2260238 -2404692 -1685977 -834700 -450228
43912d50228J37271L33824M59313K32548j57935o33277j148606j217128m64396
$$ -450228 -312957 20867 480180 712728 554793 -78484 -1227090 -2444218 -2908614
43903b908614M87649O75616K06996M991K83232L95475J37794Q076J31793J13854
$$ -2908614 -2420965 -1745349 -1538353 -1533362 -1250130 -854655 -716861 -708785 -576992 -463138
43893d63138M433J70867K01296n93314j460641p44569J368771K492514J354845
$$ -463138 -458705 -287838 -86542 -679856 -2140497 -2885066 -1516295 976219 2331064
43884B331064k80733l18024O32884O27066m40995j051023p22918l82466l04148
$$ 2331064 2050331 1732307 2365191 2992257 2551262 1500239 777321 394855 90707
43875I0707K72709J239414J192528l65159j813882j393432M56212J657252R85070
$$ 90707 363416 1602830 2795358 2430199 616317 -777115 -320903 1336349 2321419
43866B321419p26627j756070j382527m37542l3974m6291N55522J795861K138969
$$ 2321419 1594792 -161278 -1543805 -1981347 -2015321 -2061612 -1506090 289771 2428740
43857B428740O19361j380047j791241p48726j97908q01895j143082m11995Q6349
$$ 2428740 3048101 1668054 -123187 -871913 -1069821 -1871716 -3014798 -3426793 -3340444
43848c340444p45623j608034o72958J333697J914989M35572r54922m79063Q09904
$$ -3340444 -4086067 -5694101 -6367059 -5033362 -3118373 -2682801 -3637723 -4116786 -3306882
43839c306882P81311n79312j144761L45639K499233L013421J474663l90643j014958
$$ -3306882 -2525571 -3104883 -4249644 -3904005 -1404772 1608649 3083312 2692669 1677711
43830A677711o17050k77490k45064M8389P15666J131615R41264N12534J79569
$$ 1677711 1060661 783171 538107 586496 1302162 2433777 3375041 3887575 4067144
43821D067144k23007p55831r89389o60966j59771Q5954J82385K83547J20417l86344
$$ 4067144 3844137 3088306 2098917 1437951 1278180 1364134 1546519 1830066 1950483 1564139
43811A564139o01404l5029O93220O23422r5068m77217k79125k12965m75725k52908
$$ 1564139 962735 927706 1620926 2244348 2149280 1672063 1392938 1179973 704248 451340
43801D51340P50246J316905K71060j528371j928747k45131J739395J965121N34368
$$ 451340 1201586 2518491 2789551 1261180 -667567 -912698 826697 2791818 3326186
43792C326186p57026q72949n15276n76860o81816l226J126091J493702P73781
$$ 3326186 2569160 1696211 1180935 604075 -77741 -80967 1045124 2538826 3312607
43783C312607j5930k7997L58083L95451O8320k35259m56270o18443m57869o473
$$ 3312607 3296677 3268680 3626763 4022214 4090534 3855275 3399005 2780562 2322693 2316220
43773B316220N3234n51563q59090L6971J337201J450971L35115n00954l80078
$$ 2316220 2369454 1817891 958801 995772 2332973 3783944 4119059 3618105 3238027
43764C238027l00618r28452j272927l67435Q76332P89672o90765k001084k006967
$$ 3238027 2937409 2008957 736030 368595 1244927 2034599 1343834 -657250 -2664217
43755b664217j020618J02950Q62471J004749M18078n20563j047547p83695r7749
$$ -2664217 -3684835 -3581885 -2719414 -1714665 -1296587 -1817150 -2864697 -3648392 -3746141
43746c746141M18476N06936K19559k38773m68744o0335Q73302J551477J244143
$$ -3746141 -3327665 -2820729 -2601170 -2839943 -3308687 -3369022 -2495720 -944243 299900
43737B99900J32960p53134n54880N40824J537593J714151J308870J042816J172098
$$ 299900 432860 -320274 -875154 -334330 1203263 2917414 4226284 5269100 6441198
43728F441198J281192R19588J28944o46671q99187l98594M09060M63570q21884
$$ 6441198 7722390 8641978 8770922 8124251 7225064 6826470 7235530 7699100 6877216
43719F877216k474861k729985j220305L34731K13412j156435j901529j114337
$$ 6877216 4402355 1672370 452065 786796 1000208 -156227 -2057756 -3172093
43711c172093L55753J317073J455917J047948L73037j80437r5903O39842J231905
$$ -3172093 -2816340 -1499267 -43350 1004598 1377635 1197198 1101295 1741137 2973042
43702B973042Q83444k25059j085154r35728p189P41823N15833n93617j655668
$$ 2973042 3856486 3631427 2546273 1610545 1603356 2345179 2861012 2267395 611727
43693F11727j725710p04651O35747J451679J538608J246300Q84389M43823m9899
$$ 611727 -1113983 -1818634 -1182887 268792 1807400 3053700 3938089 4381912 4332013
43684D332013j72363M95441J523582J713094M93320j132507j756324j451602j494412
$$ 4332013 4159650 4655091 6178673 7891767 8385087 7252580 5496256 4044654 2550242
43675B550242k157908k069475l89059J557262J937789R03932J12362K47333M46291
$$ 2550242 392334 -1677141 -2066200 -508938 1428851 2332783 2445145 2692478 3138769
43666C138769N6949m66842o38099o52643o46154l21136K19736K55634l76364p51979
$$ 3138769 3195718 2728876 2090777 1438134 791980 470844 690580 946214 569850 -182129
43656a82129j37132R12491J346681R32913K32292k02357j48234K23741K51509
$$ -182129 -319261 593230 1939911 2872824 3105116 2902759 2754525 2978266 3229775
43647C229775n85473j613853j444018L584R89985K60847j160884j523744p50165
$$ 3229775 2644302 1030449 -413569 -409985 580000 840847 -320037 -1843781 -2593946
43638b593946j40L69643Q33368J156655N57970o27010j035197k52767O62442Q66827
$$ -2593946 -2594086 -2224443 -1391075 -234420 323550 -303460 -1338657 -1591424 -928982 -62155
43628f2155O30558L38854O856R7964J245795K590238K084917n27815k614759j912549
$$ -62155 568403 907257 914113 1012077 2257872 4848110 6933027 6405212 3790453 1877904
43618A877904L96886J509109Q67774K68425O66457J012951L67841p31851j542866
$$ 1877904 2274790 3783899 4651673 4920098 5586555 6599506 6967347 6235496 4692630
43609D692630k191112k721080k345350o43558J283393J825412O91312q77907j449684
$$ 4692630 2501518 -219562 -2564912 -3208470 -1925077 -99665 591647 -286260 -1735944
43600a735944n99203Q63394J562217Q14231n90812j271243r20283m17700k56436
$$ -1735944 -2335147 -1471753 90464 904695 313883 -957360 -1877643 -2295343 -2551779
43591b551779J07934R55884J467805R83428K03138J60152O75277Q61361N99040
$$ -2551779 -2443845 -1487961 -20156 963272 1166410 1326562 2001839 2863200 3462240
43582C462240L91317J83856m51878j201072j301805q72921p37820r20804n91730
$$ 3462240 3853557 4037413 3585535 2384463 1082658 209737 -528083 -1448887 -2040617
43573b040617L12313P05425J5770r08758j065278m65577M07175J251933J569976
$$ -2040617 -1728304 -1022879 -1007109 -1915867 -2981145 -3446722 -3039547 -1787614 -217638
43564b17638Q05891m63027o83669M72412J287857M51718r04883j016662j70517
$$ -217638 588253 125226 -558443 -86031 1201826 1653544 748661 -268001 -438518
43555d38518J87867J04032P05206J622048J233260l98627j224866m62645J18283
$$ -438518 -250651 -146619 558587 2180635 3413895 3015268 1790402 1327757 1446040
43546A446040p53999j603004o25045J267184J784038O20035m87332m70357J73567
$$ 1446040 692041 -910963 -1536008 -268824 1515214 2135249 1647917 1177560 1351127
43537A351127Q90062J604413J732331M73504j496003k216550j000890N09641N96772
$$ 1351127 2241189 3845602 5577933 6051437 4555434 2338884 1337994 1847635 2444407
43528B444407m04816j131668j264554j350696j281564m02094R99582J615521Q50014
$$ 2444407 2039591 907923 -356631 -1707327 -2988891 -3390985 -2391403 -775882 74132
43519G4132k90272n27202N0328K37895o13058j647226j378235N64861K722010
$$ 74132 -216140 -743342 -693014 -455119 -1068177 -2715403 -4093638 -3528777 -806767
43510h06767L103064J313299r28238j656216p14895M69523Q04176M75144J04678
$$ -806767 2296297 3609596 2681358 1025142 310247 779770 1583946 2059090 2163768
43501B163768j01436p6557M10219J196380J428826N05978r85942j876270j749456
$$ 2163768 2062332 1985775 2395994 3592374 5021200 5527178 4541236 2664966 915510
43492I15510j177175q40022r52957j359841j625740j190592k815J146382J484461
$$ 915510 -261665 -1101687 -2054644 -3414485 -5040225 -6230817 -6233632 -5087250 -3602789
43483c602789J236370J095815J027736N07991k39028l68768J61003M43679J02615
$$ -3602789 -2366419 -1270604 -242868 265123 26095 -342673 -181670 262009 364624
43474C64624k54795l34374n74097p93535O6077J973410L039424J975479Q9418
$$ 364624 109829 -224545 -798642 -1592177 -1526100 447310 3486734 5462213 5551631
43465E551631o06495j73700J3958j92580M4719M04193k81074j674935k027410
$$ 5551631 4945136 4771436 4785394 4592814 4637533 5041726 4760652 3085717 1058307
43456A058307q58720L37979M51371M8444j26983k37250l81351j76296J08913l77905
$$ 1058307 199587 537566 988937 1037381 910398 673148 291797 115501 224414 -153491
43446a53491j289677j126409K19944Q77448o2506j007141o04620o677n56277j049792
$$ -153491 -1443168 -2569577 -2349633 -1472185 -1534691 -2541832 -3146452 -3153129 -3709406 -4759198
43436d759198K89357K376819K494648L97887j372072j247880l74463k03575l92765
$$ -4759198 -4469841 -2093022 401626 799513 -572559 -1820439 -2194902 -2398477 -2791242
43427b791242P4414J102843J720664J337580K56810o11859n15833J82693J42880
$$ -2791242 -2716828 -1613985 106679 1444259 1701069 1089210 573377 756070 898950
43418H98950j181514k450441k092941m81024P79323J203809J564281J975956J574989
$$ 898950 -282564 -2733005 -4825946 -5306970 -4527647 -3323838 -1759557 216399 1791388
43409A791388K51151q39708q91656l92321j46029l55471q02744r89113j95042
$$ 1791388 2042539 1202831 311175 -81146 -227175 -582646 -1385390 -2374503 -2569545
43400b569545J495479K466422J257451j139662k209950j158428L79732R58056
$$ -2569545 -1074066 1392356 2649807 1510145 -699805 -1858233 -1478501 -520445
43392e20445Q61797O82522J75550p37812j332390j188433p32999k45301L75473
$$ -520445 341352 1023874 1199424 461612 -870778 -2059211 -2792210 -3037511 -2662038
43383b662038O42022p4593q70880o2562J887160K415718P09745q43083l68931
$$ -2662038 -2020016 -2094609 -2965489 -3028051 -1140891 1274827 1984572 1141489 772558
43374G72558O66775J90345j025699r56758K13184P13320J98158k57716m20058
$$ 772558 1439333 1629678 603979 -352779 -139595 573725 771883 514167 94109
43365I4109q49325j109551k42364J219054J728973J094746N24044M26814r4r41178
$$ 94109 -755216 -1864767 -2107131 -888077 840896 1935642 2459686 2886500 2886406 1945228
43355A945228j425703q80219J29663Q69816J055358N96931j99209m51418J98352
$$ 1945228 519525 -360694 -231031 638785 1694143 2291074 2091865 1640447 1838799
43346A838799P67548L53329l31880k03963K85137J78309K5058P46266J310797
$$ 1838799 2606347 2959676 2627796 2423833 2708970 2887279 2912337 3658603 4969400
43337D969400J29485j714824j581672L51577R63923r05768k511191j441123R23642
$$ 4969400 5098885 3384061 1802389 2153966 3117889 2212121 -299070 -1740193 -816551
43328h16551J905645J217320K63265l84042q34708o57075K78417Q23405J01467
$$ -816551 1089094 2306414 2569679 2185637 1350929 693854 972271 1795676 1897143
43319A897143r39560j001766m13080j62148q9070L35524N00643k75590j074051
$$ 1897143 957583 -44183 -457263 -619411 -708481 -372957 127686 -147904 -1221955
43310a221955o63398K96175L25564k22135K07750J387251J331294m37147j893715
$$ -1221955 -1885353 -1589178 -1263614 -1485749 -1277999 109252 1440546 1003399 -890316
43301h90316j535247m82103m61333j199273j201550j84560O91992O53618J83822
$$ -890316 -2425563 -2907666 -3368999 -4568272 -5769822 -5954382 -5262390 -4608772 -4424950
43292d424950L6100K37716L68512L41862N05665J052850J632952J740955J404932
$$ -4424950 -4388850 -4151134 -3782622 -3440760 -2935095 -1882245 -249293 1491662 2896594
43283B896594J200748J464778J718850J121328n26569k326981k910221j698544
$$ 2896594 4097342 5562120 7280970 8402298 7875729 5548748 2638527 939983
43275I39983L41909J493908J082891J05062k82950k47766m75407o07845J31606
$$ 939983 1281892 2775800 3858691 3963753 3680803 3433037 2957630 2349785 2481391
43266B481391J108919Q04590p04773j577188r84781k25571k68413j27798R97809
$$ 2481391 3590310 4394900 3690127 2112939 1128158 902587 634174 506376 1504185
43257A504185J776429P86005q63212j077406n8201J76421r11081j756221j343606
$$ 1504185 3280614 4066619 3203407 2126001 2067800 2244221 1333140 -423081 -1766687
43248a766687m57546L8264M17289J014176J324934Q70260J1983o15015q07830
$$ -1766687 -2224233 -2185969 -1768680 -754504 570430 1440690 1452673 837658 29828
43239B9828o56555k94840P2391L24513M82064K88811o67568j870016j830477r2877
$$ 29828 -626727 -921567 -849176 -524663 -42599 246212 -421356 -2291372 -4121849 -4214726
43229d214726J693249J934346J272558J059260Q52832m02831j712095j285962
$$ -4214726 -2521477 -587131 685427 1744687 2597519 2194688 482593 -803369
43221h03369M3406k48536j987780k141964K27888K162218J390676k90168k44039
$$ -803369 -759963 -1008499 -2996279 -5138243 -4910355 -2748137 -1357461 -1647629 -1891668
43212a891668R44425J052198m8474p13402k50882Q42932K174231L023638K001316
$$ -1891668 -947243 104955 56481 -656921 -907803 -64871 2109360 5132998 7134314
43203G134314p25125k250187m75766K330878K310476m99405k488797j881840n57043
$$ 7134314 6409189 4159002 3683236 6014114 8324590 7825185 5336388 3454548 2897505
43194B897505k25856p6633P08736R51683l05732j655950j250835M69871J585765
$$ 2897505 2671649 2595016 3303752 4255435 3949703 2293753 1042918 1512789 3098554
43185C098554J277405K44721o80249j105268q19280j6758N75775N19740J90541
$$ 3098554 4375959 4620680 3940431 2835163 2015883 1999125 2574900 3094640 3285181
43176C285181k7878m28254j253255j954374j885480j179802k85984P75611J958612
$$ 3285181 3257303 2829049 1575794 -378580 -2264060 -3443862 -3729846 -2954235 -995623
43167i95623K534213J767981L1678j415770j615073n14111J196370K398445K194140
$$ -995623 1538590 3306571 3338249 1922479 307406 -206705 989665 3388110 5582250
43158E582250Q60807k02867o9395N43443K97103r51570k092682k267931j654258
$$ 5582250 6443057 6240190 6170795 6714238 7011341 6059771 3967089 1699158 44900
43149D4900q36426j52599K41160K64310P0060o0838p1277p7827j6951K71099O13278
$$ 44900 -791526 -944125 -702965 -438655 -368595 -429433 -500710 -578537 -595488 -324389 288889
43138B88889N77779P1130m67194n67778j72020M73271J058308J245559P77488
$$ 288889 866668 937798 470604 -97174 -269194 204077 1262385 2507944 3285432
43129C285432j91812j007694j022927k40285O85767J139704J097169Q63455M62466
$$ 3285432 3093620 2085926 1062999 822714 1508481 2648185 3745354 4608809 5071275
43120E071275k94453j112676j197365l57792L72802o9039j259336j839435j477498
$$ 5071275 4776822 3664146 2466781 2108989 2481791 2412752 1153416 -686019 -2163517
43111b163517j191869j466324j216644N67088K970647L987466K849267O52143
$$ -2163517 -3355386 -4821710 -6038354 -5471266 -2500619 1486847 4336114 4988257
43103D988257j109131j782356j472214o47799k4409j33517p15801r80432o18050
$$ 4988257 3879126 2096770 624556 -23243 -47652 -181169 -896970 -1877402 -2495452
43094b495452j18529L3044k4525N8602K46758K55254R372l03496m45938k07201
$$ -2495452 -2613981 -2580937 -2605462 -2546860 -2300102 -2044848 -2035476 -2338972 -2784910 -2992111
43084b992111M99366J383546J820726J432900N44672j69042m12575l89823k52610
$$ -2992111 -2492745 -1109199 711527 2144427 2689099 2520057 2107482 1717659 1465049
43075A465049J62113Q33566J157660N58911n66593j112868o64375n2680j10747
$$ 1465049 1627162 2460728 3618388 4177299 3610706 2497838 1833463 1780783 1670036
43066A670036m67285k83488K98380M32734L6753j99479k49119q33628j766288
$$ 1670036 1202751 919263 1217643 1650377 1687130 1487651 1238532 404904 -1361384
43057a361384j703620l08679P65660K21115q06167n19281O94032J040247L27309
$$ -1361384 -3065004 -3373683 -2608023 -2386908 -3193075 -3712356 -3018324 -1978077 -1650768
43048a650768J06918Q87194J261347K46597j268849k049292j973538j319863n5857
$$ -1650768 -1543850 -656656 604691 851288 -417561 -2466853 -4440391 -5760254 -5816111
43039e816111J353908J790066J054649M00819N91904P05432p3934p98077k97332
$$ -5816111 -4462203 -2672137 -1617488 -1216669 -624765 80667 6733 -791344 -1088676
43030a088676P23582P42975k13325q84072q39535n95290j45655Q60272J715149
$$ -1088676 -365094 377881 164556 -719516 -1559051 -2154341 -2299996 -1439724 275425
43021B75425J213009l22012j184419o38562L66280R67099J285624J286741M18718
$$ 275425 1488434 1166422 -17997 -656559 -290279 676820 1962444 3249185 3667903
43012C667903j033587j762549j306094p20722o99930m79658M94549J252719Q13606
$$ 3667903 2634316 871767 -434327 -1155049 -1854979 -2334637 -1840088 -587369 226237
43003B26237k01891o94630p31682p94150m67327O12133J414722Q28047l20522
$$ 226237 24346 -670284 -1401966 -2196116 -2663443 -2051310 -636588 191459 -129063
42994a29063l21704P17527J066643J80456n15807O6614J223388J810881J639326
$$ -129063 -450767 266760 1333403 1513859 998052 1064666 2288054 4098935 5738261
42985E738261Q96771n32633k335910l317519k592523p35500Q41734J261196O62531
$$ 5738261 6635032 6102399 3766489 448970 -2143553 -2879053 -2037319 -776123 -113592
42976a13592j24818j90519N55272J001832J33366j307141j570299m70107K23184
$$ -113592 -238410 -428929 126343 1128175 1261541 -45600 -1615899 -2086006 -1862822
42967a862822m93355j279072o55191O00197P92061O9931O4246J203216K135266
$$ -1862822 -2356177 -3635249 -4290440 -3690243 -2898182 -2828251 -2764005 -1560789 574477
42958E74477J816177O71556m58355j157120r98943L11061J875426J978866K71261
$$ 574477 2390654 3062210 2603855 1446735 447792 758853 2634279 4613145 4884406
42949D884406j459177j513512l93770K26981j46684o76984q94498j192653j575058
$$ 4884406 3425229 1911717 1517947 1744928 1598244 921260 26762 -1165891 -2740949
42940b740949j164758M43532K121398K306870R47402l23077p6113J277239K063039
$$ -2740949 -3905707 -3462175 -1340777 966093 1913495 1590418 1514305 2791544 4854583
42931D854583J343420j35485j091148j275068j382799j686813j569353o11168
$$ 4854583 6198003 6062518 4971370 3696302 2313503 626690 -942663 -1553831
42923a553831N60963J023958P21920L21730K02020K04464K22159L25621K63473
$$ -1553831 -992868 31090 753010 1074740 1276760 1481224 1703383 2029004 2292477
42914B292477m32581j540554j950068q95744R23271J949286J352383l38529j955960
$$ 2292477 1859896 319342 -1630726 -2526470 -1603199 346087 1698470 1359941 -596019
42905e96019k558587j756610J14560J953275K591530J914562R52457N64301M28207
$$ -596019 -3154606 -4911216 -4796656 -2843381 -251851 1662711 2615168 3179469 3607676
42896C607676k15681j190035j480262o93461K99806M81296p5022n26473n02820
$$ 3607676 3391995 2201960 721698 28237 328043 809339 734317 207844 -294976
42887b94976m51164p48013r95844n48008M73711J141917Q70336K64862L88618
$$ -294976 -746140 -1494153 -2489997 -3038005 -2564294 -1422377 -552041 -287179 101439
42878A01439J264179J702940Q74392n06213j072377n06439K81487M17113j88590
$$ 101439 1365618 3068558 3942950 3436737 2364360 1857921 2139408 2556521 2367931
42869B367931j153230j864658j522232N8893J588714J363543m53283j731034j120492
$$ 2367931 1214701 -649957 -2172189 -2113296 -524582 838961 385678 -1345356 -2465848
42860b465848K39378N84369n9688n13650n00834n28535l86098M85719J400228
$$ -2465848 -2226470 -1642101 -1701789 -2215439 -2716273 -3244808 -3630906 -3145187 -1744959
42851a744959J009966m11916j006163j0902J233695J535154J468266J838918K014989
$$ -1744959 -734993 -1146909 -2153072 -2163974 -930279 604875 2073141 3912059 5927048
42842E927048J071255m51475j273888j198894j027024j147828j246353j013923
$$ 5927048 6998303 6546828 5272940 4074046 3047022 1899194 652841 -361082
42834c61082l19938Q32526J796688J461278j81908j493050j267052m12941k21405
$$ -361082 -681020 151506 1948194 3409472 3227564 1734514 467462 54521 -166884
42825a66884n2051J282313K630573J595245j484116l294438k046635J62801O90848
$$ -166884 -218935 1063378 3693951 5289196 3805080 510642 -1535993 -1373192 -682344
42816f82344q7062k44944L88160N24098K827o4254O54647J356363J654096J855038
$$ -682344 -769406 -1014350 -626190 -102092 -99265 -163519 491128 1847491 3501587 5356625
42806E356625J722556N62591j236065k212708j815782j115638j023248r77381
$$ 5356625 7079181 7641772 6405707 4192999 2377217 1261579 238331 -739050
42798g39050j52931R83577J294393O31843q907J55123Q18068J090712N44567l22504
$$ -739050 -891981 91596 1385989 2017832 2008925 2164048 2982116 4072828 4617395 4294891
42788D294891o37874k25497Q1838m71157j422388j648565r09899l0380M72734
$$ 4294891 3657017 3431520 3513358 3042201 1619813 -28752 -938651 -969031 -496297
42779d96297R46335J494707J379922K22665j046797j339606r17198p87025j011070
$$ -496297 450038 1944745 3324667 3547332 2500535 1160929 243731 -543294 -1554364
42770a554364o92405M63999J584729J770675J047370J8894p76459j016892o98619
$$ -1554364 -2246769 -1782770 -198041 1572634 2620004 2638898 1862439 845547 146928
42761A46928k45297k8357K18665Q95557J531656J218245J92230j42292O73553
$$ 146928 -98369 -126726 91939 987496 2519152 3737397 3929627 3787335 4460888
42752D460888J154192J2555j588945j401775O39348K115805J332698o34782j770585
$$ 4460888 5615080 5627635 4038690 2636915 3276263 5392068 6724766 6089984 4319399
42743D319399j720391j460226j296705p16829P4021Q1907o64384o58262Q56243
$$ 4319399 2599008 1138782 -157923 -874752 -800731 -718824 -1383208 -2041470 -1185227
42734a185227K276846J568024p27727j902453o34837J254493J289522m58775j742760
$$ -1185227 1091619 2659643 1931916 29463 -605374 649119 1938641 1479866 -262894
42725b62894j187796K49910R07050M28125k93927m74450j10888L56358M99956
$$ -262894 -1450690 -1200780 -293730 134395 -159532 -633982 -744870 -388512 111444
42716A11444J44961m30814n95458o123Q82008J273563R89094O06316N64007N17127
$$ 111444 256405 -174409 -769867 -775990 106018 1379581 2368675 2974991 3538998 4056125
42706D056125j05410j127038j657088j165135j51662N10437O42887P37853R47450
$$ 4056125 3950715 2823677 1166589 1454 -150208 360229 1003116 1740969 2688419
42697B688419P05945l21968j394442j400086k62003R46871J279992P41796j89924
$$ 2688419 3394364 3072396 1677954 277868 15865 962736 2242728 2984524 2794600
42688B794600j142422j671488j250036l3814Q81284O72109r3901k90733J16603
$$ 2794600 1652178 -19310 -1269346 -1303160 -421876 250233 156332 -134401 -17798
42679a7798J66727m49732q67582m03934M91354J052348J133246Q24145q701j045195
$$ -17798 148929 -300803 -1168385 -1572319 -1080965 -28617 1104629 1928774 1920073 874878
42669H74878j161105J77348J679190J620317K47805n35356M8527O35006j5245
$$ 874878 -286227 -108879 1570311 3190628 3438433 2903077 2951604 3586610 3571365
42660C571365j132446j315725o87714l26015k56532M01467J507457J750548P11662
$$ 3571365 2438919 1123194 435480 109465 -147067 254400 1761857 3512405 4224067
42651D224067l81964n65419m96852j020361j524736j010825o168R8533p05082
$$ 4224067 3842103 3276684 2779832 1759471 234735 -776090 -782258 -683725 -1388807
42642a388807j003771k32102N11725L51164k6642L15704J022419J212451R61852
$$ -1388807 -2392578 -2624680 -2112955 -1761791 -1788433 -1472729 -450310 762141 1723993
42633A723993Q97176Q77788L01270n41421o31642K00971Q95882N53173o10650
$$ 1723993 2621169 3498957 3800227 3258806 2627164 2828135 3724017 4277190 3666540
42624C666540j823593k439361j936941k15924J760548K521676J753345O17049
$$ 3666540 1842947 -596414 -2533355 -2749279 -988731 1532945 3286290 3903339
42616C903339K5110l93383j001887j028407J19043J334159J106717j74896q06718
$$ 3903339 3928449 3535066 2533179 1504772 1623815 2957974 4064691 3889795 3083077
42607C083077m28976l47531j009434j017834N10758K180678K182742Q34730j67163
$$ 3083077 2654101 2306570 1297136 279302 790060 2970738 5153480 5988210 5821047
42598E821047l28528o51529j602629k266858j759864l91969R04448J512093J280089
$$ 5821047 5492519 4840990 3238361 971503 -788361 -1180330 -275882 1236211 2516300
42589B516300N01747m7646K23189Q36043P76788M1292l15129N2669J37386o55405
$$ 2516300 3018047 2970401 3193590 4029633 4806421 4847713 4532584 4585253 4722639 4067234
42579D067234j320802r23397l71975r56758j837949j017029J237257K122247K31264
$$ 4067234 2746432 1823035 1451060 494302 -1343647 -2360676 -1123419 998828 1230092
42570A230092k173704k238601m13844O12090Q498m05766N80015J733927J568864
$$ 1230092 -943612 -3182213 -3596057 -2983967 -2975469 -3381235 -2801220 -1067293 501571
42561E01571N71898J1391j32579n02282n80108N59063K086864K006896J57832
$$ 501571 1073469 1084860 952281 449999 -130109 428954 2515818 4522714 4680546
42552D680546j239668p69995J88220j14426r56848o10425L99289r7901k199570
$$ 4680546 3440878 2670883 2859103 2744677 1787829 1177404 1576693 1478792 -720778
42543g20778l280244j739743P42043J913064K045360K551222K946599J585635
$$ -720778 -4001022 -5740765 -4998722 -3085658 -1040298 1510924 4457523 6043158
42535F043158j081624k402361j037745J305707K301645J604050K73111r50333
$$ 6043158 4961534 2559173 1521428 2827135 5128780 6732830 7005941 6055608
42527F055608j735142j626547o18474L96826O89860N97026O03066L59812m23517
$$ 6055608 4320466 2693919 2075445 2472271 3162131 3759157 4362223 4722035 4298518
42518D298518j019760q63025q36978j793768k468798r32012K012036L137366J103611
$$ 4298518 3278758 2415733 1578755 -215013 -2683811 -3615823 -1603787 1533579 2637190
42509B637190j579161j975600m05943P47874N70180J39819K67740N48988N50387
$$ 2637190 1058029 -917571 -1323514 -575640 -5460 134359 402099 951087 1501474
42500A501474M39093K98835l003j57829K91965Q96450O37486m71951j239980j063092
$$ 1501474 1940567 2239402 2236399 2078570 2370535 3266985 3904471 3432520 2192540 1129448
42490A129448o86680p09409n60569J84887O26620n1101q30009j30406J522119
$$ 1129448 442768 -266641 -827210 -642323 -15703 -66804 -896813 -1027219 494900
42481D94900J894383L51613r98143l53294J063613Q23514j054464k101959r65791
$$ 494900 2389283 2740896 1742753 1389459 2453072 3276586 2222122 120163 -845628
42472h45628Q09997J193518M31617K61143J208424K044225J718077O11808l39939
$$ -845628 -35631 1157887 1589504 1850647 3059071 5103296 6821373 7433181 7093242
42463G093242q13760r41086o89221j5664O57679O41431l28229j738311k601872
$$ 7093242 6279482 5338396 4649175 4633511 5291190 5932621 5604392 3866081 1264209
42454A264209k206493q47210K55437J91246m94482m18813Q00942J968491J834238
$$ 1264209 -942284 -1789494 -1534057 -1342811 -1837293 -2256106 -1455164 513327 2347565
42445B347565N86920n76447q32898k40933O22428J030820N82724k02371k78363
$$ 2347565 2934485 2358038 1525140 1284207 1906635 2937455 3520179 3317808 3039445
42436C039445M40961P00571k68703j374527j228051l21654r8062l49789M68228
$$ 3039445 3480406 4180977 3912274 2537747 1309696 988042 889980 540191 1008419
42427A008419K286230K971453J560127j25441l53641q9229q84860j736680n79075
$$ 1008419 3294649 6266102 7826229 7700788 7347147 7257918 6373058 4636378 4057303
42418D057303J832372K364036P7266k223411j987038k93087K91234m35651o31992
$$ 4057303 5889675 8253711 8330977 6107566 4120528 3827441 4118675 3683024 3051032
42409C051032K62058P12043k82848j527383j366131j9696P75005Q8712j042095
$$ 3051032 3313090 4025133 3742285 2214902 848771 829075 1604080 1692792 650697
42400F50697r52030N44743J828023J416772j26375q42048J31615J545112J825581
$$ 650697 -301333 243410 2071433 3488205 3361830 2519782 2651397 4196509 6022090
42391F022090R68156m9737q60999j565184j606355l45878J290384J335814n34929
$$ 6022090 6990246 6940509 6079510 4514326 2907971 2562093 3852477 5188291 4653362
42382D653362k174066j629905L52803J448791O62210q51714j445509n94104R00184
$$ 4653362 2479296 849391 1202194 2650985 3313195 2461481 1015972 421868 1322052
42373A322052J647487Q54144p24987j375260m08753R82983J359785P29808j30055
$$ 1322052 2969539 3823683 3098696 1723436 1314683 2297666 3657451 4387259 4257204
42364D257204j079877k103710k229211o78367J278562J489956r957r55375j98885
$$ 4257204 3177327 1073617 -1155594 -1833961 -555399 934557 924600 -30775 -229660
42355b29660Q11694O36965M1121L38173J097430J090099M55116K58703N43692
$$ -229660 582034 1218999 1260120 1598293 2695723 3785822 4240938 4499641 5043333
42346E043333L80942m78432j342259j713232j530452o28438Q27226J695161R72888
$$ 5043333 5424275 4945843 3603584 1890352 359900 -268538 558688 2253849 3226737
42337C226737o22065j453130j144791o13775j84417O11759J318970O31081j186896
$$ 3226737 2604672 1151542 6751 -607024 -791441 -179682 1139288 1770369 583473
42328E83473j826490m1532K255994K427751N67389j000961r83287k89586k02628
$$ 583473 -1243017 -1284549 971445 3399196 3966585 2965624 1982337 1692751 1490123
42319A490123q19192j458205j558405r52912K201N04702J74386k45342J79618
$$ 1490123 670931 -787274 -2345679 -3298591 -3296390 -2791688 -2617302 -2862644 -2683026
42310b683026J085940J258261N65984K35366Q32239J262270N92383l00290j71898
$$ -2683026 -1597086 -338825 227159 462525 1294764 2557034 3149417 2849127 2677229
42301B677229L70973j74548j375265j048748J235734K851139J611310r86884j863332
$$ 2677229 3048202 2873654 1498389 449641 1685375 4536514 6147824 5160940 3297608
42292C297608o44697M11392L18281N14227J655763J937105Q9232k056845k065607
$$ 3297608 2652911 3064303 3382584 3896811 5552574 7489679 7578911 5522066 3456459
42283C456459n21715J19521o03873r08053n0986O20215K15704l44610k53177j69535
$$ 3456459 2934744 3054265 2450392 1542339 1491353 2111568 2327272 1982662 1729485 1559950
42273A559950o68170r45142k30457P97004J176908J139365J194061P69589p56711
$$ 1559950 891780 -53362 -283819 513185 1690093 2829458 4023519 4793108 4036397
42264D036397k310944k011576K22906K212718J961159j97070k153165k267979
$$ 4036397 1725453 -286123 -63217 2149501 4110660 3913590 1760425 -507554
42256e07554q44959M51200N01206j45091k65673L15846P56965P06665O72882P73937
$$ -507554 -1352513 -901313 -400107 -545198 -810871 -495025 261940 968605 1641487 2415424
42246B415424L81212n36890r29792k25973O89540Q30137M25103P6198l33589r27536
$$ 2415424 2796636 2259746 1329954 1103981 1793521 2623658 3048761 3124959 2791370 1863834
42236A863834j076963m62041Q0846n4982j8223R81592J908692J303217k97310
$$ 1863834 786871 324830 405676 350694 332471 1314063 3222755 4525972 4228662
42227D228662j115891p98062m78454n14341j03049Q16491J149009M73365k76588
$$ 4228662 3112771 2314709 1836255 1321914 1218865 2035356 3184365 3657730 3381142
42218C381142l59885j23259k3113J2143j5277k27406j79394O42321J517781J057512
$$ 3381142 3021257 2897998 2874885 2887028 2871751 2644345 2464951 3107272 4625053 5682565
42208E682565p00390k095875k016202r73896J50030J007539J208447M07308o44801
$$ 5682565 4982175 2886300 870098 -103798 46232 1053771 2262218 2669526 2024725
42199B024725o57677J88910L82575l67275n32299N99691J573595J069479j39107
$$ 2024725 1367048 1555958 1938533 1571258 1038959 1638650 3212245 4281724 4142617
42190D142617o86013n55146l61159j27563P1894l15754j005230o85627P00918
$$ 4142617 3456604 2901458 2540299 2412736 2484630 2168876 1163646 478019 1178937
42181A178937J275969J91668p02697Q4496J061195M65286m37830L04000J414316
$$ 1178937 2454906 2646574 1943877 2028373 3089568 3554854 3117024 3421024 4835340
42172D835340L65405j820024j706100Q89072K401248J180695k93124k3669M55855
$$ 4835340 5200745 3380721 1674621 2563693 4964941 6145636 5852512 5828843 6284698
42163F284698m20644j082414J93573J761957J124437q63482j438095m11457m7092
$$ 6284698 5864054 4781640 4975213 6737170 7861607 6998125 5560030 5148573 5101481
42154E101481r49864j169907L00250J776878J468407j57451j512128j882247j410765
$$ 5101481 4151617 2981710 3281960 5058838 6527245 6369794 4857666 2975419 1564654
42145A564654l59472O70340P76590o0822o06883k4841Q09279N77514m82506r61920
$$ 1564654 1205182 1875522 2652112 2591290 1984407 1959566 2768845 3346359 2863853 1901933
42135A901933l89685K11522k480n18346m18819K73191Q56686J033976R75240O03490
$$ 1901933 1512248 1723770 1721290 1202944 784125 1057316 1914002 2947978 3923218 4526708
42125D526708l08399j297437j330873j57577J073175J074047n8952j080566j099173
$$ 4526708 4218309 2920872 1589999 1432422 2505597 3579644 3520692 2440126 1340953
42116A340953l56900L44960N27210L27866K06729L81138N17452K04926k87309
$$ 1340953 984053 1329013 1856223 2184089 2390818 2771956 3289408 3494334 3207025
42107C207025k75762J78029J82065m61476n98148N21981J712278J398723Q4931
$$ 3207025 2931263 3109292 3291357 2829881 2231733 2753714 4465992 5864715 5949646
42098E949646l84835K11757J52089j271738k364724j524033L89142J378709R20221
$$ 5949646 5564811 5776568 5928657 4656919 2292195 768162 1157304 2536013 3456234
42089C456234J1729n27058n51303j3822Q75603J319635Q34033R7029o9225l5421
$$ 3456234 3467963 2940905 2389602 2375780 3251383 4571018 5405051 5502080 5432855 5397434
42079E397434n45568j102247o04729O71165J266563P26546R9999P4974J30561
$$ 5397434 4851866 3749619 3144890 3816055 5082618 5809164 5909163 5984137 6114698
42070F114698o3080O7916O50063P50237K4895l55697M07397J116672K94995j338342
$$ 6114698 6051618 6119534 6769597 7519834 7544729 7189032 7596429 8713101 9008096 7669754
42060G669754j747008m75183R50790J366343J164290J032494R26773O54515K97944
$$ 7669754 5922746 5447563 6398353 7764696 8928986 9961480 10888253 11542768 11840712
42051A1840712l00401j392698k373361k149367q54895M8312q9883k06321M93704
$$ 11840712 11540311 10147613 7774252 5624885 4769990 4818302 4728419 4522098 5015802
42042E015802J089671O26202q2310J54690P61064M16537n28499o09028K07291
$$ 5015802 6105473 6731675 6649365 6804055 7565119 7981656 7453157 6844129 7051420
42033G051420N74105K38426L11987Q69419N25590r19215j597659m74306Q16660
$$ 7051420 7625525 7863951 8175938 9045357 9570947 8651732 7054073 6579767 7396427
42024G396427N07917n85788o37413K31538N14862n5886m33805k72507j60636j68026
$$ 7396427 7904344 7318556 6681143 6912681 7427543 7371657 6937852 6665345 6504709 6336683
42014F336683P9138R6338r01480k194236k092748m41034J087783J423886J157611
$$ 6336683 6415821 6512159 5610679 3416443 1323695 882661 1970444 3394330 4551941
42005D551941Q72627K56380n08031k93259J009108J663296M91236j202213j500758
$$ 4551941 5424568 5680948 5172917 4879658 5888766 7552062 8043298 6841085 5340327
41996E340327o05304j35664m67304m90225K10452N66121k50874j454292j567785
$$ 5340327 4735023 4599359 4132055 3641830 3852282 4418403 4167529 2713237 1145452
41987A145452j91837J548667K157987J258816o8820n59318k11352K4433j64450
$$ 1145452 953615 2502282 4660269 5919085 5850265 5290947 5079595 5104028 4939578
41978D939578j43628K21246M5182r78360j639038r38049K10678L30104l04604
$$ 4939578 4795950 5017196 5062378 4084018 2444980 1506931 1717609 2047713 1743109
41969A743109k33637P39085J321214Q71500J36398l09457p26541r17930J234J679024
$$ 1743109 1509472 2248557 3569771 4441271 4577669 4268212 3541671 2623741 2624975 4303999
41959D303999J985948j85996k740877k723818k55706J665785J187502l67496q96754
$$ 4303999 6289947 6103951 3363074 639256 383550 2049335 3236837 2869341 1972587
41950A972587k85099J99531M0971k91289n16594o28028k16992R52611J906603
$$ 1972587 1687488 1887019 1927990 1636701 1120107 492079 275087 1227698 3134301
41941C134301J425136N6321l97091L17335L84122j043576k165482j283717M55218
$$ 3134301 4559437 4615758 4218667 4536002 4920124 3876548 1711066 427349 882567
41932H82567J005562P18699J230965K018525J076255j155897j787958n9320J196924
$$ 882567 1888129 2606828 3837793 5856318 6932573 5776676 3988718 3929398 5126322
41923E126322K1478j607981j139457O15764J346750J012314R61550Q65429l70729
$$ 5126322 5147800 3539819 2400362 3016126 4362876 5375190 6336740 7202169 6831440
41914F831440j663187j018659P05727O77756j189894j830492o8212J329582K02392
$$ 6831440 5168253 4149594 4855321 5533077 4343183 2512691 2444479 3774061 3976453
41905C976453j429149o85532J521701J961766m5850j988375j981599q27440m6928
$$ 3976453 2547304 1861772 3383473 5345239 5299389 3311014 1329415 501975 455047
41896D55047K00436N46878J013889J004242K32460p77093j055166j48477J168794
$$ 455047 655483 1202361 2216250 3220492 3452952 2675859 1620693 1472216 2641010
41887B641010J543803O58614l58388m97237j13314r525p5309K05380N06855J03658
$$ 2641010 4184813 4843427 4485039 3987802 3874488 3864963 3789654 3995034 4501889 4605547
41877D605547p35446r72493l70822K30382K83246J66255K72973M13921M21613
$$ 4605547 3870101 2897608 2526786 2757168 3040414 3206669 3479642 3893563 4315176
41868D315176M96813N99711L11430k62419k57303O61660J457973R49258n88306
$$ 4315176 4811989 5411700 5723130 5460711 5203408 5865068 7323041 8272299 7683993
41859G683993j846533k170172j902516j238368J23894J894510K821228K174336
$$ 7683993 5837460 3667288 1764772 526404 650298 2544808 5366036 7540372
41851G540372R32361N56681R59953P59908n12144j665786j717710j368854j732744
$$ 7540372 8472733 9029414 9989367 10749275 10237131 8571345 6853635 5484781 3752037
41842C752037k417919k101944o38258P36881J320457J727067K344171K288541
$$ 3752037 1334118 -767826 -1406084 -669203 651254 2378321 4722492 7011033
41834G011033Q32709j018750j573426o82048K20318K17923o7876J77845O24178
$$ 7011033 7843742 6824992 5251566 4569518 4789836 5007759 4939883 5117728 5741906
41825E741906M54524k88477q25806q14525n97711l39731K42554J011909J070110
$$ 5741906 6196430 5907953 5082147 4267622 3669911 3330180 3572734 4584643 5654753
41816E654753m2223j306244j273586M259J030333R29555M43876M60516N94348
$$ 5654753 5612530 4306286 3032700 3036959 4067292 4996847 5440723 5901239 6495587
41807F495587R3121o43716o16026J10996N12570K83881K19158P43947J187438
$$ 6495587 6588708 5944992 5328966 5439962 5952532 6236413 6455571 7199518 8386956
41798H386956R29421L25552n9291l67258r60713j580607j620912r06452K36551
$$ 8386956 9316377 9641929 9582638 9215380 8254667 6674060 5053148 4146696 4383247
41789D383247J331017J826252J294765L8946q36975m62768Q16616J759175J368838
$$ 4383247 5714264 7540516 8835281 8874227 8037252 7574484 8391100 10150275 11519113
41780A1519113l44354k379958l406956k821057j288652Q4364R97844J793460K307202
$$ 11519113 11174759 8794801 5387845 2566788 1278136 1362500 2360344 4153804 6461006
41771F461006J956547J027286O04648Q34649N72250n79401j255243l93384R25279
$$ 6461006 8417553 9444839 10049487 10884136 11456386 10876985 9621742 9228358 10153637
41762A0153637J053953K13042j69696J96144M09066J70081k4457j94347p47797
$$ 10153637 11207590 11420632 11250936 11447080 11856146 12026227 12001770 11807423 11059626
41753A1059626j214957p64285R2282M7240p19492p17866J35419J10401j294365
$$ 11059626 9844669 9080384 9172666 9219906 8500414 7782548 7917967 8028368 6734003
41744F734003k058721p11308J159559J218334j94708r37307m15114P8018m7751
$$ 6734003 4675282 3963974 5123533 6341867 6147159 5209852 4794738 4872756 4825005
41735D825005J14930R77342J488925P85674m80097j106321p31113K25911J195421
$$ 4825005 4939935 5917277 7406202 8191876 7711779 6605458 5874345 6100256 7295677
41726G295677J579771R86368j72829q84125o86809p1790M69098R91792J346224
$$ 7295677 8875448 9861816 9688987 8804862 8118053 8046263 8515361 9507153 10853377
41717A0853377Q39452n97527j696159j310684r5649L61405k04502n62140q4539
$$ 10853377 11692829 11095302 9399143 8088459 7992810 8354215 8149713 7587573 7503034
41708G503034K84718l22316j189776j075805j14723L92044j28613p94311n55636
$$ 7503034 7787752 7465436 6275660 5199855 5085132 5477176 5348563 4554252 3998616
41699C998616N01892J391312J284419J58219j192481j635984o59742R24961J673983
$$ 3998616 4500508 5891820 7176239 7334458 6141977 4505993 3846251 4771212 6445195
41690F445195J183056N97494J031433J947244J823155K74170j281674j310441
$$ 6445195 7628251 8225745 9257178 11204422 13027577 13301747 12020073 10709632
41682A0709632K4209J122414P66964o68043j756812j527622l86150M01567J41394
$$ 10709632 10733841 11856255 12623219 11955176 10198364 8670742 8284592 8686159 8827553
41673H827553m65006j64817J134696J902528O89992j830237l210027j978214M68803
$$ 8827553 8362547 8197730 9332426 11234954 11924946 10094709 6884682 4906468 5375271
41664E375271J457181L18234r02508l07124J321546J764503M72741q91260r47601
$$ 5375271 6832452 7150686 6248178 5941054 7262600 9027103 9499844 8608584 7660983
41655G660983k87148j80350o77171q39134k35543O52593J222084J246289P70984
$$ 7660983 7373835 7193485 6516314 5677180 5441637 6094230 7316314 8562603 9333587
41646I333587P7418l91408m94364n71694q15419q62308m92409k29832n22514p59825
$$ 9333587 9411005 9019597 8525233 7953539 7138120 6275812 5783403 5553571 5031057 4271232
41636D271232o1197J191369J691011J091031M41145M82905O18832J41963m97971
$$ 4271232 4210035 5401404 7092415 8183446 8624591 9107496 9726328 9868291 9370320
41627I370320n22180k00537l43399p79327m76708P64483J768032J512306M12349
$$ 9370320 8848140 8647603 8304204 7524877 7048169 7812652 9580684 11092990 11505339
41618A1505339m77249q68184j029231o39931R32427L060616L770160J994702q58602
$$ 11505339 11028090 10159906 9130675 8490744 9423171 12483787 16253947 18248649 17390047
41609A7390047k512102k404035j625748q40224J92512J112633Q17322n65307j192905
$$ 17390047 14877945 12473910 10848162 10007938 10200450 11313083 12130405 11565098 10372193
41600A0372193n3713J360065J222773M8431l90498J07970L02152p9666j04987
$$ 10372193 10318480 11678545 12901318 12949749 12559251 12667221 12969373 12889707 12784720
41591A2784720K58387j32292j361702j824936n98660J095500J679650J160729
$$ 12784720 13043107 12910815 11549113 9724177 9125517 10221017 11900667 13061396
41583A3061396L80022m18880j163819j155626J0237J391328J733262J072574L09923
$$ 13061396 13441418 13022538 11858719 10703093 10713330 12104658 13837920 14910494 15220417
41574A5220417k74555r64658j477704j132752j16468M42969j67990j472002k391808
$$ 15220417 14945862 13981204 12503500 11370748 11254280 11697249 11529259 10057257 7665449
41565G665449k111017n79623J206995J750462O96029l26535M63721K405296K860237
$$ 7665449 5554432 4974809 6181804 7932266 8628295 8301760 8765481 11170777 14031014
41556A4031014O21384k294966l048986j383141L86578M47511n23644o75033N33458
$$ 14031014 14652398 12357432 9308446 7925305 8311883 8759394 8235750 7560717 8094175
41547H094175J812348J784646O24262k85820n2673P34337P81685l37681j627236
$$ 8094175 9906523 11691169 12315431 12029611 11976938 12711275 13492960 13155279 11528043
41538A1528043j777089o89911M35977O67263N00394Q97394J529590J077719n64765
$$ 11528043 9750954 9061043 9497020 10164283 10664677 11562071 13091661 14169380 13604615
41529A3604615j682181j090962P4684J62922m04768n8906J038567J191583K08014
$$ 13604615 11922434 10831472 10906156 11069078 10664310 10605404 11643971 12835554 13043568
41520A3043568j01387R03552J304837k95855k280136k380960j037193l05843m89291
$$ 13043568 12942181 13845733 15150570 14854715 12574579 10193619 9156426 8850583 8361292
41511H361292j58849R62408J489234Q17455j9906l22147o51069j190705r70478
$$ 8361292 8202443 9164851 10654085 11471540 11451634 11129487 10478418 9287713 8317235
41502H317235L31343J333720Q76054k11435n17149j96698k52782m54157K56884
$$ 8317235 8648578 9982298 10858352 10646917 10129768 9933070 9680288 9226131 9483015
41493I483015J523877J600604L8428j243344m99310J383612K159392J208666j10823
$$ 9483015 11006892 12607496 12645924 11402580 10903270 12286882 14446274 15654940 15544117
41484A5544117p45707j059482j508965j699763j403775j230434j329964n79474
$$ 15544117 14798410 13738928 12229963 10530200 9126425 7895991 6566027 5986553
41476E986553J614816L618375L354550J284580k33750l72906n69782j586998k057600
$$ 5986553 7601369 11219744 14574294 15858874 15625124 15252218 14682436 13095438 11037838
41467A1037838r10937O70700J095249O72663O11641R48328J039002J077267J479827
$$ 11037838 10126901 10797601 11892850 12565513 13177154 14125482 15164484 16241751 17721578
41458A7721578J621202Q65718J16390N60414J501187J359331L67690J61782Q64215
$$ 17721578 19342780 20208498 20324888 20885302 22386489 23745820 24113510 24275292 25139507
41449B5139507Q32395m30717j324327p97190K8964j02362n72850j55017R50948
$$ 25139507 25971902 25541185 24216858 23419668 23448632 23346270 22773420 22618403 23569351
41440B3569351J640516J658552J661972J965902K103843J458751m6218j598173
$$ 23569351 25209867 26868419 28530391 30496293 32600136 34058887 34012669 32414496
41432C2414496j858827l79811J398779J577614K58006p03110n61666o45892j764783
$$ 32414496 30555669 30175858 31574637 33152251 33410257 32707147 32145481 31499589 29734806
41423B9734806k423099j054019J233042J943510O83305l72828M69566K299796
$$ 29734806 27311707 26257688 27490730 29434240 30117545 29744717 30214283 32514079
41415C2514079K967428J702039k03069r92762k73727Q77521J415128J406619J328453
$$ 32514079 35481507 37183546 36980477 35987715 35713988 36591509 38006637 39413256 40741709
41406D0741709R65061o1003j061050q68162L22930R96081M44941l86917n40585
$$ 40741709 41706770 41645767 40584717 39716555 40039485 41035566 41480507 41093590 40553005
41397D0553005k34930J5549J71717P3165n47999r77088q8134J361416J024168
$$ 40553005 40318075 40333624 40505341 40578506 40030507 39053419 38965285 40326701 41350869
41388D1350869j338816k652953p90224K045910K570661J246692Q56815J541361
$$ 41350869 40012053 37359100 36568876 38614786 41185447 42432139 43288954 44830315
41380D4830315Q99713j246725j978613J3707K159752J979534O12130M00392J088603
$$ 44830315 45730028 44483303 42504690 42518397 44678149 46657683 47269813 47670205 48758808
41371D8758808Q25127l60499n85496P84898K184143K194129J288093P67728J051696
$$ 48758808 49583935 49223436 48637940 49422838 51606981 53801110 55089203 55856931 56908627
41362E6908627J617165K000001K233241K484136K699404K703150K436453J924665
$$ 56908627 58525792 60525793 62759034 65243170 67942574 70645724 73082177 75006842
41354G5006842J155474L21259O9157Q85543K133460K548728K059917K062070L150705
$$ 75006842 76162316 76483575 76552732 77438275 79571735 82120463 84180380 86242450 89393155
41345H9393155L852063K995240K194302L839938P152525Q716714P172371M970021
$$ 89393155 93245218 96240458 98434760 102274698 109427223 118143937 125316308 130286329
41337A30286329M693660N887087O786393P220050Q058757R202068R928291J0322515
$$ 130286329 134979989 140867076 147653469 154873519 162932276 172134344 182062635 192385150
41329A92385150J0758417J0757437R888636R058805R337139J0128448J0096294
$$ 192385150 203143567 213901004 223789640 232848445 242185584 252314032 262410326
41322B62410326R300994Q694515P986129N988076K966365O65924k21954p73047
$$ 262410326 271711320 280405835 288391964 294380040 297346405 298012329 297790375 297017328
41314B97017328j645639k037333j497846j035826j398309j678430q03168P11376
$$ 297017328 295371689 293334356 291836510 290800684 289402375 287723945 286920777 287632153
41306B87632153J630909J657166J068991l57277k713930m923258n797657n816229
$$ 287632153 289263062 290920228 291989219 291631942 288918012 283994754 278197097 272380868
41298B72380868o469502p952147q867837q401077p525182p527254q248209q491392
$$ 272380868 265911366 257959219 249091382 240690305 233165123 225637869 217389660 208898268
41290B08898268p720320o729147o675233p720830q739466q487250p037253n622858
$$ 208898268 201177948 194448801 187773568 180052738 171313272 162826022 155788769 150165911
41282A50165911m898384m100573k565392j275763j645049l114861l505347j988383
$$ 150165911 145267527 141166954 138601562 137325799 135680750 132565889 129060542 127072159
41274A27072159k54685p6433j001884j479782j218503j032000r15552J08528K095835
$$ 127072159 126817474 126741041 125739157 124259375 123040872 122008872 121093320 121201848 123297683
41265A23297683L527190L243583K150502K049453L129249L677092K572101J168570
$$ 123297683 126824873 130068456 132218958 134268411 137397660 141074752 143646853 144815423
41257A44815423J715489M178642N967964N352628L863676M014888N566219N996424
$$ 144815423 146530912 150709554 156677518 162030146 165893822 169908710 175474929 181471353
41249A81471353M430599K784675K437516K129720O17564o54812J88600J840316
$$ 181471353 185901952 188686627 191124143 193253863 193871427 193216615 193405215 195245531
41241A95245531J132932k398397n793518o711609n929752n207980m754730l943468
$$ 195245531 196378463 193980066 188186548 181474939 175545187 170337207 165582477 161639009
41233A61639009k995015k602725k769724l061833l381689l733627l814968l428584
$$ 161639009 158643994 156041269 153271545 150209712 146828023 143094396 139279428 135850844
41225A35850844k729001j701726j62129J412953K029393J604057J225310J473642
$$ 135850844 133121843 131420117 131257988 132670941 134700334 136304391 137529701 139003343
41217A39003343J635094J281131J371241K717847M420758N108021M949119N111984
$$ 139003343 140638437 141919568 143290809 146008656 150429414 155537435 160486554 165598538
41209A65598538N788566O117528N773802N355634N205763M876135L898811K406082
$$ 165598538 171387104 177504632 183278434 188634068 193839831 198715966 202614777 205020859
41201B05020859R15678r3098n22781q58020j701901k929185l850127m350162n017533
$$ 205020859 205936537 205843439 205320658 204462638 202760737 199831552 195981425 191631263 186613730
41192A86613730n920723o379660o335468o594264p114965o661951n113641m347223
$$ 186613730 180693007 174313347 167977879 161383615 154268650 147606699 142493058 138145835
41184A38145835n391110o432180n552514l874319l658099m576383m601001l713810
$$ 138145835 132754725 126322545 120770031 116895712 113237613 108661230 104060229 100346419
41176A00346419l717399m656264m488606k602947q48326m62735n47687l56372
$$ 100346419 96629020 91972756 87484150 84881203 84032877 83570142 83022455 82666083
41168H2666083o19492j573309j946176j138081m29912p80153j237467q09966j88652
$$ 82666083 82046591 80473282 78527106 77389025 76959113 76178960 74941493 74131527 73942875
41159G3942875k57455m64406r0457K55769j79215q33902q57842m61071p7110N88288
$$ 73942875 73685420 73221014 73130557 73386326 73207111 72373209 71515367 71054296 70977186 71565474
41149G1565474J481066J481906J15564j228806j161308k24623L69008O41022R48622
$$ 71565474 73046540 74528446 74644010 73415204 72253896 72029273 72398281 73039303 73987925
41140G3987925N22559j158673k556803j777990M65306J600259O08762j124569
$$ 73987925 74510484 73351811 70795008 69017018 69482324 71082583 71691345 70566776
41132G0566776k183800k542392k544833k094425j234921m37418n3266j84645r09121
$$ 70566776 68382976 65840584 63295751 61201326 59966405 59528987 59475721 59291076 58381955
41123E8381955j875248k107208j143302P8253M13469L8888k18942l70460q32780
$$ 58381955 56506707 54399499 53256197 53334450 53747919 53786807 53567865 53197405 52364625
41114E2364625j172462o98719J95462O97323J050780J856240K451449J771796
$$ 52364625 51192163 50493444 50688906 51386229 52437009 54293249 56744698 58516494
41106E8516494M73945K55740J107305J207806j80247j596670j711504j105483
$$ 58516494 58990439 59246179 60353484 61561290 61381043 59784373 58072869 56967386
41098E6967386r61761j312642j423026r69818j56400O69433J110282J007730P34059
$$ 56967386 56005625 54692983 53269957 52300139 52143739 52813172 53923454 54931184 55665243
41089E5665243N96478J86542q18850j613613j256172m04951n67119j699999k180329
$$ 55665243 56261721 56448263 55629413 54015800 52759628 52354677 51787558 50087559 47907230
41080D7907230j318137k61613k1689j82625j57187k62406p90895j223713j135473
$$ 47907230 46589093 46327480 46305791 46123166 45965979 45703573 44912678 43688965 42553492
41071D2553492r15269r73019j102544j089246j081321j034180o96674l46997n29626
$$ 42553492 41638223 40665204 39562660 38473414 37392093 36357913 35661239 35314242 34784616
41062C4784616r53987q11527k38301j15208l75588j22071M24024k1775j374008
$$ 34784616 33830629 33019102 32780801 32665593 32290005 32167934 32591958 32570183 31196175
41053C1196175j838451q07811q3440j053791k494533k578999j486097n10320K3422
$$ 31196175 29357724 28549913 28466473 27412682 24918149 22339150 20853053 20342733 20366155
41044B0366155M01807L03419m86144j131678r30528m72059l64942J6366J118139
$$ 20366155 20767962 21071381 20585237 19453559 18523031 18050972 17686030 17702396 18820535
41035A8820535J806044J037241j92811l50933J99079J13824n39294q25844j041888
$$ 18820535 20626579 21663820 21471009 21120076 21319155 21432979 20893685 20067841 19025953
41026A9025953k051457l089413k524908o00515P44848P08919K47725l9658n08342
$$ 19025953 16974496 13885083 11360175 10759660 11504508 12213427 12461152 12421494 11913152
41017A1913152q81041k56959R70949J275902M66296n1201J21283k30109j240531
$$ 11913152 11032111 10775152 11746101 13022003 13488299 13437098 13558381 13328272 12087741
41008A2087741j123950P10919J981704P81133j322734j565170m8054P90277L1524
$$ 12087741 10963791 11674710 13656414 14437547 13114813 11549643 11501589 12291866 12323390
40999A2323390p49263l01116O03628P80154L60947J51098K82521K82339q9327
$$ 12323390 11574127 11273011 11876639 12656793 13017740 13168838 13451359 13733698 13644371
40990A3644371o58023j157035j334605r99903k98422K14795O8987n73444j040829
$$ 13644371 12986348 11829313 10494708 9494805 9196383 9411178 9480165 8906721 7865892
40981G865892q62454k40681K74475M83060O78895J073081J390357J243241O35090
$$ 7865892 7003438 6762757 7037232 7520292 8199187 9272268 10662625 11905866 12540956
40972A2540956j74504j010463j640303j640348r46476k89383m29517j071911j202717
$$ 12540956 12366452 11355989 9715686 8075338 7128862 6839479 6409962 5338051 4135334
40963D135334m55835N37449J148241J347485J238153Q26184M90170Q21711J556298
$$ 4135334 3679499 4216948 5365189 6712674 7950827 8777011 9267181 10088892 11645190
40954A1645190J459260m5034j722549j851259m38799O98853J33380j552301k605844
$$ 11645190 13104450 13059416 11336867 9485608 9046809 9745662 9879042 8326741 5720897
40945E720897k116671p20544N32280J359007J942389J980656R50743o31093j207529
$$ 5720897 3604226 2883682 3415962 4774969 6717358 8698014 9648757 9017664 7810135
40936G810135k3765J733713K351349J553958K92521p59060j409488j205384Q7250
$$ 7810135 7786370 9520083 11871432 13425390 13717911 12958851 11549363 10343979 10431229
40927A0431229J405585J249822k33391j361232j289684q39494o43499j43927Q24035
$$ 10431229 11836814 13086636 12853245 11492013 10202329 9362835 8719336 8575409 9399444
40918I399444J117215J65634o35066P3851J319863J238136K1631n03124J11534
$$ 9399444 10516659 10682293 10047227 10121078 11440941 12679077 12700708 12197584 12309118
40909A2309118M01261l56258r37028l59480L94877M5508p83980n05721Q59113
$$ 12309118 12710379 12354121 11417093 11057613 11452490 11497998 10714018 10208297 11067410
40900A1067410J578510P62851k94517J4277J245081J440117j30894j834471j795118
$$ 11067410 12645920 13408771 13114254 13128531 14373612 15813729 15682835 13848364 12053246
40891A2053246m13303K26521p37159j800177j267759M40052J543490J337565P57973
$$ 12053246 11639943 11866464 11129305 9329128 8061369 8501421 10044911 11382476 12140449
40882A2140449O96780Q83212P05386K59875P9112L50857Q50037J246815J123365
$$ 12140449 12837229 13720441 14425827 14685702 14764814 15115671 15965708 17212523 18335888
40873A8335888J36099j340921k104232j320976K69668J020356L50108n51037l03105
$$ 18335888 18471987 17131066 15026834 13705858 13975526 14995882 15345990 14794953 14491848
40864A4491848Q85692J567134R25206l45041j069206r03856l41470J13390L08440
$$ 14491848 15377540 16944674 17869880 17524839 16455633 15551777 15210307 15323697 15632137
40855A5632137K49245O2178J09560P01594J604292K124927J775450O92094n47674
$$ 15632137 15881382 15943560 16053120 16754714 18359006 20483933 22259383 22951477 22403803
40846B2403803j317005j287001p27301l94992p68789j440377j617662j123846
$$ 22403803 21086798 19799797 19072496 18677504 17908715 16468338 14850676 13726830
40838A3726830m44114R1776N30691O96704J49093r78543j774443j612010q99963
$$ 13726830 13282716 13374492 13905183 14601887 14750980 13772437 11997994 10385984 9486021
40829I486021l57231l0773M85452J248863J863738J895849J089335l93212j634472
$$ 9486021 9128790 9098017 9583469 10832332 12696070 14591919 15681254 15288042 13653570
40820A3653570j509663j36698Q42131J96873j193045j490937l35333R52347J342197
$$ 13653570 12143907 12007209 12849340 13046213 11853168 10362231 10026898 10979245 12321442
40811A2321442J048362M85433m18189j449433j780578j054233M9127R08207J734928
$$ 12321442 13369804 13855237 13437048 11987615 10207037 9152804 9201931 10110138 11845066
40802A1845066K539949K315490M46842j697112k047997o04022M85914j48669j416553
$$ 11845066 14385015 16700505 17147347 15450235 13402238 12798216 13284130 13135461 11718908
40793A1718908j638283r12865n14901o90754m58172N26398J249786R12951J87264
$$ 11718908 10080625 9167760 8652859 7962105 7503933 8030331 9280117 10193068 10380332
40784A0380332J52482O34194N18000n11984j443506j290396l09736M55958M26349
$$ 10380332 10532814 11167008 11685008 11173024 9729518 8439122 8129386 8585344 9011693
40775I011693o6438k98430J89065J251449K150125K047815Q38525n53013j011960
$$ 9011693 8945255 8646825 8835890 10087339 12237464 14285279 15123804 14570791 13558831
40766A3558831m23425K17977m2076j077425j904346j752010p38524L77973Q81381
$$ 13558831 13135406 13353383 13311307 12233882 10329536 8577526 7839002 8216975 9098356
40757I098356N70171j81860p23826o50929j70636J33893k1653l29004l74770k05329
$$ 9098356 9668527 9486667 8762841 8111912 7941276 8075169 8053516 7724512 7349742 7144413
40747G144413j58603l11754m60948n68182p94922j051311r48698l49345L95615
$$ 7144413 6985810 6674056 6213108 5644926 4850004 3798693 2849995 2500650 2896265
40738B896265Q83938R77225O18697j42490p91078o46067J55685O30059L39803
$$ 2896265 3780203 4757428 5376125 5233635 4442557 3796490 3952175 4582234 4922037
40729D922037J01347O66137J436456J397609O98610J95683p2281o21545j063610
$$ 4922037 5023384 5689521 7125977 8523586 9222196 9417879 9345598 8724053 7660443
40720G660443n00311N69023M35739j206537k413906j636940J20658Q99101M46277
$$ 7660443 7160132 7729155 8164894 6958357 4544451 2907511 3028169 3927270 4373547
40711D373547j5690J05017L09599K32228J0314l80236r94218j232926m25648R02862
$$ 4373547 4357857 4462874 4772473 5004701 5015015 4634779 3640561 2407635 1981987 2884849
40701B884849J457447R85417N51553P20278O17145n55436k018580k383972j588902
$$ 2884849 4342296 5327713 5879266 6599544 7216689 6661253 4642673 2258701 669799
40692F69799q43115p70084n88306N21294J953192K283664J135652k76604o75393
$$ 669799 -173316 -943400 -1531706 -1010412 942780 3226444 4362096 4085492 3410099
40683C410099k11916P3802j34395j99356J04055k0489j085325k103286j568545
$$ 3410099 3198183 3271985 3137590 2938234 3042289 3021800 1936475 -166811 -1735356
40674a735356N26954K460446K707028J508787K26345m04552q00667j406977j732009
$$ -1735356 -1208402 1252044 3959072 5467859 5694204 5289652 4488985 3082008 1349999
40665A349999j029473L62612J184750R37184N63178R06232J307409P25267l63399
$$ 1349999 320526 683138 1867888 2805072 3368250 4274482 5581891 6307158 5943759
40656E943759n31926L66561J022342P96971M68077M96204K06533n74213p18404
$$ 5943759 5411833 5778394 6800736 7597707 8065784 8561988 8768521 8194308 7475904
40647G475904K27824P72546l05497j683961j249067O71704J739743R18710m49053
$$ 7475904 7703728 8476274 8170777 6486816 5237749 5909453 7649196 8567906 8118853
40638H118853q62451l57421K28023L86689O4803m15891n09628k48866m86964j413859
$$ 8118853 7256402 6898981 7127004 7513693 7578496 7162605 6652977 6404111 5917147 4503288
40628D503288j601927l611J848143J638965j78157j023626l32654k94216j815976
$$ 4503288 2901361 2897750 4745893 6384858 6206701 5183075 4850421 4556205 2740229
40619B740229k635574r92543J284479J506811J16427m57656K93037P12339N3803
$$ 2740229 104655 -887888 396591 1903402 2019829 1562173 1855210 2567549 2621352
40610B621352n92652m13308J04221M60184P56461P55141j08166j360438j557975
$$ 2621352 2028700 1615392 1719613 2179797 2936258 3691399 3583233 2222795 664820
40601F64820k87933J075790J222125M86019n1234j20637j66005l75360n77995
$$ 664820 376887 1452677 2674802 3160821 3109587 2988950 2822945 2447585 1869590
40592A869590o70534n49869j9260P44098J095127Q32301O85115J197587J630007
$$ 1869590 1199056 649187 629927 1374025 2469152 3301453 3986568 5184155 6814162
40583F814162R57246l03437m86885P92866J806758R76887r55339k000439j537286
$$ 6814162 7771408 7467971 6981086 7773952 9580710 10557597 9602258 7601819 6064533
40574F064533o88222l69281k88971o1868o9458o21516j179913j104265n01033
$$ 6064533 5376311 5007030 4718059 4656191 4586733 3965217 2785304 1681039 1180006
40565A180006K43694J062752J715143J486170K19216j021521j218233p13662l52270
$$ 1180006 1423700 2486452 4201595 5687765 5906981 4885460 3667227 2953565 2601295
40556B601295n5279N81983R96257M49925l66561j63579P83105J018046L45683
$$ 2601295 2546016 3127999 4124256 4574181 4207620 4044041 4827146 5845192 6190875
40547F190875J2273L25949J19714r11662j369860n44052K20284k60268j045459
$$ 6190875 6203148 6529097 6648811 5737149 4367289 3823237 4043521 3783253 2737794
40538B737794p33158K66565O41305L01973O1121o898l76184p86262n19486L56181
$$ 2737794 2004636 2271201 2912506 3214479 3275600 3268702 2892518 2106256 1586770 1942951
40528A942951J065806J093231L09019j208231k681293k824495j477275j40671
$$ 1942951 3008757 4101988 4411007 3202776 521483 -2303012 -3780287 -3920958
40520c920958J10908J31756Q85596J453727O66408l85999K45826K032393K433383
$$ -3920958 -3810050 -3678294 -2792698 -1338971 -672563 -1058562 -812736 1219657 3653040
40511C653040O55402j324242j773141j126662l70397M61991J271911J145763j39703
$$ 3653040 4308442 2984200 1211059 84397 -286000 175991 1447902 2593665 2453962
40502B453962j128774m89323J004610J445200K74206j166422j368308k36695J062148
$$ 2453962 1325188 835865 1840475 3285675 3559881 2393459 1025151 788456 1850604
40493A850604J427797Q49594J06925l81622q94570j446790j317159j76683J057883
$$ 1850604 3278401 4127995 4234920 3853298 2958728 1511938 194779 18096 1075979
40484A075979J376225J013988O74591J92549p60138j382369p68772K80536K35267
$$ 1075979 2452204 3466192 4140783 4333332 3573194 2190825 1422053 1702589 1937856
40475A937856o82228q45922P2381P15197M47978J49131K62832L3668p73900j227775
$$ 1937856 1255628 409706 482087 1197284 1645262 1794393 2057225 2090893 1316993 89218
40465H9218r08269n14835k68033M78158J488472J496270M83211J8771N11065L89361
$$ 89218 -819051 -1333886 -1601919 -1123761 364711 1860981 2344192 2362963 2874028 3263389
40455C263389r10135j588212n74638M83058J76727j50267Q38693J530005P9344
$$ 3263389 2353254 765042 190404 673462 850189 699922 1538615 3068620 3147964
40446C147964j844952j399388O82972J257070q5432p57193P8184K79018j116308
$$ 3147964 1303012 -96376 586596 1843666 1758234 1001041 1079225 1358243 241935
40437B41935k000287p98011R36750J201452N25651M78851R74402Q90681J66656
$$ 241935 -1758352 -2556363 -1619613 -418161 107490 586341 1560743 2451424 2618080
40428B618080l45660l24218l8778L47308N93068J87919q79412j822056k060684
$$ 2618080 2272420 1948202 1909424 2256732 2849800 3037719 2158307 336251 -1724433
40419a724433j750087r90064L44423J574557J465455K50355r2145J340272K700890
$$ -1724433 -3474520 -4464584 -4120161 -2545604 -1080149 -829794 -921939 418333 3119223
40410C119223J932465k46143j530048j270327p22962o33871m50726J63886O96549
$$ 3119223 5051688 4805545 3275497 2005170 1282208 648337 197611 361497 1058046
40401A058046Q38252Q53467P40758K25219k93547l4799O87922N60676p05993j655124
$$ 1058046 1896298 2749765 3490523 3715742 3422195 3387396 4075318 4635994 3930001 2274877
40391B274877j107368R9358L40367n01424j026213l48755Q09905J177845M33136
$$ 2274877 1167509 1266867 1607234 1105810 79597 -269158 540747 1718592 2151728
40382B151728o22448j051260o60781J5863M10226M49748L98331L70578K35133
$$ 2151728 1529280 478020 -182761 -166898 243328 693076 1091407 1461985 1697118
40373A697118p0157l99045n93252n90886l36298J63503O85682R86709J162498
$$ 1697118 1626961 1227916 634664 43778 -292520 -129017 556665 1543374 2705872
40364B705872J442095J557860Q20699q74981k526538k942264j967334m36281Q13720
$$ 2705872 4147967 5705827 6526526 5651545 3125007 182743 -1784591 -2220872 -1407152
40355a407152J409862J219007L91173l85517m17431K1702n8777q67537j346178
$$ -1407152 2710 1221717 1612890 1227373 809942 831644 772867 -94670 -1440848
40346a440848o96860L47648N93085J56420J19771O93076Q97784J57746q94840
$$ -1440848 -2137708 -1790060 -1196975 -1040555 -920784 -227708 670076 827822 -67018
40337f7018j493105j614237j383237n96592N58952J232275J117879J110887J836299
$$ -67018 -1560123 -3174360 -4557597 -5154189 -4595237 -3362962 -2245083 -1134196 702103
40328G02103K289799J142748j070835k378648j846636m39894N72808Q70291N96854
$$ 702103 2991902 4134650 3063815 685167 -1161469 -1601363 -1028555 -158264 438590
40319D38590j09073o48262j33004J294001K180764J551707K62301k42343P1297
$$ 438590 329517 -318745 -451749 842252 3023016 4574723 4837024 4594681 4665978
40310D665978M8596p36789j361804r88939o4621L64870L7283l74367l33690j12508
$$ 4665978 4714574 3977785 2615981 1627042 1562421 1927291 1964574 1590207 1256517 1144009
40300A144009j98946m45185l01326K26760M96259K76823J98766O92179J118477
$$ 1144009 945063 499878 198552 425312 921571 1198394 1397160 2089339 3207816
40291C207816O90791k42410p32568o51822n17700k30643O53337J482024R78356
$$ 3207816 3898607 3656197 2923629 2271807 1754107 1523464 2176801 3658825 4637181
40282D637181n09704r65717K85882J231347J31724j680157j777347l15627M43460
$$ 4637181 4127477 3161760 3447642 4678989 4810713 3130556 1353209 1037582 1481042
40273A481042k43311p86460j68303N89285N07741K03817L11321P1248j086029
$$ 1481042 1237731 451271 282968 872253 1379994 1583811 1895132 1966380 880351
40264H80351j893647q94310J083148J845729Q67918k51460k86091K80028O56302
$$ 880351 -1013296 -1907606 -824458 1021271 1889189 1637729 1351638 1631666 2287968
40255B287968R37512J251475J014762k8167r60973r02706l84514m80942j070036
$$ 2287968 3225480 4476955 5491717 5463550 4502577 3599871 3215357 2734415 1664379
40246A664379j106915l90570J30117j24884o33250q15011q13154p99866m14847
$$ 1664379 557464 166894 297011 172127 -461123 -1276134 -2089288 -2889154 -3304001
40237c304001M67984J133645R24604K30986j32306r3437j12785j90728M6168M88649
$$ -3304001 -2836017 -1702372 -777768 -546782 -679088 -772525 -885310 -1076038 -1029870 -541221
40227e41221O59456N88797O85278P43799O6991j204234j846208j126784J27734
$$ -541221 118235 707032 1392310 2136109 2203100 998866 -847342 -1974126 -1846392
40218a846392O24043J98059k85410k19747J70978L45867O9322l71869l48340M47411
$$ -1846392 -1222349 -1024290 -1309700 -1529447 -1358469 -1012602 -943280 -1315149 -1663489 -1216078
40208a216078J355088J266160J20707p17846j86057R08062Q96973m38589j564988
$$ -1216078 139010 1405170 1525877 808031 621974 1530036 2427009 1988420 423432
40199D23432j263983o9218P25139P15849M44251L04533J56371j04869k89117l75454
$$ 423432 -840551 -909769 -184630 531219 975470 1280003 1436374 1331505 1042388 666934
40189F66934o88034j271698j493808p86566M00041J013557Q15651O92440J225766
$$ 666934 -21100 -1292798 -2786606 -3573172 -3173131 -2159574 -1343923 -651483 574283
40180E74283J657856R82582m11399j135348o96663k7308j5371m70744q68582j181603
$$ 574283 2232139 3214721 2803322 1667974 971311 944003 928632 457888 -410694 -1592297
40170a592297j403935j060491K1953J024354J074585N37048N22974J269167J802475
$$ -1592297 -2996232 -4056723 -4034770 -3010416 -1935831 -1398783 -875809 393358 2195833
40161B195833J266084n2899j154243j335270o59226K52972P82767Q04222N92334
$$ 2195833 3461917 3409018 2254775 919505 260279 513251 1296018 2100240 2692574
40152B692574K58862l66425j155202j500436j092205m00961O5613M72797J038951
$$ 2692574 2951436 2585011 1429809 -70627 -1162832 -1563793 -1498180 -1025383 13568
40143A3568J266607O59631j62432q1336Q73222J432338P18582q20115k153489
$$ 13568 1280175 1939806 1777374 1696038 2569260 4001598 4720180 3900065 1746576
40134A746576k563103j773100j11334J237239J030122n39241j791817j407350
$$ 1746576 -816527 -2589627 -2700961 -1463722 -433600 -972841 -2764658 -4172008
40126d172008J80431J489235J547308N20128o33543q58385J06278J299975J516333
$$ -4172008 -3991577 -2502342 -955034 -434906 -1068449 -1926834 -1820556 -520581 995752
40117I95752P82093J71273J06663j38822r36636j436035q73674K32183J000473
$$ 995752 1777845 1949118 2055781 1916959 980323 -455712 -1329386 -1097203 -96730
40108i6730J389153J566328J036138l63586j361973o79182Q60326J229668R0554
$$ -96730 1292423 2858751 3894889 3531303 2169330 1490148 2350474 3580142 3670696
40099C670696q42125m67574L51951O16469P12006J147127J163549m7349j672466
$$ 3670696 2828571 2360997 2712948 3329417 4041423 5188550 6352099 6304750 4632284
40090D632284k250122j747054j268792j079520m38005O33460J014785L66895n6226
$$ 4632284 2382162 635108 -633684 -1713204 -2151209 -1517749 -502964 -136069 -192295
40081a92295P07878J708415J383163k11379j542924j589280o99819K70356P03605
$$ -192295 515583 2223998 3607161 3395782 1852858 263578 -436241 -165885 537720
40072E37720K31555r46003j661827p28631J387304K730597K132225N27770m88653
$$ 537720 769275 -176728 -1838555 -2567186 -1179882 1550715 3682940 4210710 3722057
40063C722057o00171n32128o00664n01593k14423j39259l58539n14328m50516
$$ 3722057 3121886 2589758 1989094 1487501 1273078 1133819 775280 260952 -189564
40054a89564l64509l11930j30381J19524J51550q1122l50261n32156o04111l98849
$$ -189564 -554073 -866003 -996384 -876860 -725310 -806432 -1156693 -1688849 -2292960 -2691809
40044b691809J60254P36360R74122R75284Q65780L22566p07422j317322p61957
$$ -2691809 -2531555 -1795195 -821073 154211 1019991 1342557 635135 -682187 -1444144
40035a444144J33322Q2489l77569N01278K574808L345558J515357q35048j065104
$$ -1444144 -1310822 -1228333 -1605902 -1104624 1470184 4815742 6331099 5496051 4430947
40026D430947M46407J282495N60144m09455n80740m11750n71211r24337j100631
$$ 4430947 4877354 6159849 6719993 6310538 5729798 5318048 4746837 3822500 2721869
40017B721869r84279m77647L08569O67607P5187p58984p08428K3812K32084k55193
$$ 2721869 1737590 1259943 1568512 2236119 2311306 1552322 843894 867706 1099790 844597
40007H44597l24186M08807Q47375K24055p38624j192243j368261j539878j066402
$$ 844597 520411 929218 1776593 2000648 1262024 69781 -1298480 -2838358 -3904760
39998c904760L44937J496179J222093K94473L14755J198062J345487J98264r27124
$$ -3904760 -3559823 -2063644 -841551 -547078 -232323 965739 2311226 2509490 1582366
39989A582366q09956J81971J026024J361645J252933N30808q26297k158195k666258
$$ 1582366 772410 954381 1980405 3342050 4594983 5125791 4299494 2141299 -524959
39980e24959k234426j265686n5596J166771J900054J720160Q91973J02936l78553
$$ -524959 -2759385 -4025071 -4080667 -2913896 -1013842 706318 1598291 1701227 1322674
39971A322674p57350r50530m89921N17125J032505L81585n35610k65861J063207
$$ 1322674 565324 -385206 -875127 -358002 674503 1056088 520478 254617 1317824
39962A317824J737046R14786p3771K17792R99774M32407j308403k002951p02063
$$ 1317824 3054870 3969656 3895885 4113677 5113451 5545858 4237455 2234504 1532441
39953A532441P52857M85960o59478o25267O34625J283259N72142k10283J6510
$$ 1532441 2285298 2771258 2111780 1486513 2121138 3404397 3976539 3766256 3782766
39944C782766O05979N53722L7509k84421m76224q38803r96887n22089O0797n4441
$$ 3782766 4388745 4942467 4979976 4695555 4219331 3380528 2383641 1861552 1922349 1867908
39934A867908o07729o40720n0306K79769m8629l52360k2608N82665Q24353O78682
$$ 1867908 1260179 619459 569153 848922 800293 447933 425325 1007990 1832343 2511025
39924B511025M70857K57841n262q7803K08286O22805P46339N37660K02907j42330
$$ 2511025 2981882 3239723 3234461 3146658 3354944 3977749 4724088 5261748 5464655 5322325
39914E322325l32040n1090O18824R08827K80888n98443n80088L36064R38072N18054
$$ 5322325 4990285 4939195 5558019 6466846 6747734 6149291 5569203 5905267 6843339 7361393
39904G361393k02991k69921J30044J12661n90965j472277k089954k347912k062714
$$ 7361393 7158402 6888481 7018525 7131186 6540221 5067944 2977990 630078 -1432636
39895a432636j034215K94136R11345L88999m29292l60594O50251J464941J193227
$$ -1432636 -2466851 -2172715 -1261370 -872371 -1301663 -1662257 -1012006 452935 1646162
39886A646162K37940l80530l40779o7787L43034J305473K506494K487961M39868
$$ 1646162 1884102 1503572 1162793 1095006 1438040 2743513 5250007 7737968 8177836
39877H177836k198448l180574k224897r44156j01389J194245K983606L229921
$$ 8177836 5979388 2798814 573917 -370239 -471628 722617 3706223 6936144
39869F936144P04866k382600k793681n83203J181995Q09097k06436j47016L48753
$$ 6936144 7641010 5258410 2464729 1881526 3063521 3872618 3666182 3519166 3867919
39860C867919j92197j568720k339553j871043p27166M40836J388974J974414K066140
$$ 3867919 3675722 2107002 -232551 -2103594 -2830760 -2389924 -1000950 973464 3039604
39851C039604J587140M45870j042541j686743n09798J391416J544859n45913k259641
$$ 3039604 4626744 5072614 4030073 2343330 1833532 3224948 4769807 4223894 1964253
39842A964253j321789R87577J778361N53360p90095j166308j137960q45736L36869
$$ 1964253 642464 1630041 3408402 3961762 3171667 2005359 867399 21663 358532
39833C58532J729747J392085q19302k364057j485282K42084M05443p03693r61531
$$ 358532 2088279 3480364 2661062 297005 -1188277 -946193 -540750 -1244443 -2205974
39824b205974J60755J141758J041151O08760N61402M34809k24611p77548m62711
$$ -2205974 -2045219 -903461 137690 746450 1307852 1742661 1518050 740502 277791
39815B77791K99277M36108k59879q60957n46840L68197Q42941L22952p02356j346664
$$ 277791 577068 1013176 753297 -107660 -654500 -286303 556638 879590 177234 -1169430
39805a169430j275638q32877m25484j18347K26205P25381J338614J663493J088148
$$ -1169430 -2445068 -3277945 -3703429 -3821776 -3595571 -2870190 -1531576 131917 1220065
39796A220065l46970j475444j172568P4707O94710J97202l09872p9609J28368
$$ 1220065 873095 -602349 -1774917 -1700210 -1005500 -808298 -1118170 -1197779 -1069411
39787a069411l41079n54213N41515J998299J830877j49399j943158j928407n79080
$$ -1069411 -1410490 -1964703 -1423188 575111 2405988 2256589 313431 -1614976 -2194056
39778b194056O74983J217237J332071J282981R72007K88555n50360j014315p21851
$$ -2194056 -1519073 -301836 1030235 2313216 3285223 3573778 3023418 2009103 1287252
39769A287252k0257K30207k48026p20652n44290j18121q6293k28514k8876K75251
$$ 1287252 1266995 1497202 1249176 528524 -15766 -133887 -220180 -448694 -477570 -202319
39759b02319L04779N73283J536128K158638J163318n98087j031801q3873J24148
$$ -202319 102460 675743 2211871 4370509 5533827 4935740 3903939 3820066 3944214
39750C944214j086609j642793j71511J531245J245389l11662r59136m66802j88969
$$ 3944214 2857605 1214812 1043301 2574546 3819935 3508273 2549137 2082335 1893366
39741A893366k69852L37766J509544J916710J257658M63931k46853j412664k379812
$$ 1893366 1623514 1961280 3470824 5387534 6645192 7109123 6862270 5449606 3069794
39732C069794j621137N49964J836900J286194N53370Q01400O21592j254821l139550
$$ 3069794 1448657 1998621 3835521 5121715 5675085 6476485 7098077 5843256 2703706
39723B703706k585249j83335J242825O44677l59763m32333q7382L1180L79208
$$ 2703706 118457 -64878 1177947 1822624 1462861 1030528 943146 974326 1353534
39714A353534J149148J292296P7227j433414j648145n65663M20425M77318J42239
$$ 1353534 2502682 3794978 3872205 2438791 790646 224983 645408 1122726 1264965
39705A264965K56920Q46604J208055P39610l66625j106467n55694R59014J885795
$$ 1264965 1521885 2368489 3576544 4316154 3949529 2843062 2287368 3246382 5132177
39696E132177J083561p65486j871157j358747n7740P02101M76173k82087r91874
$$ 5132177 6215738 5450252 3579095 2220348 2162608 2864709 3340882 3058795 2066921
39687B066921j294327j032174m41163j96883p01453j304422q02463J035954K892344
$$ 2066921 772594 -259580 -700743 -897626 -1599079 -2903501 -3705964 -2670010 222334
39678B22334L252852K071908O19791j53860m68915q37303j071292p48563k31350
$$ 222334 3475186 5547094 6166885 6013025 5544110 4706807 3635515 2886952 2655602
39669B655602l47394j006814j008745K77570J696077J587269j4068j404025j434084
$$ 2655602 2308208 1301394 292649 570219 2266296 3853565 3839497 2435472 1001388
39660A001388o92061j39953L21611J081695J505367P16614o56934r54190J58321
$$ 1001388 309327 169374 490985 1572680 3078047 3794661 3137727 2183537 2341858
39651B341858J086737N16160r04196j698410j387795m32948P02333J481844J130141
$$ 2341858 3428595 3944755 3040559 1342149 -45646 -478594 223739 1705583 2835724
39642B835724k77869j158614j72226J703622K226276R14846l93964k17600P13284
$$ 2835724 2557855 1399241 1227015 2930637 5156913 6071759 5677795 5460195 6173479
39633F173479Q17685k10517j375234j756812j263081m55998n7632k82732n44258
$$ 6173479 6991164 6780647 5405413 3648601 2385520 1929522 1871890 1589158 1044900
39624A044900k96185j7599m77337j136139o06745J026132J848297Q12823o16485
$$ 1044900 748715 731116 253779 -882360 -1489105 -462973 1385324 2198147 1581662
39615A581662o05499M87858J033624O09935J6771m47786j025007j245997m23532
$$ 1581662 976163 1464021 2497645 3107580 3124351 2676565 1651558 405561 -17971
39606a7971P08572O08391o11622j022773K87898J743106J464133k75690j761326
$$ -17971 690601 1298992 687370 -335403 -47505 1695601 3159734 2884044 1122718
39597A122718k083877j612886q21531K21390J269504J657062R19348n86335j780223
$$ 1122718 -961159 -2574045 -3395576 -3174186 -1904682 -247620 671728 85393 -1694830
39588a694830j655383k14955J385491J907158J205059R9371o34845o60342J24470
$$ -1694830 -3350213 -3565168 -2179677 -272519 932540 1031911 397066 -263276 -138806
39579a38806J287469J599602K31502j712594k094075n23239R77063O66718p41339
$$ -138806 1148663 2748265 2979767 1267173 -826902 -1350141 -373078 293640 -447699
39570d47699j428560q99116J6546P11035J087293Q54093j66251j246928j388538
$$ -447699 -1876259 -2775375 -2758829 -2047794 -960501 -106408 -272659 -1519587 -2908125
39561b908125o53664M8287L42886N94493Q55264O71233M4406l50545j38110L24585
$$ -2908125 -3561789 -3513502 -3170616 -2576123 -1720859 -1049626 -1005220 -1355765 -1493875 -1169290
39551a169290O63679R10658J004490N83817l84635j278141j425782p46752K96774
$$ -1169290 -505611 405047 1409537 1993354 1608719 330578 -1095204 -1841956 -1545182
39542a545182J073141J175327Q06218N93985O40194J90490j080671k024850j385287
$$ -1545182 -472041 703286 1509504 2103489 2743683 2934173 1853502 -171348 -1556635
39533a556635J51939P01583p1044n41212K44919J233789J346253J099274J132604
$$ -1556635 -1404696 -703113 -774157 -1315369 -1070450 163339 1509592 2608866 3741470
39524C741470O91525q35852k090867j359652O97882J835547J325858L87821k37072
$$ 3741470 4432995 3597143 1506276 146624 844506 2680053 4005911 4393732 4156660
39515D156660j029625j840006j478646O7806R11527j03467j567625j589249m36787
$$ 4156660 3127035 1287029 -191617 -123811 787716 684249 -883376 -2472625 -2909412
39506b909412L35921L70681M82734Q08543O54717m876l39236K62N10753P95443
$$ -2909412 -2573491 -2202810 -1720076 -911533 -256816 -261692 -600928 -600666 -89913 705530
39496G05530Q24673L36467q53740j952455j831637p18214l5186l34123o36096
$$ 705530 1530203 1866670 1012930 -939525 -2771162 -3489376 -3524562 -3858685 -4494781
39487d494781j91469M10207M99739M92374R75832J609208J763441J450048R07979
$$ -4494781 -4686250 -4276043 -3776304 -3283930 -2308098 -698890 1064551 2514599 3422578
39478C422578J43001m47498p5625R32601Q41370j057166k855050k450799n99951
$$ 3422578 3565579 3118081 3042456 3975057 4816427 3759261 904211 -1546588 -2146539
39469b146539L20602j20000k64529M79028P15428l44760j510019j557079p60875
$$ -2146539 -1825937 -1945937 -2210466 -1731438 -1016010 -1360770 -2870789 -4427868 -5188743
39460e188743K78935J584465K663365K186924N2508j730297j566922l64826K59592
$$ -5188743 -4909808 -3325343 -661978 1524946 1577454 -152843 -1719765 -2084591 -1824999
39451a824999M37400J027241J467039P51302l80869n15209j86812r47547k104565
$$ -1824999 -1387599 -360358 1106681 1857983 1477114 961905 775093 -172454 -2277019
39442b277019j223776J676127L283193J609394r89662j266098L41717Q84745n29603
$$ -2277019 -3500795 -1824668 1458525 3067919 2078257 812159 1153876 2038621 1509018
39433A509018j885705j637531n47574K13104P67214J446019J570525N90452n17100
$$ 1509018 -376687 -2014218 -2561792 -2348688 -1581474 -135455 1435070 2025522 1508422
39424A508422l68755P05615R73629k12164j397351r99995N15048J224569J61807
$$ 1508422 1139667 1845282 2818911 2606747 1209396 209401 724449 1949018 2110825
39415B110825j645159k560562k110448j112872n00732m27088m03536j6065N83790
$$ 2110825 465666 -2094896 -4205344 -5318216 -5818948 -6246036 -6649572 -6665637 -6081847
39406f081847R02234Q11109P96173J217835J571639J067557r8667p82042m15055
$$ -6081847 -5179613 -4368504 -3572331 -2354496 -782857 284700 186033 -596009 -1011064
39397a011064K13900J33967m70638o59600k3829R86077J683496J640251R10524
$$ -1011064 -797164 -663197 -1133835 -1793435 -1817264 -831187 852309 2492560 3403084
39388C403084J31394n5687K8856n49617j630365j677822n4137J564304J354669
$$ 3403084 3534478 3478791 3507647 2958030 1327665 -350157 -404294 1160010 2514679
39379B514679j5748n43637O5111M18528L9171k13158k06703p36818j424993p99532
$$ 2514679 2498931 1955294 2020405 2438933 2478104 2264946 2058243 1321425 -103568 -903100
39369i03100R23137J560907M35382l32548O34320J610809Q62920k79725P21M18979
$$ -903100 20037 1580944 2016326 1683778 2318098 3928907 4791827 4512102 4512823 4931802
39359D931802j194240l471669l031441J1120J806578M84791j395841j224402K7013
$$ 4931802 3737562 265893 -2765548 -2754428 -947850 -463059 -1858900 -3083302 -3056289
39350c056289L23210O2126P15302J797891J658841K96323p46941p13419j05954
$$ -3056289 -2733079 -2670953 -1955651 -157760 1501081 1797404 1050463 337044 231090
39341B31090O31873J271141J103236k47761j593891j368438P5356Q84289L96966
$$ 231090 862963 2134104 3237340 2989579 1395688 27250 102606 986895 1383861
39332A383861j61893J36605O29259M47496j84180p11598j124749j312678o43708
$$ 1383861 1221968 1358573 1987832 2435328 2251148 1539550 414801 -897877 -1541585
39323a541585Q61292J833039J135043m47920j176033o02665J96644L55937N9357
$$ -1541585 -680293 1152746 2287789 1839869 663836 61171 257815 613752 673109
39314F73109k78747n49916n02163J98692J110012J175561K48076m50764p1939
$$ 673109 394362 -155554 -657717 -459025 650987 1826548 2074624 1623860 1551921
39305A551921N01575o824j213407j577669o95259J95960J13042m54843o01209
$$ 1551921 2053496 2046672 833265 -744404 -1439663 -1243703 -1130661 -1585504 -2186713
39296b186713k31916L02564Q80604J237880P56823n34876j455969j122452l33345
$$ -2186713 -2418629 -2116065 -1235461 2419 759242 224366 -1231603 -2354055 -2687400
39287b687400m24377j189549j219573j24301R40881J071993O17940P6855o77588
$$ -2687400 -3111777 -4301326 -5520899 -5645200 -4704319 -3632326 -3014386 -2937531 -3615119
39278c615119j472570j396725k07735Q16353N22792l55955k61220Q80367J647057
$$ -3615119 -5087689 -6484414 -6692149 -5875796 -5353004 -5708959 -5970179 -5089812 -3442755
39269c442755J192261J17034p08486j026043p03614M74866J996041K505656J307133
$$ -3442755 -2250494 -2133460 -2841946 -3867989 -4571603 -4096737 -2100696 404960 1712093
39260A712093n02979j145264k35902Q43744O71717n91313j511446j058195L64191
$$ 1712093 1209114 63850 -172052 671692 1343409 752096 -759350 -1817545 -1453354
39251a453354J586834J995003J780998J128305n0938j324066j552986k62278J360164
$$ -1453354 133480 2128483 3909481 5037786 4986848 3662782 2109796 1847518 3207682
39242C207682J753543R31341J21339k76899j031608k228425k560689j236016N43707
$$ 3207682 4961225 5892566 6013905 5737006 4705398 2476973 -83716 -1319732 -776025
39233g76025J058453K89686l93640k34057L40958Q11025J048429P62864l98102
$$ -776025 282428 572114 178474 -55583 285375 1096400 2144829 2907693 2509591
39224B509591j950156k704569k158077j020697o3245P58962J574801J812775R74998
$$ 2509591 559435 -2145134 -4303211 -5323908 -5387153 -4628191 -3053390 -1240615 -265617
39215b65617k74926p36963l02824j09494q70576j785673j615735l90043O60742
$$ -265617 -540543 -1277506 -1580330 -1689824 -2560400 -4346073 -5961808 -6351851 -5691109
39206e691109P85547N60499P38802R64605M57798l61707j20389J343591K218184
$$ -5691109 -4905562 -4345063 -3606261 -2641656 -2183858 -2545565 -2665954 -1322363 895821
39197H95821J017537j150225j851860n17366J004232J143878M55815J90213K54290
$$ 895821 1913358 763133 -1088727 -1606093 -601861 542017 997832 1188045 1442335
39188A442335l17437j505391k080989j205368M89468J533930J018324n33865j484908
$$ 1442335 1124898 -380493 -2461482 -3666850 -3177382 -1643452 -625128 -1158993 -2643901
39179b643901o20038J341760K249263R78696j122877j871839q31151N53962J014241
$$ -2643901 -3263939 -1922179 327084 1305780 182903 -1688936 -2520087 -1966125 -951884
39170i51884O25917L2103m26842n63161j85905N06987R41239Q38977M19556j43764
$$ -951884 -325967 -293864 -720706 -1283867 -1469772 -962785 -21546 817431 1236987 1093223
39160A093223q44160j311065r27103J93285J013207Q00657L9322k73455K09919
$$ 1093223 249063 -1062002 -1989105 -1795820 -782613 18044 57366 -216089 -6170
39151f170J035112J478015R69592m18142j589531j222586N55804J941101J483474
$$ -6170 1028942 2506957 3476549 3058407 1468876 246290 802094 2743195 4226669
39142D226669k57820j698419k137667j830561q87813O21909J822173J685455O08904
$$ 4226669 3968849 2270430 132763 -1697798 -2585611 -1963702 -141529 1543926 2152830
39133B152830O1444L99856L04510j061320k533314k526895j267834l02553k72715
$$ 2152830 2214274 2614130 2918640 1857320 -675994 -3202889 -4470723 -4773276 -5045991
39124e045991l83727L9505O60050J037576J386995J866426J911969J096537J64249
$$ -5045991 -5429718 -5390213 -4730163 -3692587 -2305592 -439166 1472803 2569340 2733589
39115B733589K28951J023221R31227q68342l015061l339916j312576J390460K611960
$$ 2733589 2962540 3985761 4916988 4048646 1033585 -2306331 -3618907 -2228447 383513
39106C83513J659859k64911j224696l25079J338926J776761M18735j181294j450258
$$ 383513 2043372 1778461 553765 228686 1567612 3344373 3763108 2581814 1131556
39097A131556q53842q38742j349783r55731O67082K106300K418202K219046J867524
$$ 1131556 277714 -561028 -1910811 -2866542 -2199460 -93160 2325042 4544088 6411612
39088F411612M32277k169036l693862k292487L56469R77529o56471j469574K86545
$$ 6411612 6843889 4674853 980991 -1311496 -955027 22502 -633969 -2103543 -1816998
39079a816998K545175K564353O28132q66202p38604J67129P89707Q84937M59915
$$ -1816998 728177 3292530 3920662 3054460 2315856 2482985 3272692 4157629 4617544
39070D617544m45392j209189r08586M26982J535701J360451L06340m26979m60765
$$ 4617544 4172152 2962963 2054377 2481359 4017060 5377511 5683851 5256872 4796107
39061D796107n42263j204516j791362j313085Q4571J191796J235579O28658R0186
$$ 4796107 4253844 3049328 1257966 -55119 29452 1221248 2456827 3085485 3175671
39052C175671k63343o28295j000537j386724j862042j953475q19027J209520K191160
$$ 3175671 2912328 2284033 1283496 -103228 -1965270 -3918745 -4737772 -3528252 -1337092
39043a337092Q94295j104840j136824R96956K727338K124555J49952r83327n18962
$$ -1337092 -442797 -1547637 -2684461 -1687505 1039833 3164388 3314340 2331013 1812051
39034A812051M71647O67326j83312j144684j031882K50856J448239J488882Q60275
$$ 1812051 2283698 2951024 2767712 1623028 591146 842002 2290241 3779123 4639398
39025D639398O56549P79299K98003p60502j451108j602161j892183k205228j592456
$$ 4639398 5295947 6075246 6373249 5612747 4161639 2559478 667295 -1537933 -3130389
39016c130389j09226J007743J344108J741627K320724K005068O77179j95350J0149
$$ -3130389 -3239615 -2231872 -887764 853863 3174587 5179655 5856834 5661484 5671633
39007E671633J3092r36142j642362j285410r84793j410794j062506R34788K408048
$$ 5671633 5684725 4748583 3106221 1820811 836018 -574776 -1637282 -702494 1705554
38998A705554J192724j051675j097411R14875J939137P98779o33097q93871o20549
$$ 1705554 2898278 1846603 749192 1664067 3603204 4401983 3768886 2875015 2254466
38989B254466n28346l36323j51193o23883j326065j084993j82648n7119o45962
$$ 2254466 1726120 1389797 1238604 614721 -711344 -1796337 -1978985 -2036104 -2682066
38980b682066m10460O93420Q62665l03689q17811M32105J860080J835801R16903
$$ -2682066 -3092526 -2399106 -1536441 -1840130 -2657941 -2225836 -365756 1470045 2386948
38971B386948J25204q10435j949666j939270j55469J616470J508610K31918l26195
$$ 2386948 2512152 1701717 -247949 -2187219 -2342688 -726218 782392 1014310 688115
38962F88115P0352L35674J70448R0821J06359j08073l38811l26471l83020n26258
$$ 688115 758467 1094141 1264589 1355410 1461769 1353696 1014885 688414 305394 -220864
38952b20864n4917R43491R59153p09846k382110k217305q17917Q2215L34817Q22586
$$ -220864 -275781 667710 1626863 917017 -1465093 -3682398 -4500315 -4418100 -4083283 -3260697
38942c260697J217704N42004o21659o86395M09445J199742J057832P07391M86000
$$ -3260697 -2042993 -1500989 -2122648 -2809043 -2399598 -1199856 -142024 565367 1051367
38933A051367l7271o62643n56137J51470L67221r8881j41792Q16069J866023J855219
$$ 1051367 1014096 351453 -204684 -53214 314007 215126 73334 889403 2755426 4610645
38923D610645O63605r08044j774203j255146J18997R25489P09484O52316J380345
$$ 4610645 5274250 4366206 2592003 1336857 1455854 2381343 3090827 3743143 5123488
38914E123488J441122l38356k319201k244056r13350q06516j706008j080975J153825
$$ 5123488 6564610 6226254 3907053 1662997 749647 -56869 -1762877 -2843852 -1690027
38905a690027J930002p994j872738j182918O44263J069152K64145j15333P1468
$$ -1690027 239975 231981 -1640757 -2823675 -2179412 -1110260 -846115 -961448 -889980
38896h89980Q8295L19048J226924J636475M24364j153336j165890j04783J61226
$$ -889980 -801685 -482637 744287 2380762 2805126 1651790 485900 381117 542343
38887E42343k28935M98348K221865K535777L87515k195957k859012j612914N1473
$$ 542343 313408 811756 3033621 5569398 5956913 3760956 901944 -710970 -659497
38878f59497J176915J495971Q74538k77730r09162o27276m10364j087400j754745
$$ -659497 517418 2013389 2887927 2610197 1701035 1073759 663395 -424005 -2178750
38869b178750r05726J116905K147704J074008m45562j29871J694523K434360Q74521
$$ -2178750 -3084476 -1967571 180133 1254141 808579 678708 2373231 4807591 5682112
38860E682112j088680j235041j71835j10715j359495k083582j375815m07092j33845
$$ 5682112 4593432 3358391 3186556 3075841 1716346 -367236 -1743051 -2150143 -2283988
38851b283988O4447O48346P67561K7877l19253O10258J632432J402023O68218
$$ -2283988 -2219541 -1571195 -803634 -775757 -1095010 -484752 1147680 2549703 3217921
38842C217921Q17309J312261O52991q47367j352923k82778J019850J258553L21759
$$ 3217921 4035230 5347491 6000482 5153115 3800192 3517414 4537264 5795817 6117576
38833F117576j255216k519219k245206m01958J059162N42834p44552o68274K68808
$$ 6117576 4862360 2343141 97935 -304023 755139 1297973 553421 -114853 153955
38824A53955j77204j886488k217904l60396J185961N47023q28129q95194p3061
$$ 153955 -23249 -1909737 -4127641 -4488037 -3302076 -2755053 -3583182 -4478376 -4551437
38815d551437J97942k1936Q868J3533k78455J17290J654901K552853J126235j167212
$$ -4551437 -4353495 -4375431 -4366563 -4353030 -4631485 -4514195 -2859294 -306441 819794 -347418
38805c47418j438122M07172J588826N55917j152777j591835r21305l53357j26336
$$ -347418 -1785540 -1378368 210458 766375 -386402 -1978237 -2899542 -3252899 -3379235
38796c379235L06698R13391R72249J12523j112017j693847j122571M6630P20418
$$ -3379235 -3072537 -2159146 -1186897 -1074374 -2186391 -3880238 -5002809 -4956179 -4235761
38787d235761N23985J78327L42382O32923L61830k81286n60374l28577p265K81563
$$ -4235761 -3711776 -3533449 -3191067 -2558144 -2196314 -2477600 -3037974 -3366551 -3373816 -3092253
38777c092253O78239Q38944J50503j191297k001720j249523Q43351K760512K734749
$$ -3092253 -2414014 -1575070 -1424567 -2615864 -4617584 -5867107 -5023756 -2263244 471505
38768D71505M52434k047432k122327K48201K108834J340336m88436o55255N45947
$$ 471505 923939 -1123493 -3245820 -2997619 -888785 451551 -36885 -692140 -146193
38759a46193N54453j049165j694773Q0154K201589K007276k21296k138129k383812
$$ -146193 408260 -640905 -2335678 -2255524 -53935 1953341 1732045 -406084 -2789896
38750b789896j289479L98633J928365K310055J137789n76060j410441j116818
$$ -2789896 -4079375 -3680742 -1752377 557678 1695467 1119407 -291034 -1407852
38742a407852m12971K61228P98800P51479j82921j212573j178362k41707K40594
$$ -1407852 -1820823 -1559595 -760795 -9316 -192237 -1404810 -2583172 -2824879 -2584285
38733b584285k95336p61124L7106J727198K773467K191909N12461p96272p48393
$$ -2584285 -2879621 -3640745 -3603639 -1876441 897026 3088935 3601396 2805124 2056731
38724B056731J47817L81764p75843k185706k083654l60355J102686O63048j074724
$$ 2056731 2204548 2586312 1810469 -375237 -2458891 -2819246 -1716560 -1053512 -2128236
38715b128236k008934j055710O65625J274968L13108r50561j262892q07575n01097
$$ -2128236 -4137170 -5192880 -4527255 -3252287 -2939179 -3889740 -5152632 -5960207 -6461304
38706f461304l92846L31096J741599K585743J906143N25631L4670O32360R34889
$$ -6461304 -6854150 -6523054 -4781455 -2195712 -289569 236062 270732 903092 1837981
38697A837981l0121j516844k113258j481460n11017m4845k1224J08518N55875
$$ 1837981 1807860 291016 -1822242 -3303702 -3814719 -3859564 -3880788 -3772270 -3216395
38688c216395J029032J180430R36803M46109m257n32O74494J547506J689315P77243
$$ -3216395 -2187363 -1006933 -70130 375979 371722 371190 1045684 2593190 4282505 5059748
38678E059748m52132j196233j523949j720026j343456l9348J142438P34560q36680
$$ 5059748 4607616 3411383 1887434 167408 -1176048 -1215396 -72958 661602 -175078
38669a75078j541605o98544R2808k91508o45242L36401J628438J545390N94451
$$ -175078 -1716683 -2415227 -2322419 -2613927 -3259169 -2922768 -1294330 251060 845511
38660H45511M73563J033099O63890n91872q57317L91410J372949R51516L27775
$$ 845511 1319074 2352173 3016063 2424191 1566874 1958284 3331233 4282749 4610524
38651D610524O98818J195178N80871n67860r75527p66928q64205j201672j098823
$$ 4610524 5309342 6504520 7085391 6517531 5542004 4775076 3910871 2709199 1610376
38642A610376p17660o66043p21862l80845j26997o41629j204250n53858Q79346
$$ 1610376 892716 226673 -495189 -876034 -1003031 -1644660 -2848910 -3402768 -2523422
38633b523422J350891M67856k57816J42037P67313O11699J26256J09708K96146
$$ -2523422 -1172531 -704675 -962491 -820454 -53141 558558 684814 794522 1090668
$$ [...]
##END NTUPLES=NMR SPECTRUM
##END=
